{"text_format":"1","workbook":"xlsx","n_sheets":11,"sheets":["Instructions","Safety Application","DSRTSignature","Project Scoring","ScoringCalculations","ScoringTable","RefTables","CMS","Coordinates","SafetyPriority","Import"],"not_rendered":{"charts":0,"images":5,"macros":1,"external_links":0,"defined_names":41,"comments":0,"pivot_tables":0},"unopened":[],"bounds":{"document_bytes":16777216,"sheet_cells":100000,"rows_first":2000,"rows_last":500,"rows_between":2000,"halvings":0,"cell_chars":16384,"cell_head_chars":4096},"cells_cut":0,"cells_raw":0,"read":"whole","date_system":"1900"}

{"sheet":"Instructions","index":0,"n_rows":27,"n_cols":12,"rows_kept":27,"cut":false,"hidden":false,"merged":[[11,0,11,8],[30,0,30,8],[31,0,31,8],[32,0,32,8],[33,0,33,8],[15,0,15,8],[16,0,16,8],[17,0,17,8],[18,0,18,8],[19,0,19,8],[23,0,23,8],[27,0,27,8],[28,0,28,8],[29,0,29,8],[24,0,24,8],[25,0,25,8],[26,0,26,8],[0,0,0,8],[21,0,21,8],[22,0,22,8],[3,0,3,8],[4,0,4,8],[5,0,5,8],[14,0,14,8],[1,0,1,8],[2,0,2,8],[6,0,6,8],[7,0,7,8],[9,0,9,8],[10,0,10,8],[12,0,12,8],[13,0,13,8]]}
["Application and Scoring Tool Instructions",null,null,null,null,null,null,null,null,null,"Version",20171212]
[]
["The instructions can be used to understand the functionality of the tool.  The tool attempts to complete as many fields as possible form information entered in the Economic Crash Analysis Tool (ECAT).  "]
[]
["The worksheets have been protected because the tool is standardized to import into the ODOT Central Office Database. Once submitted, the complete data layouts will be imported into the current database.  At this point, the district will be able to make any changes desired prior to the HSIP Program Committee Review."]
[]
[]
["I recommend starting a new application by importing data from existing ECAT Tool(s).  The import functionality will obtain information from (1) an ECAT Tool that does not have a fundamental change in Safety Performance Function (SPF) ('No' response in Cell \"K14\" on the Project Information Worksheet) or (2) an ECAT Tool that has have a fundamental change in Safety Performance Function (SPF) ('Yes' response in Cell \"K14\" on the Project Information Worksheet).  Follow the coded prompts.  Two files will be required for Item (2).  The order of import is does not matter.  Following the import process, please verify the data as assumptions have been made.  For example, it was assumed that only one route (major route) was used in the Project Element Description Table when determining project limits (All NLFIDs match in Column F).\n\nNote:  If you choose to import a new dataset, any previous information will be overridden."]
[]
[]
{"$rows_left_out":18}
{"sheet":"Safety Application","index":1,"n_rows":108,"n_cols":28,"rows_kept":108,"cut":false,"hidden":false,"merged":[[107,0,107,9],[105,0,105,2],[69,0,69,2],[72,0,72,2],[47,4,47,9],[48,4,48,9],[49,4,49,9],[50,4,50,9],[51,4,51,9],[52,4,52,9],[53,4,53,9],[65,6,65,9],[66,6,66,9],[70,0,70,2],[71,0,71,2],[69,9,71,9],[56,6,56,9],[57,6,57,9],[58,6,58,9],[59,6,59,9],[60,6,60,9],[61,6,61,9],[62,6,62,9],[63,6,63,9],[64,6,64,9],[57,10,57,11],[57,12,57,13],[57,14,57,15],[58,14,58,15],[59,14,59,15],[60,14,60,15],[61,14,61,15],[62,14,62,15],[63,14,63,15],[62,12,62,13],[63,10,63,11],[63,12,63,13],[64,14,64,15],[65,14,65,15],[66,14,66,15],[58,10,58,11],[58,12,58,13],[59,10,59,11],[59,12,59,13],[60,10,60,11],[60,12,60,13],[61,10,61,11],[61,12,61,13],[62,10,62,11],[64,10,64,11],[64,12,64,13],[65,10,65,11],[65,12,65,13],[66,10,66,11],[66,12,66,13],[0,0,0,9],[6,0,6,2],[1,3,1,9],[2,3,2,9],[3,3,3,9],[4,3,4,9],[5,3,5,9],[6,3,6,9],[4,0,4,2],[5,0,5,2],[2,0,2,2],[3,0,3,2],[16,0,16,9],[15,0,15,9],[1,0,1,2],[9,7,9,9],[10,7,10,9],[8,0,8,9],[9,0,9,1],[10,0,10,1],[11,0,11,1],[9,5,9,6],[10,5,10,6],[11,5,11,6],[11,7,11,9],[9,2,9,4],[10,2,10,4],[11,2,11,4],[13,0,13,1],[12,2,12,4],[13,5,13,6],[12,7,12,9],[12,0,12,1],[12,5,12,6],[13,2,13,4],[13,7,13,9],[38,0,38,6],[39,0,39,6],[40,0,40,6],[17,0,17,9],[18,0,18,9],[19,0,19,9],[20,0,20,9],[21,0,21,9],[30,0,30,9],[23,0,23,9],[22,0,22,9],[32,0,32,3],[34,0,34,9],[35,0,35,6],[36,0,36,6],[37,0,37,6],[24,0,24,4],[25,0,25,4],[26,0,26,4],[27,0,27,4],[29,0,29,4],[28,0,28,4],[41,0,41,6],[42,0,42,6],[43,0,43,6],[68,0,68,9],[47,0,47,3],[48,0,48,3],[49,0,49,3],[50,0,50,3],[51,0,51,3],[52,0,52,3],[58,0,58,1],[59,0,59,1],[60,0,60,1],[61,0,61,1],[62,0,62,1],[46,0,46,9],[63,0,63,1],[64,0,64,1],[65,0,65,1],[66,0,66,1],[57,0,57,1],[55,0,55,9],[56,0,56,1],[44,0,44,7],[79,0,79,2],[75,0,75,2],[80,0,80,2],[73,0,73,2],[74,0,74,2],[87,4,87,6],[87,7,87,9],[90,4,90,6],[90,7,90,9],[83,0,83,9],[84,0,84,9],[88,4,88,6],[88,7,88,9],[89,4,89,6],[89,7,89,9],[78,0,78,2],[86,0,86,9],[76,0,76,2],[77,0,77,2],[87,0,87,3],[88,0,88,3],[89,0,89,3],[90,0,90,3],[101,0,101,9],[96,5,96,7],[95,8,95,9],[96,8,96,9],[95,5,95,7],[81,0,81,2],[98,8,98,9],[97,0,97,7],[98,0,98,7],[97,8,97,9],[92,4,92,6],[92,7,92,9],[91,4,91,6],[91,7,91,9],[95,0,95,4],[96,0,96,4],[91,0,91,3],[92,0,92,3],[94,0,94,9]]}
["General Project Information",null,null,null,null,null,null,null,null,null,null,null,null,null,null,null,null,null,null,null,null,null,null,null,null,"Show Conditional Format:","Yes"]
["Project Sponsoring Agency",null,null,"ODOT District 6",null,null,null,null,null,null,null,null,null,null,null,null,null,null,null,null,null,null,null,null,null,"Lat Long Format:","Yes"]
["Project Name",null,null,"Courtright Rd Bridge over I-70",null,null,null,null,null,null,null,null,null,null,null,null,null,null,null,null,null,null,null,null,null,"Priority Rank Format:","Yes"]
["PID",null,null,109659]
["Project Manager",null,null,"Drew Hurst"]
["Contact Phone",null,null,"740-833-8345"]
["Contact Email",null,null,"andrew.hurst@dot.ohio.gov"]
[]
["Location Information"]
["ODOT District",null,6,null,null,"County",null,"FRA"]
{"$rows_left_out":99}
{"sheet":"DSRTSignature","index":2,"n_rows":47,"n_cols":27,"rows_kept":47,"cut":false,"hidden":true,"merged":[[3,0,3,2],[3,3,3,9],[0,0,0,9],[1,0,1,2],[1,3,1,9],[2,0,2,2],[2,3,2,9],[23,0,23,4],[8,0,8,9],[9,0,9,9],[4,0,4,2],[4,3,4,9],[5,0,5,2],[5,3,5,9],[6,0,6,2],[6,3,6,9],[10,0,10,9],[11,0,11,9],[12,0,12,9],[17,0,17,4],[17,5,17,7],[13,0,13,9],[14,0,14,9],[46,0,46,9],[41,0,41,9],[42,0,42,4],[42,5,42,7],[43,0,43,4],[43,5,43,7],[44,0,44,7],[44,8,44,9],[45,0,45,7],[45,8,45,9],[40,0,40,7],[40,8,40,9],[35,0,35,7],[36,0,36,9],[34,0,34,7],[34,8,34,9],[35,8,35,9],[39,8,39,9],[37,0,37,4],[37,5,37,7],[38,0,38,4],[38,5,38,7],[39,0,39,7],[30,0,30,7],[24,8,24,9],[25,0,25,7],[29,8,29,9],[29,0,29,7],[30,8,30,9],[25,8,25,9],[26,0,26,9],[16,0,16,9],[27,0,27,4],[27,5,27,7],[28,0,28,4],[28,5,28,7],[23,5,23,7],[24,0,24,7],[19,0,19,7],[19,8,19,9],[20,0,20,7],[20,8,20,9],[18,0,18,4],[18,5,18,7],[21,0,21,9],[22,0,22,4],[22,5,22,7],[31,0,31,9],[32,0,32,4],[32,5,32,7],[33,0,33,4],[33,5,33,7]]}
["General Project Information",null,null,null,null,null,null,null,null,null,null,null,null,null,null,null,null,null,null,null,null,null,null,null,null,"Show Conditional Format:","Yes"]
["Project Sponsoring Agency",null,null,null,null,null,null,null,null,null,null,null,null,null,null,null,null,null,null,null,null,null,null,null,null,"Lat Long Format:","Yes"]
["Project Name",null,null,"","","","","","","",null,null,null,null,null,null,null,null,null,null,null,null,null,null,null,"Priority Rank Format:","Yes"]
["PID",null,null,"","","","","","",""]
["Project Manager"]
["Contact Phone"]
["Contact Email"]
[]
["Project Description"]
["Summary of Crash Patterns"]
{"$rows_left_out":38}
{"sheet":"Project Scoring","index":3,"n_rows":19,"n_cols":9,"rows_kept":19,"cut":false,"hidden":false,"merged":[[5,0,5,1],[5,2,5,4],[5,5,5,6],[5,7,5,9],[6,0,6,1],[6,2,6,4],[6,5,6,6],[6,7,6,9],[3,0,3,1],[3,2,3,4],[3,5,3,6],[3,7,3,9],[4,0,4,1],[4,2,4,4],[4,5,4,6],[4,7,4,9],[0,0,0,9],[1,0,1,9],[2,0,2,1],[2,2,2,4],[2,5,2,6],[2,7,2,9],[16,1,16,6],[8,1,8,6],[18,1,18,7],[12,1,12,6],[13,1,13,6],[14,1,14,6],[15,1,15,6],[10,1,10,6],[9,1,9,6],[11,1,11,6]]}
["Project Scoring Summary"]
["General Project Information"]
["Project Name",null,"FRA-70",null,null,"Contact Email"]
["Project Description",null,"add sidewalk to overpass",null,null,"Contact Phone"]
["Reference Number",null,1,null,null,"Date Performed"]
["Analyst",null,null,null,null,"Analysis Year"]
["Agency/Company",null,null,null,null,"Analysis Type Performed",null,"ECAT - No Change in base SPF"]
[]
[null,"Category",null,null,null,null,null,"Value","Points Awarded"]
[null,"Expected Crash Frequency",null,null,null,null,null,{"$f":"IF('Safety Application'!H37=\"\",\"\",'Safety Application'!H37)","v":0.44},{"$f":"IF('Safety Application'!I37=\"\",\"\",'Safety Application'!I37)","v":0}]
{"$rows_left_out":10}
{"sheet":"ScoringCalculations","index":4,"n_rows":59,"n_cols":35,"rows_kept":59,"cut":false,"hidden":false,"merged":[[2,0,2,2],[3,0,3,2],[5,0,5,5],[0,0,0,5],[33,0,33,7],[28,1,28,2],[32,0,32,7],[43,0,43,7],[44,0,44,2],[45,0,45,2],[34,0,34,2],[35,0,35,2],[36,0,36,2],[37,0,37,2],[39,0,39,2],[38,0,38,2],[41,0,41,2],[40,0,40,2],[58,0,58,2],[57,0,57,3],[48,0,48,7],[50,3,50,4],[51,3,51,4],[52,3,52,4],[53,3,53,4],[43,26,43,28],[33,26,33,33],[34,26,34,28],[35,26,35,28],[36,26,36,28],[37,26,37,28],[38,26,38,28],[40,26,40,33],[41,26,41,28],[42,26,42,28]]}
["Relative Severity Index Calculation",null,null,null,null,null,null,null,null,null,null,null,null,null,null,null,null,null,null,null,null,null,null,null,null,null,null,null,null,null,null,null,null,null,"All Sites"]
[null,null,null,null,null,null,null,null,null,null,null,null,null,null,null,null,null,null,null,null,null,null,null,null,null,null,"NLFID:",null,null,null,"FindTruck",0,null,null,"HSM Elements Only"]
["Site Type",null,null,null,null,null,null,null,null,null,null,null,null,null,null,null,null,null,null,null,null,null,null,null,null,null,"Blog:",null,null,null,"FindVC",0,null,null,"Observed Elements Only"]
["Urban Non-Freeway",null,null,null,null,null,null,null,null,null,null,null,null,null,null,null,null,null,null,null,null,null,null,null,null,null,"Elog:"]
[null,null,null,null,null,null,null,null,null,null,null,null,null,null,null,null,null,null,null,null,null,null,null,null,null,null,"WAADT:"]
["Fill in the Number of Crashes by Crash Type",null,null,null,null,null,null,null,null,null,null,null,null,null,null,null,null,null,null,null,null,null,null,null,null,null,"WAADTT:"]
["Crash Type","Number of Crashes","Crash Type Severity Calc","Rural Non-Freeway","Urban Non-Freeway","Freeway",null,null,null,null,null,null,null,null,null,null,null,null,null,null,null,null,null,null,null,null,"WVCRatio:"]
["Not Stated",8.9999999999999998E-4,{"$f":"IF($A$4=\"\",\"\",IF($A$4=D$7,B8*D8,IF($A$4=E$7,B8*E8,IF($A$4=F$7,B8*F8))))","v":29.321330808950087},57175.982758620688,32579.256454388986,20119.272727272728,null,null,null,null,null,null,null,null,null,null,null,null,null,null,null,null,null,null,null,null,"TotalLength:"]
["Head On",3.1000000000000003E-3,{"$f":"IF($A$4=\"\",\"\",IF($A$4=D$7,B9*D9,IF($A$4=E$7,B9*E9,IF($A$4=F$7,B9*F9))))","v":265.67335007743208},271494.18433670752,85701.080670139374,249708.12738853504,null,null,null,null,null,null,null,null,null,null,null,null,null,null,null,null,null,null,null,null,"Functional Class:",null,{"$f":"IFERROR(VLOOKUP(AB9,RefTables!E27:F34,2,FALSE),\"Other\")","v":"Other"}]
["Rear End",0.18820000000000001,3725.7547590397267,29092.43537414966,19796.784054408748,23786.410013252833,null,null,null,null,null,null,null,null,null,null,null,null,null,null,null,null,null,null,null,null,"Truck %:",{"$f":"IFERROR(ROUND(AB6/AB5,4),\"\")","v":""}]
{"$rows_left_out":50}
{"sheet":"ScoringTable","index":5,"n_rows":40,"n_cols":44,"rows_kept":40,"cut":false,"hidden":false,"merged":[[38,9,39,9],[36,9,37,9],[1,40,1,41],[2,6,2,7],[2,8,2,9],[0,40,0,43],[1,42,1,43],[0,0,0,9],[0,26,0,35],[0,36,0,39],[1,26,1,27],[1,28,1,29],[1,30,1,31],[1,32,1,33],[1,34,1,35],[1,36,1,37],[1,38,1,39],[1,0,1,9],[2,0,2,1],[2,2,2,3],[2,4,2,5],[22,0,22,1],[21,0,21,1],[21,2,21,5],[22,2,22,3],[22,4,22,5]]}
["ODOT Highway Safety Improvement Program (HSIP) Scoring Matrix",null,null,null,null,null,null,null,null,null,null,null,null,null,null,null,null,null,null,null,null,null,null,null,null,null,"Safety Criteria",null,null,null,null,null,null,null,null,null,"Traffic Criteria",null,null,null,"Economic Analysis"]
["Safety Criteria",null,null,null,null,null,null,null,null,null,null,null,null,null,null,null,null,null,null,null,null,null,null,null,null,null,"Expected Crash Frequency",null,"Ratio of Observed Fatal and Serious Injuries to Observed Total Crashes",null,"Percentage of the Potential for Safety Improvement to Total Expected Crashes",null,"Relative Severity Index",null,"Equivalent Property Damage Only Index",null,"Truck Percentage",null,"Volume to Capacity Ratio",null,"Benefit Cost Ratio",null,"Safety Request Percentage"]
["Expected Crash Frequency",null,"Ratio of Observed Fatal and Serious Injuries to Observed Total Crashes",null,"Percentage of the Potential for Safety Improvement to Total Expected Crashes",null,"Relative Severity Index",null,"Equivalent Property Damage Only Index",null,null,null,null,null,null,null,null,null,null,null,null,null,null,null,null,null,"Value","Points","Value","Points","Value","Points","Value","Points","Value","Points","Value","Points","Value","Points","Value","Points","Value","Points"]
["Value","Points","Value","Points","Value","Points","Value","Points","Value","Points",null,null,null,null,null,null,null,null,null,null,null,null,null,null,null,null,0,0,0,0,0,0,0,0,0,0,0,0,0,0,0,0,0,10]
[{"$f":"\"< \"&AA5","v":"< 3"},{"$f":"IF(AB4=\"\",\"\",AB4)","v":0},{"$f":"\"< \"&AC5","v":"< 0.01"},{"$f":"IF(AD4=\"\",\"\",AD4)","v":0},{"$f":"\"< \"&AE5*100&\"%\"","v":"< 1%"},{"$f":"IF(AF4=\"\",\"\",AF4)","v":0},{"$f":"\"< \"&TEXT(AG5,\"00,000\")","v":"< 20,000"},{"$f":"IF(AH4=\"\",\"\",AH4)","v":0},{"$f":"\"< \"&AI5","v":"< 1"},{"$f":"IF(AJ4=\"\",\"\",AJ4)","v":0},null,null,null,null,null,null,null,null,null,null,null,null,null,null,null,null,3,2,0.01,1,0.01,2,20000,2,1,1,0.01,null,0.55000000000000004,2,1,3,0.7,8]
[{"$f":"AA5&\"-\"&AA6-0.01","v":"3-5.99"},{"$f":"IF(AB5=\"\",\"\",AB5)","v":2},"0.01-0.02",1,{"$f":"AE5*100&\"-\"&(AE6-0.0001)*100&\"%\"","v":"1-1.99%"},2,{"$f":"TEXT(AG5,\"00,000\")&\"-\"&TEXT(AG6-0.01,\"00,000.00\")","v":"20,000-24,999.99"},2,"1-1.99",1,null,null,null,null,null,null,null,null,null,null,null,null,null,null,null,null,6,{"$f":"AB5+2","v":4},0.03,2,0.02,4,25000,4,2,2,0.02,null,{"$f":"AM5+0.1","v":0.65},4,{"$f":"AO5+0.15","v":1.1499999999999999},6,0.75,6]
["6-8.99",4,"0.03-0.04",2,{"$f":"AE6*100&\"-\"&(AE7-0.0001)*100&\"%\"","v":"2-2.99%"},4,{"$f":"TEXT(AG6,\"00,000\")&\"-\"&TEXT(AG7-0.01,\"00,000.00\")","v":"25,000-29,999.99"},4,"2-2.99",2,null,null,null,null,null,null,null,null,null,null,null,null,null,null,null,null,9,{"$f":"AB6+2","v":6},0.05,3,0.03,6,30000,6,3,3,0.03,null,{"$f":"AM6+0.1","v":0.75},6,{"$f":"AO6+0.15","v":1.2999999999999998},9,0.8,4]
["9-11.99",6,"0.05-0.06",3,"3-3.99%",6,"30,000-34,999.99",6,"3-3.99",3,null,null,null,null,null,null,null,null,null,null,null,null,null,null,null,null,12,8,7.0000000000000007E-2,4,0.04,8,35000,8,4,4,0.04,null,0.85,8,1.4499999999999997,12,0.85,2]
["12-14.99",8,"0.07-0.08",4,"4-4.99%",8,"35,000-39,999.99",8,"4-4.99",4,null,null,null,null,null,null,null,null,null,null,null,null,null,null,null,null,15,10,0.09,5,0.05,10,40000,10,5,5,0.05,null,0.95,10,1.5999999999999996,15,0.9,0]
[{"$f":"\"≥ \"&AA9","v":"≥ 15"},10,{"$f":"\"≥ \"&AC9","v":"≥ 0.09"},5,"5-5.99%",10,{"$f":"\"≥ \"&TEXT(AG9,\"00,000\")","v":"≥ 40,000"},10,{"$f":"\"≥ \"&AI9","v":"≥ 5"},5,null,null,null,null,null,null,null,null,null,null,null,null,null,null,null,null,null,null,null,null,6.0000000000000005E-2,12,null,null,null,null,null,null,null,null,1.7499999999999996,18,null,{"$f":"IF(BR9=\"\",\"\",BR9)","v":""}]
{"$rows_left_out":31}
{"sheet":"RefTables","index":6,"n_rows":93,"n_cols":13,"rows_kept":93,"cut":false,"hidden":true,"merged":[]}
["County Code","District Number",null,"Ohio SHSP Emphasis Area",null,"FHWA SHSP Emphasis Area",null,"Improvement Type","Access management","Advanced technology and ITS","Alignment","Interchange design","Intersection geometry"]
["ADA",9,null,"Emphasis Area I - Data and Support Systems",null,"Creating more effective processes and safety management systems",null,"Access management",null,null,"Alignment - other","Acceleration / deceleration / merge lane"]
["ALL",1,null,"Emphasis Area II - Serious Crash Types",null,"Curbing aggressive driving",null,"Advanced technology and ITS","Access management - other","AdvancedtechnologyandITS","Horizontal curve realignment","Convert at-grade intersection to interchange","Auxiliary lanes - add acceleration lane"]
["ASD",3,null,"Emphasis Area III - High-Risk Behaviors/Drivers",null,"Designing safer work zones",null,"Alignment","Change in access - close or restrict existing access","Advanced technology and ITS - other","Horizontal and vertical alignment","Extend existing lane on ramp","Auxiliary lanes - add auxiliary through lane"]
["ATB",4,null,"Emphasis Area IV - Special Vehicles/Roadway Users",null,"Enhancing emergency medical capabilities to increase survivability",null,"Animal-related","Change in access - miscellaneous/unspecified","Congestion detection / traffic monitoring system","Vertical alignment or elevation change","Improve intersection radius at ramp terminus","Auxiliary lanes - add left-turn lane"]
["ATH",10,null,"Emphasis Area V - Incident and Congestion Related Crashes",null,"Ensuring drivers are licensed and fully competent",null,"Interchange design","Grassed median - extend existing","Dynamic message signs",null,"Installation of new lane on ramp","Auxiliary lanes - add right-turn lane"]
["AUG",7,null,null,null,"Ensuring safer bicycle travel",null,"Intersection geometry","Median crossover - close crossover","Over height vehicle detection","Roadside","Interchange design - other","Auxiliary lanes - add right-turn lane (free-flow)"]
["BEL",11,null,"EmphasisAreaIDataandSupportSystems",null,"Improving information and decision support systems",null,"Intersection traffic control","Median crossover - directional crossover",null,null,"Ramp closure","Auxiliary lanes - add slip lane"]
["BRO",9,null,"Timely Data",null,"Improving motorcycle safety and increasing motorcycle awareness",null,"Lighting","Median crossover - relocate existing",null,"Barrier end treatments (crash cushions, terminals)","Ramp metering","Auxiliary lanes - add two-way left-turn lane"]
["BUT",8,null,"Reliable Data",null,"Improving the design and operation of highway intersections",null,"Miscellaneous","Median crossover - unspecified",null,"Barrier transitions",null,"Auxiliary lanes - extend acceleration/deceleration lane"]
{"$rows_left_out":84}
{"sheet":"CMS","index":7,"n_rows":5,"n_cols":15,"rows_kept":5,"cut":false,"hidden":true,"merged":[]}
["NLF_ID","LOGPOINT_COUNTY_NBR","BTRS_CONGESTION_SEGMENTS6.LOGPOINT_COUNTY_NBR+BTRS_CONGESTION_SEGMENTS6.SECTION_LENGTH_NBR","SECTION_LENGTH_NBR","FUNCTIONAL_CLASS_CD","TOTAL_VOLUME_NBR","TRUCK_VOLUME_NBR","VOLUME_CAPACITY_RATIO_NBR"]
[null,null,null,null,null,null,null,null,null,"NLFID:","NLFID",null,null,null,{"$f":"IF(N2=\"\",\"\",VALUE(N2))","v":""}]
[null,null,null,null,null,null,null,null,null,"Blog:"]
[null,null,null,null,null,null,null,null,null,"Elog:"]
[null,null,null,null,null,null,null,null,null,"Error:",1]

{"sheet":"Coordinates","index":8,"n_rows":3,"n_cols":7,"rows_kept":3,"cut":false,"hidden":true,"merged":[]}
["NLF_ID","LOGPOINT_COUNTY_NBR","LATITUDE_NBR","LONGITUDE_NBR"]
["SFRAIR00071**C",5.31,39.833392000000003,-83.101623000000004,null,null,"NLFID:"]
[null,null,null,null,null,null,"Logpoint:"]

{"sheet":"SafetyPriority","index":9,"n_rows":4,"n_cols":40,"rows_kept":4,"cut":false,"hidden":true,"merged":[]}
["KeyID","List_Year","Time Period","Location Type","Freeway/Non-Freeway","District","County","Route","Suffix","NLF_ID","TRANS_ROUTE_CD","TRANS_ROUTE_ID","Begin Log","End Log","Length","Rank","INTERSECTION","STREET_AT","Crash Frequency","Fatal Crashes","Injury Crashes","Fatalities","Injuries","V/C","ADT","TOTLANES","WIDTH","FUNCLASS","LOS","Crash Rate_MVMT","Injury Crash Rate_MVMT","Fatal Crash Rate_100MVMT","Fatalities_SeriousInjuries","Crash_Density(PerMilePerYear)","Serious_Injuries","Fatality_Serious_Injury_Rate","Hazard Value Rank_TotCRxFatIncRatexFatIncInjuries",null,"Safety Year:",2012]
[null,null,null,null,null,null,null,null,null,null,null,null,null,null,null,null,null,null,null,null,null,null,null,null,null,null,null,null,null,null,null,null,null,null,null,null,null,null,"NLFID:"]
[null,null,null,null,null,null,null,null,null,null,null,null,null,null,null,null,null,null,null,null,null,null,null,null,null,null,null,null,null,null,null,null,null,null,null,null,null,null,"Blog:"]
[null,null,null,null,null,null,null,null,null,null,null,null,null,null,null,null,null,null,null,null,null,null,null,null,null,null,null,null,null,null,null,null,null,null,null,null,null,null,"Elog:"]

{"sheet":"Import","index":10,"n_rows":63,"n_cols":75,"rows_kept":63,"cut":false,"hidden":true,"merged":[[0,0,0,1]]}
["Application ID:",null,{"$f":"IF('Safety Application'!A106=\"\",\"Not Assigned\",'Safety Application'!A106)","v":"201905D06-04"}]
[]
[]
["General Application Data"]
["https://extranet.dot.state.oh.us/divisions/Planning/plan/HSIP_applications/Lists/AppData/ImportView.aspx"]
["Title","Cycle","AppID","District","CountyCd","Sponsor","Project Name","PID","ProjectManager","PM_Phone","PM_Email","Applicant_Name","Applicant_Title","Applicant_Phone","ApplicationDt","RouteNbr","RouteName","Blog","Elog","FolderPath"]
[{"$f":"C7","v":"201905D06-04"},{"$f":"LEFT(C7,6)","v":"201905"},{"$f":"C1","v":"201905D06-04"},{"$f":"'Safety Application'!C10","v":6},{"$f":"'Safety Application'!H10","v":"FRA"},{"$f":"IF('Safety Application'!D2=\"\",\"\",'Safety Application'!D2)","v":"ODOT District 6"},{"$f":"IF('Safety Application'!D3=\"\",\"\",'Safety Application'!D3)","v":"Courtright Rd Bridge over I-70"},{"$f":"IF('Safety Application'!D4=\"\",\"\",'Safety Application'!D4)","v":109659},{"$f":"IF('Safety Application'!D5=\"\",\"\",'Safety Application'!D5)","v":"Drew Hurst"},{"$f":"IF('Safety Application'!D6=\"\",\"\",'Safety Application'!D6)","v":"740-833-8345"},{"$f":"IF('Safety Application'!D7=\"\",\"\",'Safety Application'!D7)","v":"andrew.hurst@dot.ohio.gov"},{"$f":"IF('Safety Application'!A97=\"\",\"\",'Safety Application'!A97)","v":"Drew Hurst"},{"$f":"IF('Safety Application'!F97=\"\",\"\",'Safety Application'!F97)","v":"Traffic Safety Engineer"},{"$f":"'Safety Application'!I97","v":"740-833-8345"},{"$f":"IF('Safety Application'!I99=\"\",\"\",MONTH('Safety Application'!I99)&\"/\"&DAY('Safety Application'!I99)&\"/\"&YEAR('Safety Application'!I99))","v":"5/7/2019"},{"$f":"'Safety Application'!C11","v":70},{"$f":"'Safety Application'!H11","v":"Courtright Rd"},{"$f":"'Safety Application'!C12","v":20.29},{"$f":"'Safety Application'!H12","v":""},{"$f":"IF(LEFT('Safety Application'!A108,1)=\"\\\",'Safety Application'!A108,\"\\\\itcfs007.dot.state.oh.us\\odrive\"&MID('Safety Application'!A108,FIND(\"\\\",'Safety Application'!A108,1),100))","v":"\\\\itcfs007.dot.state.oh.us\\odrive\\SAFETY\\D06\\SAFETY APPLICATIONS\\FRA-70-20.29"}]
[]
[]
["Project Priority"]
{"$rows_left_out":53}