{"text_format":"1","workbook":"xlsx","n_sheets":5,"sheets":["I - CC 87+00 to 88+40 (L)","R- CC 87+00 to 88+40 (L)","I - CC 87+50 to 88+40 (R)","R- CC 87+50 to 88+40 (R)","Rainfall Intensity"],"not_rendered":{"charts":0,"images":1,"macros":1,"external_links":1,"defined_names":128,"comments":0,"pivot_tables":0},"unopened":[],"bounds":{"document_bytes":16777216,"sheet_cells":100000,"rows_first":2000,"rows_last":500,"rows_between":2000,"halvings":0,"cell_chars":16384,"cell_head_chars":4096},"cells_cut":0,"cells_raw":0,"read":"whole","date_system":"1900"}

{"sheet":"I - CC 87+00 to 88+40 (L)","index":0,"n_rows":37,"n_cols":31,"rows_kept":37,"cut":false,"hidden":false,"merged":[[0,0,0,22],[15,0,15,4],[15,6,15,8],[15,9,15,11],[15,12,15,15],[15,16,15,19]]}
["Ditch Analysis Input Worksheet"]
["PID:",114496]
["Date",{"$f":"TODAY()","v":"2024-06-27"}]
["Project","Columbia Connector"]
["Location","Sta. 87+00 to 88+40 Left"]
["Designer","ZTM"]
["Checker","SNS"]
["Rainfall Area","C"]
["Depth Design Year",10]
["Shear Stress Design Year",5]
["Time to first section",10,null,null,null,null,null,null,null,null,null,null,null,null,null,null,null,null,null,null,null,null,null,"MACRO COLUMN (ctrl q)"]
["Pick up Flow:"]
[]
["Paved Gutter? (Y/N)","n"]
[]
{"$rows_left_out":23}
{"sheet":"R- CC 87+00 to 88+40 (L)","index":1,"n_rows":114,"n_cols":23,"rows_kept":114,"cut":false,"hidden":false,"merged":[[12,0,12,4],[12,5,12,8],[12,9,12,12],[12,14,12,22],[0,0,0,22],[1,0,1,2],[1,8,2,9],[1,10,2,10],[1,11,2,11]]}
["Ditch Analysis"]
["PID:",null,null,{"$f":"'I - CC 87+00 to 88+40 (L)'!B2","v":114496},null,null,null,null,"Ditch Lining",null,"Manning's \"n\"","Allowable Shear Stress"]
["Date:",null,null,{"$f":"'I - CC 87+00 to 88+40 (L)'!B3","v":"2024-06-27"}]
["Project:",null,null,{"$f":"'I - CC 87+00 to 88+40 (L)'!B4","v":"Columbia Connector"},null,null,null,null,"Seed",null,0.04,0.4]
["Location:",null,null,{"$f":"'I - CC 87+00 to 88+40 (L)'!B5","v":"Sta. 87+00 to 88+40 Left"},null,null,null,null,"Jute Mat",null,0.04,0.45]
["Designer:",null,null,{"$f":"'I - CC 87+00 to 88+40 (L)'!B6","v":"ZTM"},null,null,null,null,"Temporary Mat",null,0.04,1]
["Checker:",null,null,{"$f":"'I - CC 87+00 to 88+40 (L)'!B7","v":"SNS"},null,null,null,null,"Permanent Mat, Type 1",null,0.04,2]
["Rainfall Area:",null,null,{"$f":"'I - CC 87+00 to 88+40 (L)'!B8","v":"C"},null,null,null,null,"Permanent Mat, Type 2",null,0.04,3]
["Depth Storm Frequency:",null,null,{"$f":"'I - CC 87+00 to 88+40 (L)'!B9","v":10},null,null,null,null,"Permanent Mat, Type 3",null,0.04,5,null,"* Grade Steeper than Allowable"]
["Shear Stress Storm Frequency:",null,null,{"$f":"'I - CC 87+00 to 88+40 (L)'!B10","v":5},null,null,null,null,"RCP, Type B",null,0.06,6]
["Pickup Flow (cfs):",null,null,{"$f":"'I - CC 87+00 to 88+40 (L)'!B12","v":0}]
[]
["Station",null,null,null,null,"Dimension",null,null,null,"Rainfall",null,null,null,"Lining Type","Discharge"]
["Ref. No.","Begin","End","Side","Length (ft.)","Radius/Width (ft.)","Inslope (ft./ft.)","Backslope (ft./ft.)","Grade (ft./ft.)","Area (acres)","Total Area (acres)","Runoff Coefficient","CA (sum)","Protection Type","Intensity (in./hr.)","Storm Freq. (Yrs.)","Mann. Coef.","Time Flow (min.)","Velocity Flow (fps)","Shear (lbs./sq.ft)","Design Flow (cfs.)","Depth Flow (ft.)","Width Flow (ft.)"]
[{"$f":"IF('I - CC 87+00 to 88+40 (L)'!A18<>\"\", 'I - CC 87+00 to 88+40 (L)'!A18, \"\")","v":1},{"$f":"IF('I - CC 87+00 to 88+40 (L)'!B18<>\"\", 'I - CC 87+00 to 88+40 (L)'!B18, \"\")","v":8700},{"$f":"IF('I - CC 87+00 to 88+40 (L)'!C18<>\"\", 'I - CC 87+00 to 88+40 (L)'!C18, \"\")","v":8750},{"$f":"IF('I - CC 87+00 to 88+40 (L)'!D18<>\"\", 'I - CC 87+00 to 88+40 (L)'!D18, \"\")","v":"L"},{"$f":"IF('I - CC 87+00 to 88+40 (L)'!E18<>\"\", 'I - CC 87+00 to 88+40 (L)'!E18, \"\")","v":50},{"$f":"IF('I - CC 87+00 to 88+40 (L)'!J18<>\"\", 'I - CC 87+00 to 88+40 (L)'!J18, \"\")","v":6},{"$f":"IF('I - CC 87+00 to 88+40 (L)'!K18<>\"\", 'I - CC 87+00 to 88+40 (L)'!K18, \"\")","v":3},{"$f":"IF('I - CC 87+00 to 88+40 (L)'!L18<>\"\", 'I - CC 87+00 to 88+40 (L)'!L18, \"\")","v":4},{"$f":"IF('I - CC 87+00 to 88+40 (L)'!I18<>\"\", IF('I - CC 87+00 to 88+40 (L)'!I18>0.2, 'I - CC 87+00 to 88+40 (L)'!I18&\"*\", 'I - CC 87+00 to 88+40 (L)'!I18), \"\")","v":5.7999999999999996E-3},{"$f":"IF('I - CC 87+00 to 88+40 (L)'!M18<>\"\", 'I - CC 87+00 to 88+40 (L)'!M18, \"\")","v":3.6999999999999998E-2},{"$f":"IF(J15<>\"\",J15, \"\")","v":3.6999999999999998E-2},{"$f":"IF('I - CC 87+00 to 88+40 (L)'!N18<>\"\", 'I - CC 87+00 to 88+40 (L)'!N18, \"\")","v":0.45},{"$f":"IF(J15<>\"\", J15*L15, \"\")","v":1.6649999999999998E-2},{"$f":"IF(A15<>\"\", IF('I - CC 87+00 to 88+40 (L)'!$B$14=\"Y\", \"Paved Gutter\",IF(T15<$L$4, $I$4, IF(T15<$L$5, $I$5, IF(T15<$L$6, $I$6, IF(T15<$L$7, $I$7, IF(T15<$L$8, $I$8, IF(T15<$L$9, $I$9, $I$10))))))), \"\")","v":"Seed"},{"$f":"IF('I - CC 87+00 to 88+40 (L)'!A18<>\"\", IF($D$8=\"A\",(VLOOKUP($P$15,'[1]Rainfall Intensity'!$B$2:$E$7,2,FALSE))/(R15+VLOOKUP($P$15,'[1]Rainfall Intensity'!$B$2:$E$7,3,FALSE))^VLOOKUP($P$15,'[1]Rainfall Intensity'!$B$2:$E$7,4,FALSE),IF($D$8=\"B\",(VLOOKUP($P$15,'[1]Rainfall Intensity'!$B$8:$E$13,2,FALSE))/(R15+VLOOKUP($P$15,'[1]Rainfall Intensity'!$B$8:$E$13,3,FALSE))^VLOOKUP($P$15,'[1]Rainfall Intensity'!$B$8:$E$13,4,FALSE),IF($D$8=\"C\",(VLOOKUP($P$15,'[1]Rainfall Intensity'!$B$14:$E$19,2,FALSE))/(R15+VLOOKUP($P$15,'[1]Rainfall Intensity'!$B$14:$E$19,3,FALSE))^VLOOKUP($P$15,'[1]Rainfall Intensity'!$B$14:$E$19,4,FALSE),IF($D$8=\"D\",(VLOOKUP($P$15,'[1]Rainfall Intensity'!$B$20:$E$25,2,FALSE))/(R15+VLOOKUP($P$15,'[1]Rainfall Intensity'!$B$20:$E$25,3,FALSE))^VLOOKUP($P$15,'[1]Rainfall Intensity'!$B$20:$E$25,4,FALSE),FALSE)))), \"\")","v":4.8202795627711961},{"$f":"IF('I - CC 87+00 to 88+40 (L)'!A18<>\"\", $D$10, \"\")","v":5},{"$f":"IF('I - CC 87+00 to 88+40 (L)'!A18<>\"\", IF('I - CC 87+00 to 88+40 (L)'!$B$14=\"Y\", 0.015,VLOOKUP(N15, $I$4:$K$10, 3, FALSE)), \"\")","v":0.04},{"$f":"IF('I - CC 87+00 to 88+40 (L)'!A18<>\"\", 'I - CC 87+00 to 88+40 (L)'!R18, \"\")","v":10},{"$f":"IF(A15<>\"\",U15/(V15*(F15+F15+G15*V15+H15*V15)/2),\"\")","v":0.18685033923990738},{"$f":"IF(A15<>\"\", 62.4*V15*'I - CC 87+00 to 88+40 (L)'!I18, \"\")","v":2.4909143999999991E-2},{"$f":"IF('I - CC 87+00 to 88+40 (L)'!A18<>\"\", 'I - CC 87+00 to 88+40 (L)'!V18, \"\")","v":8.0257654720140403E-2},{"$f":"IF('I - CC 87+00 to 88+40 (L)'!X18<>\"\",'I - CC 87+00 to 88+40 (L)'!X18, \"\")","v":6.8824999999999983E-2},{"$f":"IF(A15<>\"\",F15+G15*V15+H15*V15, \"\")","v":6.4817749999999998}]
{"$rows_left_out":100}
{"sheet":"I - CC 87+50 to 88+40 (R)","index":2,"n_rows":36,"n_cols":31,"rows_kept":36,"cut":false,"hidden":false,"merged":[[0,0,0,22],[15,0,15,4],[15,6,15,8],[15,9,15,11],[15,12,15,15],[15,16,15,19]]}
["Ditch Analysis Input Worksheet"]
["PID:",114496]
["Date",{"$f":"TODAY()","v":"2024-06-27"}]
["Project","Columbia Connector"]
["Location","Sta. 87+00 to 88+40 Right"]
["Designer","ZTM"]
["Checker","SNS"]
["Rainfall Area","C"]
["Depth Design Year",10]
["Shear Stress Design Year",5]
["Time to first section",10,null,null,null,null,null,null,null,null,null,null,null,null,null,null,null,null,null,null,null,null,null,"MACRO COLUMN (ctrl q)"]
["Pick up Flow:"]
[]
["Paved Gutter? (Y/N)","n"]
[]
{"$rows_left_out":22}
{"sheet":"R- CC 87+50 to 88+40 (R)","index":3,"n_rows":114,"n_cols":23,"rows_kept":114,"cut":false,"hidden":false,"merged":[[12,0,12,4],[12,5,12,8],[12,9,12,12],[12,14,12,22],[0,0,0,22],[1,0,1,2],[1,8,2,9],[1,10,2,10],[1,11,2,11]]}
["Ditch Analysis"]
["PID:",null,null,{"$f":"'I - CC 87+50 to 88+40 (R)'!B2","v":114496},null,null,null,null,"Ditch Lining",null,"Manning's \"n\"","Allowable Shear Stress"]
["Date:",null,null,{"$f":"'I - CC 87+50 to 88+40 (R)'!B3","v":"2024-06-27"}]
["Project:",null,null,{"$f":"'I - CC 87+50 to 88+40 (R)'!B4","v":"Columbia Connector"},null,null,null,null,"Seed",null,0.04,0.4]
["Location:",null,null,{"$f":"'I - CC 87+50 to 88+40 (R)'!B5","v":"Sta. 87+00 to 88+40 Right"},null,null,null,null,"Jute Mat",null,0.04,0.45]
["Designer:",null,null,{"$f":"'I - CC 87+50 to 88+40 (R)'!B6","v":"ZTM"},null,null,null,null,"Temporary Mat",null,0.04,1]
["Checker:",null,null,{"$f":"'I - CC 87+50 to 88+40 (R)'!B7","v":"SNS"},null,null,null,null,"Permanent Mat, Type 1",null,0.04,2]
["Rainfall Area:",null,null,{"$f":"'I - CC 87+50 to 88+40 (R)'!B8","v":"C"},null,null,null,null,"Permanent Mat, Type 2",null,0.04,3]
["Depth Storm Frequency:",null,null,{"$f":"'I - CC 87+50 to 88+40 (R)'!B9","v":10},null,null,null,null,"Permanent Mat, Type 3",null,0.04,5,null,"* Grade Steeper than Allowable"]
["Shear Stress Storm Frequency:",null,null,{"$f":"'I - CC 87+50 to 88+40 (R)'!B10","v":5},null,null,null,null,"RCP, Type B",null,0.06,6]
["Pickup Flow (cfs):",null,null,{"$f":"'I - CC 87+50 to 88+40 (R)'!B12","v":0}]
[]
["Station",null,null,null,null,"Dimension",null,null,null,"Rainfall",null,null,null,"Lining Type","Discharge"]
["Ref. No.","Begin","End","Side","Length (ft.)","Radius/Width (ft.)","Inslope (ft./ft.)","Backslope (ft./ft.)","Grade (ft./ft.)","Area (acres)","Total Area (acres)","Runoff Coefficient","CA (sum)","Protection Type","Intensity (in./hr.)","Storm Freq. (Yrs.)","Mann. Coef.","Time Flow (min.)","Velocity Flow (fps)","Shear (lbs./sq.ft)","Design Flow (cfs.)","Depth Flow (ft.)","Width Flow (ft.)"]
[{"$f":"IF('I - CC 87+50 to 88+40 (R)'!A18<>\"\", 'I - CC 87+50 to 88+40 (R)'!A18, \"\")","v":1},{"$f":"IF('I - CC 87+50 to 88+40 (R)'!B18<>\"\", 'I - CC 87+50 to 88+40 (R)'!B18, \"\")","v":8750},{"$f":"IF('I - CC 87+50 to 88+40 (R)'!C18<>\"\", 'I - CC 87+50 to 88+40 (R)'!C18, \"\")","v":8800},{"$f":"IF('I - CC 87+50 to 88+40 (R)'!D18<>\"\", 'I - CC 87+50 to 88+40 (R)'!D18, \"\")","v":"R"},{"$f":"IF('I - CC 87+50 to 88+40 (R)'!E18<>\"\", 'I - CC 87+50 to 88+40 (R)'!E18, \"\")","v":50},{"$f":"IF('I - CC 87+50 to 88+40 (R)'!J18<>\"\", 'I - CC 87+50 to 88+40 (R)'!J18, \"\")","v":2},{"$f":"IF('I - CC 87+50 to 88+40 (R)'!K18<>\"\", 'I - CC 87+50 to 88+40 (R)'!K18, \"\")","v":2},{"$f":"IF('I - CC 87+50 to 88+40 (R)'!L18<>\"\", 'I - CC 87+50 to 88+40 (R)'!L18, \"\")","v":2},{"$f":"IF('I - CC 87+50 to 88+40 (R)'!I18<>\"\", IF('I - CC 87+50 to 88+40 (R)'!I18>0.2, 'I - CC 87+50 to 88+40 (R)'!I18&\"*\", 'I - CC 87+50 to 88+40 (R)'!I18), \"\")","v":2.9600000000000001E-2},{"$f":"IF('I - CC 87+50 to 88+40 (R)'!M18<>\"\", 'I - CC 87+50 to 88+40 (R)'!M18, \"\")","v":3.3000000000000002E-2},{"$f":"IF(J15<>\"\",J15, \"\")","v":3.3000000000000002E-2},{"$f":"IF('I - CC 87+50 to 88+40 (R)'!N18<>\"\", 'I - CC 87+50 to 88+40 (R)'!N18, \"\")","v":0.7},{"$f":"IF(J15<>\"\", J15*L15, \"\")","v":2.3099999999999999E-2},{"$f":"IF(A15<>\"\", IF('I - CC 87+50 to 88+40 (R)'!$B$14=\"Y\", \"Paved Gutter\",IF(T15<$L$4, $I$4, IF(T15<$L$5, $I$5, IF(T15<$L$6, $I$6, IF(T15<$L$7, $I$7, IF(T15<$L$8, $I$8, IF(T15<$L$9, $I$9, $I$10))))))), \"\")","v":"Seed"},{"$f":"IF('I - CC 87+50 to 88+40 (R)'!A18<>\"\", IF($D$8=\"A\",(VLOOKUP($P$15,'[1]Rainfall Intensity'!$B$2:$E$7,2,FALSE))/(R15+VLOOKUP($P$15,'[1]Rainfall Intensity'!$B$2:$E$7,3,FALSE))^VLOOKUP($P$15,'[1]Rainfall Intensity'!$B$2:$E$7,4,FALSE),IF($D$8=\"B\",(VLOOKUP($P$15,'[1]Rainfall Intensity'!$B$8:$E$13,2,FALSE))/(R15+VLOOKUP($P$15,'[1]Rainfall Intensity'!$B$8:$E$13,3,FALSE))^VLOOKUP($P$15,'[1]Rainfall Intensity'!$B$8:$E$13,4,FALSE),IF($D$8=\"C\",(VLOOKUP($P$15,'[1]Rainfall Intensity'!$B$14:$E$19,2,FALSE))/(R15+VLOOKUP($P$15,'[1]Rainfall Intensity'!$B$14:$E$19,3,FALSE))^VLOOKUP($P$15,'[1]Rainfall Intensity'!$B$14:$E$19,4,FALSE),IF($D$8=\"D\",(VLOOKUP($P$15,'[1]Rainfall Intensity'!$B$20:$E$25,2,FALSE))/(R15+VLOOKUP($P$15,'[1]Rainfall Intensity'!$B$20:$E$25,3,FALSE))^VLOOKUP($P$15,'[1]Rainfall Intensity'!$B$20:$E$25,4,FALSE),FALSE)))), \"\")","v":4.8202795627711961},{"$f":"IF('I - CC 87+50 to 88+40 (R)'!A18<>\"\", $D$10, \"\")","v":5},{"$f":"IF('I - CC 87+50 to 88+40 (R)'!A18<>\"\", IF('I - CC 87+50 to 88+40 (R)'!$B$14=\"Y\", 0.015,VLOOKUP(N15, $I$4:$K$10, 3, FALSE)), \"\")","v":0.04},{"$f":"IF('I - CC 87+50 to 88+40 (R)'!A18<>\"\", 'I - CC 87+50 to 88+40 (R)'!R18, \"\")","v":10},{"$f":"IF(A15<>\"\",U15/(V15*(F15+F15+G15*V15+H15*V15)/2),\"\")","v":0.54232816939018302},{"$f":"IF(A15<>\"\", 62.4*V15*'I - CC 87+50 to 88+40 (R)'!I18, \"\")","v":0.17334470399999993},{"$f":"IF('I - CC 87+50 to 88+40 (R)'!A18<>\"\", 'I - CC 87+50 to 88+40 (R)'!V18, \"\")","v":0.11134845790001463},{"$f":"IF('I - CC 87+50 to 88+40 (R)'!X18<>\"\",'I - CC 87+50 to 88+40 (R)'!X18, \"\")","v":9.3849999999999975E-2},{"$f":"IF(A15<>\"\",F15+G15*V15+H15*V15, \"\")","v":2.3754}]
{"$rows_left_out":100}
{"sheet":"Rainfall Intensity","index":4,"n_rows":25,"n_cols":5,"rows_kept":25,"cut":false,"hidden":false,"merged":[[1,0,6,0],[7,0,12,0],[13,0,18,0],[19,0,24,0]]}
["Intensity Zone","Frequency","Constant \"a\"","Constant \"b\"","Constant \"c\""]
["A",2,46.183999999999997,9,0.85899999999999999]
[null,5,56.984999999999999,10.25,0.85099999999999998]
[null,10,64.167000000000002,11,0.84199999999999997]
[null,25,66.528000000000006,11,0.81100000000000005]
[null,50,65.701999999999998,10.75,0.78200000000000003]
[null,100,64.489000000000004,10.5,0.754]
["B",2,47.987000000000002,9,0.85899999999999999]
[null,5,60.683999999999997,10.5,0.85799999999999998]
[null,10,73.126000000000005,12,0.86299999999999999]
[null,25,75.840999999999994,12,0.83299999999999996]
[null,50,65.620999999999995,10,0.78100000000000003]
[null,100,85.046999999999997,13.25,0.80600000000000005]
["C",2,56.298999999999999,10,0.876]
[null,5,67.933000000000007,11,0.86899999999999999]
{"$rows_left_out":10}