{"text_format":"1","workbook":"xlsx","n_sheets":14,"sheets":["REPORT","CSF","GRID>GRND","OWNERS","OSIP","MON TABLE","GPS_IMPORT","CP01","CP02","CP03","CP04","LEVEL RUN","TIN","DATABASE"],"not_rendered":{"charts":0,"images":1,"macros":1,"external_links":1,"defined_names":30,"comments":0,"pivot_tables":0},"unopened":[],"bounds":{"document_bytes":16777216,"sheet_cells":100000,"rows_first":2000,"rows_last":500,"rows_between":2000,"halvings":0,"cell_chars":16384,"cell_head_chars":4096},"cells_cut":0,"cells_raw":0,"read":"whole","date_system":"1900"}

{"sheet":"REPORT","index":0,"n_rows":56,"n_cols":7,"rows_kept":56,"cut":false,"hidden":false,"merged":[[41,0,41,4],[40,0,40,4],[44,0,44,4],[45,0,45,1],[45,3,45,4],[25,0,25,3],[20,1,20,3],[23,0,23,3],[17,2,17,4],[19,2,19,4],[21,0,21,3],[24,0,24,3],[22,0,22,3],[18,2,18,4],[26,2,26,3],[30,0,30,4],[47,2,47,4],[31,0,31,1],[32,0,32,4],[46,0,46,4],[38,0,38,4],[36,0,36,4],[27,0,27,1],[27,2,27,3],[28,2,28,3],[28,0,28,1],[47,0,47,1],[39,0,39,4],[43,1,43,2],[42,0,42,4],[0,0,0,4],[3,1,3,4],[7,0,7,4],[8,0,8,4],[9,0,9,1],[9,2,9,4],[5,0,5,4],[6,0,6,2],[1,1,1,2],[4,1,4,4],[29,8,29,9],[27,8,27,9],[29,0,29,1],[29,2,29,3],[54,0,54,4],[53,2,53,4],[52,2,52,4],[51,2,51,4],[50,2,50,4],[51,0,51,1],[48,2,48,4],[37,0,37,4],[31,2,31,4],[50,0,50,1],[48,0,48,1],[49,0,49,1],[55,0,55,4],[52,0,52,1],[10,0,10,1],[10,2,10,4],[11,0,11,1],[11,2,11,4],[12,0,12,1],[13,0,13,1],[13,2,13,4],[14,0,14,1],[14,2,14,4],[15,0,15,1],[15,2,15,4],[16,0,16,1],[16,2,16,4],[53,0,53,1]]}
["Surveyor’s Report"]
["Project: ","XXX-XXX-XXXX",null,"PID:","XXXXX"]
[]
["Scope: ","Establish Control, Centerline, and Right-of-Way"]
["Type:"]
[]
["Gray boxes denote INPUT",null,null,null,"Tan boxes denote OUTPUT (check)"]
[]
["Datum and Coordinate System",null,null,null,null,null,"Type:"]
["Coordinate System: ",null,"Ohio State Plane, North Zone (3401)",null,null,null,"(Select from List)"]
["Horizontal Reference Datum: ",null,"NAD83 (2011)",null,null,null,"Bridge Monitoring"]
["Ellipsoid: ",null,"GRS80",null,null,null,"Bridge Rehab"]
["Grid to Ground Multiplier (1/CSF):",null,null,"Factor is 8 decimal places per Survey & Mapping Specifications.",null,null,"Bridge Replacement"]
["Origin of Combined Scale Factor: ",null,"(0,0)",null,null,null,"Culvert Rehab"]
["Vertical Reference Datum: ",null,"NAVD88",null,null,null,"Highway Widening"]
["Geoid Model: ",null,"Geoid 12A",null,null,null,"Slope Repair"]
["Units: ",null,"US Survey Feet (sft)",null,null,null,"Stream Maintenance"]
["Original Survey Subdivision:"]
["Township:"]
["Quarter Section/Section/Lot:"]
["Files","Current projects are filed under i:\\projectdata\\XXXXX\\\n       past projects are filed under j:\\projectdata\\XXXXX\\",null,null,"Description"]
["Design\\geopak\\jobXXX.gpk",null,null,null,"GEOPAK Coordinate Geometry File"]
["Design\\geopak\\XXXXX.tin",null,null,null,"GEOPAK Ground Surface File"]
["Design\\survey\\XXXXX_Survey.prj",null,null,null,"GEOPAK Project File"]
["Design\\survey\\basemaps\\XXXXXBE001.dgn",null,null,null,"Planimetric Survey Basemap"]
["Design\\geopak\\basemaps\\XXXXXBK001.dgn",null,null,null,"Centerline/Right-of-Way/Boundary Basemap"]
[null,null,"Double-click icons to open"]
["Centerline Chain",null,"Field Notes",null,"Research"]
["Insert\nPDF\nHere",null,"Insert\nPDF\nHere",null,"Insert\nPDF\nHere"]
["XXXXX_CLCHAIN.pdf",null,"XXXXX_FIELDNOTES.pdf",null,"XXXXX_RESEARCH.pdf"]
["References"]
["Alignment based on the following plan:"]
["Other references used:"]
[]
[]
[]
["Equipment Maintenance"]
["Equipment maintenance logs are on file at the Ohio Department of Transportation, District 3."]
["Methodology and Equipment Used"]
["The centerline alignment and Right-of-Way were determined from plan information and data collected by the ODOT survey department.\n "]
["Horizontal control was positioned with a minimum of 5 VRS-derived GNSS observations. "]
["Vertical control was established by differential leveling."]
["All positions are in conformance to the ODOT Surveying and Mapping Specifications."]
["CP01","was assigned an absolute elevation of ",null,0,"sft."]
["The Grid to Ground Multiplier for the project was computed by taking the inverse of the TBC-generated "]
["combined scale factor for: ",null,"CP01"]
[]
["Report Submitted by: "]
["Date Submitted:"]
[]
["Surveying Performed by: "]
[]
[]
[]
["DGN Overview Map"]
["Insert close-up screen shot of combined DGN here"]

{"sheet":"CSF","index":1,"n_rows":311,"n_cols":17,"rows_kept":311,"cut":false,"hidden":false,"merged":[[3,0,3,1],[3,2,3,6],[0,0,0,6],[0,10,0,11],[1,1,1,2],[1,4,1,6],[2,0,2,6],[4,0,4,5],[5,0,5,2],[5,3,5,6],[6,0,6,5],[7,0,7,1],[7,5,7,6],[8,0,8,1],[8,5,8,6],[10,0,10,1],[10,2,10,4],[10,5,10,6],[17,0,17,1],[11,0,11,1],[11,2,11,4],[11,5,11,6],[12,0,12,6],[13,0,13,1],[14,0,14,1],[14,2,14,6],[15,0,15,6],[16,0,16,1],[25,0,25,1],[25,2,25,6],[18,0,18,1],[19,0,19,1],[19,2,19,6],[20,0,20,6],[21,0,21,1],[22,0,22,1],[22,2,22,6],[23,0,23,6],[24,0,24,1],[24,2,24,6],[26,0,26,6],[27,0,27,1],[27,2,27,6],[28,0,28,1],[28,2,28,6],[31,0,31,6],[32,0,32,1],[33,0,33,1],[33,2,33,6],[29,0,29,6],[30,0,30,6],[41,3,41,4],[34,0,34,6],[35,0,35,1],[35,3,35,4],[35,5,35,6],[36,3,36,4],[37,3,37,4],[37,5,37,6],[38,3,38,4],[39,0,39,6],[40,0,40,1],[40,3,40,4],[40,5,40,6],[47,0,47,6],[48,0,49,4],[48,5,48,6],[42,3,42,4],[42,5,42,6],[43,3,43,4],[44,0,44,6],[45,0,46,4],[45,5,45,6]]}
["Combined Scale Factor Calculations",null,null,null,null,null,null,null,"Zone","Index Value","Project Latitude",null,"Radius of the Earth (meters)","Tabular Difference","Scale Factor (k)","Differences","Coordinate System List"]
["Project: ",{"$f":"REPORT!B2","v":"XXX-XXX-XXXX"},null,"PID:",{"$f":"REPORT!E2","v":"XXXXX"},null,null,null,"NZ",3940,39,40,7485451.5980000002,30.84836,1.0002349100000001]
[null,null,null,null,null,null,null,null,"NZ",3941,39,41,7483600.6969999997,30.848230000000001,1.0002279300000001,{"$f":"O2-O3","v":6.9799999999897722E-6},"State Plane Coordinate System: Ohio North (3401)"]
["Horizontal Datum: NAD83",null,"State Plane Coordinate System: Ohio North (3401)",null,null,null,null,null,"NZ",3942,39,42,7481749.8030000003,30.848109999999998,1.00022104,6.8900000000926553E-6,"State Plane Coordinate System: Ohio South (3402)"]
[null,null,null,null,null,null,null,null,"NZ",3943,39,43,7479898.9160000002,30.847989999999999,1.00021424,6.7999999999734939E-6]
["Gray boxes denote INPUT",null,null,"Tan boxes denote OUTPUT (check)",null,null,null,null,"NZ",3944,39,44,7478048.0369999995,30.84787,1.0002075100000001,6.7299999999548277E-6]
[null,null,null,null,null,null,null,null,"NZ",3945,39,45,7476197.165,30.847760000000001,1.00020087,6.6400000000577108E-6]
[null,null,"Input Deg.","Min.","Sec.","Zone Parameters:",null,null,"NZ",3946,39,46,7474346.2989999996,30.847650000000002,1.0001943099999999,6.5600000000998193E-6]
["Project Mean Latitude (DMS):",null,null,null,null,{"$f":"IF(C4=\"State Plane Coordinate System: Ohio North (3401)\",\n\"k = 1 at lats. 40⁰ 26' and 41⁰ 42'\",\n\"k = 1 at lats. 38⁰ 44' and 40⁰ 20'\")","v":"k = 1 at lats. 40⁰ 26' and 41⁰ 42'"},null,null,"NZ",3947,39,47,7472495.4400000004,30.847539999999999,1.00018783,6.4799999999198832E-6]
[{"$f":"ISBLANK(D9)","v":true},{"$f":"ISBLANK(E9)","v":true},null,{"$f":"IF(OR(A10,B10)=TRUE,\"Minute and second fields must be populated\",\"\")","v":"Minute and second fields must be populated"},null,null,null,null,"NZ",3948,39,48,7470644.5880000005,30.847429999999999,1.00018144,6.3900000000227664E-6]
[null,null,"Input Ellipsoid Height:",null,null,{"$f":"IF(C4=\"State Plane Coordinate System: Ohio North (3401)\",\n\"Origin at 82⁰ 30' long., 39⁰ 40' lat.\",\n\"Origin at 82⁰ 30' long., 38⁰ 00' lat.\")","v":"Origin at 82⁰ 30' long., 39⁰ 40' lat."},null,null,"NZ",3949,39,49,7468793.7419999996,30.84732,1.0001751299999999,6.3100000000648748E-6]
["Project Mean Height (ft):",null,null,null,null,"Origin coords: x=600,000m, y=0m",null,null,"NZ",3950,39,50,7466942.9029999999,30.84722,1.0001689,6.2299999998849387E-6]
[null,null,null,null,null,null,null,null,"NZ",3951,39,51,7465092.0690000001,30.84712,1.00016276,6.1399999999878219E-6]
[null,null,"Radius of the Earth * (Radius of the Earth + Proj. Mean Elev.) =",null,null,null,null,null,"NZ",3952,39,52,7463241.2419999996,30.84703,1.0001567,6.0600000000299303E-6]
["Sea Level Factor:",null,{"$f":"TRUNC(20906000/(20906000+C12),9)","v":1},null,null,null,null,null,"NZ",3953,39,53,7461390.4199999999,30.84693,1.0001507199999999,5.9800000000720388E-6]
[null,null,null,null,null,null,null,null,"NZ",3954,39,54,7459539.6040000003,30.84684,1.00014482,5.8999999998921027E-6]
[null,null,"Tabular data proportioned according to the number of seconds:",null,null,null,null,null,"NZ",3955,39,55,7457688.7939999998,30.84675,1.0001390100000001,5.8099999999949858E-6]
[null,null,{"$f":"IF($C$4=\"State Plane Coordinate System: Ohio North (3401)\",VLOOKUP(D18,J1:O150,6),VLOOKUP(D18,J151:O310,6))","v":{"$error":"#N/A"}},{"$f":"VALUE(IF(D9>9,CONCATENATE(C9,D9),CONCATENATE(C9*10,D9)))","v":0},{"$f":"IF(C18>C19,1-E9/60,E9/60)","v":{"$error":"#N/A"}},{"$f":"\"Scale factor at \"&LEFT($D18,2)&\"⁰ \"&RIGHT($D18,2)&\"' latitude\"","v":"Scale factor at 0⁰ 0' latitude"},null,null,"NZ",3956,39,56,7455837.9890000001,30.84667,1.00013328,5.7300000000370943E-6]
[null,null,{"$f":"IF($C$4=\"State Plane Coordinate System: Ohio North (3401)\",VLOOKUP(D19,J2:O151,6),VLOOKUP(D19,J152:O311,6))","v":{"$error":"#N/A"}},{"$f":"IF(D9=59,(VALUE(IF(D9>9,CONCATENATE(C9,D9),CONCATENATE(C9*10,D9)))+41),(VALUE(IF(D9>9,CONCATENATE(C9,D9),CONCATENATE(C9*10,D9)))+1))","v":1},{"$f":"IF(C18<C19,1-E9/60,E9/60)","v":{"$error":"#N/A"}},{"$f":"\"Scale factor at \"&LEFT($D19,2)&\"⁰ \"&RIGHT($D19,2)&\"' latitude\"","v":"Scale factor at 1⁰ 1' latitude"},null,null,"NZ",3957,39,57,7453987.1890000002,30.846579999999999,1.0001276299999999,5.6500000000792028E-6]
["Scale Factor (k):",null,{"$f":"C18*E18+C19*E19","v":{"$error":"#N/A"}},null,null,null,null,null,"NZ",3958,39,58,7452136.3940000003,30.846499999999999,1.00012206,5.5699999998992666E-6]
[null,null,null,null,null,null,null,null,"NZ",3959,39,59,7450285.6040000003,30.846419999999998,1.00011658,5.4800000000021498E-6]
[null,null,{"$f":"LEFT(A15,16)&\" * \"&LEFT(A20,12)&\" =\"","v":"Sea Level Factor * Scale Factor ="},null,null,null,null,null,"NZ",4000,40,0,7448434.8190000001,30.846340000000001,1.00011118,5.4000000000442583E-6]
["Combined Scale Factor (CSF):",null,{"$f":"C15*C20","v":{"$error":"#N/A"}},null,null,null,null,null,"NZ",4001,40,1,7446584.0379999997,30.846270000000001,1.0001058700000001,5.3099999999250969E-6]
[null,null,null,null,null,null,null,null,"NZ",4002,40,2,7444733.2620000001,30.8462,1.0001006299999999,5.2400000001284752E-6]
[null,null,"Unitless Grid to Ground Multiplier:",null,null,null,null,null,"NZ",4003,40,3,7442882.4900000002,30.846129999999999,1.0000954799999999,5.1500000000093138E-6]
["Grid to Ground Multiplier (1/CSF):",null,{"$f":"1/C23","v":{"$error":"#N/A"}},null,null,null,null,null,"NZ",4004,40,4,7441031.7220000001,30.846070000000001,1.00009042,5.0599999998901524E-6]
[null,null,null,null,null,null,null,null,"NZ",4005,40,5,7439180.9579999996,30.846,1.0000854299999999,4.9900000000935307E-6]
[null,null,"Converts Grid Meters to Ground Feet:",null,null,null,null,null,"NZ",4006,40,6,7437330.1979999999,30.845939999999999,1.00008053,4.8999999999743693E-6]
["Project Adjustment Factor (PAF):",null,{"$f":"C26*3.28083333","v":{"$error":"#N/A"}},null,null,null,null,null,"NZ",4007,40,7,7435479.4409999996,30.845880000000001,1.00007571,4.8200000000164778E-6]
[null,null,null,null,null,null,null,null,"NZ",4011,40,11,7428076.449,30.845680000000002,1.00005728,{"$f":"O34-O30","v":4.4799999998623719E-6}]
["Check spreadsheet-generated (XLS) CSF against Trimble Business Center-generated (TBC) CSF below.",null,null,null,null,null,null,null,"NZ",4012,40,12,7426225.7079999996,30.84563,1.00005287,{"$f":"O30-O31","v":4.4100000000657502E-6}]
[null,null,null,null,null,null,null,null,"NZ",4008,40,8,7433628.6880000001,30.845829999999999,1.0000709800000001,{"$f":"O29-O32","v":4.7299999998973163E-6}]
[null,null,"Compare to Unitless Grid to Ground Multiplier:",null,null,null,null,null,"NZ",4009,40,9,7431777.9390000002,30.845770000000002,1.0000663299999999,{"$f":"O32-O33","v":4.6500000001614694E-6}]
["Input TBC-generated 1/CSF:",null,null,null,null,null,null,null,"NZ",4010,40,10,7429927.1919999998,30.84572,1.0000617599999999,{"$f":"O33-O34","v":4.5699999999815333E-6}]
[null,null,null,null,null,null,null,null,"NZ",4013,40,13,7424374.9699999997,30.845590000000001,1.00004856,{"$f":"O31-O35","v":4.3100000000073635E-6}]
["Test point at one end of project:",null,"Northing (ft)","Easting (ft)",null,"Grid - Ground (XLS)",null,null,"NZ",4014,40,14,7422524.2350000003,30.845549999999999,1.00004432,{"$f":"O35-O36","v":4.2399999999886973E-6}]
[null,"Input Grid Coordinates:",null,null,null,{"$f":"IF(C37-C38>0,ABS(ROUND(C37-C38,3))&\"' shift N\",ABS(ROUND(C37-C38,3))&\"' shift S\")","v":{"$error":"#N/A"}},{"$f":"IF(D37-D38>0,ABS(ROUND(D37-D38,3))&\"' shift E\",ABS(ROUND(D37-D38,3))&\"' shift W\")","v":{"$error":"#N/A"}},null,"NZ",4015,40,15,7420673.5020000003,30.845510000000001,1.0000401699999999,4.1500000000915804E-6]
[{"$f":"$A37","v":0},"Ground (XLS):",{"$f":"$C37*$C$26","v":{"$error":"#N/A"}},{"$f":"$D37*$C$26","v":{"$error":"#N/A"}},null,"Ground (XLS) - Ground (TBC)",null,null,"NZ",4016,40,16,7418822.7719999999,30.845469999999999,1.0000361,4.0699999999116443E-6]
[{"$f":"$A37","v":0},"Ground (TBC):",{"$f":"$C37*$C$34","v":0},{"$f":"$D37*$C$34","v":0},null,{"$f":"IF(C38-C39>0,ABS(ROUND(C38-C39,3))&\"' shift N\",ABS(ROUND(C38-C39,3))&\"' shift S\")","v":{"$error":"#N/A"}},{"$f":"IF(D38-D39>0,ABS(ROUND(D38-D39,3))&\"' shift E\",ABS(ROUND(D38-D39,3))&\"' shift W\")","v":{"$error":"#N/A"}},null,"NZ",4017,40,17,7416972.0429999996,30.84544,1.00003212,3.9800000000145275E-6]
[null,null,null,null,null,null,null,null,"NZ",4018,40,18,7415121.3169999998,30.845410000000001,1.00002821,3.9099999999958612E-6]
["Test point at other end of project:",null,"Northing (ft)","Easting (ft)",null,"Grid - Ground (XLS)",null,null,"NZ",4019,40,19,7413270.5920000002,30.845379999999999,1.0000244,3.8099999999374745E-6]
[null,"Input Grid Coordinates:",null,null,null,{"$f":"IF(C42-C43>0,ABS(ROUND(C42-C43,3))&\"' shift N\",ABS(ROUND(C42-C43,3))&\"' shift S\")","v":{"$error":"#N/A"}},{"$f":"IF(D42-D43>0,ABS(ROUND(D42-D43,3))&\"' shift E\",ABS(ROUND(D42-D43,3))&\"' shift W\")","v":{"$error":"#N/A"}},null,"NZ",4020,40,20,7411419.8689999999,30.845359999999999,1.0000206599999999,3.7400000001408529E-6]
[{"$f":"$A42","v":0},"Ground (XLS):",{"$f":"$C42*$C$26","v":{"$error":"#N/A"}},{"$f":"$D42*$C$26","v":{"$error":"#N/A"}},null,"Ground XLS - Ground TBC",null,null,"NZ",4021,40,21,7409569.1469999999,30.84534,1.0000170100000001,3.6499999997996468E-6]
[{"$f":"$A42","v":0},"Ground (TBC):",{"$f":"$C42*$C$34","v":0},{"$f":"$D42*$C$34","v":0},null,{"$f":"IF(C43-C44>0,ABS(ROUND(C43-C44,3))&\"' shift N\",ABS(ROUND(C43-C44,3))&\"' shift S\")","v":{"$error":"#N/A"}},{"$f":"IF(D43-D44>0,ABS(ROUND(D43-D44,3))&\"' shift E\",ABS(ROUND(D43-D44,3))&\"' shift W\")","v":{"$error":"#N/A"}},null,"NZ",4022,40,22,7407718.4270000001,30.845320000000001,1.00001344,3.5700000000637999E-6]
[null,null,null,null,null,null,null,null,"NZ",4023,40,23,7405867.7079999996,30.845300000000002,1.0000099499999999,3.4900000001059084E-6]
[{"$f":"\"Change in computed horizontal distance between \"&A$37&\" and \"&A$42&\" due to CSF used (an approximate \"&ROUND(SQRT((C38-C43)^2+(D38-D43)^2),0)&\" foot distance):\"","v":{"$error":"#N/A"}},null,null,null,null,"Ground (XLS) vs. Ground (TBC)",null,null,"NZ",4024,40,24,7404016.9900000002,30.845289999999999,1.0000065499999999,3.399999999986747E-6]
[null,null,null,null,null,{"$f":"IF(ABS(C38-C43)>ABS(C39-C44),ABS(ROUND((C38-C39)-(C43-C44),3))&\"' further N-S\",ABS(ROUND((C38-C39)-(C43-C44),3))&\"' nearer N-S\")","v":{"$error":"#N/A"}},{"$f":"IF(ABS(D38-D43)>ABS(D39-D44),ABS(ROUND((D38-D39)-(D43-D44),3))&\"' further E-W\",ABS(ROUND((D38-D39)-(D43-D44),3))&\"' nearer E-W\")","v":{"$error":"#N/A"}},null,"NZ",4025,40,25,7402166.273,30.845269999999999,1.0000032299999999,3.3200000000288554E-6]
[null,null,null,null,null,null,null,null,"NZ",4027,40,27,7398464.8399999999,30.84526,0.99999685000000005,6.3799999998614965E-6]
[{"$f":"\"Change in computed horizontal distance between \"&A$37&\" and \"&A$42&\" by adjusting from grid to ground (approx. \"&ROUND(SQRT((C38-C43)^2+(D38-D43)^2),0)&\" ft dist.):\"","v":{"$error":"#N/A"}},null,null,null,null,"Grid vs. Ground (XLS)",null,null,"NZ",4028,40,28,7396614.125,30.84525,0.99999378000000005,3.0699999999939109E-6]
[null,null,null,null,null,{"$f":"IF(ABS(C38-C43)>ABS(C37-C42),ABS(ROUND((C37-C38)-(C42-C43),3))&\"' further N-S\",ABS(ROUND((C37-C38)-(C42-C43),3))&\"' nearer N-S\")","v":{"$error":"#N/A"}},{"$f":"IF(ABS(D38-D43)>ABS(D37-D42),ABS(ROUND((D37-D38)-(D42-D43),3))&\"' further E-W\",ABS(ROUND((D37-D38)-(D42-D43),3))&\"' nearer E-W\")","v":{"$error":"#N/A"}},null,"NZ",4029,40,29,7394763.409,30.84525,0.99999079999999996,2.9800000000967941E-6]
[null,null,null,null,null,null,null,null,"NZ",4030,40,30,7392912.6940000001,30.84525,0.99998790000000004,2.899999999916858E-6]
[null,null,null,null,null,null,null,null,"NZ",4031,40,31,7391061.9790000003,30.84526,0.99998507999999997,2.8200000000699887E-6]
[null,null,null,null,null,null,null,null,"NZ",4032,40,32,7389211.2630000003,30.84526,0.99998235000000002,2.7299999999508273E-6]
[null,null,null,null,null,null,null,null,"NZ",4033,40,33,7387360.5480000004,30.845269999999999,0.99997970000000003,2.6499999999929358E-6]
[null,null,null,null,null,null,null,null,"NZ",4034,40,34,7385509.8310000002,30.845279999999999,0.99997712999999999,2.5700000000350443E-6]
[null,null,null,null,null,null,null,null,"NZ",4035,40,35,7383659.1140000001,30.845300000000002,0.99997464999999996,2.4800000000269051E-6]
[null,null,null,null,null,null,null,null,"NZ",4036,40,36,7381808.3959999997,30.845320000000001,0.99997225000000001,2.3999999999579913E-6]
[null,null,null,null,null,null,null,null,"NZ",4037,40,37,7379957.6770000001,30.845330000000001,0.99996993000000001,2.3200000000000998E-6]
[null,null,null,null,null,null,null,null,"NZ",4038,40,38,7378106.9570000004,30.845359999999999,0.99996770000000001,2.2299999999919606E-6]
[null,null,null,null,null,null,null,null,"NZ",4039,40,39,7376256.2359999996,30.845379999999999,0.99996556000000003,2.1399999999838215E-6]
[null,null,null,null,null,null,null,null,"NZ",4040,40,40,7374405.5130000003,30.845410000000001,0.99996348999999995,2.0700000000761776E-6]
[null,null,null,null,null,null,null,null,"NZ",4041,40,41,7372554.7889999999,30.84544,0.99996151,1.9799999999570161E-6]
[null,null,null,null,null,null,null,null,"NZ",4042,40,42,7370704.0619999999,30.845469999999999,0.99995961,1.8999999999991246E-6]
[null,null,null,null,null,null,null,null,"NZ",4043,40,43,7368853.3339999998,30.845500000000001,0.99995780000000001,1.8099999999909855E-6]
[null,null,null,null,null,null,null,null,"NZ",4044,40,44,7367002.6040000003,30.84554,0.99995606999999997,1.730000000033094E-6]
[null,null,null,null,null,null,null,null,"NZ",4045,40,45,7365151.8720000004,30.845580000000002,0.99995442999999995,1.6400000000249548E-6]
[null,null,null,null,null,null,null,null,"NZ",4046,40,46,7363301.1370000001,30.84562,0.99995286999999999,1.559999999956041E-6]
[null,null,null,null,null,null,null,null,"NZ",4047,40,47,7361450.3990000002,30.845669999999998,0.99995139,{"$f":"O67-O68","v":1.4799999999981495E-6}]
[null,null,null,null,null,null,null,null,"NZ",4048,40,48,7359599.659,30.84572,0.99995000000000001,1.3899999999900103E-6]
[null,null,null,null,null,null,null,null,"NZ",4049,40,49,7357748.9160000002,30.845770000000002,0.99994868999999997,1.3100000000321188E-6]
[null,null,null,null,null,null,null,null,"NZ",4050,40,50,7355898.1699999999,30.84582,0.99994746000000001,1.229999999963205E-6]
[null,null,null,null,null,null,null,null,"NZ",4051,40,51,7354047.4210000001,30.845880000000001,0.99994632000000006,1.1399999999550658E-6]
[null,null,null,null,null,null,null,null,"NZ",4052,40,52,7352196.6689999998,30.845929999999999,0.99994527,1.050000000057949E-6]
[null,null,null,null,null,null,null,null,"NZ",4053,40,53,7350345.9129999997,30.84599,0.99994428999999996,9.8000000003928278E-7]
[null,null,null,null,null,null,null,null,"NZ",4054,40,54,7348495.1529999999,30.846060000000001,0.99994340000000004,8.8999999992012135E-7]
[null,null,null,null,null,null,null,null,"NZ",4055,40,55,7346644.3899999997,30.846119999999999,0.99994260000000001,8.0000000002300453E-7]
[null,null,null,null,null,null,null,null,"NZ",4056,40,56,7344793.6220000004,30.84619,0.99994187999999995,7.20000000065113E-7]
[null,null,null,null,null,null,null,null,"NZ",4057,40,57,7342942.8509999998,30.846260000000001,0.99994123999999995,6.3999999999619916E-7]
[null,null,null,null,null,null,null,null,"NZ",4058,40,58,7341092.0750000002,30.846340000000001,0.99994068999999997,5.4999999998806004E-7]
[null,null,null,null,null,null,null,null,"NZ",4059,40,59,7339241.2949999999,30.846409999999999,0.99994022000000005,4.6999999991914621E-7]
[null,null,null,null,null,null,null,null,"NZ",4100,41,0,7337390.5099999998,30.846489999999999,0.99993984000000002,3.8000000002202938E-7]
[null,null,null,null,null,null,null,null,"NZ",4101,41,1,7335539.7199999997,30.84657,0.99993953999999996,3.0000000006413785E-7]
[null,null,null,null,null,null,null,null,"NZ",4102,41,2,7333688.926,30.84666,0.99993931999999996,2.1999999999522402E-7]
[null,null,null,null,null,null,null,null,"NZ",4103,41,3,7331838.1270000003,30.84674,0.99993918999999998,1.2999999998708489E-7]
[null,null,null,null,null,null,null,null,"NZ",4104,41,4,7329987.3219999997,30.846830000000001,0.99993913999999995,5.0000000029193359E-8]
[null,null,null,null,null,null,null,null,"NZ",4105,41,5,7328136.5120000001,30.84693,0.99993918000000004,-4.0000000089968069E-8]
[null,null,null,null,null,null,null,null,"NZ",4106,41,6,7326285.6960000005,30.847020000000001,0.99993929999999998,-1.199999999368373E-7]
[null,null,null,null,null,null,null,null,"NZ",4107,41,7,7324434.875,30.84712,0.99993949999999998,-2.0000000000575113E-7]
[null,null,null,null,null,null,null,null,"NZ",4108,41,8,7322584.0480000004,30.84722,0.99993979,-2.9000000001389026E-7]
[null,null,null,null,null,null,null,null,"NZ",4109,41,9,7320733.2149999999,30.84732,0.99994017000000002,-3.8000000002202938E-7]
[null,null,null,null,null,null,null,null,"NZ",4110,41,10,7318882.3760000002,30.84742,0.99994063,-4.5999999997992091E-7]
[null,null,null,null,null,null,null,null,"NZ",4111,41,11,7317031.5310000004,30.847529999999999,0.99994117000000005,-5.4000000004883475E-7]
[null,null,null,null,null,null,null,null,"NZ",4112,41,12,7315180.6789999995,30.847639999999998,0.99994179999999999,-6.2999999994595157E-7]
[null,null,null,null,null,null,null,null,"NZ",4113,41,13,7313329.8200000003,30.847760000000001,0.99994251000000001,-7.1000000001486541E-7]
[null,null,null,null,null,null,null,null,"NZ",4114,41,14,7311478.9550000001,30.84787,0.99994331000000003,-8.0000000002300453E-7]
[null,null,null,null,null,null,null,null,"NZ",4115,41,15,7309628.0829999996,30.847989999999999,0.99994419000000001,-8.7999999998089606E-7]
[null,null,null,null,null,null,null,null,"NZ",4116,41,16,7307777.2029999997,30.848109999999998,0.99994514999999995,-9.599999999387876E-7]
[null,null,null,null,null,null,null,null,"NZ",4117,41,17,7305926.3169999998,30.848230000000001,0.99994620000000001,-1.050000000057949E-6]
[null,null,null,null,null,null,null,null,"NZ",4118,41,18,7304075.4230000004,30.84836,0.99994733999999996,-1.1399999999550658E-6]
[null,null,null,null,null,null,null,null,"NZ",4119,41,19,7302224.5209999997,30.848490000000002,0.99994855999999999,{"$f":"O99-O100","v":-1.2200000000239797E-6}]
[null,null,null,null,null,null,null,null,"NZ",4120,41,20,7300373.6119999997,30.84862,0.99994985999999997,-1.2999999999818712E-6]
[null,null,null,null,null,null,null,null,"NZ",4121,41,21,7298522.6950000003,30.848749999999999,0.99995124999999996,-1.3899999999900103E-6]
[null,null,null,null,null,null,null,null,"NZ",4122,41,22,7296671.7699999996,30.848890000000001,0.99995272000000002,-1.4700000000589242E-6]
[null,null,null,null,null,null,null,null,"NZ",4123,41,23,7294820.8370000003,30.849029999999999,0.99995427999999997,-1.559999999956041E-6]
[null,null,null,null,null,null,null,null,"NZ",4124,41,24,7292969.8949999996,30.849170000000001,0.99995592,-1.6400000000249548E-6]
[null,null,null,null,null,null,null,null,"NZ",4125,41,25,7291118.9450000003,30.849309999999999,0.99995765000000003,-1.730000000033094E-6]
[null,null,null,null,null,null,null,null,"NZ",4126,41,26,7289267.9859999996,30.849460000000001,0.99995946000000002,-1.8099999999909855E-6]
[null,null,null,null,null,null,null,null,"NZ",4127,41,27,7287417.0180000002,30.849609999999998,0.99996136000000002,-1.8999999999991246E-6]
[null,null,null,null,null,null,null,null,"NZ",4128,41,28,7285566.0420000004,30.84976,0.99996333999999998,-1.9799999999570161E-6]
[null,null,null,null,null,null,null,null,"NZ",4129,41,29,7283715.0559999999,30.849920000000001,0.99996541000000005,-2.0700000000761776E-6]
[null,null,null,null,null,null,null,null,"NZ",4130,41,30,7281864.0609999998,30.850069999999999,0.99996755999999998,-2.1499999999230468E-6]
[null,null,null,null,null,null,null,null,"NZ",4131,41,31,7280013.057,30.85023,0.99996978999999997,-2.2299999999919606E-6]
[null,null,null,null,null,null,null,null,"NZ",4132,41,32,7278162.0429999996,30.8504,0.99997212000000002,-2.3300000000503474E-6]
[null,null,null,null,null,null,null,null,"NZ",4133,41,33,7276311.0190000003,30.850560000000002,0.99997451999999998,-2.3999999999579913E-6]
[null,null,null,null,null,null,null,null,"NZ",4134,41,34,7274459.9850000003,30.850729999999999,0.99997701000000006,-2.4900000000771527E-6]
[null,null,null,null,null,null,null,null,"NZ",4135,41,35,7272608.9409999996,30.850899999999999,0.99997959000000003,-2.5799999999742695E-6]
[null,null,null,null,null,null,null,null,"NZ",4136,41,36,7270757.8870000001,30.85107,0.99998224999999996,-2.6599999999321611E-6]
[null,null,null,null,null,null,null,null,"NZ",4137,41,37,7268906.8229999999,30.85125,0.99998498999999996,-2.7400000000010749E-6]
[null,null,null,null,null,null,null,null,"NZ",4138,41,38,7267055.7479999997,30.851430000000001,0.99998783000000002,-2.8400000000594616E-6]
[null,null,null,null,null,null,null,null,"NZ",4139,41,39,7265204.6619999995,30.851610000000001,0.99999073999999999,-2.9099999999671056E-6]
[null,null,null,null,null,null,null,null,"NZ",4140,41,40,7263353.5659999996,30.851790000000001,0.99999373999999996,-2.9999999999752447E-6]
[null,null,null,null,null,null,null,null,"NZ",4141,41,41,7261502.4579999996,30.851980000000001,0.99999682999999995,-3.0899999999833838E-6]
[null,null,null,null,null,null,null,null,"NZ",4142,41,42,7259651.3389999997,30.852170000000001,1,-3.1700000000522977E-6]
[null,null,null,null,null,null,null,null,"NZ",4143,41,43,7257800.2089999998,30.852360000000001,1.0000032599999999,-3.2599999999494145E-6]
[null,null,null,null,null,null,null,null,"NZ",4144,41,44,7255949.068,30.852550000000001,1.0000066000000001,-3.3400000001293506E-6]
[null,null,null,null,null,null,null,null,"NZ",4145,41,45,7254097.915,30.85275,1.0000100199999999,-3.4199999998651975E-6]
[null,null,null,null,null,null,null,null,"NZ",4146,41,46,7252246.75,30.85295,1.0000135400000001,-3.5200000001456289E-6]
[null,null,null,null,null,null,null,null,"NZ",4147,41,47,7250395.5729999999,30.853149999999999,1.00001713,-3.5899999999422505E-6]
[null,null,null,null,null,null,null,null,"NZ",4148,41,48,7248544.3839999996,30.853359999999999,1.00002082,-3.6900000000006372E-6]
[null,null,null,null,null,null,null,null,"NZ",4149,41,49,7246693.182,30.853560000000002,1.0000245800000001,-3.7600000000193035E-6]
[null,null,null,null,null,null,null,null,"NZ",4150,41,50,7244841.9680000003,30.853770000000001,1.0000284399999999,-3.8599999998556456E-6]
[null,null,null,null,null,null,null,null,"NZ",4151,41,51,7242990.7419999996,30.85399,1.0000323799999999,{"$f":"O131-O132","v":-3.9400000000355817E-6}]
[null,null,null,null,null,null,null,null,"NZ",4152,41,52,7241139.5029999996,30.854199999999999,1.0000363999999999,-4.0199999999934732E-6]
[null,null,null,null,null,null,null,null,"NZ",4153,41,53,7239288.2510000002,30.854420000000001,1.00004051,-4.1100000001126347E-6]
[null,null,null,null,null,null,null,null,"NZ",4154,41,54,7237436.9850000003,30.85464,1.0000446999999999,-4.1899999998484816E-6]
[null,null,null,null,null,null,null,null,"NZ",4155,41,55,7235585.7070000004,30.854859999999999,1.0000489800000001,-4.2800000001896876E-6]
[null,null,null,null,null,null,null,null,"NZ",4156,41,56,7233734.415,30.855090000000001,1.00005335,-4.3699999998647598E-6]
[null,null,null,null,null,null,null,null,"NZ",4157,41,57,7231883.1100000003,30.855319999999999,1.0000578,-4.450000000044696E-6]
[null,null,null,null,null,null,null,null,"NZ",4158,41,58,7230031.7910000002,30.855550000000001,1.0000623399999999,-4.5399999999418128E-6]
[null,null,null,null,null,null,null,null,"NZ",4159,41,59,7228180.4579999996,30.855779999999999,1.0000669600000001,-4.6200000001217489E-6]
[null,null,null,null,null,null,null,null,"NZ",4200,42,0,7226329.1109999996,30.856020000000001,1.0000716700000001,-4.7100000000188658E-6]
[null,null,null,null,null,null,null,null,"NZ",4201,42,1,7224477.7489999998,30.856259999999999,1.0000764600000001,-4.7899999999767573E-6]
[null,null,null,null,null,null,null,null,"NZ",4202,42,2,7222626.3739999998,30.8565,1.0000813399999999,-4.8799999998738741E-6]
[null,null,null,null,null,null,null,null,"NZ",4203,42,3,7220774.9840000002,30.856750000000002,1.0000863,-4.9600000000538103E-6]
[null,null,null,null,null,null,null,null,"NZ",4204,42,4,7218923.5789999999,30.85699,1.0000913499999999,-5.0499999999509271E-6]
[null,null,null,null,null,null,null,null,"NZ",4205,42,5,7217072.1600000001,30.857240000000001,1.00009649,-5.1400000000700885E-6]
[null,null,null,null,null,null,null,null,"NZ",4206,42,6,7215220.7249999996,30.857489999999999,1.00010171,-5.22000000002798E-6]
[null,null,null,null,null,null,null,null,"NZ",4207,42,7,7213369.2750000004,30.857749999999999,1.00010702,-5.3099999999250969E-6]
[null,null,null,null,null,null,null,null,"NZ",4208,42,8,7211517.8109999998,30.85801,1.0001124100000001,-5.390000000105033E-6]
[null,null,null,null,null,null,null,null,"NZ",4209,42,9,7209666.3300000001,30.858270000000001,1.0001178900000001,-5.4800000000021498E-6]
[null,null,null,null,null,null,null,null,"NZ",4210,42,10,7207814.8339999998,30.858529999999998,1.00012345,-5.5599999999600414E-6]
[null,null,null,null,null,null,null,null,"SZ",3800,38,0,7932869.0369999995,30.839220000000001,1.00022476]
[null,null,null,null,null,null,null,null,"SZ",3801,38,1,7931018.6840000004,30.839099999999998,1.00021786,{"$f":"O152-O153","v":6.9000000000318806E-6}]
[null,null,null,null,null,null,null,null,"SZ",3802,38,2,7929168.3380000005,30.838979999999999,1.0002110500000001,6.8099999999127192E-6]
[null,null,null,null,null,null,null,null,"SZ",3803,38,3,7927318,30.83886,1.0002043300000001,6.7200000000156024E-6]
[null,null,null,null,null,null,null,null,"SZ",3804,38,4,7925467.6679999996,30.838740000000001,1.0001976800000001,6.6499999999969361E-6]
[null,null,null,null,null,null,null,null,"SZ",3805,38,5,7923617.3430000003,30.838629999999998,1.00019112,6.5600000000998193E-6]
[null,null,null,null,null,null,null,null,"SZ",3806,38,6,7921767.0259999996,30.838519999999999,1.0001846400000001,6.4799999999198832E-6]
[null,null,null,null,null,null,null,null,"SZ",3807,38,7,7919916.7149999999,30.83841,1.00017825,6.3900000000227664E-6]
[null,null,null,null,null,null,null,null,"SZ",3808,38,8,7918066.4100000001,30.8383,1.00017193,6.3200000000041001E-6]
[null,null,null,null,null,null,null,null,"SZ",3809,38,9,7916216.1119999997,30.838200000000001,1.0001656999999999,6.2300000001069833E-6]
[null,null,null,null,null,null,null,null,"SZ",3810,38,10,7914365.8200000003,30.838100000000001,1.0001595599999999,6.1399999999878219E-6]
[null,null,null,null,null,null,null,null,"SZ",3811,38,11,7912515.534,30.838100000000001,1.00015349,6.0699999999691556E-6]
[null,null,null,null,null,null,null,null,"SZ",3812,38,12,7910665.2529999996,30.837910000000001,1.0001475099999999,5.9800000000720388E-6]
[null,null,null,null,null,null,null,null,"SZ",3813,38,13,7908814.9790000003,30.837820000000001,1.00014161,5.8999999998921027E-6]
[null,null,null,null,null,null,null,null,"SZ",3814,38,14,7906964.71,30.837720000000001,1.0001358,5.8099999999949858E-6]
[null,null,null,null,null,null,null,null,"SZ",3815,38,15,7905114.4460000005,30.83764,1.00013007,5.7300000000370943E-6]
[null,null,null,null,null,null,null,null,"SZ",3816,38,16,7903264.1880000001,30.83755,1.0001244199999999,5.6500000000792028E-6]
[null,null,null,null,null,null,null,null,"SZ",3817,38,17,7901413.9349999996,30.83747,1.00011885,5.5699999998992666E-6]
[null,null,null,null,null,null,null,null,"SZ",3818,38,18,7899563.6869999999,30.837389999999999,1.00011337,5.4800000000021498E-6]
[null,null,null,null,null,null,null,null,"SZ",3819,38,19,7897713.4440000001,30.837309999999999,1.00010797,5.4000000000442583E-6]
[null,null,null,null,null,null,null,null,"SZ",3820,38,20,7895863.2050000001,30.837240000000001,1.0001026500000001,5.3199999998643221E-6]
[null,null,null,null,null,null,null,null,"SZ",3821,38,21,7894012.9709999999,30.83717,1.00009741,5.2400000001284752E-6]
[null,null,null,null,null,null,null,null,"SZ",3822,38,22,7892162.7410000004,30.8371,1.00009226,5.1500000000093138E-6]
[null,null,null,null,null,null,null,null,"SZ",3823,38,23,7890312.5149999997,30.837029999999999,1.0000872000000001,5.0599999998901524E-6]
[null,null,null,null,null,null,null,null,"SZ",3824,38,24,7888462.2929999996,30.836960000000001,1.00008221,4.9900000000935307E-6]
[null,null,null,null,null,null,null,null,"SZ",3825,38,25,7886612.0750000002,30.8369,1.00007731,4.8999999999743693E-6]
[null,null,null,null,null,null,null,null,"SZ",3826,38,26,7884761.8609999996,30.836839999999999,1.00007249,4.8200000000164778E-6]
[null,null,null,null,null,null,null,null,"SZ",3827,38,27,7882911.6509999996,30.836790000000001,1.0000677600000001,4.7299999998973163E-6]
[null,null,null,null,null,null,null,null,"SZ",3828,38,28,7881061.4440000001,30.836729999999999,1.0000631,4.6600000001006947E-6]
[null,null,null,null,null,null,null,null,"SZ",3829,38,29,7879211.2400000002,30.836680000000001,1.00005853,4.5699999999815333E-6]
[null,null,null,null,null,null,null,null,"SZ",3830,38,30,7877361.0389999999,30.83663,1.0000540499999999,4.4800000000844165E-6]
[null,null,null,null,null,null,null,null,"SZ",3831,38,31,7875510.841,30.836580000000001,1.00004965,4.3999999999044803E-6]
[null,null,null,null,null,null,null,null,"SZ",3832,38,32,7873660.6459999997,30.836539999999999,1.0000453300000001,4.3199999999465888E-6]
[null,null,null,null,null,null,null,null,"SZ",3833,38,33,7871810.4529999997,30.836500000000001,1.0000410900000001,{"$f":"O184-O185","v":4.2399999999886973E-6}]
[null,null,null,null,null,null,null,null,"SZ",3834,38,34,7869960.2630000003,30.836459999999999,1.00003694,4.1500000000915804E-6]
[null,null,null,null,null,null,null,null,"SZ",3835,38,35,7868110.0760000004,30.83642,1.0000328700000001,4.0699999999116443E-6]
[null,null,null,null,null,null,null,null,"SZ",3836,38,36,7866259.8899999997,30.836390000000002,1.0000288799999999,3.9900000001757974E-6]
[null,null,null,null,null,null,null,null,"SZ",3837,38,37,7864409.7070000004,30.836359999999999,1.0000249800000001,3.8999999998345913E-6]
[null,null,null,null,null,null,null,null,"SZ",3838,38,38,7862559.5250000004,30.83633,1.00002116,3.8200000000987444E-6]
[null,null,null,null,null,null,null,null,"SZ",3839,38,39,7860709.3449999997,30.836310000000001,1.00001743,3.729999999979583E-6]
[null,null,null,null,null,null,null,null,"SZ",3840,38,40,7858859.1670000004,30.836279999999999,1.00001377,3.6599999999609167E-6]
[null,null,null,null,null,null,null,null,"SZ",3841,38,41,7857008.9900000002,30.836259999999999,1.0000102099999999,3.5600000001245746E-6]
[null,null,null,null,null,null,null,null,"SZ",3842,38,42,7855158.8140000002,30.83624,1.00000672,3.4899999998838638E-6]
[null,null,null,null,null,null,null,null,"SZ",3843,38,43,7853308.6399999997,30.83623,1.00000332,3.399999999986747E-6]
[null,null,null,null,null,null,null,null,"SZ",3844,38,44,7851458.466,30.836220000000001,1,3.3200000000288554E-6]
[null,null,null,null,null,null,null,null,"SZ",3845,38,45,7849608.2929999996,30.836210000000001,0.99999676999999998,3.2300000000207163E-6]
[null,null,null,null,null,null,null,null,"SZ",3846,38,46,7847758.1210000003,30.836200000000002,0.99999360999999998,3.1600000000020501E-6]
[null,null,null,null,null,null,null,null,"SZ",3847,38,47,7845907.949,30.836189999999998,0.99999055000000003,3.0599999999436633E-6]
[null,null,null,null,null,null,null,null,"SZ",3848,38,48,7844057.7769999998,30.836189999999998,0.99998756,2.9900000000360194E-6]
[null,null,null,null,null,null,null,null,"SZ",3849,38,49,7842207.6059999997,30.836189999999998,0.99998465999999997,2.9000000000278803E-6]
[null,null,null,null,null,null,null,null,"SZ",3850,38,50,7840357.4340000004,30.836189999999998,0.99998184000000001,2.8199999999589664E-6]
[null,null,null,null,null,null,null,null,"SZ",3851,38,51,7838507.2630000003,30.836200000000002,0.99997910999999995,2.7300000000618496E-6]
[null,null,null,null,null,null,null,null,"SZ",3852,38,52,7836657.091,30.836210000000001,0.99997645999999996,2.6499999999929358E-6]
[null,null,null,null,null,null,null,null,"SZ",3853,38,53,7834806.9189999998,30.836220000000001,0.99997389000000003,2.5699999999240219E-6]
[null,null,null,null,null,null,null,null,"SZ",3854,38,54,7832956.7460000003,30.83623,0.99997141,2.4800000000269051E-6]
[null,null,null,null,null,null,null,null,"SZ",3855,38,55,7831106.5719999997,30.83624,0.99996901000000005,2.3999999999579913E-6]
[null,null,null,null,null,null,null,null,"SZ",3856,38,56,7829256.3969999999,30.836259999999999,0.99996669999999999,2.3100000000608745E-6]
[null,null,null,null,null,null,null,null,"SZ",3857,38,57,7827406.2220000001,30.836279999999999,0.99996446999999999,2.2299999999919606E-6]
[null,null,null,null,null,null,null,null,"SZ",3858,38,58,7825556.0449999999,30.836310000000001,0.99996231999999996,2.1500000000340691E-6]
[null,null,null,null,null,null,null,null,"SZ",3859,38,59,7823705.8660000004,30.83633,0.99996026000000005,2.0599999999149077E-6]
[null,null,null,null,null,null,null,null,"SZ",3900,39,0,7821855.6859999998,30.836359999999999,0.99995827999999998,1.9800000000680384E-6]
[null,null,null,null,null,null,null,null,"SZ",3901,39,1,7820005.5039999997,30.836390000000002,0.99995637999999998,1.8999999999991246E-6]
[null,null,null,null,null,null,null,null,"SZ",3902,39,2,7818155.3210000005,30.83643,0.99995456999999999,1.8099999999909855E-6]
[null,null,null,null,null,null,null,null,"SZ",3903,39,3,7816305.1349999998,30.836459999999999,0.99995283999999995,1.730000000033094E-6]
[null,null,null,null,null,null,null,null,"SZ",3904,39,4,7814454.9469999997,30.836500000000001,0.99995118999999999,1.6499999999641801E-6]
[null,null,null,null,null,null,null,null,"SZ",3905,39,5,7812604.7570000002,30.836539999999999,0.99994963000000003,{"$f":"O216-O217","v":1.559999999956041E-6}]
[null,null,null,null,null,null,null,null,"SZ",3906,39,6,7810754.5650000004,30.836590000000001,0.99994815999999997,1.4700000000589242E-6]
[null,null,null,null,null,null,null,null,"SZ",3907,39,7,7808904.3689999999,30.83663,0.99994676000000005,1.3999999999292356E-6]
[null,null,null,null,null,null,null,null,"SZ",3908,39,8,7807054.1710000001,30.836680000000001,0.99994545000000001,1.3100000000321188E-6]
[null,null,null,null,null,null,null,null,"SZ",3909,39,9,7805203.9699999997,30.836739999999999,0.99994422999999999,1.2200000000239797E-6]
[null,null,null,null,null,null,null,null,"SZ",3910,39,10,7803353.7659999998,30.836790000000001,0.99994309000000003,1.1399999999550658E-6]
[null,null,null,null,null,null,null,null,"SZ",3911,39,11,7801503.5590000004,30.836849999999998,0.99994203000000004,1.0599999999971743E-6]
[null,null,null,null,null,null,null,null,"SZ",3912,39,12,7799653.3480000002,30.83691,0.99994106000000005,9.6999999998903519E-7]
[null,null,null,null,null,null,null,null,"SZ",3913,39,13,7797803.1339999996,30.836970000000001,0.99994017000000002,8.9000000003114366E-7]
[null,null,null,null,null,null,null,null,"SZ",3914,39,14,7795952.915,30.837029999999999,0.99993936000000005,8.0999999996222982E-7]
[null,null,null,null,null,null,null,null,"SZ",3915,39,15,7794102.693,30.8371,0.99993863999999999,7.20000000065113E-7]
[null,null,null,null,null,null,null,null,"SZ",3916,39,16,7792252.4670000002,30.83717,0.99993801000000004,6.2999999994595157E-7]
[null,null,null,null,null,null,null,null,"SZ",3917,39,17,7790402.2369999997,30.837250000000001,0.99993745999999994,5.5000000009908234E-7]
[null,null,null,null,null,null,null,null,"SZ",3918,39,18,7788552.0020000003,30.837319999999998,0.99993699000000003,4.6999999991914621E-7]
[null,null,null,null,null,null,null,null,"SZ",3919,39,19,7786701.7630000003,30.837399999999999,0.99993659999999995,3.9000000007227698E-7]
[null,null,null,null,null,null,null,null,"SZ",3920,39,20,7784851.5190000003,30.837479999999999,0.9999363,2.9999999995311555E-7]
[null,null,null,null,null,null,null,null,"SZ",3921,39,21,7783001.2699999996,30.83756,0.99993609000000006,2.0999999994497642E-7]
[null,null,null,null,null,null,null,null,"SZ",3922,39,22,7781151.017,30.83765,0.99993595999999996,1.3000000009810719E-7]
[null,null,null,null,null,null,null,null,"SZ",3923,39,23,7779300.7580000004,30.83774,0.99993591000000004,4.9999999918171056E-8]
[null,null,null,null,null,null,null,null,"SZ",3924,39,24,7777450.4929999998,30.83783,0.99993593999999997,-2.9999999928698173E-8]
[null,null,null,null,null,null,null,null,"SZ",3925,39,25,7775600.2240000004,30.83792,0.99993606999999995,-1.2999999998708489E-7]
[null,null,null,null,null,null,null,null,"SZ",3926,39,26,7773749.949,30.83802,0.99993626999999996,-2.0000000000575113E-7]
[null,null,null,null,null,null,null,null,"SZ",3927,39,27,7771899.6670000004,30.83812,0.99993655999999997,-2.9000000001389026E-7]
[null,null,null,null,null,null,null,null,"SZ",3928,39,28,7770049.3799999999,30.83822,0.99993694,-3.8000000002202938E-7]
[null,null,null,null,null,null,null,null,"SZ",3929,39,29,7768199.0870000003,30.83832,0.99993739000000004,-4.5000000004069562E-7]
[null,null,null,null,null,null,null,null,"SZ",3930,39,30,7766348.7879999997,30.838429999999999,0.99993794000000003,-5.4999999998806004E-7]
[null,null,null,null,null,null,null,null,"SZ",3931,39,31,7764498.4819999998,30.838539999999998,0.99993856000000003,-6.2000000000672628E-7]
[null,null,null,null,null,null,null,null,"SZ",3932,39,32,7762648.1699999999,30.838650000000001,0.99993927999999999,-7.199999999540907E-7]
[null,null,null,null,null,null,null,null,"SZ",3933,39,33,7760797.8509999998,30.838760000000001,0.99994006999999996,-7.8999999997275694E-7]
[null,null,null,null,null,null,null,null,"SZ",3934,39,34,7758947.5250000004,30.83888,0.99994095000000005,-8.8000000009191837E-7]
[null,null,null,null,null,null,null,null,"SZ",3935,39,35,7757097.1919999998,30.838999999999999,0.99994192000000004,-9.6999999998903519E-7]
[null,null,null,null,null,null,null,null,"SZ",3936,39,36,7755246.852,30.839120000000001,0.99994296999999999,-1.0499999999469267E-6]
[null,null,null,null,null,null,null,null,"SZ",3937,39,37,7753396.5049999999,30.83925,0.9999441,{"$f":"O248-O249","v":-1.1300000000158406E-6}]
[null,null,null,null,null,null,null,null,"SZ",3938,39,38,7751546.1500000004,30.839379999999998,0.99994532000000003,-1.2200000000239797E-6]
[null,null,null,null,null,null,null,null,"SZ",3939,39,39,7749695.7869999995,30.839510000000001,0.99994662999999995,-1.3099999999210965E-6]
[null,null,null,null,null,null,null,null,"SZ",3940,39,40,7747845.4170000004,30.839639999999999,0.99994801,-1.380000000050785E-6]
[null,null,null,null,null,null,null,null,"SZ",3941,39,41,7745995.0389999999,30.839780000000001,0.99994949,-1.4799999999981495E-6]
[null,null,null,null,null,null,null,null,"SZ",3942,39,42,7744144.6519999998,30.83991,0.99995104000000001,-1.5500000000168157E-6]
[null,null,null,null,null,null,null,null,"SZ",3943,39,43,7742294.2570000002,30.840050000000002,0.99995268999999998,-1.6499999999641801E-6]
[null,null,null,null,null,null,null,null,"SZ",3944,39,44,7740443.8540000003,30.840199999999999,0.99995440999999996,-1.7199999999828464E-6]
[null,null,null,null,null,null,null,null,"SZ",3945,39,45,7738593.4419999998,30.840340000000001,0.99995621999999995,-1.8099999999909855E-6]
[null,null,null,null,null,null,null,null,"SZ",3946,39,46,7736743.0219999999,30.840489999999999,0.99995811999999995,-1.8999999999991246E-6]
[null,null,null,null,null,null,null,null,"SZ",3947,39,47,7734892.5920000002,30.84064,0.99996010000000002,-1.9800000000680384E-6]
[null,null,null,null,null,null,null,null,"SZ",3948,39,48,7733042.1529999999,30.840800000000002,0.99996216999999998,-2.0699999999651553E-6]
[null,null,null,null,null,null,null,null,"SZ",3949,39,49,7731191.7060000002,30.840949999999999,0.99996432000000002,-2.1500000000340691E-6]
[null,null,null,null,null,null,null,null,"SZ",3950,39,50,7729341.2479999997,30.84111,0.99996655000000001,-2.2299999999919606E-6]
[null,null,null,null,null,null,null,null,"SZ",3951,39,51,7727490.7819999997,30.841270000000002,0.99996887000000001,-2.3200000000000998E-6]
[null,null,null,null,null,null,null,null,"SZ",3952,39,52,7725640.3049999997,30.841439999999999,0.99997128000000002,-2.4100000000082389E-6]
[null,null,null,null,null,null,null,null,"SZ",3953,39,53,7723789.8190000001,30.841609999999999,0.99997376999999998,-2.4899999999661304E-6]
[null,null,null,null,null,null,null,null,"SZ",3954,39,54,7721939.3229999999,30.84178,0.99997634000000002,-2.5700000000350443E-6]
[null,null,null,null,null,null,null,null,"SZ",3955,39,55,7720088.8159999996,30.841950000000001,0.99997899999999995,-2.6599999999321611E-6]
[null,null,null,null,null,null,null,null,"SZ",3956,39,56,7718238.2989999996,30.842120000000001,0.99998175,-2.7500000000513225E-6]
[null,null,null,null,null,null,null,null,"SZ",3957,39,57,7716387.7719999999,30.842300000000002,0.99998458000000001,-2.830000000009214E-6]
[null,null,null,null,null,null,null,null,"SZ",3958,39,58,7714537.2340000002,30.842479999999998,0.99998748999999998,-2.9099999999671056E-6]
[null,null,null,null,null,null,null,null,"SZ",3959,39,59,7712686.6849999996,30.842659999999999,0.99999048999999995,-2.9999999999752447E-6]
[null,null,null,null,null,null,null,null,"SZ",4000,40,0,7710836.125,30.842849999999999,0.99999358000000005,-3.0900000000944061E-6]
[null,null,null,null,null,null,null,null,"SZ",4001,40,1,7708985.5539999995,30.843039999999998,0.99999674999999999,-3.1699999999412753E-6]
[null,null,null,null,null,null,null,null,"SZ",4002,40,2,7707134.9720000001,30.843229999999998,1,-3.2500000000101892E-6]
[null,null,null,null,null,null,null,null,"SZ",4003,40,3,7705284.3779999996,30.843419999999998,1.0000033399999999,-3.339999999907306E-6]
[null,null,null,null,null,null,null,null,"SZ",4004,40,4,7703433.773,30.843620000000001,1.0000067699999999,-3.4300000000264674E-6]
[null,null,null,null,null,null,null,null,"SZ",4005,40,5,7701583.1560000004,30.843820000000001,1.0000102799999999,-3.509999999984359E-6]
[null,null,null,null,null,null,null,null,"SZ",4006,40,6,7699732.5269999998,30.84402,1.0000138700000001,-3.5900000001642951E-6]
[null,null,null,null,null,null,null,null,"SZ",4007,40,7,7697881.8859999999,30.84422,1.0000175499999999,-3.6799999998393673E-6]
[null,null,null,null,null,null,null,null,"SZ",4008,40,8,7696031.233,30.844429999999999,1.0000213200000001,-3.7700000001805734E-6]
[null,null,null,null,null,null,null,null,"SZ",4009,40,9,7694180.5669999998,30.844639999999998,1.00002517,{"$f":"O280-O281","v":-3.8499999999164203E-6}]
[null,null,null,null,null,null,null,null,"SZ",4010,40,10,7692329.8890000004,30.844850000000001,1.0000290999999999,-3.9299999998743118E-6]
[null,null,null,null,null,null,null,null,"SZ",4011,40,11,7690479.1979999999,30.84506,1.00003313,-4.0300000001547431E-6]
[null,null,null,null,null,null,null,null,"SZ",4012,40,12,7688628.4950000001,30.845279999999999,1.00003723,-4.0999999999513648E-6]
[null,null,null,null,null,null,null,null,"SZ",4013,40,13,7686777.7779999999,30.845500000000001,1.00004143,-4.2000000000097515E-6]
[null,null,null,null,null,null,null,null,"SZ",4014,40,14,7684927.0480000004,30.84572,1.0000457,-4.2700000000284177E-6]
[null,null,null,null,null,null,null,null,"SZ",4015,40,15,7683076.3049999997,30.845949999999998,1.0000500699999999,-4.3699999998647598E-6]
[null,null,null,null,null,null,null,null,"SZ",4016,40,16,7681225.5480000004,30.846170000000001,1.00005451,-4.4400000001054707E-6]
[null,null,null,null,null,null,null,null,"SZ",4017,40,17,7679374.7779999999,30.846399999999999,1.0000590499999999,-4.5399999999418128E-6]
[null,null,null,null,null,null,null,null,"SZ",4018,40,18,7677523.9929999998,30.846640000000001,1.0000636700000001,-4.6200000001217489E-6]
[null,null,null,null,null,null,null,null,"SZ",4019,40,19,7675673.1950000003,30.846869999999999,1.0000683699999999,-4.6999999998575959E-6]
[null,null,null,null,null,null,null,null,"SZ",4020,40,20,7673822.3830000004,30.847110000000001,1.0000731599999999,-4.7899999999767573E-6]
[null,null,null,null,null,null,null,null,"SZ",4021,40,21,7671971.5559999999,30.847349999999999,1.00007804,-4.8800000000959187E-6]
[null,null,null,null,null,null,null,null,"SZ",4022,40,22,7670120.7149999999,30.8476,1.000073,5.0400000000117018E-6]
[null,null,null,null,null,null,null,null,"SZ",4023,40,23,7668269.8590000002,30.847840000000001,1.00008805,-1.5050000000016439E-5]
[null,null,null,null,null,null,null,null,"SZ",4024,40,24,7666418.9890000001,30.848089999999999,1.0000931799999999,-5.1299999999088186E-6]
[null,null,null,null,null,null,null,null,"SZ",4025,40,25,7664568.1030000001,30.84834,1.0000983999999999,-5.22000000002798E-6]
[null,null,null,null,null,null,null,null,"SZ",4026,40,26,7662717.2029999997,30.848600000000001,1.0001036999999999,-5.2999999999858716E-6]
[null,null,null,null,null,null,null,null,"SZ",4027,40,27,7660866.2869999995,30.848849999999999,1.00010909,-5.390000000105033E-6]
[null,null,null,null,null,null,null,null,"SZ",4028,40,28,7659015.3559999997,30.84911,1.0001145600000001,-5.4700000000629245E-6]
[null,null,null,null,null,null,null,null,"SZ",4029,40,29,7657164.409,30.84937,1.00012013,-5.5699999998992666E-6]
[null,null,null,null,null,null,null,null,"SZ",4030,40,30,7655313.4469999997,30.849640000000001,1.0001257699999999,-5.6399999999179329E-6]
[null,null,null,null,null,null,null,null,"SZ",4031,40,31,7653462.4680000003,30.849910000000001,1.0001315,-5.7300000000370943E-6]
[null,null,null,null,null,null,null,null,"SZ",4032,40,32,7651611.4740000004,30.850180000000002,1.0001373200000001,-5.8200000001562557E-6]
[null,null,null,null,null,null,null,null,"SZ",4033,40,33,7649760.4630000005,30.850449999999999,1.0001432299999999,-5.909999999831328E-6]
[null,null,null,null,null,null,null,null,"SZ",4034,40,34,7647909.4359999998,30.850719999999999,1.0001492199999999,-5.9900000000112641E-6]
[null,null,null,null,null,null,null,null,"SZ",4035,40,35,7646058.3930000002,30.850999999999999,1.0001552899999999,-6.0699999999691556E-6]
[null,null,null,null,null,null,null,null,"SZ",4036,40,36,7644207.3329999996,30.851279999999999,1.0001644999999999,-9.2099999999817328E-6]
[null,null,null,null,null,null,null,null,"SZ",4037,40,37,7642356.2560000001,30.851569999999999,1.0001677,-3.2000000000920181E-6]
[null,null,null,null,null,null,null,null,"SZ",4038,40,38,7640505.1619999995,30.851849999999999,1.0001740299999999,-6.3299999999433254E-6]
[null,null,null,null,null,null,null,null,"SZ",4039,40,39,7638654.051,30.852139999999999,1.00018045,-6.4200000000624868E-6]

{"sheet":"GRID>GRND","index":2,"n_rows":95,"n_cols":14,"rows_kept":95,"cut":false,"hidden":false,"merged":[[0,6,0,7],[1,6,1,7],[0,1,0,2],[1,1,1,2],[5,0,5,4],[5,6,5,10],[4,0,4,4],[4,6,4,10]]}
["Project:",{"$f":"REPORT!B2","v":"XXX-XXX-XXXX"},null,null,null,"Input Units (please select):","State Plane Grid - US Survey Feet",null,null,"Unitless Grid to Ground Factor:",{"$f":"REPORT!C13","v":0}]
["Pid:",{"$f":"REPORT!E2","v":"XXXXX"},null,null,null,"Output Units (please select):","Ground - US Survey Feet",null,null,"Project Adjustment Factor:",{"$f":"K1*K3","v":0}]
[null,null,null,null,null,null,null,null,null,"Metric to US Survey Feet Factor:",{"$f":"3937/1200","v":3.2808333333333333}]
[]
["INPUT",null,null,null,null,null,"OUTPUT"]
[{"$f":"G1","v":"State Plane Grid - US Survey Feet"},null,null,null,null,null,{"$f":"G2","v":"Ground - US Survey Feet"},null,null,null,null,null,null,"INPUT UNITS"]
["NAME","NORTH","EAST","ORTHO HT","FEATURE",null,"NAME","NORTH","EAST","ORTHO HT","FEATURE",null,null,"State Plane Grid - Meters"]
[null,null,null,null,null,null,{"$f":"A8","v":0},{"$f":"IF(AND($G$1=\"STATE PLANE GRID - METERS\",$G$2=\"STATE PLANE GRID - US SURVEY FEET\"),B8*$K$3,IF(AND($G$1=\"STATE PLANE GRID - METERS\",$G$2=\"GROUND - METERS\"),B8*$K$1,IF(AND($G$1=\"STATE PLANE GRID - METERS\",$G$2=\"GROUND - US SURVEY FEET\"),B8*$K$2,IF(AND($G$1=\"STATE PLANE GRID - US SURVEY FEET\",$G$2=\"STATE PLANE GRID - METERS\"),B8/$K$3,IF(AND($G$1=\"STATE PLANE GRID - US SURVEY FEET\",$G$2=\"GROUND - METERS\"),B8/$K$2,IF(AND($G$1=\"STATE PLANE GRID - US SURVEY FEET\",$G$2=\"GROUND - US SURVEY FEET\"),B8*$K$1,IF(AND($G$1=\"GROUND - METERS\",$G$2=\"STATE PLANE GRID - US SURVEY FEET\"),B8*$K$3/$K$1,IF(AND($G$1=\"GROUND - METERS\",$G$2=\"STATE PLANE GRID - METERS\"),B8/$K$1,IF(AND($G$1=\"GROUND - METERS\",$G$2=\"GROUND - US SURVEY FEET\"),B8*$K$3,IF(AND($G$1=\"GROUND - US SURVEY FEET\",$G$2=\"STATE PLANE GRID - US SURVEY FEET\"),B8/$K$1,IF(AND($G$1=\"GROUND - US SURVEY FEET\",$G$2=\"STATE PLANE GRID - METERS\"),B8/$K$2,IF(AND($G$1=\"GROUND - US SURVEY FEET\",$G$2=\"GROUND - METERS\"),B8/$K$3))))))))))))","v":0},{"$f":"IF(AND($G$1=\"STATE PLANE GRID - METERS\",$G$2=\"STATE PLANE GRID - US SURVEY FEET\"),C8*$K$3,IF(AND($G$1=\"STATE PLANE GRID - METERS\",$G$2=\"GROUND - METERS\"),C8*$K$1,IF(AND($G$1=\"STATE PLANE GRID - METERS\",$G$2=\"GROUND - US SURVEY FEET\"),C8*$K$2,IF(AND($G$1=\"STATE PLANE GRID - US SURVEY FEET\",$G$2=\"STATE PLANE GRID - METERS\"),C8/$K$3,IF(AND($G$1=\"STATE PLANE GRID - US SURVEY FEET\",$G$2=\"GROUND - METERS\"),C8/$K$2,IF(AND($G$1=\"STATE PLANE GRID - US SURVEY FEET\",$G$2=\"GROUND - US SURVEY FEET\"),C8*$K$1,IF(AND($G$1=\"GROUND - METERS\",$G$2=\"STATE PLANE GRID - US SURVEY FEET\"),C8*$K$3/$K$1,IF(AND($G$1=\"GROUND - METERS\",$G$2=\"STATE PLANE GRID - METERS\"),C8/$K$1,IF(AND($G$1=\"GROUND - METERS\",$G$2=\"GROUND - US SURVEY FEET\"),C8*$K$3,IF(AND($G$1=\"GROUND - US SURVEY FEET\",$G$2=\"STATE PLANE GRID - US SURVEY FEET\"),C8/$K$1,IF(AND($G$1=\"GROUND - US SURVEY FEET\",$G$2=\"STATE PLANE GRID - METERS\"),C8/$K$2,IF(AND($G$1=\"GROUND - US SURVEY FEET\",$G$2=\"GROUND - METERS\"),C8/$K$3))))))))))))","v":0},{"$f":"IF(AND($G$1=\"STATE PLANE GRID - METERS\",$G$2=\"STATE PLANE GRID - US SURVEY FEET\"),D8*$K$3,IF(AND($G$1=\"STATE PLANE GRID - METERS\",$G$2=\"GROUND - METERS\"),B8,IF(AND($G$1=\"STATE PLANE GRID - METERS\",$G$2=\"GROUND - US SURVEY FEET\"),D8*$K$3,IF(AND($G$1=\"STATE PLANE GRID - US SURVEY FEET\",$G$2=\"STATE PLANE GRID - METERS\"),D8/$K$3,IF(AND($G$1=\"STATE PLANE GRID - US SURVEY FEET\",$G$2=\"GROUND - METERS\"),D8/$K$3,IF(AND($G$1=\"STATE PLANE GRID - US SURVEY FEET\",$G$2=\"GROUND - US SURVEY FEET\"),D8,IF(AND($G$1=\"GROUND - METERS\",$G$2=\"STATE PLANE GRID - US SURVEY FEET\"),D8*$K$3,IF(AND($G$1=\"GROUND - METERS\",$G$2=\"STATE PLANE GRID - METERS\"),D8,IF(AND($G$1=\"GROUND - METERS\",$G$2=\"GROUND - US SURVEY FEET\"),D8*$K$3,IF(AND($G$1=\"GROUND - US SURVEY FEET\",$G$2=\"STATE PLANE GRID - US SURVEY FEET\"),D8,IF(AND($G$1=\"GROUND - US SURVEY FEET\",$G$2=\"STATE PLANE GRID - METERS\"),D8/$K$3,IF(AND($G$1=\"GROUND - US SURVEY FEET\",$G$2=\"GROUND - METERS\"),D8/$K$3))))))))))))","v":0},{"$f":"E8","v":0},null,null,"State Plane Grid - US Survey Feet"]
[null,null,null,null,null,null,0,0,0,0,0,null,null,"Ground - Meters"]
[null,null,null,null,null,null,0,0,0,0,0,null,null,"Ground - US Survey Feet"]
[null,null,null,null,null,null,0,0,0,0,0]
[null,null,null,null,null,null,0,0,0,0,0]
[null,null,null,null,null,null,0,0,0,0,0]
[null,null,null,null,null,null,0,0,0,0,0]
[null,null,null,null,null,null,0,0,0,0,0]
[null,null,null,null,null,null,0,0,0,0,0]
[null,null,null,null,null,null,0,0,0,0,0]
[null,null,null,null,null,null,0,0,0,0,0]
[null,null,null,null,null,null,0,0,0,0,0]
[null,null,null,null,null,null,0,0,0,0,0]
[null,null,null,null,null,null,0,0,0,0,0]
[null,null,null,null,null,null,0,0,0,0,0]
[null,null,null,null,null,null,0,0,0,0,0]
[null,null,null,null,null,null,0,0,0,0,0]
[null,null,null,null,null,null,0,0,0,0,0]
[null,null,null,null,null,null,0,0,0,0,0]
[null,null,null,null,null,null,0,0,0,0,0]
[null,null,null,null,null,null,0,0,0,0,0]
[null,null,null,null,null,null,0,0,0,0,0]
[null,null,null,null,null,null,0,0,0,0,0]
[null,null,null,null,null,null,0,0,0,0,0]
[null,null,null,null,null,null,0,0,0,0,0]
[null,null,null,null,null,null,0,0,0,0,0]
[null,null,null,null,null,null,0,0,0,0,0]
[null,null,null,null,null,null,0,0,0,0,0]
[null,null,null,null,null,null,0,0,0,0,0]
[null,null,null,null,null,null,0,0,0,0,0]
[null,null,null,null,null,null,0,0,0,0,0]
[null,null,null,null,null,null,0,0,0,0,0]
[null,null,null,null,null,null,0,{"$f":"IF(AND($G$1=\"STATE PLANE GRID - METERS\",$G$2=\"STATE PLANE GRID - US SURVEY FEET\"),B40*$K$3,IF(AND($G$1=\"STATE PLANE GRID - METERS\",$G$2=\"GROUND - METERS\"),B40*$K$1,IF(AND($G$1=\"STATE PLANE GRID - METERS\",$G$2=\"GROUND - US SURVEY FEET\"),B40*$K$2,IF(AND($G$1=\"STATE PLANE GRID - US SURVEY FEET\",$G$2=\"STATE PLANE GRID - METERS\"),B40/$K$3,IF(AND($G$1=\"STATE PLANE GRID - US SURVEY FEET\",$G$2=\"GROUND - METERS\"),B40/$K$2,IF(AND($G$1=\"STATE PLANE GRID - US SURVEY FEET\",$G$2=\"GROUND - US SURVEY FEET\"),B40*$K$1,IF(AND($G$1=\"GROUND - METERS\",$G$2=\"STATE PLANE GRID - US SURVEY FEET\"),B40*$K$3/$K$1,IF(AND($G$1=\"GROUND - METERS\",$G$2=\"STATE PLANE GRID - METERS\"),B40/$K$1,IF(AND($G$1=\"GROUND - METERS\",$G$2=\"GROUND - US SURVEY FEET\"),B40*$K$3,IF(AND($G$1=\"GROUND - US SURVEY FEET\",$G$2=\"STATE PLANE GRID - US SURVEY FEET\"),B40/$K$1,IF(AND($G$1=\"GROUND - US SURVEY FEET\",$G$2=\"STATE PLANE GRID - METERS\"),B40/$K$2,IF(AND($G$1=\"GROUND - US SURVEY FEET\",$G$2=\"GROUND - METERS\"),B40/$K$3))))))))))))","v":0},{"$f":"IF(AND($G$1=\"STATE PLANE GRID - METERS\",$G$2=\"STATE PLANE GRID - US SURVEY FEET\"),C40*$K$3,IF(AND($G$1=\"STATE PLANE GRID - METERS\",$G$2=\"GROUND - METERS\"),C40*$K$1,IF(AND($G$1=\"STATE PLANE GRID - METERS\",$G$2=\"GROUND - US SURVEY FEET\"),C40*$K$2,IF(AND($G$1=\"STATE PLANE GRID - US SURVEY FEET\",$G$2=\"STATE PLANE GRID - METERS\"),C40/$K$3,IF(AND($G$1=\"STATE PLANE GRID - US SURVEY FEET\",$G$2=\"GROUND - METERS\"),C40/$K$2,IF(AND($G$1=\"STATE PLANE GRID - US SURVEY FEET\",$G$2=\"GROUND - US SURVEY FEET\"),C40*$K$1,IF(AND($G$1=\"GROUND - METERS\",$G$2=\"STATE PLANE GRID - US SURVEY FEET\"),C40*$K$3/$K$1,IF(AND($G$1=\"GROUND - METERS\",$G$2=\"STATE PLANE GRID - METERS\"),C40/$K$1,IF(AND($G$1=\"GROUND - METERS\",$G$2=\"GROUND - US SURVEY FEET\"),C40*$K$3,IF(AND($G$1=\"GROUND - US SURVEY FEET\",$G$2=\"STATE PLANE GRID - US SURVEY FEET\"),C40/$K$1,IF(AND($G$1=\"GROUND - US SURVEY FEET\",$G$2=\"STATE PLANE GRID - METERS\"),C40/$K$2,IF(AND($G$1=\"GROUND - US SURVEY FEET\",$G$2=\"GROUND - METERS\"),C40/$K$3))))))))))))","v":0},{"$f":"IF(AND($G$1=\"STATE PLANE GRID - METERS\",$G$2=\"STATE PLANE GRID - US SURVEY FEET\"),D40*$K$3,IF(AND($G$1=\"STATE PLANE GRID - METERS\",$G$2=\"GROUND - METERS\"),B40,IF(AND($G$1=\"STATE PLANE GRID - METERS\",$G$2=\"GROUND - US SURVEY FEET\"),D40*$K$3,IF(AND($G$1=\"STATE PLANE GRID - US SURVEY FEET\",$G$2=\"STATE PLANE GRID - METERS\"),D40/$K$3,IF(AND($G$1=\"STATE PLANE GRID - US SURVEY FEET\",$G$2=\"GROUND - METERS\"),D40/$K$3,IF(AND($G$1=\"STATE PLANE GRID - US SURVEY FEET\",$G$2=\"GROUND - US SURVEY FEET\"),D40,IF(AND($G$1=\"GROUND - METERS\",$G$2=\"STATE PLANE GRID - US SURVEY FEET\"),D40*$K$3,IF(AND($G$1=\"GROUND - METERS\",$G$2=\"STATE PLANE GRID - METERS\"),D40,IF(AND($G$1=\"GROUND - METERS\",$G$2=\"GROUND - US SURVEY FEET\"),D40*$K$3,IF(AND($G$1=\"GROUND - US SURVEY FEET\",$G$2=\"STATE PLANE GRID - US SURVEY FEET\"),D40,IF(AND($G$1=\"GROUND - US SURVEY FEET\",$G$2=\"STATE PLANE GRID - METERS\"),D40/$K$3,IF(AND($G$1=\"GROUND - US SURVEY FEET\",$G$2=\"GROUND - METERS\"),D40/$K$3))))))))))))","v":0},0]
[null,null,null,null,null,null,0,0,0,0,0]
[null,null,null,null,null,null,0,0,0,0,0]
[null,null,null,null,null,null,0,0,0,0,0]
[null,null,null,null,null,null,0,0,0,0,0]
[null,null,null,null,null,null,0,0,0,0,0]
[null,null,null,null,null,null,0,0,0,0,0]
[null,null,null,null,null,null,0,0,0,0,0]
[null,null,null,null,null,null,0,0,0,0,0]
[null,null,null,null,null,null,0,0,0,0,0]
[null,null,null,null,null,null,0,0,0,0,0]
[null,null,null,null,null,null,0,0,0,0,0]
[null,null,null,null,null,null,0,0,0,0,0]
[null,null,null,null,null,null,0,0,0,0,0]
[null,null,null,null,null,null,0,0,0,0,0]
[null,null,null,null,null,null,0,0,0,0,0]
[null,null,null,null,null,null,0,0,0,0,0]
[null,null,null,null,null,null,0,0,0,0,0]
[null,null,null,null,null,null,0,0,0,0,0]
[null,null,null,null,null,null,0,0,0,0,0]
[null,null,null,null,null,null,0,0,0,0,0]
[null,null,null,null,null,null,0,0,0,0,0]
[null,null,null,null,null,null,0,0,0,0,0]
[null,null,null,null,null,null,0,0,0,0,0]
[null,null,null,null,null,null,0,0,0,0,0]
[null,null,null,null,null,null,0,0,0,0,0]
[null,null,null,null,null,null,0,0,0,0,0]
[null,null,null,null,null,null,0,0,0,0,0]
[null,null,null,null,null,null,0,0,0,0,0]
[null,null,null,null,null,null,0,0,0,0,0]
[null,null,null,null,null,null,0,0,0,0,0]
[null,null,null,null,null,null,0,0,0,0,0]
[null,null,null,null,null,null,{"$f":"A72","v":0},{"$f":"IF(AND($G$1=\"STATE PLANE GRID - METERS\",$G$2=\"STATE PLANE GRID - US SURVEY FEET\"),B72*$K$3,IF(AND($G$1=\"STATE PLANE GRID - METERS\",$G$2=\"GROUND - METERS\"),B72*$K$1,IF(AND($G$1=\"STATE PLANE GRID - METERS\",$G$2=\"GROUND - US SURVEY FEET\"),B72*$K$2,IF(AND($G$1=\"STATE PLANE GRID - US SURVEY FEET\",$G$2=\"STATE PLANE GRID - METERS\"),B72/$K$3,IF(AND($G$1=\"STATE PLANE GRID - US SURVEY FEET\",$G$2=\"GROUND - METERS\"),B72/$K$2,IF(AND($G$1=\"STATE PLANE GRID - US SURVEY FEET\",$G$2=\"GROUND - US SURVEY FEET\"),B72*$K$1,IF(AND($G$1=\"GROUND - METERS\",$G$2=\"STATE PLANE GRID - US SURVEY FEET\"),B72*$K$3/$K$1,IF(AND($G$1=\"GROUND - METERS\",$G$2=\"STATE PLANE GRID - METERS\"),B72/$K$1,IF(AND($G$1=\"GROUND - METERS\",$G$2=\"GROUND - US SURVEY FEET\"),B72*$K$3,IF(AND($G$1=\"GROUND - US SURVEY FEET\",$G$2=\"STATE PLANE GRID - US SURVEY FEET\"),B72/$K$1,IF(AND($G$1=\"GROUND - US SURVEY FEET\",$G$2=\"STATE PLANE GRID - METERS\"),B72/$K$2,IF(AND($G$1=\"GROUND - US SURVEY FEET\",$G$2=\"GROUND - METERS\"),B72/$K$3))))))))))))","v":0},{"$f":"IF(AND($G$1=\"STATE PLANE GRID - METERS\",$G$2=\"STATE PLANE GRID - US SURVEY FEET\"),C72*$K$3,IF(AND($G$1=\"STATE PLANE GRID - METERS\",$G$2=\"GROUND - METERS\"),C72*$K$1,IF(AND($G$1=\"STATE PLANE GRID - METERS\",$G$2=\"GROUND - US SURVEY FEET\"),C72*$K$2,IF(AND($G$1=\"STATE PLANE GRID - US SURVEY FEET\",$G$2=\"STATE PLANE GRID - METERS\"),C72/$K$3,IF(AND($G$1=\"STATE PLANE GRID - US SURVEY FEET\",$G$2=\"GROUND - METERS\"),C72/$K$2,IF(AND($G$1=\"STATE PLANE GRID - US SURVEY FEET\",$G$2=\"GROUND - US SURVEY FEET\"),C72*$K$1,IF(AND($G$1=\"GROUND - METERS\",$G$2=\"STATE PLANE GRID - US SURVEY FEET\"),C72*$K$3/$K$1,IF(AND($G$1=\"GROUND - METERS\",$G$2=\"STATE PLANE GRID - METERS\"),C72/$K$1,IF(AND($G$1=\"GROUND - METERS\",$G$2=\"GROUND - US SURVEY FEET\"),C72*$K$3,IF(AND($G$1=\"GROUND - US SURVEY FEET\",$G$2=\"STATE PLANE GRID - US SURVEY FEET\"),C72/$K$1,IF(AND($G$1=\"GROUND - US SURVEY FEET\",$G$2=\"STATE PLANE GRID - METERS\"),C72/$K$2,IF(AND($G$1=\"GROUND - US SURVEY FEET\",$G$2=\"GROUND - METERS\"),C72/$K$3))))))))))))","v":0},{"$f":"IF(AND($G$1=\"STATE PLANE GRID - METERS\",$G$2=\"STATE PLANE GRID - US SURVEY FEET\"),D72*$K$3,IF(AND($G$1=\"STATE PLANE GRID - METERS\",$G$2=\"GROUND - METERS\"),B72,IF(AND($G$1=\"STATE PLANE GRID - METERS\",$G$2=\"GROUND - US SURVEY FEET\"),D72*$K$3,IF(AND($G$1=\"STATE PLANE GRID - US SURVEY FEET\",$G$2=\"STATE PLANE GRID - METERS\"),D72/$K$3,IF(AND($G$1=\"STATE PLANE GRID - US SURVEY FEET\",$G$2=\"GROUND - METERS\"),D72/$K$3,IF(AND($G$1=\"STATE PLANE GRID - US SURVEY FEET\",$G$2=\"GROUND - US SURVEY FEET\"),D72,IF(AND($G$1=\"GROUND - METERS\",$G$2=\"STATE PLANE GRID - US SURVEY FEET\"),D72*$K$3,IF(AND($G$1=\"GROUND - METERS\",$G$2=\"STATE PLANE GRID - METERS\"),D72,IF(AND($G$1=\"GROUND - METERS\",$G$2=\"GROUND - US SURVEY FEET\"),D72*$K$3,IF(AND($G$1=\"GROUND - US SURVEY FEET\",$G$2=\"STATE PLANE GRID - US SURVEY FEET\"),D72,IF(AND($G$1=\"GROUND - US SURVEY FEET\",$G$2=\"STATE PLANE GRID - METERS\"),D72/$K$3,IF(AND($G$1=\"GROUND - US SURVEY FEET\",$G$2=\"GROUND - METERS\"),D72/$K$3))))))))))))","v":0},{"$f":"E72","v":0}]
[null,null,null,null,null,null,0,0,0,0,0]
[null,null,null,null,null,null,0,0,0,0,0]
[null,null,null,null,null,null,0,0,0,0,0]
[null,null,null,null,null,null,0,0,0,0,0]
[null,null,null,null,null,null,0,0,0,0,0]
[null,null,null,null,null,null,0,0,0,0,0]
[null,null,null,null,null,null,0,0,0,0,0]
[null,null,null,null,null,null,0,0,0,0,0]
[null,null,null,null,null,null,0,0,0,0,0]
[null,null,null,null,null,null,0,0,0,0,0]
[null,null,null,null,null,null,0,0,0,0,0]
[null,null,null,null,null,null,0,0,0,0,0]
[null,null,null,null,null,null,0,0,0,0,0]
[null,null,null,null,null,null,0,0,0,0,0]
[null,null,null,null,null,null,0,0,0,0,0]
[null,null,null,null,null,null,0,0,0,0,0]
[null,null,null,null,null,null,0,0,0,0,0]
[null,null,null,null,null,null,0,0,0,0,0]
[null,null,null,null,null,null,0,0,0,0,0]
[null,null,null,null,null,null,0,0,0,0,0]
[null,null,null,null,null,null,0,0,0,0,0]
[null,null,null,null,null,null,0,0,0,0,0]
[null,null,null,null,null,null,0,0,0,0,0]

{"sheet":"OWNERS","index":3,"n_rows":1,"n_cols":12,"rows_kept":1,"cut":false,"hidden":false,"merged":[]}
["First","Last","Address","City","State","Zip Code","Deed Book/Page","Auditor Parcel Number","Area","Section","Lot","Tax Map Parcel"]

{"sheet":"OSIP","index":4,"n_rows":96,"n_cols":18,"rows_kept":96,"cut":false,"hidden":false,"merged":[[0,2,0,4],[1,2,1,4],[6,14,6,15],[6,16,6,17],[23,0,23,8],[15,0,15,8],[7,0,7,8]]}
[null,"Project:",{"$f":"REPORT!B2","v":"XXX-XXX-XXXX"}]
[null,"Pid:",{"$f":"REPORT!E2","v":"XXXXX"}]
[]
["Calculate the Project Coordinates for the corners of the Aerial Mapping Raster File"]
["To scale the Geo-referenced file to the Project Datum  ",null,null,null,null,null,null,null,null,null,null,null,null,"Project County:",null,{"$f":"REPORT!B2","v":"XXX-XXX-XXXX"},{"$f":"MID(P5,1,3)","v":"XXX"}]
[]
[null,null,null,null,null,null,null,null,null,null,null,null,null,null,"Photo Corners",null,"Pixel Range"]
["INPUT: SP GRID - US SURVEY FEET",null,null,null,null,null,null,null,null,null,null,null,null,"COUNTY","EASTING","NORTHING","EASTING","NORTHING"]
[null,"X (East)","Y (North) ",null,null,null,null,null,null,null,null,null,null,"ADA",1620000,215000,130000,175000]
["Lower left (SW) origin:",{"$f":"VLOOKUP(MID(REPORT!B2,1,3),OSIP!N9:R96,2,FALSE)","v":{"$error":"#N/A"}},{"$f":"VLOOKUP(MID(REPORT!B2,1,3),OSIP!N9:R96,3,FALSE)","v":{"$error":"#N/A"}},"Enter X,Y from Georeferenced Raster File Header",null,null,null,null,null,null,null,null,null,"ALL",1440000,355000,150000,110000]
["Pixel Range:",{"$f":"VLOOKUP(MID(REPORT!B2,1,3),OSIP!N9:R96,4,FALSE)","v":{"$error":"#N/A"}},{"$f":"VLOOKUP(MID(REPORT!B2,1,3),OSIP!N9:R96,5,FALSE)","v":{"$error":"#N/A"}},"Enter X,Y from Georeferenced Raster File Header",null,null,null,null,null,null,null,null,null,"ASD",1985000,320000,90000,195000]
["Upper right (NE) origin:",{"$f":"B10+B11","v":{"$error":"#N/A"}},{"$f":"C10+C11","v":{"$error":"#N/A"}},"Calculated NE ORIGIN using Delta X & Delta Y",null,null,null,null,null,null,null,null,null,"ASH",2375000,670000,140000,185000]
[null,null,null,null,null,null,null,null,null,null,null,null,null,"ATH",2025000,430000,165000,140000]
["PAF (scale multiplier):",{"$f":"REPORT!C13","v":0},null,"Enter Unitless Project Adjustment Factor for Project",null,null,null,null,null,null,null,null,null,"AUG",1420000,255000,170000,125000]
[null,null,null,null,null,null,null,null,null,null,null,null,null,"BEL",2320000,675000,155000,120000]
["OUTPUT: PROJECT GROUND - US SURVEY FEET",null,null,null,null,null,null,null,null,null,null,null,null,"BRO",1525000,230000,115000,235000]
[null,"X (East)","Y (North) ",null,null,null,null,null,null,null,null,null,null,"BUT",1310000,475000,145000,115000]
["Lower left (SW) origin (MAP01):",{"$f":"PRODUCT(B10,B14)","v":{"$error":"#N/A"}},{"$f":"PRODUCT(C10,B14)","v":{"$error":"#N/A"}},"Calculated Scaled ORIGIN Coordinates",null,null,null,null,null,null,null,null,null,"CAR",2295000,275000,130000,120000]
["Upper right (NE) origin (MAP02):",{"$f":"PRODUCT(B12,B14)","v":{"$error":"#N/A"}},{"$f":"PRODUCT(C12,B14)","v":{"$error":"#N/A"}},"Calculated Scaled ORIGIN Coordinates",null,null,null,null,null,null,null,null,null,"CHP",1535000,730000,160000,105000]
[null,null,null,null,null,null,null,null,null,null,null,null,null,"CLA",1530000,645000,160000,105000]
[null,null,null,"(Edit Header & Footer for Printing File report copy)",null,null,null,null,null,null,null,null,null,"CLE",1450000,280000,100000,190000]
[null,null,null,null,null,null,null,null,null,null,null,null,null,"CLI",1540000,445000,125000,130000]
["1) Place a Shape (BOX) in the MicroStation file at the Project Origin Coordinates and use KEY-IN COMMAND  XY= (X value),(Y value) for both corners",null,null,null,null,null,null,null,null,null,null,null,null,"COL",2355000,335000,165000,130000]
["2) Attach the Raster File using the \"INTERACTIVE\" Toggle & PLACE at the Corners of the BOX",null,null,null,null,null,null,null,null,null,null,null,null,"COS",2050000,175000,165000,115000]
[null,null,null,null,null,null,null,null,null,null,null,null,null,"CRA",1795000,375000,115000,115000]
["This will scale the Aerial Mapping Ortho Photo to fit the PROJECT COORDINATES",null,null,null,null,null,null,null,null,null,null,null,null,"CUY",2110000,585000,170000,145000]
[null,null,null,null,null,null,null,null,null,null,null,null,null,"DAR",1315000,700000,115000,170000]
[null,null,null,null,null,null,null,null,null,null,null,null,null,"DEF",1330000,550000,165000,100000]
[null,null,null,null,null,null,null,null,null,null,null,null,null,"DEL",1755000,165000,150000,120000]
[null,null,null,null,null,null,null,null,null,null,null,null,null,"ERI",1855000,585000,160000,135000]
[null,null,null,null,null,null,null,null,null,null,null,null,null,"FAI",1870000,565000,140000,145000]
[null,null,null,null,null,null,null,null,null,null,null,null,null,"FAY",1635000,500000,125000,130000]
[null,null,null,null,null,null,null,null,null,null,null,null,null,"FRA",1755000,650000,145000,135000]
[null,null,null,null,null,null,null,null,null,null,null,null,null,"FUL",1445000,665000,150000,90000]
[null,null,null,null,null,null,null,null,null,null,null,null,null,"GAL",1940000,210000,145000,170000]
[null,null,null,null,null,null,null,null,null,null,null,null,null,"GEA",2270000,610000,110000,145000]
[null,null,null,null,null,null,null,null,null,null,null,null,null,"GRE",1510000,565000,140000,115000]
[null,null,null,null,null,null,null,null,null,null,null,null,null,"GUE",2180000,670000,145000,145000]
[null,null,null,null,null,null,null,null,null,null,null,null,null,"HAM",1305000,375000,170000,110000]
[null,null,null,null,null,null,null,null,null,null,null,null,null,"HAN",1585000,420000,135000,135000]
[null,null,null,null,null,null,null,null,null,null,null,null,null,"HAR",1580000,305000,135000,120000]
[null,null,null,null,null,null,null,null,null,null,null,null,null,"HAS",2290000,180000,135000,105000]
[null,null,null,null,null,null,null,null,null,null,null,null,null,"HEN",1460000,545000,130000,125000]
[null,null,null,null,null,null,null,null,null,null,null,null,null,"HIG",1575000,370000,155000,135000]
[null,null,null,null,null,null,null,null,null,null,null,null,null,"HOC",1895000,495000,170000,115000]
[null,null,null,null,null,null,null,null,null,null,null,null,null,"HOL",2045000,280000,160000,90000]
[null,null,null,null,null,null,null,null,null,null,null,null,null,"HUR",1870000,480000,145000,115000]
[null,null,null,null,null,null,null,null,null,null,null,null,null,"JAC",1880000,305000,110000,140000]
[null,null,null,null,null,null,null,null,null,null,null,null,null,"JEF",2400000,180000,100000,165000]
[null,null,null,null,null,null,null,null,null,null,null,null,null,"KNO",1895000,205000,165000,130000]
[null,null,null,null,null,null,null,null,null,null,null,null,null,"LAK",2240000,690000,140000,115000]
[null,null,null,null,null,null,null,null,null,null,null,null,null,"LAW",1875000,145000,155000,165000]
[null,null,null,null,null,null,null,null,null,null,null,null,null,"LIC",1885000,695000,175000,135000]
[null,null,null,null,null,null,null,null,null,null,null,null,null,"LOG",1545000,205000,145000,120000]
[null,null,null,null,null,null,null,null,null,null,null,null,null,"LOR",2005000,505000,135000,175000]
[null,null,null,null,null,null,null,null,null,null,null,null,null,"LUC",1585000,635000,225000,125000]
[null,null,null,null,null,null,null,null,null,null,null,null,null,"MAD",1640000,615000,135000,160000]
[null,null,null,null,null,null,null,null,null,null,null,null,null,"MAH",2355000,450000,165000,95000]
[null,null,null,null,null,null,null,null,null,null,null,null,null,"MAR",1710000,275000,160000,105000]
[null,null,null,null,null,null,null,null,null,null,null,null,null,"MED",2055000,480000,140000,110000]
[null,null,null,null,null,null,null,null,null,null,null,null,null,"MEG",2015000,315000,175000,125000]
[null,null,null,null,null,null,null,null,null,null,null,null,null,"MER",1325000,255000,110000,145000]
[null,null,null,null,null,null,null,null,null,null,null,null,null,"MIA",1425000,685000,120000,125000]
[null,null,null,null,null,null,null,null,null,null,null,null,null,"MOE",2300000,560000,145000,125000]
[null,null,null,null,null,null,null,null,null,null,null,null,null,"MOT",1410000,575000,125000,130000]
[null,null,null,null,null,null,null,null,null,null,null,null,null,"MRG",2085000,525000,145000,125000]
[null,null,null,null,null,null,null,null,null,null,null,null,null,"MRW",1820000,245000,115000,140000]
[null,null,null,null,null,null,null,null,null,null,null,null,null,"MUS",2040000,640000,160000,150000]
[null,null,null,null,null,null,null,null,null,null,null,null,null,"NOB",2190000,575000,135000,140000]
[null,null,null,null,null,null,null,null,null,null,null,null,null,"OTT",1715000,650000,20000,105000]
[null,null,null,null,null,null,null,null,null,null,null,null,null,"PAU",1330000,485000,135000,105000]
[null,null,null,null,null,null,null,null,null,null,null,null,null,"PER",1975000,560000,130000,145000]
[null,null,null,null,null,null,null,null,null,null,null,null,null,"PIC",1750000,530000,155000,135000]
[null,null,null,null,null,null,null,null,null,null,null,null,null,"PIK",1715000,345000,175000,95000]
[null,null,null,null,null,null,null,null,null,null,null,null,null,"POR",2270000,480000,115000,140000]
[null,null,null,null,null,null,null,null,null,null,null,null,null,"PRE",1310000,575000,105000,135000]
[null,null,null,null,null,null,null,null,null,null,null,null,null,"PUT",1440000,435000,150000,120000]
[null,null,null,null,null,null,null,null,null,null,null,null,null,"RIC",1900000,320000,115000,165000]
[null,null,null,null,null,null,null,null,null,null,null,null,null,"ROS",1715000,425000,190000,130000]
[null,null,null,null,null,null,null,null,null,null,null,null,null,"SAN",1715000,575000,165000,100000]
[null,null,null,null,null,null,null,null,null,null,null,null,null,"SCI",1745000,205000,185000,170000]
[null,null,null,null,null,null,null,null,null,null,null,null,null,"SEN",1710000,480000,170000,105000]
[null,null,null,null,null,null,null,null,null,null,null,null,null,"SHE",1425000,190000,130000,115000]
[null,null,null,null,null,null,null,null,null,null,null,null,null,"STA",2200000,350000,165000,135000]
[null,null,null,null,null,null,null,null,null,null,null,null,null,"SUM",2190000,450000,85000,175000]
[null,null,null,null,null,null,null,null,null,null,null,null,null,"TRU",2375000,535000,145000,140000]
[null,null,null,null,null,null,null,null,null,null,null,null,null,"TUS",2185000,200000,130000,170000]
[null,null,null,null,null,null,null,null,null,null,null,null,null,"UNI",1650000,160000,265000,295000]
[null,null,null,null,null,null,null,null,null,null,null,null,null,"VAN",1325000,375000,135000,120000]
[null,null,null,null,null,null,null,null,null,null,null,null,null,"VIN",1890000,370000,150000,140000]
[null,null,null,null,null,null,null,null,null,null,null,null,null,"WAR",1440000,460000,115000,125000]
[null,null,null,null,null,null,null,null,null,null,null,null,null,"WAS",2150000,440000,235000,165000]
[null,null,null,null,null,null,null,null,null,null,null,null,null,"WAY",2070000,360000,135000,125000]
[null,null,null,null,null,null,null,null,null,null,null,null,null,"WIL",1335000,645000,130000,105000]
[null,null,null,null,null,null,null,null,null,null,null,null,null,"WOO",1585000,545000,135000,170000]
[null,null,null,null,null,null,null,null,null,null,null,null,null,"WYA",1685000,370000,115000,115000]

{"sheet":"MON TABLE","index":5,"n_rows":218,"n_cols":17,"rows_kept":218,"cut":false,"hidden":false,"merged":[[142,9,143,14],[142,16,143,16],[142,15,143,15],[183,8,186,8],[183,9,183,14],[184,9,184,14],[186,9,186,14],[150,9,150,14],[146,8,150,8],[146,9,147,14],[148,9,148,14],[186,1,186,2],[103,8,103,16],[104,8,104,16],[150,3,150,7],[186,3,186,7],[184,0,185,6],[184,7,185,7],[146,0,147,7],[150,1,150,2],[148,0,149,6],[148,7,149,7],[183,0,183,7],[110,1,110,2],[110,9,110,14],[110,3,110,7],[106,8,110,8],[0,0,0,3],[0,7,0,11],[0,13,0,16],[1,15,1,16],[2,15,3,16],[0,4,0,6],[3,14,4,14],[37,0,37,7],[69,0,69,7],[1,0,2,7],[1,8,5,8],[3,13,4,13],[3,0,4,6],[3,7,4,7],[3,9,4,9],[3,10,4,10],[3,11,4,12],[1,9,2,14],[5,1,5,2],[5,9,5,14],[5,3,5,7],[106,9,107,14],[108,0,109,6],[108,7,109,7],[106,0,107,7],[101,0,101,1],[102,0,102,1],[103,0,103,1],[104,0,104,7],[103,4,103,7],[102,4,102,7],[101,4,101,7],[102,8,102,16],[101,8,101,16],[106,15,106,16],[107,15,108,16],[108,9,108,14]]}
["PROJECT: ",null,null,null,{"$f":"REPORT!B2","v":"XXX-XXX-XXXX"},null,null,"PID:",null,null,null,null,{"$f":"REPORT!$E$2","v":"XXXXX"}]
["PROJECT GROUND COORDINATES - US SURVEY FEET",null,null,null,null,null,null,null,"PROJECT CONTROL POINTS","STATE PLANE GRID COORDINATES",null,null,null,null,null,"  MONUMENTS TO BE SET"]
[null,null,null,null,null,null,null,null,null,null,null,null,null,null,null," DURING CONSTRUCTION"]
["Project coordinates (U.S. Survey Feet) are relative to State Plane Grid coordinates (meters) by a Project Adjustment Factor of:",null,null,null,null,null,null,{"$f":"C103","v":0},null,"Horiz. Datum:",{"$f":"REPORT!C11","v":"NAD83 (2011)"},{"$f":"REPORT!C10","v":"Ohio State Plane, North Zone (3401)"},null,"Vert. Datum:",{"$f":"REPORT!C15","v":"NAVD88"}]
[null,null,null,null,null,null,null,null,null,null,null,null,null,null,null,"ITEM 623.05","ITEM 623.05"]
[null,{"$f":"\"C/L of Right-of-Way SR \"&MID(E1,5,3)","v":"C/L of Right-of-Way SR XXX"},null,{"$f":"REPORT!C32&\" used for alignment\"","v":" used for alignment"},null,null,null,null,null,{"$f":"REPORT!A44&\" defined by GPS from CORS using \"&REPORT!C16&\". All other elevations are established by leveling from \"&REPORT!A44&\".\"","v":"CP01 defined by GPS from CORS using Geoid 12A. All other elevations are established by leveling from CP01."},null,null,null,null,null,"MONUMENT ","REFERENCE"]
["NAME","STATION","OFFSET (US FT)","RT/LT","NORTH (US FT)","EAST (US FT)","ELEVATION (US FT)","FEATURE","DESCRIPTION","NAME","NORTH (m)","EAST (m)","ORTHO HT (m)","NORTH (US FT)","EAST (US FT)","ASSEMBLY","MONUMENT"]
[null,null,null,{"$f":"IF(C8<0,\"LT\",\"RT\")","v":"RT"},null,null,null,null,null,{"$f":"A8","v":0},{"$f":"E8/$C$103","v":{"$error":"#DIV/0!"}},{"$f":"F8/$C$103","v":{"$error":"#DIV/0!"}},{"$f":"G8/$C$104","v":0},{"$f":"$K8*$C$104","v":{"$error":"#DIV/0!"}},{"$f":"$L8*$C$104","v":{"$error":"#DIV/0!"}}]
[null,null,null,{"$f":"IF(C9<0,\"LT\",\"RT\")","v":"RT"},null,null,null,null,null,{"$f":"A9","v":0},{"$error":"#DIV/0!"},{"$error":"#DIV/0!"},0,{"$error":"#DIV/0!"},{"$error":"#DIV/0!"}]
[null,null,null,"RT",null,null,null,null,null,0,{"$error":"#DIV/0!"},{"$error":"#DIV/0!"},0,{"$error":"#DIV/0!"},{"$error":"#DIV/0!"}]
[null,null,null,"RT",null,null,null,null,null,0,{"$error":"#DIV/0!"},{"$error":"#DIV/0!"},0,{"$error":"#DIV/0!"},{"$error":"#DIV/0!"}]
[null,null,null,"RT",null,null,null,null,null,0,{"$error":"#DIV/0!"},{"$error":"#DIV/0!"},0,{"$error":"#DIV/0!"},{"$error":"#DIV/0!"}]
[null,null,null,"RT",null,null,null,null,null,0,{"$error":"#DIV/0!"},{"$error":"#DIV/0!"},0,{"$error":"#DIV/0!"},{"$error":"#DIV/0!"}]
[null,null,null,"RT",null,null,null,null,null,0,{"$error":"#DIV/0!"},{"$error":"#DIV/0!"},0,{"$error":"#DIV/0!"},{"$error":"#DIV/0!"}]
[null,null,null,"RT",null,null,null,null,null,0,{"$error":"#DIV/0!"},{"$error":"#DIV/0!"},0,{"$error":"#DIV/0!"},{"$error":"#DIV/0!"}]
[null,null,null,"RT",null,null,null,null,null,0,{"$error":"#DIV/0!"},{"$error":"#DIV/0!"},0,{"$error":"#DIV/0!"},{"$error":"#DIV/0!"}]
[null,null,null,"RT",null,null,null,null,null,0,{"$error":"#DIV/0!"},{"$error":"#DIV/0!"},0,{"$error":"#DIV/0!"},{"$error":"#DIV/0!"}]
[null,null,null,"RT",null,null,null,null,null,0,{"$error":"#DIV/0!"},{"$error":"#DIV/0!"},0,{"$error":"#DIV/0!"},{"$error":"#DIV/0!"}]
[null,null,null,"RT",null,null,null,null,null,0,{"$error":"#DIV/0!"},{"$error":"#DIV/0!"},0,{"$error":"#DIV/0!"},{"$error":"#DIV/0!"}]
[null,null,null,"RT",null,null,null,null,null,0,{"$error":"#DIV/0!"},{"$error":"#DIV/0!"},0,{"$error":"#DIV/0!"},{"$error":"#DIV/0!"}]
[null,null,null,"RT",null,null,null,null,null,0,{"$error":"#DIV/0!"},{"$error":"#DIV/0!"},0,{"$error":"#DIV/0!"},{"$error":"#DIV/0!"}]
[null,null,null,"RT",null,null,null,null,null,0,{"$error":"#DIV/0!"},{"$error":"#DIV/0!"},0,{"$error":"#DIV/0!"},{"$error":"#DIV/0!"}]
[null,null,null,"RT",null,null,null,null,null,0,{"$error":"#DIV/0!"},{"$error":"#DIV/0!"},0,{"$error":"#DIV/0!"},{"$error":"#DIV/0!"}]
[null,null,null,"RT",null,null,null,null,null,0,{"$error":"#DIV/0!"},{"$error":"#DIV/0!"},0,{"$error":"#DIV/0!"},{"$error":"#DIV/0!"}]
[null,null,null,"RT",null,null,null,null,null,0,{"$error":"#DIV/0!"},{"$error":"#DIV/0!"},0,{"$error":"#DIV/0!"},{"$error":"#DIV/0!"}]
[null,null,null,"RT",null,null,null,null,null,0,{"$error":"#DIV/0!"},{"$error":"#DIV/0!"},0,{"$error":"#DIV/0!"},{"$error":"#DIV/0!"}]
[null,null,null,"RT",null,null,null,null,null,0,{"$error":"#DIV/0!"},{"$error":"#DIV/0!"},0,{"$error":"#DIV/0!"},{"$error":"#DIV/0!"}]
[null,null,null,"RT",null,null,null,null,null,0,{"$error":"#DIV/0!"},{"$error":"#DIV/0!"},0,{"$error":"#DIV/0!"},{"$error":"#DIV/0!"}]
[null,null,null,"RT",null,null,null,null,null,0,{"$error":"#DIV/0!"},{"$error":"#DIV/0!"},0,{"$error":"#DIV/0!"},{"$error":"#DIV/0!"}]
[null,null,null,"RT",null,null,null,null,null,0,{"$error":"#DIV/0!"},{"$error":"#DIV/0!"},0,{"$error":"#DIV/0!"},{"$error":"#DIV/0!"}]
[null,null,null,"RT",null,null,null,null,null,0,{"$error":"#DIV/0!"},{"$error":"#DIV/0!"},0,{"$error":"#DIV/0!"},{"$error":"#DIV/0!"}]
[null,null,null,"RT",null,null,null,null,null,{"$f":"A32","v":0},{"$error":"#DIV/0!"},{"$error":"#DIV/0!"},0,{"$error":"#DIV/0!"},{"$error":"#DIV/0!"}]
[null,null,null,"RT",null,null,null,null,null,0,{"$error":"#DIV/0!"},{"$error":"#DIV/0!"},0,{"$error":"#DIV/0!"},{"$error":"#DIV/0!"}]
[null,null,null,"RT",null,null,null,null,null,0,{"$error":"#DIV/0!"},{"$error":"#DIV/0!"},0,{"$error":"#DIV/0!"},{"$error":"#DIV/0!"}]
[null,null,null,"RT",null,null,null,null,null,0,{"$error":"#DIV/0!"},{"$error":"#DIV/0!"},0,{"$error":"#DIV/0!"},{"$error":"#DIV/0!"}]
[null,null,null,"RT",null,null,null,null,null,{"$f":"A36","v":0},{"$error":"#DIV/0!"},{"$error":"#DIV/0!"},0,{"$error":"#DIV/0!"},{"$error":"#DIV/0!"}]
[null,null,null,"RT",null,null,null,null,null,{"$f":"A37","v":0},{"$error":"#DIV/0!"},{"$error":"#DIV/0!"},0,{"$error":"#DIV/0!"},{"$error":"#DIV/0!"}]
[{"$f":"\"EXISTING  MONUMENTATION    \"&\"CENTERLINE OF RIGHT OF WAY    STATE ROUTE \"&MID(E1,5,3)","v":"EXISTING  MONUMENTATION    CENTERLINE OF RIGHT OF WAY    STATE ROUTE XXX"},null,null,null,null,null,null,null,"EXISTING CENTERLINE CONTROL POINTS","Horiz. Datum:",{"$f":"REPORT!C11","v":"NAD83 (2011)"},{"$f":"REPORT!C10","v":"Ohio State Plane, North Zone (3401)"},null,"Vert. Datum:",{"$f":"REPORT!C15","v":"NAVD88"}]
["NAME","STATION","OFFSET (US FT)","RT/LT","NORTH (US FT)","EAST (US FT)","ELEVATION (US FT)","FEATURE","DESCRIPTION","NAME","NORTH (m)","EAST (m)","ORTHO HT (m)","NORTH (US FT)","EAST (US FT)"]
[null,null,null,{"$f":"IF(C40<0,\"LT\",\"RT\")","v":"RT"},null,null,null,null,null,{"$f":"A40","v":0},{"$f":"E40/$C$103","v":{"$error":"#DIV/0!"}},{"$f":"F40/$C$103","v":{"$error":"#DIV/0!"}},{"$f":"G40/$C$104","v":0},{"$f":"$K40*$C$104","v":{"$error":"#DIV/0!"}},{"$f":"$L40*$C$104","v":{"$error":"#DIV/0!"}}]
[null,null,null,"RT",null,null,null,null,null,0,{"$error":"#DIV/0!"},{"$error":"#DIV/0!"},0,{"$error":"#DIV/0!"},{"$error":"#DIV/0!"}]
[null,null,null,"RT",null,null,null,null,null,0,{"$error":"#DIV/0!"},{"$error":"#DIV/0!"},0,{"$error":"#DIV/0!"},{"$error":"#DIV/0!"}]
[null,null,null,"RT",null,null,null,null,null,0,{"$error":"#DIV/0!"},{"$error":"#DIV/0!"},0,{"$error":"#DIV/0!"},{"$error":"#DIV/0!"}]
[null,null,null,"RT",null,null,null,null,null,0,{"$error":"#DIV/0!"},{"$error":"#DIV/0!"},0,{"$error":"#DIV/0!"},{"$error":"#DIV/0!"}]
[null,null,null,"RT",null,null,null,null,null,0,{"$error":"#DIV/0!"},{"$error":"#DIV/0!"},0,{"$error":"#DIV/0!"},{"$error":"#DIV/0!"}]
[null,null,null,"RT",null,null,null,null,null,0,{"$error":"#DIV/0!"},{"$error":"#DIV/0!"},0,{"$error":"#DIV/0!"},{"$error":"#DIV/0!"}]
[null,null,null,"RT",null,null,null,null,null,0,{"$error":"#DIV/0!"},{"$error":"#DIV/0!"},0,{"$error":"#DIV/0!"},{"$error":"#DIV/0!"}]
[null,null,null,"RT",null,null,null,null,null,0,{"$error":"#DIV/0!"},{"$error":"#DIV/0!"},0,{"$error":"#DIV/0!"},{"$error":"#DIV/0!"}]
[null,null,null,"RT",null,null,null,null,null,0,{"$error":"#DIV/0!"},{"$error":"#DIV/0!"},0,{"$error":"#DIV/0!"},{"$error":"#DIV/0!"}]
[null,null,null,"RT",null,null,null,null,null,0,{"$error":"#DIV/0!"},{"$error":"#DIV/0!"},0,{"$error":"#DIV/0!"},{"$error":"#DIV/0!"}]
[null,null,null,"RT",null,null,null,null,null,{"$f":"A51","v":0},{"$error":"#DIV/0!"},{"$error":"#DIV/0!"},0,{"$error":"#DIV/0!"},{"$error":"#DIV/0!"}]
[null,null,null,"RT",null,null,null,null,null,0,{"$error":"#DIV/0!"},{"$error":"#DIV/0!"},0,{"$error":"#DIV/0!"},{"$error":"#DIV/0!"}]
[null,null,null,"RT",null,null,null,null,null,0,{"$error":"#DIV/0!"},{"$error":"#DIV/0!"},0,{"$error":"#DIV/0!"},{"$error":"#DIV/0!"}]
[null,null,null,"RT",null,null,null,null,null,0,{"$error":"#DIV/0!"},{"$error":"#DIV/0!"},0,{"$error":"#DIV/0!"},{"$error":"#DIV/0!"}]
[null,null,null,"RT",null,null,null,null,null,0,{"$error":"#DIV/0!"},{"$error":"#DIV/0!"},0,{"$error":"#DIV/0!"},{"$error":"#DIV/0!"}]
[null,null,null,"RT",null,null,null,null,null,0,{"$error":"#DIV/0!"},{"$error":"#DIV/0!"},0,{"$error":"#DIV/0!"},{"$error":"#DIV/0!"}]
[null,null,null,"RT",null,null,null,null,null,{"$f":"A57","v":0},{"$error":"#DIV/0!"},{"$error":"#DIV/0!"},0,{"$error":"#DIV/0!"},{"$error":"#DIV/0!"}]
[null,null,null,"RT",null,null,null,null,null,0,{"$error":"#DIV/0!"},{"$error":"#DIV/0!"},0,{"$error":"#DIV/0!"},{"$error":"#DIV/0!"}]
[null,null,null,"RT",null,null,null,null,null,0,{"$error":"#DIV/0!"},{"$error":"#DIV/0!"},0,{"$error":"#DIV/0!"},{"$error":"#DIV/0!"}]
[null,null,null,"RT",null,null,null,null,null,0,{"$error":"#DIV/0!"},{"$error":"#DIV/0!"},0,{"$error":"#DIV/0!"},{"$error":"#DIV/0!"}]
[null,null,null,"RT",null,null,null,null,null,0,{"$error":"#DIV/0!"},{"$error":"#DIV/0!"},0,{"$error":"#DIV/0!"},{"$error":"#DIV/0!"}]
[null,null,null,"RT",null,null,null,null,null,0,{"$error":"#DIV/0!"},{"$error":"#DIV/0!"},0,{"$error":"#DIV/0!"},{"$error":"#DIV/0!"}]
[null,null,null,"RT",null,null,null,null,null,0,{"$error":"#DIV/0!"},{"$error":"#DIV/0!"},0,{"$error":"#DIV/0!"},{"$error":"#DIV/0!"}]
[null,null,null,"RT",null,null,null,null,null,0,{"$error":"#DIV/0!"},{"$error":"#DIV/0!"},0,{"$error":"#DIV/0!"},{"$error":"#DIV/0!"}]
[null,null,null,"RT",null,null,null,null,null,0,{"$error":"#DIV/0!"},{"$error":"#DIV/0!"},0,{"$error":"#DIV/0!"},{"$error":"#DIV/0!"}]
[null,null,null,"RT",null,null,null,null,null,0,{"$error":"#DIV/0!"},{"$error":"#DIV/0!"},0,{"$error":"#DIV/0!"},{"$error":"#DIV/0!"}]
[null,null,null,"RT",null,null,null,null,null,0,{"$error":"#DIV/0!"},{"$error":"#DIV/0!"},0,{"$error":"#DIV/0!"},{"$error":"#DIV/0!"}]
[null,null,null,"RT",null,null,null,null,null,0,{"$error":"#DIV/0!"},{"$error":"#DIV/0!"},0,{"$error":"#DIV/0!"},{"$error":"#DIV/0!"}]
[null,null,null,"RT",null,null,null,null,null,0,{"$error":"#DIV/0!"},{"$error":"#DIV/0!"},0,{"$error":"#DIV/0!"},{"$error":"#DIV/0!"}]
[{"$f":"\"    CENTERLINE OF RIGHT OF WAY & CONSTRUCTION    \"&\"STATE ROUTE \"&MID(E1,5,3)","v":"    CENTERLINE OF RIGHT OF WAY & CONSTRUCTION    STATE ROUTE XXX"},null,null,null,null,null,null,null,"CENTERLINE ALIGNMENT","Horiz. Datum:",{"$f":"REPORT!C11","v":"NAD83 (2011)"},{"$f":"REPORT!C10","v":"Ohio State Plane, North Zone (3401)"},null,"Vert. Datum:",{"$f":"REPORT!C15","v":"NAVD88"}]
["NAME","STATION","OFFSET (US FT)","RT/LT","NORTH (US FT)","EAST (US FT)","ELEVATION (US FT)","FEATURE","DESCRIPTION","NAME","NORTH (m)","EAST (m)","ORTHO HT (m)","NORTH (US FT)","EAST (US FT)"]
[null,null,null,{"$f":"IF(C72<0,\"LT\",\"RT\")","v":"RT"},null,null,null,null,null,{"$f":"A72","v":0},{"$f":"E72/$C$103","v":{"$error":"#DIV/0!"}},{"$f":"F72/$C$103","v":{"$error":"#DIV/0!"}},{"$f":"G72/$C$104","v":0},{"$f":"$K72*$C$104","v":{"$error":"#DIV/0!"}},{"$f":"$L72*$C$104","v":{"$error":"#DIV/0!"}}]
[null,null,null,"RT",null,null,null,null,null,{"$f":"A73","v":0},{"$error":"#DIV/0!"},{"$error":"#DIV/0!"},0,{"$error":"#DIV/0!"},{"$error":"#DIV/0!"}]
[null,null,null,"RT",null,null,null,null,null,0,{"$error":"#DIV/0!"},{"$error":"#DIV/0!"},0,{"$error":"#DIV/0!"},{"$error":"#DIV/0!"}]
[null,null,null,"RT",null,null,null,null,null,0,{"$error":"#DIV/0!"},{"$error":"#DIV/0!"},0,{"$error":"#DIV/0!"},{"$error":"#DIV/0!"}]
[null,null,null,"RT",null,null,null,null,null,{"$f":"A76","v":0},{"$error":"#DIV/0!"},{"$error":"#DIV/0!"},0,{"$error":"#DIV/0!"},{"$error":"#DIV/0!"}]
[null,null,null,"RT",null,null,null,null,null,0,{"$error":"#DIV/0!"},{"$error":"#DIV/0!"},0,{"$error":"#DIV/0!"},{"$error":"#DIV/0!"}]
[null,null,null,"RT",null,null,null,null,null,0,{"$error":"#DIV/0!"},{"$error":"#DIV/0!"},0,{"$error":"#DIV/0!"},{"$error":"#DIV/0!"}]
[null,null,null,"RT",null,null,null,null,null,0,{"$error":"#DIV/0!"},{"$error":"#DIV/0!"},0,{"$error":"#DIV/0!"},{"$error":"#DIV/0!"}]
[null,null,null,"RT",null,null,null,null,null,0,{"$error":"#DIV/0!"},{"$error":"#DIV/0!"},0,{"$error":"#DIV/0!"},{"$error":"#DIV/0!"}]
[null,null,null,"RT",null,null,null,null,null,0,{"$error":"#DIV/0!"},{"$error":"#DIV/0!"},0,{"$error":"#DIV/0!"},{"$error":"#DIV/0!"}]
[null,null,null,"RT",null,null,null,null,null,0,{"$error":"#DIV/0!"},{"$error":"#DIV/0!"},0,{"$error":"#DIV/0!"},{"$error":"#DIV/0!"}]
[null,null,null,"RT",null,null,null,null,null,0,{"$error":"#DIV/0!"},{"$error":"#DIV/0!"},0,{"$error":"#DIV/0!"},{"$error":"#DIV/0!"}]
[null,null,null,"RT",null,null,null,null,null,0,{"$error":"#DIV/0!"},{"$error":"#DIV/0!"},0,{"$error":"#DIV/0!"},{"$error":"#DIV/0!"}]
[null,null,null,"RT",null,null,null,null,null,0,{"$error":"#DIV/0!"},{"$error":"#DIV/0!"},0,{"$error":"#DIV/0!"},{"$error":"#DIV/0!"}]
[null,null,null,"RT",null,null,null,null,null,0,{"$error":"#DIV/0!"},{"$error":"#DIV/0!"},0,{"$error":"#DIV/0!"},{"$error":"#DIV/0!"}]
[null,null,null,"RT",null,null,null,null,null,0,{"$error":"#DIV/0!"},{"$error":"#DIV/0!"},0,{"$error":"#DIV/0!"},{"$error":"#DIV/0!"}]
[null,null,null,"RT",null,null,null,null,null,0,{"$error":"#DIV/0!"},{"$error":"#DIV/0!"},0,{"$error":"#DIV/0!"},{"$error":"#DIV/0!"}]
[null,null,null,"RT",null,null,null,null,null,0,{"$error":"#DIV/0!"},{"$error":"#DIV/0!"},0,{"$error":"#DIV/0!"},{"$error":"#DIV/0!"}]
[null,null,null,"RT",null,null,null,null,null,0,{"$error":"#DIV/0!"},{"$error":"#DIV/0!"},0,{"$error":"#DIV/0!"},{"$error":"#DIV/0!"}]
[null,null,null,"RT",null,null,null,null,null,0,{"$error":"#DIV/0!"},{"$error":"#DIV/0!"},0,{"$error":"#DIV/0!"},{"$error":"#DIV/0!"}]
[null,null,null,"RT",null,null,null,null,null,0,{"$error":"#DIV/0!"},{"$error":"#DIV/0!"},0,{"$error":"#DIV/0!"},{"$error":"#DIV/0!"}]
[null,null,null,"RT",null,null,null,null,null,0,{"$error":"#DIV/0!"},{"$error":"#DIV/0!"},0,{"$error":"#DIV/0!"},{"$error":"#DIV/0!"}]
[null,null,null,"RT",null,null,null,null,null,0,{"$error":"#DIV/0!"},{"$error":"#DIV/0!"},0,{"$error":"#DIV/0!"},{"$error":"#DIV/0!"}]
[null,null,null,"RT",null,null,null,null,null,0,{"$error":"#DIV/0!"},{"$error":"#DIV/0!"},0,{"$error":"#DIV/0!"},{"$error":"#DIV/0!"}]
[null,null,null,"RT",null,null,null,null,null,0,{"$error":"#DIV/0!"},{"$error":"#DIV/0!"},0,{"$error":"#DIV/0!"},{"$error":"#DIV/0!"}]
[null,null,null,"RT",null,null,null,null,null,0,{"$error":"#DIV/0!"},{"$error":"#DIV/0!"},0,{"$error":"#DIV/0!"},{"$error":"#DIV/0!"}]
[null,null,null,"RT",null,null,null,null,null,0,{"$error":"#DIV/0!"},{"$error":"#DIV/0!"},0,{"$error":"#DIV/0!"},{"$error":"#DIV/0!"}]
[null,null,null,"RT",null,null,null,null,null,0,{"$error":"#DIV/0!"},{"$error":"#DIV/0!"},0,{"$error":"#DIV/0!"},{"$error":"#DIV/0!"}]
[null,null,null,"RT",null,null,null,null,null,0,{"$error":"#DIV/0!"},{"$error":"#DIV/0!"},0,{"$error":"#DIV/0!"},{"$error":"#DIV/0!"}]
[null,null,null,"RT",null,null,null,null,null,0,{"$error":"#DIV/0!"},{"$error":"#DIV/0!"},0,{"$error":"#DIV/0!"},{"$error":"#DIV/0!"}," "]
["Grid to Ground Multiplier (1/CSF) = ",null,{"$f":"REPORT!C13","v":0},null,"State Plane Grid to Project Ground (same units)",null,null,null,"Unitless Factor:"]
["Project Adjustment Factor (PAF) =",null,{"$f":"C102*C104","v":0},null,"State Plane Grid (meters) to Project Ground (US Survey Feet)",null,null,null,{"$f":"REPORT!A45&REPORT!A46&REPORT!C46","v":"The Grid to Ground Multiplier for the project was computed by taking the inverse of the TBC-generated combined scale factor for: CP01"}]
["English to metric conversion =",null,{"$f":"3937/1200","v":3.2808333333333333},null,"US Survey foor to meters conversion factor",null,null,null,"Primary Project Control:"]
["PROJECT coordinates are scaled from GRID coordinates about the Ohio North Zone grid point N=0, E=0 (N 39⁰ 27' 01.76097\", W 89⁰ 28' 32.98476\").",null,null,null,null,null,null,null,{"$f":"REPORT!A41&REPORT!A42&REPORT!A43","v":"Horizontal control was positioned with a minimum of 5 VRS-derived GNSS observations. Vertical control was established by differential leveling.All positions are in conformance to the ODOT Surveying and Mapping Specifications."}]
[]
["PROJECT GROUND COORDINATES - US SURVEY FEET",null,null,null,null,null,null,null,"PROPOSED RIGHT OF WAY MONUMENTS","STATE PLANE GRID COORDINATES",null,null,null,null,null,"MONUMENTS TO BE RESET"]
[null,null,null,null,null,null,null,null,null,null,null,null,null,null,null,"AFTER CONSTRUCTION"]
[{"$f":"A4","v":"Project coordinates (U.S. Survey Feet) are relative to State Plane Grid coordinates (meters) by a Project Adjustment Factor of:"},null,null,null,null,null,null,{"$f":"H4","v":0}]
[null,null,null,null,null,null,null,null,null,"Horiz. Datum:",{"$f":"REPORT!C11","v":"NAD83 (2011)"},{"$f":"REPORT!C10","v":"Ohio State Plane, North Zone (3401)"},null,"Vert. Datum:",{"$f":"REPORT!C15","v":"NAVD88"},"ITEM 623.05","ITEM 623.05"]
[null,{"$f":"$B$6","v":"C/L of Right-of-Way SR XXX"},null,{"$f":"$D$6","v":" used for alignment"},null,null,null,null,null,null,null,null,null,null,null,"RIGHT OF WAY ","BOUNDARY"]
["NAME","STATION","OFFSET (US FT)","RT/LT","NORTH (US FT)","EAST (US FT)","ELEVATION (US FT)","FEATURE","DESCRIPTION","NAME","NORTH (m)","EAST (m)","ORTHO HT (m)","NORTH (US FT)","EAST (US FT)","PIN (TYPE \"B\")","PIN (TYPE \"B\")"]
[null,null,null,{"$f":"IF(C113<0,\"LT\",\"RT\")","v":"RT"},null,null,null,null,null,{"$f":"A113","v":0},{"$f":"E113/$C$103","v":{"$error":"#DIV/0!"}},{"$f":"F113/$C$103","v":{"$error":"#DIV/0!"}},{"$f":"G113/$C$104","v":0},{"$f":"$K113*$C$104","v":{"$error":"#DIV/0!"}},{"$f":"$L113*$C$104","v":{"$error":"#DIV/0!"}}]
[null,null,null,{"$f":"IF(C114<0,\"LT\",\"RT\")","v":"RT"},null,null,null,null,null,{"$f":"A114","v":0},{"$f":"E114/$C$103","v":{"$error":"#DIV/0!"}},{"$f":"F114/$C$103","v":{"$error":"#DIV/0!"}},{"$f":"G114/$C$104","v":0},{"$error":"#DIV/0!"},{"$error":"#DIV/0!"}," "]
[null,null,null,"RT",null,null,null,null,null,0,{"$error":"#DIV/0!"},{"$error":"#DIV/0!"},0,{"$error":"#DIV/0!"},{"$error":"#DIV/0!"}]
[null,null,null,"RT",null,null,null,null,null,0,{"$error":"#DIV/0!"},{"$error":"#DIV/0!"},0,{"$error":"#DIV/0!"},{"$error":"#DIV/0!"}]
[null,null,null,"RT",null,null,null,null,null,0,{"$error":"#DIV/0!"},{"$error":"#DIV/0!"},0,{"$error":"#DIV/0!"},{"$error":"#DIV/0!"}]
[null,null,null,"RT",null,null,null,null,null,0,{"$error":"#DIV/0!"},{"$error":"#DIV/0!"},0,{"$error":"#DIV/0!"},{"$error":"#DIV/0!"}," "]
[null,null,null,"RT",null,null,null,null,null,0,{"$error":"#DIV/0!"},{"$error":"#DIV/0!"},0,{"$error":"#DIV/0!"},{"$error":"#DIV/0!"}]
[null,null,null,"RT",null,null,null,null,null,0,{"$error":"#DIV/0!"},{"$error":"#DIV/0!"},0,{"$error":"#DIV/0!"},{"$error":"#DIV/0!"}]
[null,null,null,"RT",null,null,null,null,null,0,{"$error":"#DIV/0!"},{"$error":"#DIV/0!"},0,{"$error":"#DIV/0!"},{"$error":"#DIV/0!"}]
[null,null,null,"RT",null,null,null,null,null,0,{"$error":"#DIV/0!"},{"$error":"#DIV/0!"},0,{"$error":"#DIV/0!"},{"$error":"#DIV/0!"}," "]
[null,null,null,"RT",null,null,null,null,null,0,{"$error":"#DIV/0!"},{"$error":"#DIV/0!"},0,{"$error":"#DIV/0!"},{"$error":"#DIV/0!"}]
[null,null,null,"RT",null,null,null,null,null,0,{"$error":"#DIV/0!"},{"$error":"#DIV/0!"},0,{"$error":"#DIV/0!"},{"$error":"#DIV/0!"}]
[null,null,null,"RT",null,null,null,null,null,0,{"$error":"#DIV/0!"},{"$error":"#DIV/0!"},0,{"$error":"#DIV/0!"},{"$error":"#DIV/0!"}]
[null,null,null,"RT",null,null,null,null,null,0,{"$f":"E126/$C$103","v":{"$error":"#DIV/0!"}},{"$error":"#DIV/0!"},0,{"$error":"#DIV/0!"},{"$error":"#DIV/0!"}," "]
[null,null,null,"RT",null,null,null,null,null,0,{"$error":"#DIV/0!"},{"$error":"#DIV/0!"},0,{"$error":"#DIV/0!"},{"$error":"#DIV/0!"}]
[null,null,null,"RT",null,null,null,null,null,0,{"$error":"#DIV/0!"},{"$error":"#DIV/0!"},0,{"$error":"#DIV/0!"},{"$error":"#DIV/0!"}]
[null,null,null,"RT",null,null,null,null,null,0,{"$error":"#DIV/0!"},{"$error":"#DIV/0!"},0,{"$error":"#DIV/0!"},{"$error":"#DIV/0!"}]
[null,null,null,"RT",null,null,null,null,null,{"$f":"A130","v":0},{"$error":"#DIV/0!"},{"$f":"F130/$C$103","v":{"$error":"#DIV/0!"}},{"$f":"G130/$C$104","v":0},{"$error":"#DIV/0!"},{"$error":"#DIV/0!"}," "]
[null,null,null,"RT",null,null,null,null,null,0,{"$error":"#DIV/0!"},{"$error":"#DIV/0!"},0,{"$error":"#DIV/0!"},{"$error":"#DIV/0!"}]
[null,null,null,"RT",null,null,null,null,null,0,{"$error":"#DIV/0!"},{"$error":"#DIV/0!"},0,{"$error":"#DIV/0!"},{"$error":"#DIV/0!"}]
[null,null,null,"RT",null,null,null,null,null,0,{"$error":"#DIV/0!"},{"$error":"#DIV/0!"},0,{"$error":"#DIV/0!"},{"$error":"#DIV/0!"}]
[null,null,null,"RT",null,null,null,null,null,{"$f":"A134","v":0},{"$f":"E134/$C$103","v":{"$error":"#DIV/0!"}},{"$f":"F134/$C$103","v":{"$error":"#DIV/0!"}},{"$f":"G134/$C$104","v":0},{"$error":"#DIV/0!"},{"$error":"#DIV/0!"}," "]
[null,null,null,"RT",null,null,null,null,null,0,{"$error":"#DIV/0!"},{"$error":"#DIV/0!"},0,{"$error":"#DIV/0!"},{"$error":"#DIV/0!"}]
[null,null,null,"RT",null,null,null,null,null,0,{"$error":"#DIV/0!"},{"$error":"#DIV/0!"},0,{"$error":"#DIV/0!"},{"$error":"#DIV/0!"}]
[null,null,null,"RT",null,null,null,null,null,0,{"$error":"#DIV/0!"},{"$error":"#DIV/0!"},0,{"$error":"#DIV/0!"},{"$error":"#DIV/0!"}]
[null,null,null,"RT",null,null,null,null,null,0,{"$error":"#DIV/0!"},{"$error":"#DIV/0!"},0,{"$error":"#DIV/0!"},{"$error":"#DIV/0!"}," "]
[null,null,null,"RT",null,null,null,null,null,0,{"$error":"#DIV/0!"},{"$error":"#DIV/0!"},0,{"$error":"#DIV/0!"},{"$error":"#DIV/0!"}]
[null,null,null,"RT",null,null,null,null,null,0,{"$error":"#DIV/0!"},{"$error":"#DIV/0!"},0,{"$error":"#DIV/0!"},{"$error":"#DIV/0!"}]
[null,null,null,"RT",null,null,null,null,null,0,{"$error":"#DIV/0!"},{"$error":"#DIV/0!"},0,{"$error":"#DIV/0!"},{"$error":"#DIV/0!"}]
[null,null,null,"RT",null,null,null,null,null,0,{"$error":"#DIV/0!"},{"$error":"#DIV/0!"},0,{"$error":"#DIV/0!"},{"$error":"#DIV/0!"}]
[null,null,null,null,null,null,null,null,null,"SUBTOTAL MONUMENTS - QUANTITY CARRIED TO CENTERLINE PLAT SHEET 3 OF 4 ",null,null,null,null,null,{"$f":"+SUM(P112:P142)","v":0},{"$f":"+SUM(Q7:Q142)","v":0}]
[]
[]
[]
["PROJECT GROUND COORDINATES - US SURVEY FEET",null,null,null,null,null,null,null,"EXISTING RIGHT OF WAY POINTS","STATE PLANE GRID COORDINATES"]
[]
[{"$f":"A4","v":"Project coordinates (U.S. Survey Feet) are relative to State Plane Grid coordinates (meters) by a Project Adjustment Factor of:"},null,null,null,null,null,null,{"$f":"H4","v":0}]
[null,null,null,null,null,null,null,null,null,"Horiz. Datum:",{"$f":"REPORT!C11","v":"NAD83 (2011)"},{"$f":"REPORT!C10","v":"Ohio State Plane, North Zone (3401)"},null,"Vert. Datum:",{"$f":"REPORT!C15","v":"NAVD88"}]
[null,{"$f":"$B$6","v":"C/L of Right-of-Way SR XXX"},null,{"$f":"$D$6","v":" used for alignment"}]
["NAME","STATION","OFFSET (US FT)","RT/LT","NORTH (US FT)","EAST (US FT)","ELEVATION (US FT)","FEATURE","DESCRIPTION","NAME","NORTH (m)","EAST (m)","ORTHO HT (m)","NORTH (US FT)","EAST (US FT)"]
[null,null,null,{"$f":"IF(C153<0,\"LT\",\"RT\")","v":"RT"},null,null,null,null,null,{"$f":"A153","v":0},{"$f":"E153/$C$103","v":{"$error":"#DIV/0!"}},{"$error":"#DIV/0!"},{"$f":"G153/$C$104","v":0},{"$f":"$K153*$C$104","v":{"$error":"#DIV/0!"}},{"$f":"$L153*$C$104","v":{"$error":"#DIV/0!"}}]
[null,null,null,"RT",null,null,null,null,null,0,{"$error":"#DIV/0!"},{"$error":"#DIV/0!"},0,{"$error":"#DIV/0!"},{"$error":"#DIV/0!"}]
[null,null,null,"RT",null,null,null,null,null,0,{"$error":"#DIV/0!"},{"$error":"#DIV/0!"},0,{"$error":"#DIV/0!"},{"$error":"#DIV/0!"}]
[null,null,null,"RT",null,null,null,null,null,0,{"$error":"#DIV/0!"},{"$error":"#DIV/0!"},0,{"$error":"#DIV/0!"},{"$error":"#DIV/0!"}]
[null,null,null,"RT",null,null,null,null,null,0,{"$error":"#DIV/0!"},{"$error":"#DIV/0!"},0,{"$error":"#DIV/0!"},{"$error":"#DIV/0!"}]
[null,null,null,"RT",null,null,null,null,null,0,{"$error":"#DIV/0!"},{"$error":"#DIV/0!"},0,{"$error":"#DIV/0!"},{"$error":"#DIV/0!"}]
[null,null,null,"RT",null,null,null,null,null,0,{"$error":"#DIV/0!"},{"$error":"#DIV/0!"},0,{"$error":"#DIV/0!"},{"$error":"#DIV/0!"}]
[null,null,null,"RT",null,null,null,null,null,{"$f":"A160","v":0},{"$f":"E160/$C$103","v":{"$error":"#DIV/0!"}},{"$f":"F160/$C$103","v":{"$error":"#DIV/0!"}},{"$f":"G160/$C$104","v":0},{"$error":"#DIV/0!"},{"$error":"#DIV/0!"}]
[null,null,null,"RT",null,null,null,null,null,0,{"$error":"#DIV/0!"},{"$error":"#DIV/0!"},0,{"$error":"#DIV/0!"},{"$error":"#DIV/0!"}]
[null,null,null,"RT",null,null,null,null,null,0,{"$error":"#DIV/0!"},{"$error":"#DIV/0!"},0,{"$error":"#DIV/0!"},{"$error":"#DIV/0!"}]
[null,null,null,"RT",null,null,null,null,null,0,{"$error":"#DIV/0!"},{"$error":"#DIV/0!"},0,{"$error":"#DIV/0!"},{"$error":"#DIV/0!"}]
[null,null,null,"RT",null,null,null,null,null,0,{"$error":"#DIV/0!"},{"$error":"#DIV/0!"},0,{"$error":"#DIV/0!"},{"$error":"#DIV/0!"}]
[null,null,null,"RT",null,null,null,null,null,0,{"$error":"#DIV/0!"},{"$error":"#DIV/0!"},0,{"$error":"#DIV/0!"},{"$error":"#DIV/0!"}]
[null,null,null,"RT",null,null,null,null,null,0,{"$error":"#DIV/0!"},{"$error":"#DIV/0!"},0,{"$error":"#DIV/0!"},{"$error":"#DIV/0!"}]
[null,null,null,"RT",null,null,null,null,null,0,{"$error":"#DIV/0!"},{"$error":"#DIV/0!"},0,{"$error":"#DIV/0!"},{"$error":"#DIV/0!"}]
[null,null,null,"RT",null,null,null,null,null,0,{"$error":"#DIV/0!"},{"$error":"#DIV/0!"},0,{"$error":"#DIV/0!"},{"$error":"#DIV/0!"}]
[null,null,null,"RT",null,null,null,null,null,0,{"$error":"#DIV/0!"},{"$error":"#DIV/0!"},0,{"$error":"#DIV/0!"},{"$error":"#DIV/0!"}]
[null,null,null,"RT",null,null,null,null,null,0,{"$error":"#DIV/0!"},{"$error":"#DIV/0!"},0,{"$error":"#DIV/0!"},{"$error":"#DIV/0!"}]
[null,null,null,"RT",null,null,null,null,null,0,{"$error":"#DIV/0!"},{"$error":"#DIV/0!"},0,{"$error":"#DIV/0!"},{"$error":"#DIV/0!"}]
[null,null,null,"RT",null,null,null,null,null,0,{"$error":"#DIV/0!"},{"$error":"#DIV/0!"},0,{"$error":"#DIV/0!"},{"$error":"#DIV/0!"}]
[null,null,null,"RT",null,null,null,null,null,0,{"$error":"#DIV/0!"},{"$error":"#DIV/0!"},0,{"$error":"#DIV/0!"},{"$error":"#DIV/0!"}]
[null,null,null,"RT",null,null,null,null,null,0,{"$error":"#DIV/0!"},{"$error":"#DIV/0!"},0,{"$error":"#DIV/0!"},{"$error":"#DIV/0!"}]
[null,null,null,"RT",null,null,null,null,null,0,{"$error":"#DIV/0!"},{"$error":"#DIV/0!"},0,{"$error":"#DIV/0!"},{"$error":"#DIV/0!"}]
[null,null,null,"RT",null,null,null,null,null,0,{"$error":"#DIV/0!"},{"$error":"#DIV/0!"},0,{"$error":"#DIV/0!"},{"$error":"#DIV/0!"}]
[null,null,null,"RT",null,null,null,null,null,0,{"$error":"#DIV/0!"},{"$error":"#DIV/0!"},0,{"$error":"#DIV/0!"},{"$error":"#DIV/0!"}]
[null,null,null,"RT",null,null,null,null,null,0,{"$error":"#DIV/0!"},{"$error":"#DIV/0!"},0,{"$error":"#DIV/0!"},{"$error":"#DIV/0!"}]
[null,null,null,"RT",null,null,null,null,null,0,{"$error":"#DIV/0!"},{"$error":"#DIV/0!"},0,{"$error":"#DIV/0!"},{"$error":"#DIV/0!"}]
[null,null,null,"RT",null,null,null,null,null,0,{"$error":"#DIV/0!"},{"$error":"#DIV/0!"},0,{"$error":"#DIV/0!"},{"$error":"#DIV/0!"}]
[null,null,null,"RT",null,null,null,null,null,0,{"$error":"#DIV/0!"},{"$error":"#DIV/0!"},0,{"$error":"#DIV/0!"},{"$error":"#DIV/0!"}]
[null,null,null,"RT",null,null,null,null,null,0,{"$error":"#DIV/0!"},{"$error":"#DIV/0!"},0,{"$error":"#DIV/0!"},{"$error":"#DIV/0!"}]
[]
["PROJECT GROUND COORDINATES - US SURVEY FEET",null,null,null,null,null,null,null,"EXISTING BOUNDARY MONUMENTS","STATE PLANE GRID COORDINATES"]
[{"$f":"A4","v":"Project coordinates (U.S. Survey Feet) are relative to State Plane Grid coordinates (meters) by a Project Adjustment Factor of:"},null,null,null,null,null,null,{"$f":"H4","v":0}]
[null,null,null,null,null,null,null,null,null,"Horiz. Datum:",{"$f":"REPORT!C11","v":"NAD83 (2011)"},{"$f":"REPORT!C10","v":"Ohio State Plane, North Zone (3401)"},null,"Vert. Datum:",{"$f":"REPORT!C15","v":"NAVD88"}]
[null,{"$f":"$B$6","v":"C/L of Right-of-Way SR XXX"},null,{"$f":"$D$6","v":" used for alignment"}]
["NAME","STATION","OFFSET (US FT)","RT/LT","NORTH (US FT)","EAST (US FT)","ELEVATION (US FT)","FEATURE","DESCRIPTION","NAME","NORTH (m)","EAST (m)","ORTHO HT (m)","NORTH (US FT)","EAST (US FT)"]
[null,null,null,{"$f":"IF(C189<0,\"LT\",\"RT\")","v":"RT"},null,null,null,null,null,{"$f":"A189","v":0},{"$f":"E189/$C$103","v":{"$error":"#DIV/0!"}},{"$error":"#DIV/0!"},{"$f":"G189/$C$104","v":0},{"$f":"$K189*$C$104","v":{"$error":"#DIV/0!"}},{"$f":"$L189*$C$104","v":{"$error":"#DIV/0!"}}]
[null,null,null,"RT",null,null,null,null,null,{"$f":"A190","v":0},{"$f":"E190/$C$103","v":{"$error":"#DIV/0!"}},{"$f":"F190/$C$103","v":{"$error":"#DIV/0!"}},{"$f":"G190/$C$104","v":0},{"$error":"#DIV/0!"},{"$error":"#DIV/0!"}]
[null,null,null,"RT",null,null,null,null,null,0,{"$error":"#DIV/0!"},{"$error":"#DIV/0!"},0,{"$error":"#DIV/0!"},{"$error":"#DIV/0!"}]
[null,null,null,"RT",null,null,null,null,null,0,{"$error":"#DIV/0!"},{"$error":"#DIV/0!"},0,{"$error":"#DIV/0!"},{"$error":"#DIV/0!"}]
[null,null,null,"RT",null,null,null,null,null,{"$f":"A193","v":0},{"$f":"E193/$C$103","v":{"$error":"#DIV/0!"}},{"$f":"F193/$C$103","v":{"$error":"#DIV/0!"}},{"$f":"G193/$C$104","v":0},{"$error":"#DIV/0!"},{"$error":"#DIV/0!"}]
[null,null,null,"RT",null,null,null,null,null,0,{"$error":"#DIV/0!"},{"$error":"#DIV/0!"},0,{"$error":"#DIV/0!"},{"$error":"#DIV/0!"}]
[null,null,null,"RT",null,null,null,null,null,0,{"$error":"#DIV/0!"},{"$error":"#DIV/0!"},0,{"$error":"#DIV/0!"},{"$error":"#DIV/0!"}]
[null,null,null,"RT",null,null,null,null,null,0,{"$error":"#DIV/0!"},{"$error":"#DIV/0!"},0,{"$error":"#DIV/0!"},{"$error":"#DIV/0!"}]
[null,null,null,"RT",null,null,null,null,null,0,{"$error":"#DIV/0!"},{"$error":"#DIV/0!"},0,{"$error":"#DIV/0!"},{"$error":"#DIV/0!"}]
[null,null,null,"RT",null,null,null,null,null,0,{"$error":"#DIV/0!"},{"$error":"#DIV/0!"},0,{"$error":"#DIV/0!"},{"$error":"#DIV/0!"}]
[null,null,null,"RT",null,null,null,null,null,0,{"$error":"#DIV/0!"},{"$error":"#DIV/0!"},0,{"$error":"#DIV/0!"},{"$error":"#DIV/0!"}]
[null,null,null,"RT",null,null,null,null,null,0,{"$error":"#DIV/0!"},{"$error":"#DIV/0!"},0,{"$error":"#DIV/0!"},{"$error":"#DIV/0!"}]
[null,null,null,"RT",null,null,null,null,null,0,{"$error":"#DIV/0!"},{"$error":"#DIV/0!"},0,{"$error":"#DIV/0!"},{"$error":"#DIV/0!"}]
[null,null,null,"RT",null,null,null,null,null,0,{"$error":"#DIV/0!"},{"$error":"#DIV/0!"},0,{"$error":"#DIV/0!"},{"$error":"#DIV/0!"}]
[null,null,null,"RT",null,null,null,null,null,0,{"$error":"#DIV/0!"},{"$error":"#DIV/0!"},0,{"$error":"#DIV/0!"},{"$error":"#DIV/0!"}]
[null,null,null,"RT",null,null,null,null,null,0,{"$error":"#DIV/0!"},{"$error":"#DIV/0!"},0,{"$error":"#DIV/0!"},{"$error":"#DIV/0!"}]
[null,null,null,"RT",null,null,null,null,null,0,{"$error":"#DIV/0!"},{"$error":"#DIV/0!"},0,{"$error":"#DIV/0!"},{"$error":"#DIV/0!"}]
[null,null,null,"RT",null,null,null,null,null,0,{"$error":"#DIV/0!"},{"$error":"#DIV/0!"},0,{"$error":"#DIV/0!"},{"$error":"#DIV/0!"}]
[null,null,null,"RT",null,null,null,null,null,0,{"$error":"#DIV/0!"},{"$error":"#DIV/0!"},0,{"$error":"#DIV/0!"},{"$error":"#DIV/0!"}]
[null,null,null,"RT",null,null,null,null,null,0,{"$error":"#DIV/0!"},{"$error":"#DIV/0!"},0,{"$error":"#DIV/0!"},{"$error":"#DIV/0!"}]
[null,null,null,"RT",null,null,null,null,null,0,{"$error":"#DIV/0!"},{"$error":"#DIV/0!"},0,{"$error":"#DIV/0!"},{"$error":"#DIV/0!"}]
[null,null,null,"RT",null,null,null,null,null,0,{"$error":"#DIV/0!"},{"$error":"#DIV/0!"},0,{"$error":"#DIV/0!"},{"$error":"#DIV/0!"}]
[null,null,null,"RT",null,null,null,null,null,0,{"$error":"#DIV/0!"},{"$error":"#DIV/0!"},0,{"$error":"#DIV/0!"},{"$error":"#DIV/0!"}]
[null,null,null,"RT",null,null,null,null,null,0,{"$error":"#DIV/0!"},{"$error":"#DIV/0!"},0,{"$error":"#DIV/0!"},{"$error":"#DIV/0!"}]
[null,null,null,"RT",null,null,null,null,null,0,{"$error":"#DIV/0!"},{"$error":"#DIV/0!"},0,{"$error":"#DIV/0!"},{"$error":"#DIV/0!"}]
[null,null,null,"RT",null,null,null,null,null,0,{"$error":"#DIV/0!"},{"$error":"#DIV/0!"},0,{"$error":"#DIV/0!"},{"$error":"#DIV/0!"}]
[null,null,null,"RT",null,null,null,null,null,0,{"$error":"#DIV/0!"},{"$error":"#DIV/0!"},0,{"$error":"#DIV/0!"},{"$error":"#DIV/0!"}]
[null,null,null,"RT",null,null,null,null,null,0,{"$error":"#DIV/0!"},{"$error":"#DIV/0!"},0,{"$error":"#DIV/0!"},{"$error":"#DIV/0!"}]
[null,null,null,"RT",null,null,null,null,null,0,{"$error":"#DIV/0!"},{"$error":"#DIV/0!"},0,{"$error":"#DIV/0!"},{"$error":"#DIV/0!"}]
[null,null,null,"RT",null,null,null,null,null,0,{"$error":"#DIV/0!"},{"$error":"#DIV/0!"},0,{"$error":"#DIV/0!"},{"$error":"#DIV/0!"}]

{"sheet":"GPS_IMPORT","index":6,"n_rows":5,"n_cols":9,"rows_kept":5,"cut":false,"hidden":false,"merged":[[4,8,6,9]]}
[]
[]
[]
[]
[null,null,null,null,null,null,null,null,"Imported data should be in Grid Meters!"]

{"sheet":"CP01","index":7,"n_rows":41,"n_cols":11,"rows_kept":41,"cut":false,"hidden":false,"merged":[[37,1,37,2],[38,1,38,2],[27,1,27,2],[0,0,0,10],[36,1,36,2],[30,0,30,6],[26,0,26,6],[35,0,35,6],[28,1,28,2],[27,8,38,10]]}
["VRS GNSS Project Control Monument Coordinate Analysis"]
[]
["Project:",{"$f":"REPORT!B2","v":"XXX-XXX-XXXX"},"GPS Antenna:","Trimble R6",null,null,null,null,null,"Report Date:"]
["PID:",{"$f":"REPORT!E2","v":"XXXXX"},"VRS Network:","ODOT VRS",null,null,null,null,null,"Prepared By:"]
["Point ID:",null,"No. of Sessions:",{"$f":"COUNTIF(GPS_IMPORT!A2:A1000,$B$5)","v":0},null,null,null,null,null,"Checked By:"]
["SESSION #","Point","Observation Date","Start Time","Northing(m)","Easting(m)","Height(m)","∆ Northing(m)","∆ Easting(m)","∆ Height(m)","Include in Solution?"]
[1,{"$f":"IF(ROWS(GPS_IMPORT!$1:1)<=COUNTIF(GPS_IMPORT!$A$2:$A$10000,$B$5),INDEX(GPS_IMPORT!$2:$10000,MATCH($B$5,(GPS_IMPORT!$A$2:$A$10000),0)+ROWS($1:1)-1,COLUMN()-1),0)","v":0},{"$f":"IF(ROWS(GPS_IMPORT!$1:1)<=COUNTIF(GPS_IMPORT!$A$2:$A$10000,$B$5),INDEX(GPS_IMPORT!$2:$10000,MATCH($B$5,(GPS_IMPORT!$A$2:$A$10000),0)+ROWS($1:1)-1,COLUMN()-1),0)","v":"00:00:00"},{"$f":"IF(ROWS(GPS_IMPORT!$1:1)<=COUNTIF(GPS_IMPORT!$A$2:$A$10000,$B$5),INDEX(GPS_IMPORT!$2:$10000,MATCH($B$5,(GPS_IMPORT!$A$2:$A$10000),0)+ROWS($1:1)-1,COLUMN()-1),0)","v":"00:00:00"},{"$f":"IF(ROWS(GPS_IMPORT!$1:1)<=COUNTIF(GPS_IMPORT!$A$2:$A$10000,$B$5),INDEX(GPS_IMPORT!$2:$10000,MATCH($B$5,(GPS_IMPORT!$A$2:$A$10000),0)+ROWS($1:1)-1,COLUMN()-1),0)","v":0},{"$f":"IF(ROWS(GPS_IMPORT!$1:1)<=COUNTIF(GPS_IMPORT!$A$2:$A$10000,$B$5),INDEX(GPS_IMPORT!$2:$10000,MATCH($B$5,(GPS_IMPORT!$A$2:$A$10000),0)+ROWS($1:1)-1,COLUMN()-1),0)","v":0},{"$f":"IF(ROWS(GPS_IMPORT!$1:1)<=COUNTIF(GPS_IMPORT!$A$2:$A$10000,$B$5),INDEX(GPS_IMPORT!$2:$10000,MATCH($B$5,(GPS_IMPORT!$A$2:$A$10000),0)+ROWS($1:1)-1,COLUMN()-1),0)","v":0},{"$f":"IF(E7>0,E$22-E7,0)","v":0},0,0,true]
[2,{"$f":"IF(ROWS(GPS_IMPORT!$1:2)<=COUNTIF(GPS_IMPORT!$A$2:$A$10000,$B$5),INDEX(GPS_IMPORT!$2:$10000,MATCH($B$5,(GPS_IMPORT!$A$2:$A$10000),0)+ROWS($1:2)-1,COLUMN()-1),0)","v":0},{"$f":"IF(ROWS(GPS_IMPORT!$1:2)<=COUNTIF(GPS_IMPORT!$A$2:$A$10000,$B$5),INDEX(GPS_IMPORT!$2:$10000,MATCH($B$5,(GPS_IMPORT!$A$2:$A$10000),0)+ROWS($1:2)-1,COLUMN()-1),0)","v":"00:00:00"},{"$f":"IF(ROWS(GPS_IMPORT!$1:2)<=COUNTIF(GPS_IMPORT!$A$2:$A$10000,$B$5),INDEX(GPS_IMPORT!$2:$10000,MATCH($B$5,(GPS_IMPORT!$A$2:$A$10000),0)+ROWS($1:2)-1,COLUMN()-1),0)","v":"00:00:00"},{"$f":"IF(ROWS(GPS_IMPORT!$1:2)<=COUNTIF(GPS_IMPORT!$A$2:$A$10000,$B$5),INDEX(GPS_IMPORT!$2:$10000,MATCH($B$5,(GPS_IMPORT!$A$2:$A$10000),0)+ROWS($1:2)-1,COLUMN()-1),0)","v":0},{"$f":"IF(ROWS(GPS_IMPORT!$1:2)<=COUNTIF(GPS_IMPORT!$A$2:$A$10000,$B$5),INDEX(GPS_IMPORT!$2:$10000,MATCH($B$5,(GPS_IMPORT!$A$2:$A$10000),0)+ROWS($1:2)-1,COLUMN()-1),0)","v":0},{"$f":"IF(ROWS(GPS_IMPORT!$1:2)<=COUNTIF(GPS_IMPORT!$A$2:$A$10000,$B$5),INDEX(GPS_IMPORT!$2:$10000,MATCH($B$5,(GPS_IMPORT!$A$2:$A$10000),0)+ROWS($1:2)-1,COLUMN()-1),0)","v":0},0,0,0,true]
[3,{"$f":"IF(ROWS(GPS_IMPORT!$1:3)<=COUNTIF(GPS_IMPORT!$A$2:$A$10000,$B$5),INDEX(GPS_IMPORT!$2:$10000,MATCH($B$5,(GPS_IMPORT!$A$2:$A$10000),0)+ROWS($1:3)-1,COLUMN()-1),0)","v":0},{"$f":"IF(ROWS(GPS_IMPORT!$1:3)<=COUNTIF(GPS_IMPORT!$A$2:$A$10000,$B$5),INDEX(GPS_IMPORT!$2:$10000,MATCH($B$5,(GPS_IMPORT!$A$2:$A$10000),0)+ROWS($1:3)-1,COLUMN()-1),0)","v":"00:00:00"},{"$f":"IF(ROWS(GPS_IMPORT!$1:3)<=COUNTIF(GPS_IMPORT!$A$2:$A$10000,$B$5),INDEX(GPS_IMPORT!$2:$10000,MATCH($B$5,(GPS_IMPORT!$A$2:$A$10000),0)+ROWS($1:3)-1,COLUMN()-1),0)","v":"00:00:00"},{"$f":"IF(ROWS(GPS_IMPORT!$1:3)<=COUNTIF(GPS_IMPORT!$A$2:$A$10000,$B$5),INDEX(GPS_IMPORT!$2:$10000,MATCH($B$5,(GPS_IMPORT!$A$2:$A$10000),0)+ROWS($1:3)-1,COLUMN()-1),0)","v":0},{"$f":"IF(ROWS(GPS_IMPORT!$1:3)<=COUNTIF(GPS_IMPORT!$A$2:$A$10000,$B$5),INDEX(GPS_IMPORT!$2:$10000,MATCH($B$5,(GPS_IMPORT!$A$2:$A$10000),0)+ROWS($1:3)-1,COLUMN()-1),0)","v":0},{"$f":"IF(ROWS(GPS_IMPORT!$1:3)<=COUNTIF(GPS_IMPORT!$A$2:$A$10000,$B$5),INDEX(GPS_IMPORT!$2:$10000,MATCH($B$5,(GPS_IMPORT!$A$2:$A$10000),0)+ROWS($1:3)-1,COLUMN()-1),0)","v":0},0,0,0,true]
[4,{"$f":"IF(ROWS(GPS_IMPORT!$1:4)<=COUNTIF(GPS_IMPORT!$A$2:$A$10000,$B$5),INDEX(GPS_IMPORT!$2:$10000,MATCH($B$5,(GPS_IMPORT!$A$2:$A$10000),0)+ROWS($1:4)-1,COLUMN()-1),0)","v":0},{"$f":"IF(ROWS(GPS_IMPORT!$1:4)<=COUNTIF(GPS_IMPORT!$A$2:$A$10000,$B$5),INDEX(GPS_IMPORT!$2:$10000,MATCH($B$5,(GPS_IMPORT!$A$2:$A$10000),0)+ROWS($1:4)-1,COLUMN()-1),0)","v":"00:00:00"},{"$f":"IF(ROWS(GPS_IMPORT!$1:4)<=COUNTIF(GPS_IMPORT!$A$2:$A$10000,$B$5),INDEX(GPS_IMPORT!$2:$10000,MATCH($B$5,(GPS_IMPORT!$A$2:$A$10000),0)+ROWS($1:4)-1,COLUMN()-1),0)","v":"00:00:00"},{"$f":"IF(ROWS(GPS_IMPORT!$1:4)<=COUNTIF(GPS_IMPORT!$A$2:$A$10000,$B$5),INDEX(GPS_IMPORT!$2:$10000,MATCH($B$5,(GPS_IMPORT!$A$2:$A$10000),0)+ROWS($1:4)-1,COLUMN()-1),0)","v":0},{"$f":"IF(ROWS(GPS_IMPORT!$1:4)<=COUNTIF(GPS_IMPORT!$A$2:$A$10000,$B$5),INDEX(GPS_IMPORT!$2:$10000,MATCH($B$5,(GPS_IMPORT!$A$2:$A$10000),0)+ROWS($1:4)-1,COLUMN()-1),0)","v":0},{"$f":"IF(ROWS(GPS_IMPORT!$1:4)<=COUNTIF(GPS_IMPORT!$A$2:$A$10000,$B$5),INDEX(GPS_IMPORT!$2:$10000,MATCH($B$5,(GPS_IMPORT!$A$2:$A$10000),0)+ROWS($1:4)-1,COLUMN()-1),0)","v":0},0,0,0,true]
[5,{"$f":"IF(ROWS(GPS_IMPORT!$1:5)<=COUNTIF(GPS_IMPORT!$A$2:$A$10000,$B$5),INDEX(GPS_IMPORT!$2:$10000,MATCH($B$5,(GPS_IMPORT!$A$2:$A$10000),0)+ROWS($1:5)-1,COLUMN()-1),0)","v":0},{"$f":"IF(ROWS(GPS_IMPORT!$1:5)<=COUNTIF(GPS_IMPORT!$A$2:$A$10000,$B$5),INDEX(GPS_IMPORT!$2:$10000,MATCH($B$5,(GPS_IMPORT!$A$2:$A$10000),0)+ROWS($1:5)-1,COLUMN()-1),0)","v":"00:00:00"},{"$f":"IF(ROWS(GPS_IMPORT!$1:5)<=COUNTIF(GPS_IMPORT!$A$2:$A$10000,$B$5),INDEX(GPS_IMPORT!$2:$10000,MATCH($B$5,(GPS_IMPORT!$A$2:$A$10000),0)+ROWS($1:5)-1,COLUMN()-1),0)","v":"00:00:00"},{"$f":"IF(ROWS(GPS_IMPORT!$1:5)<=COUNTIF(GPS_IMPORT!$A$2:$A$10000,$B$5),INDEX(GPS_IMPORT!$2:$10000,MATCH($B$5,(GPS_IMPORT!$A$2:$A$10000),0)+ROWS($1:5)-1,COLUMN()-1),0)","v":0},{"$f":"IF(ROWS(GPS_IMPORT!$1:5)<=COUNTIF(GPS_IMPORT!$A$2:$A$10000,$B$5),INDEX(GPS_IMPORT!$2:$10000,MATCH($B$5,(GPS_IMPORT!$A$2:$A$10000),0)+ROWS($1:5)-1,COLUMN()-1),0)","v":0},{"$f":"IF(ROWS(GPS_IMPORT!$1:5)<=COUNTIF(GPS_IMPORT!$A$2:$A$10000,$B$5),INDEX(GPS_IMPORT!$2:$10000,MATCH($B$5,(GPS_IMPORT!$A$2:$A$10000),0)+ROWS($1:5)-1,COLUMN()-1),0)","v":0},0,0,0,true]
[6,{"$f":"IF(ROWS(GPS_IMPORT!$1:6)<=COUNTIF(GPS_IMPORT!$A$2:$A$10000,$B$5),INDEX(GPS_IMPORT!$2:$10000,MATCH($B$5,(GPS_IMPORT!$A$2:$A$10000),0)+ROWS($1:6)-1,COLUMN()-1),0)","v":0},{"$f":"IF(ROWS(GPS_IMPORT!$1:6)<=COUNTIF(GPS_IMPORT!$A$2:$A$10000,$B$5),INDEX(GPS_IMPORT!$2:$10000,MATCH($B$5,(GPS_IMPORT!$A$2:$A$10000),0)+ROWS($1:6)-1,COLUMN()-1),0)","v":"00:00:00"},{"$f":"IF(ROWS(GPS_IMPORT!$1:6)<=COUNTIF(GPS_IMPORT!$A$2:$A$10000,$B$5),INDEX(GPS_IMPORT!$2:$10000,MATCH($B$5,(GPS_IMPORT!$A$2:$A$10000),0)+ROWS($1:6)-1,COLUMN()-1),0)","v":"00:00:00"},{"$f":"IF(ROWS(GPS_IMPORT!$1:6)<=COUNTIF(GPS_IMPORT!$A$2:$A$10000,$B$5),INDEX(GPS_IMPORT!$2:$10000,MATCH($B$5,(GPS_IMPORT!$A$2:$A$10000),0)+ROWS($1:6)-1,COLUMN()-1),0)","v":0},{"$f":"IF(ROWS(GPS_IMPORT!$1:6)<=COUNTIF(GPS_IMPORT!$A$2:$A$10000,$B$5),INDEX(GPS_IMPORT!$2:$10000,MATCH($B$5,(GPS_IMPORT!$A$2:$A$10000),0)+ROWS($1:6)-1,COLUMN()-1),0)","v":0},{"$f":"IF(ROWS(GPS_IMPORT!$1:6)<=COUNTIF(GPS_IMPORT!$A$2:$A$10000,$B$5),INDEX(GPS_IMPORT!$2:$10000,MATCH($B$5,(GPS_IMPORT!$A$2:$A$10000),0)+ROWS($1:6)-1,COLUMN()-1),0)","v":0},0,0,0,true]
[7,{"$f":"IF(ROWS(GPS_IMPORT!$1:7)<=COUNTIF(GPS_IMPORT!$A$2:$A$10000,$B$5),INDEX(GPS_IMPORT!$2:$10000,MATCH($B$5,(GPS_IMPORT!$A$2:$A$10000),0)+ROWS($1:7)-1,COLUMN()-1),0)","v":0},{"$f":"IF(ROWS(GPS_IMPORT!$1:7)<=COUNTIF(GPS_IMPORT!$A$2:$A$10000,$B$5),INDEX(GPS_IMPORT!$2:$10000,MATCH($B$5,(GPS_IMPORT!$A$2:$A$10000),0)+ROWS($1:7)-1,COLUMN()-1),0)","v":"00:00:00"},{"$f":"IF(ROWS(GPS_IMPORT!$1:7)<=COUNTIF(GPS_IMPORT!$A$2:$A$10000,$B$5),INDEX(GPS_IMPORT!$2:$10000,MATCH($B$5,(GPS_IMPORT!$A$2:$A$10000),0)+ROWS($1:7)-1,COLUMN()-1),0)","v":"00:00:00"},{"$f":"IF(ROWS(GPS_IMPORT!$1:7)<=COUNTIF(GPS_IMPORT!$A$2:$A$10000,$B$5),INDEX(GPS_IMPORT!$2:$10000,MATCH($B$5,(GPS_IMPORT!$A$2:$A$10000),0)+ROWS($1:7)-1,COLUMN()-1),0)","v":0},{"$f":"IF(ROWS(GPS_IMPORT!$1:7)<=COUNTIF(GPS_IMPORT!$A$2:$A$10000,$B$5),INDEX(GPS_IMPORT!$2:$10000,MATCH($B$5,(GPS_IMPORT!$A$2:$A$10000),0)+ROWS($1:7)-1,COLUMN()-1),0)","v":0},{"$f":"IF(ROWS(GPS_IMPORT!$1:7)<=COUNTIF(GPS_IMPORT!$A$2:$A$10000,$B$5),INDEX(GPS_IMPORT!$2:$10000,MATCH($B$5,(GPS_IMPORT!$A$2:$A$10000),0)+ROWS($1:7)-1,COLUMN()-1),0)","v":0},0,0,0,true]
[8,{"$f":"IF(ROWS(GPS_IMPORT!$1:8)<=COUNTIF(GPS_IMPORT!$A$2:$A$10000,$B$5),INDEX(GPS_IMPORT!$2:$10000,MATCH($B$5,(GPS_IMPORT!$A$2:$A$10000),0)+ROWS($1:8)-1,COLUMN()-1),0)","v":0},{"$f":"IF(ROWS(GPS_IMPORT!$1:8)<=COUNTIF(GPS_IMPORT!$A$2:$A$10000,$B$5),INDEX(GPS_IMPORT!$2:$10000,MATCH($B$5,(GPS_IMPORT!$A$2:$A$10000),0)+ROWS($1:8)-1,COLUMN()-1),0)","v":"00:00:00"},{"$f":"IF(ROWS(GPS_IMPORT!$1:8)<=COUNTIF(GPS_IMPORT!$A$2:$A$10000,$B$5),INDEX(GPS_IMPORT!$2:$10000,MATCH($B$5,(GPS_IMPORT!$A$2:$A$10000),0)+ROWS($1:8)-1,COLUMN()-1),0)","v":"00:00:00"},{"$f":"IF(ROWS(GPS_IMPORT!$1:8)<=COUNTIF(GPS_IMPORT!$A$2:$A$10000,$B$5),INDEX(GPS_IMPORT!$2:$10000,MATCH($B$5,(GPS_IMPORT!$A$2:$A$10000),0)+ROWS($1:8)-1,COLUMN()-1),0)","v":0},{"$f":"IF(ROWS(GPS_IMPORT!$1:8)<=COUNTIF(GPS_IMPORT!$A$2:$A$10000,$B$5),INDEX(GPS_IMPORT!$2:$10000,MATCH($B$5,(GPS_IMPORT!$A$2:$A$10000),0)+ROWS($1:8)-1,COLUMN()-1),0)","v":0},{"$f":"IF(ROWS(GPS_IMPORT!$1:8)<=COUNTIF(GPS_IMPORT!$A$2:$A$10000,$B$5),INDEX(GPS_IMPORT!$2:$10000,MATCH($B$5,(GPS_IMPORT!$A$2:$A$10000),0)+ROWS($1:8)-1,COLUMN()-1),0)","v":0},0,0,0,true]
[9,{"$f":"IF(ROWS(GPS_IMPORT!$1:9)<=COUNTIF(GPS_IMPORT!$A$2:$A$10000,$B$5),INDEX(GPS_IMPORT!$2:$10000,MATCH($B$5,(GPS_IMPORT!$A$2:$A$10000),0)+ROWS($1:9)-1,COLUMN()-1),0)","v":0},{"$f":"IF(ROWS(GPS_IMPORT!$1:9)<=COUNTIF(GPS_IMPORT!$A$2:$A$10000,$B$5),INDEX(GPS_IMPORT!$2:$10000,MATCH($B$5,(GPS_IMPORT!$A$2:$A$10000),0)+ROWS($1:9)-1,COLUMN()-1),0)","v":"00:00:00"},{"$f":"IF(ROWS(GPS_IMPORT!$1:9)<=COUNTIF(GPS_IMPORT!$A$2:$A$10000,$B$5),INDEX(GPS_IMPORT!$2:$10000,MATCH($B$5,(GPS_IMPORT!$A$2:$A$10000),0)+ROWS($1:9)-1,COLUMN()-1),0)","v":"00:00:00"},{"$f":"IF(ROWS(GPS_IMPORT!$1:9)<=COUNTIF(GPS_IMPORT!$A$2:$A$10000,$B$5),INDEX(GPS_IMPORT!$2:$10000,MATCH($B$5,(GPS_IMPORT!$A$2:$A$10000),0)+ROWS($1:9)-1,COLUMN()-1),0)","v":0},{"$f":"IF(ROWS(GPS_IMPORT!$1:9)<=COUNTIF(GPS_IMPORT!$A$2:$A$10000,$B$5),INDEX(GPS_IMPORT!$2:$10000,MATCH($B$5,(GPS_IMPORT!$A$2:$A$10000),0)+ROWS($1:9)-1,COLUMN()-1),0)","v":0},{"$f":"IF(ROWS(GPS_IMPORT!$1:9)<=COUNTIF(GPS_IMPORT!$A$2:$A$10000,$B$5),INDEX(GPS_IMPORT!$2:$10000,MATCH($B$5,(GPS_IMPORT!$A$2:$A$10000),0)+ROWS($1:9)-1,COLUMN()-1),0)","v":0},0,0,0,true]
[10,{"$f":"IF(ROWS(GPS_IMPORT!$1:10)<=COUNTIF(GPS_IMPORT!$A$2:$A$10000,$B$5),INDEX(GPS_IMPORT!$2:$10000,MATCH($B$5,(GPS_IMPORT!$A$2:$A$10000),0)+ROWS($1:10)-1,COLUMN()-1),0)","v":0},{"$f":"IF(ROWS(GPS_IMPORT!$1:10)<=COUNTIF(GPS_IMPORT!$A$2:$A$10000,$B$5),INDEX(GPS_IMPORT!$2:$10000,MATCH($B$5,(GPS_IMPORT!$A$2:$A$10000),0)+ROWS($1:10)-1,COLUMN()-1),0)","v":"00:00:00"},{"$f":"IF(ROWS(GPS_IMPORT!$1:10)<=COUNTIF(GPS_IMPORT!$A$2:$A$10000,$B$5),INDEX(GPS_IMPORT!$2:$10000,MATCH($B$5,(GPS_IMPORT!$A$2:$A$10000),0)+ROWS($1:10)-1,COLUMN()-1),0)","v":"00:00:00"},{"$f":"IF(ROWS(GPS_IMPORT!$1:10)<=COUNTIF(GPS_IMPORT!$A$2:$A$10000,$B$5),INDEX(GPS_IMPORT!$2:$10000,MATCH($B$5,(GPS_IMPORT!$A$2:$A$10000),0)+ROWS($1:10)-1,COLUMN()-1),0)","v":0},{"$f":"IF(ROWS(GPS_IMPORT!$1:10)<=COUNTIF(GPS_IMPORT!$A$2:$A$10000,$B$5),INDEX(GPS_IMPORT!$2:$10000,MATCH($B$5,(GPS_IMPORT!$A$2:$A$10000),0)+ROWS($1:10)-1,COLUMN()-1),0)","v":0},{"$f":"IF(ROWS(GPS_IMPORT!$1:10)<=COUNTIF(GPS_IMPORT!$A$2:$A$10000,$B$5),INDEX(GPS_IMPORT!$2:$10000,MATCH($B$5,(GPS_IMPORT!$A$2:$A$10000),0)+ROWS($1:10)-1,COLUMN()-1),0)","v":0},0,0,0,true]
[11,{"$f":"IF(ROWS(GPS_IMPORT!$1:11)<=COUNTIF(GPS_IMPORT!$A$2:$A$10000,$B$5),INDEX(GPS_IMPORT!$2:$10000,MATCH($B$5,(GPS_IMPORT!$A$2:$A$10000),0)+ROWS($1:11)-1,COLUMN()-1),0)","v":0},{"$f":"IF(ROWS(GPS_IMPORT!$1:11)<=COUNTIF(GPS_IMPORT!$A$2:$A$10000,$B$5),INDEX(GPS_IMPORT!$2:$10000,MATCH($B$5,(GPS_IMPORT!$A$2:$A$10000),0)+ROWS($1:11)-1,COLUMN()-1),0)","v":"00:00:00"},{"$f":"IF(ROWS(GPS_IMPORT!$1:11)<=COUNTIF(GPS_IMPORT!$A$2:$A$10000,$B$5),INDEX(GPS_IMPORT!$2:$10000,MATCH($B$5,(GPS_IMPORT!$A$2:$A$10000),0)+ROWS($1:11)-1,COLUMN()-1),0)","v":"00:00:00"},{"$f":"IF(ROWS(GPS_IMPORT!$1:11)<=COUNTIF(GPS_IMPORT!$A$2:$A$10000,$B$5),INDEX(GPS_IMPORT!$2:$10000,MATCH($B$5,(GPS_IMPORT!$A$2:$A$10000),0)+ROWS($1:11)-1,COLUMN()-1),0)","v":0},{"$f":"IF(ROWS(GPS_IMPORT!$1:11)<=COUNTIF(GPS_IMPORT!$A$2:$A$10000,$B$5),INDEX(GPS_IMPORT!$2:$10000,MATCH($B$5,(GPS_IMPORT!$A$2:$A$10000),0)+ROWS($1:11)-1,COLUMN()-1),0)","v":0},{"$f":"IF(ROWS(GPS_IMPORT!$1:11)<=COUNTIF(GPS_IMPORT!$A$2:$A$10000,$B$5),INDEX(GPS_IMPORT!$2:$10000,MATCH($B$5,(GPS_IMPORT!$A$2:$A$10000),0)+ROWS($1:11)-1,COLUMN()-1),0)","v":0},0,0,0,true]
[12,{"$f":"IF(ROWS(GPS_IMPORT!$1:12)<=COUNTIF(GPS_IMPORT!$A$2:$A$10000,$B$5),INDEX(GPS_IMPORT!$2:$10000,MATCH($B$5,(GPS_IMPORT!$A$2:$A$10000),0)+ROWS($1:12)-1,COLUMN()-1),0)","v":0},{"$f":"IF(ROWS(GPS_IMPORT!$1:12)<=COUNTIF(GPS_IMPORT!$A$2:$A$10000,$B$5),INDEX(GPS_IMPORT!$2:$10000,MATCH($B$5,(GPS_IMPORT!$A$2:$A$10000),0)+ROWS($1:12)-1,COLUMN()-1),0)","v":"00:00:00"},{"$f":"IF(ROWS(GPS_IMPORT!$1:12)<=COUNTIF(GPS_IMPORT!$A$2:$A$10000,$B$5),INDEX(GPS_IMPORT!$2:$10000,MATCH($B$5,(GPS_IMPORT!$A$2:$A$10000),0)+ROWS($1:12)-1,COLUMN()-1),0)","v":"00:00:00"},{"$f":"IF(ROWS(GPS_IMPORT!$1:12)<=COUNTIF(GPS_IMPORT!$A$2:$A$10000,$B$5),INDEX(GPS_IMPORT!$2:$10000,MATCH($B$5,(GPS_IMPORT!$A$2:$A$10000),0)+ROWS($1:12)-1,COLUMN()-1),0)","v":0},{"$f":"IF(ROWS(GPS_IMPORT!$1:12)<=COUNTIF(GPS_IMPORT!$A$2:$A$10000,$B$5),INDEX(GPS_IMPORT!$2:$10000,MATCH($B$5,(GPS_IMPORT!$A$2:$A$10000),0)+ROWS($1:12)-1,COLUMN()-1),0)","v":0},{"$f":"IF(ROWS(GPS_IMPORT!$1:12)<=COUNTIF(GPS_IMPORT!$A$2:$A$10000,$B$5),INDEX(GPS_IMPORT!$2:$10000,MATCH($B$5,(GPS_IMPORT!$A$2:$A$10000),0)+ROWS($1:12)-1,COLUMN()-1),0)","v":0},0,0,0,true]
[13,{"$f":"IF(ROWS(GPS_IMPORT!$1:13)<=COUNTIF(GPS_IMPORT!$A$2:$A$10000,$B$5),INDEX(GPS_IMPORT!$2:$10000,MATCH($B$5,(GPS_IMPORT!$A$2:$A$10000),0)+ROWS($1:13)-1,COLUMN()-1),0)","v":0},{"$f":"IF(ROWS(GPS_IMPORT!$1:13)<=COUNTIF(GPS_IMPORT!$A$2:$A$10000,$B$5),INDEX(GPS_IMPORT!$2:$10000,MATCH($B$5,(GPS_IMPORT!$A$2:$A$10000),0)+ROWS($1:13)-1,COLUMN()-1),0)","v":"00:00:00"},{"$f":"IF(ROWS(GPS_IMPORT!$1:13)<=COUNTIF(GPS_IMPORT!$A$2:$A$10000,$B$5),INDEX(GPS_IMPORT!$2:$10000,MATCH($B$5,(GPS_IMPORT!$A$2:$A$10000),0)+ROWS($1:13)-1,COLUMN()-1),0)","v":"00:00:00"},{"$f":"IF(ROWS(GPS_IMPORT!$1:13)<=COUNTIF(GPS_IMPORT!$A$2:$A$10000,$B$5),INDEX(GPS_IMPORT!$2:$10000,MATCH($B$5,(GPS_IMPORT!$A$2:$A$10000),0)+ROWS($1:13)-1,COLUMN()-1),0)","v":0},{"$f":"IF(ROWS(GPS_IMPORT!$1:13)<=COUNTIF(GPS_IMPORT!$A$2:$A$10000,$B$5),INDEX(GPS_IMPORT!$2:$10000,MATCH($B$5,(GPS_IMPORT!$A$2:$A$10000),0)+ROWS($1:13)-1,COLUMN()-1),0)","v":0},{"$f":"IF(ROWS(GPS_IMPORT!$1:13)<=COUNTIF(GPS_IMPORT!$A$2:$A$10000,$B$5),INDEX(GPS_IMPORT!$2:$10000,MATCH($B$5,(GPS_IMPORT!$A$2:$A$10000),0)+ROWS($1:13)-1,COLUMN()-1),0)","v":0},{"$f":"IF(E19>0,E$22-E19,0)","v":0},0,0,false]
[14,{"$f":"IF(ROWS(GPS_IMPORT!$1:14)<=COUNTIF(GPS_IMPORT!$A$2:$A$10000,$B$5),INDEX(GPS_IMPORT!$2:$10000,MATCH($B$5,(GPS_IMPORT!$A$2:$A$10000),0)+ROWS($1:14)-1,COLUMN()-1),0)","v":0},{"$f":"IF(ROWS(GPS_IMPORT!$1:14)<=COUNTIF(GPS_IMPORT!$A$2:$A$10000,$B$5),INDEX(GPS_IMPORT!$2:$10000,MATCH($B$5,(GPS_IMPORT!$A$2:$A$10000),0)+ROWS($1:14)-1,COLUMN()-1),0)","v":"00:00:00"},{"$f":"IF(ROWS(GPS_IMPORT!$1:14)<=COUNTIF(GPS_IMPORT!$A$2:$A$10000,$B$5),INDEX(GPS_IMPORT!$2:$10000,MATCH($B$5,(GPS_IMPORT!$A$2:$A$10000),0)+ROWS($1:14)-1,COLUMN()-1),0)","v":"00:00:00"},{"$f":"IF(ROWS(GPS_IMPORT!$1:14)<=COUNTIF(GPS_IMPORT!$A$2:$A$10000,$B$5),INDEX(GPS_IMPORT!$2:$10000,MATCH($B$5,(GPS_IMPORT!$A$2:$A$10000),0)+ROWS($1:14)-1,COLUMN()-1),0)","v":0},{"$f":"IF(ROWS(GPS_IMPORT!$1:14)<=COUNTIF(GPS_IMPORT!$A$2:$A$10000,$B$5),INDEX(GPS_IMPORT!$2:$10000,MATCH($B$5,(GPS_IMPORT!$A$2:$A$10000),0)+ROWS($1:14)-1,COLUMN()-1),0)","v":0},{"$f":"IF(ROWS(GPS_IMPORT!$1:14)<=COUNTIF(GPS_IMPORT!$A$2:$A$10000,$B$5),INDEX(GPS_IMPORT!$2:$10000,MATCH($B$5,(GPS_IMPORT!$A$2:$A$10000),0)+ROWS($1:14)-1,COLUMN()-1),0)","v":0},0,0,0,false]
[15,{"$f":"IF(ROWS(GPS_IMPORT!$1:15)<=COUNTIF(GPS_IMPORT!$A$2:$A$10000,$B$5),INDEX(GPS_IMPORT!$2:$10000,MATCH($B$5,(GPS_IMPORT!$A$2:$A$10000),0)+ROWS($1:15)-1,COLUMN()-1),0)","v":0},{"$f":"IF(ROWS(GPS_IMPORT!$1:15)<=COUNTIF(GPS_IMPORT!$A$2:$A$10000,$B$5),INDEX(GPS_IMPORT!$2:$10000,MATCH($B$5,(GPS_IMPORT!$A$2:$A$10000),0)+ROWS($1:15)-1,COLUMN()-1),0)","v":"00:00:00"},{"$f":"IF(ROWS(GPS_IMPORT!$1:15)<=COUNTIF(GPS_IMPORT!$A$2:$A$10000,$B$5),INDEX(GPS_IMPORT!$2:$10000,MATCH($B$5,(GPS_IMPORT!$A$2:$A$10000),0)+ROWS($1:15)-1,COLUMN()-1),0)","v":"00:00:00"},{"$f":"IF(ROWS(GPS_IMPORT!$1:15)<=COUNTIF(GPS_IMPORT!$A$2:$A$10000,$B$5),INDEX(GPS_IMPORT!$2:$10000,MATCH($B$5,(GPS_IMPORT!$A$2:$A$10000),0)+ROWS($1:15)-1,COLUMN()-1),0)","v":0},{"$f":"IF(ROWS(GPS_IMPORT!$1:15)<=COUNTIF(GPS_IMPORT!$A$2:$A$10000,$B$5),INDEX(GPS_IMPORT!$2:$10000,MATCH($B$5,(GPS_IMPORT!$A$2:$A$10000),0)+ROWS($1:15)-1,COLUMN()-1),0)","v":0},{"$f":"IF(ROWS(GPS_IMPORT!$1:15)<=COUNTIF(GPS_IMPORT!$A$2:$A$10000,$B$5),INDEX(GPS_IMPORT!$2:$10000,MATCH($B$5,(GPS_IMPORT!$A$2:$A$10000),0)+ROWS($1:15)-1,COLUMN()-1),0)","v":0},0,0,0,false]
[null,null,null,"AVERAGE",{"$f":"(IF($K$7=TRUE,E7,0)+IF($K$8=TRUE,E8,0)+IF($K$9=TRUE,E9,0)+IF($K$10=TRUE,E10,0)+IF($K$11=TRUE,E11,0)+IF($K$12=TRUE,E12,0)+IF($K$13=TRUE,E13,0)+IF($K$14=TRUE,E14,0)+IF($K$15=TRUE,E15,0)+IF($K$16=TRUE,E16,0)+IF($K$17=TRUE,E17,0)+IF($K$18=TRUE,E18,0)+IF($K$19=TRUE,E19,0)+IF($K$20=TRUE,E20,0)+IF($K$21=TRUE,E21,0))/(IF($K$7=TRUE,1,0)+IF($K$8=TRUE,1,0)+IF($K$9=TRUE,1,0)+IF($K$10=TRUE,1,0)+IF($K$11=TRUE,1,0)+IF($K$12=TRUE,1,0)+IF($K$13=TRUE,1,0)+IF($K$14=TRUE,1,0)+IF($K$15=TRUE,1,0)+IF($K$16=TRUE,1,0)+IF($K$17=TRUE,1,0)+IF($K$18=TRUE,1,0)+IF($K$19=TRUE,1,0)+IF($K$20=TRUE,1,0)+IF($K$21=TRUE,1,0))","v":0},{"$f":"(IF($K$7=TRUE,F7,0)+IF($K$8=TRUE,F8,0)+IF($K$9=TRUE,F9,0)+IF($K$10=TRUE,F10,0)+IF($K$11=TRUE,F11,0)+IF($K$12=TRUE,F12,0)+IF($K$13=TRUE,F13,0)+IF($K$14=TRUE,F14,0)+IF($K$15=TRUE,F15,0)+IF($K$16=TRUE,F16,0)+IF($K$17=TRUE,F17,0)+IF($K$18=TRUE,F18,0)+IF($K$19=TRUE,F19,0)+IF($K$20=TRUE,F20,0)+IF($K$21=TRUE,F21,0))/(IF($K$7=TRUE,1,0)+IF($K$8=TRUE,1,0)+IF($K$9=TRUE,1,0)+IF($K$10=TRUE,1,0)+IF($K$11=TRUE,1,0)+IF($K$12=TRUE,1,0)+IF($K$13=TRUE,1,0)+IF($K$14=TRUE,1,0)+IF($K$15=TRUE,1,0)+IF($K$16=TRUE,1,0)+IF($K$17=TRUE,1,0)+IF($K$18=TRUE,1,0)+IF($K$19=TRUE,1,0)+IF($K$20=TRUE,1,0)+IF($K$21=TRUE,1,0))","v":0},{"$f":"(IF($K$7=TRUE,G7,0)+IF($K$8=TRUE,G8,0)+IF($K$9=TRUE,G9,0)+IF($K$10=TRUE,G10,0)+IF($K$11=TRUE,G11,0)+IF($K$12=TRUE,G12,0)+IF($K$13=TRUE,G13,0)+IF($K$14=TRUE,G14,0)+IF($K$15=TRUE,G15,0)+IF($K$16=TRUE,G16,0)+IF($K$17=TRUE,G17,0)+IF($K$18=TRUE,G18,0)+IF($K$19=TRUE,G19,0)+IF($K$20=TRUE,G20,0)+IF($K$21=TRUE,G21,0))/\n(IF($K$7=TRUE,1,0)+IF($K$8=TRUE,1,0)+IF($K$9=TRUE,1,0)+IF($K$10=TRUE,1,0)+IF($K$11=TRUE,1,0)+IF($K$12=TRUE,1,0)+IF($K$13=TRUE,1,0)+IF($K$14=TRUE,1,0)+IF($K$15=TRUE,1,0)+IF($K$16=TRUE,1,0)+IF($K$17=TRUE,1,0)+IF($K$18=TRUE,1,0)+IF($K$19=TRUE,1,0)+IF($K$20=TRUE,1,0)+IF($K$21=TRUE,1,0))","v":0},"RMSE:","RMSE:","RMSE:"]
[null,null,null,null,null,null,"RMSE IN METRIC:",{"$f":"SQRT((\n(IF($K$7=TRUE,H7^2,0))+(IF($K$8=TRUE,H8^2,0))+(IF($K$9=TRUE,H9^2,0))+(IF($K$10=TRUE,H10^2,0))+(IF($K$11=TRUE,H11^2,0))+(IF($K$12=TRUE,H12^2,0))+(IF($K$13=TRUE,H13^2,0))+(IF($K$14=TRUE,H14^2,0))+(IF($K$15=TRUE,H15^2,0))+(IF($K$16=TRUE,H16^2,0))+(IF($K$17=TRUE,H17^2,0))+(IF($K$18=TRUE,H18^2,0))+(IF($K$19=TRUE,H19^2,0))+(IF($K$20=TRUE,H20^2,0))+(IF($K$21=TRUE,H21^2,0)))/\n(IF($K$7=TRUE,1,0)+IF($K$8=TRUE,1,0)+IF($K$9=TRUE,1,0)+IF($K$10=TRUE,1,0)+IF($K$11=TRUE,1,0)+IF($K$12=TRUE,1,0)+IF($K$13=TRUE,1,0)+IF($K$14=TRUE,1,0)+IF($K$15=TRUE,1,0)+IF($K$16=TRUE,1,0)+IF($K$17=TRUE,1,0)+IF($K$18=TRUE,1,0)+IF($K$19=TRUE,1,0)+IF($K$20=TRUE,1,0)+IF($K$21=TRUE,1,0)))","v":0},{"$f":"SQRT((\n(IF($K$7=TRUE,I7^2,0))+(IF($K$8=TRUE,I8^2,0))+(IF($K$9=TRUE,I9^2,0))+(IF($K$10=TRUE,I10^2,0))+(IF($K$11=TRUE,I11^2,0))+(IF($K$12=TRUE,I12^2,0))+(IF($K$13=TRUE,I13^2,0))+(IF($K$14=TRUE,I14^2,0))+(IF($K$15=TRUE,I15^2,0))+(IF($K$16=TRUE,I16^2,0))+(IF($K$17=TRUE,I17^2,0))+(IF($K$18=TRUE,I18^2,0))+(IF($K$19=TRUE,I19^2,0))+(IF($K$20=TRUE,I20^2,0))+(IF($K$21=TRUE,I21^2,0)))/\n(IF($K$7=TRUE,1,0)+IF($K$8=TRUE,1,0)+IF($K$9=TRUE,1,0)+IF($K$10=TRUE,1,0)+IF($K$11=TRUE,1,0)+IF($K$12=TRUE,1,0)+IF($K$13=TRUE,1,0)+IF($K$14=TRUE,1,0)+IF($K$15=TRUE,1,0)+IF($K$16=TRUE,1,0)+IF($K$17=TRUE,1,0)+IF($K$18=TRUE,1,0)+IF($K$19=TRUE,1,0)+IF($K$20=TRUE,1,0)+IF($K$21=TRUE,1,0)))","v":0},{"$f":"SQRT((\n(IF($K$7=TRUE,J7^2,0))+(IF($K$8=TRUE,J8^2,0))+(IF($K$9=TRUE,J9^2,0))+(IF($K$10=TRUE,J10^2,0))+(IF($K$11=TRUE,J11^2,0))+(IF($K$12=TRUE,J12^2,0))+(IF($K$13=TRUE,J13^2,0))+(IF($K$14=TRUE,J14^2,0))+(IF($K$15=TRUE,J15^2,0))+(IF($K$16=TRUE,J16^2,0))+(IF($K$17=TRUE,J17^2,0))+(IF($K$18=TRUE,J18^2,0))+(IF($K$19=TRUE,J19^2,0))+(IF($K$20=TRUE,J20^2,0))+(IF($K$21=TRUE,J21^2,0)))/\n(IF($K$7=TRUE,1,0)+IF($K$8=TRUE,1,0)+IF($K$9=TRUE,1,0)+IF($K$10=TRUE,1,0)+IF($K$11=TRUE,1,0)+IF($K$12=TRUE,1,0)+IF($K$13=TRUE,1,0)+IF($K$14=TRUE,1,0)+IF($K$15=TRUE,1,0)+IF($K$16=TRUE,1,0)+IF($K$17=TRUE,1,0)+IF($K$18=TRUE,1,0)+IF($K$19=TRUE,1,0)+IF($K$20=TRUE,1,0)+IF($K$21=TRUE,1,0)))","v":0}]
[null,null,"ENGLISH TO METRIC CONVERSION",{"$f":"3937/1200","v":3.2808333333333333},null,null,"RMSE IN US SURVEY FEET:",{"$f":"H23*$D$24","v":0},{"$f":"I23*$D$24","v":0},{"$f":"J23*$D$24","v":0}]
[null,null,"UNITLESS GRID TO GROUND MULTIPLIER",{"$f":"REPORT!C13","v":0},null,null,null,{"$f":"IF(H24<=0.029,\"PASS\",\"FAIL\")","v":"PASS"},{"$f":"IF(I24<=0.029,\"PASS\",\"FAIL\")","v":"PASS"},{"$f":"IF(J24<=0.039,\"PASS\",\"FAIL\")","v":"PASS"}]
[]
["AVERAGED GPS-DERIVED POSITION",null,null,null,null,null,null,null,"Notes:"]
[null,"MONUMENT COORDINATES",null,"NORTHING","EASTING","ORTHO HEIGHT"]
[null,"METERS (GRID)",null,{"$f":"$E$22","v":0},{"$f":"$F$22","v":0},{"$f":"$G$22","v":0}]
[]
["LEVELED ELEVATION"]
["US SURVEY FEET",null,{"$f":"VLOOKUP(B5,'LEVEL RUN'!A8:I59,9,FALSE)","v":{"$error":"#N/A"}},"(Type the leveled elevation or N/A if no leveled elevation is available)"]
["MONUMENT HELD",null,null,"(Type the monument name from which leveling originated)"]
["LEVELED ELEVATION - GPS DERIVED ELEVATION   = ",null,null,null,{"$f":"IF(C32=\"N/A\",\"N/A\",C32-(F29*D24))","v":{"$error":"#N/A"}}]
[]
["FINAL MONUMENT COORDINATES"]
[null,"MONUMENT COORDINATES",null,"NORTHING","EASTING","ELEVATION","FEATURE CODE"]
[null,"US SURVEY FEET (GRID)",null,{"$f":"$E$22*$D$24","v":0},{"$f":"$F$22*$D$24","v":0},{"$f":"IF($C$32=\"N/A\",($G$22*$D$24),$C$32)","v":{"$error":"#N/A"}},"IPINS"]
[null,"US SURVEY FEET (GROUND)",null,{"$f":"$D$38*$D$25","v":0},{"$f":"$E$38*$D$25","v":0},{"$f":"IF($C$32=\"N/A\",($G$22*$D$24),$C$32)","v":{"$error":"#N/A"}},"IPINS"]
[]
["∆ North,  ∆ East, and ∆ Ht. are the difference between the average northing, easting, and height for each observation.",null,null,null,null,null,null,null,"Mask Angle:","13°"]

{"sheet":"CP02","index":8,"n_rows":41,"n_cols":11,"rows_kept":41,"cut":false,"hidden":false,"merged":[[0,0,0,10],[26,0,26,6],[27,1,27,2],[27,8,38,10],[38,1,38,2],[28,1,28,2],[30,0,30,6],[35,0,35,6],[36,1,36,2],[37,1,37,2]]}
["VRS GNSS Project Control Monument Coordinate Analysis"]
[]
["PROJECT:",{"$f":"REPORT!B2","v":"XXX-XXX-XXXX"},"GPS Antenna:","Trimble R6",null,null,null,null,null,"Report Date:",{"$f":"'CP01'!K3","v":"00:00:00"}]
["PID:",{"$f":"REPORT!E2","v":"XXXXX"},"VRS Network:","ODOT VRS",null,null,null,null,null,"Prepared By:",{"$f":"'CP01'!K4","v":0}]
["MONUMENT NUMBER:","CP02","No. of Sessions:",{"$f":"COUNTIF(GPS_IMPORT!A2:A1000,$B$5)","v":0},null,null,null,null,null,"Checked By:",{"$f":"'CP01'!K5","v":0}]
["SESSION #","Point","Observation Date","Start Time","Northing(m)","Easting(m)","Height(m)","∆ Northing(m)","∆ Easting(m)","∆ Height(m)","Include in Solution?"]
[1,{"$f":"IF(ROWS(GPS_IMPORT!$1:1)<=COUNTIF(GPS_IMPORT!$A$2:$A$10000,$B$5),INDEX(GPS_IMPORT!$2:$10000,MATCH($B$5,(GPS_IMPORT!$A$2:$A$10000),0)+ROWS($1:1)-1,COLUMN()-1),0)","v":0},{"$f":"IF(ROWS(GPS_IMPORT!$1:1)<=COUNTIF(GPS_IMPORT!$A$2:$A$10000,$B$5),INDEX(GPS_IMPORT!$2:$10000,MATCH($B$5,(GPS_IMPORT!$A$2:$A$10000),0)+ROWS($1:1)-1,COLUMN()-1),0)","v":"00:00:00"},{"$f":"IF(ROWS(GPS_IMPORT!$1:1)<=COUNTIF(GPS_IMPORT!$A$2:$A$10000,$B$5),INDEX(GPS_IMPORT!$2:$10000,MATCH($B$5,(GPS_IMPORT!$A$2:$A$10000),0)+ROWS($1:1)-1,COLUMN()-1),0)","v":"00:00:00"},{"$f":"IF(ROWS(GPS_IMPORT!$1:1)<=COUNTIF(GPS_IMPORT!$A$2:$A$10000,$B$5),INDEX(GPS_IMPORT!$2:$10000,MATCH($B$5,(GPS_IMPORT!$A$2:$A$10000),0)+ROWS($1:1)-1,COLUMN()-1),0)","v":0},{"$f":"IF(ROWS(GPS_IMPORT!$1:1)<=COUNTIF(GPS_IMPORT!$A$2:$A$10000,$B$5),INDEX(GPS_IMPORT!$2:$10000,MATCH($B$5,(GPS_IMPORT!$A$2:$A$10000),0)+ROWS($1:1)-1,COLUMN()-1),0)","v":0},{"$f":"IF(ROWS(GPS_IMPORT!$1:1)<=COUNTIF(GPS_IMPORT!$A$2:$A$10000,$B$5),INDEX(GPS_IMPORT!$2:$10000,MATCH($B$5,(GPS_IMPORT!$A$2:$A$10000),0)+ROWS($1:1)-1,COLUMN()-1),0)","v":0},{"$f":"IF(E7>0,E$22-E7,0)","v":0},0,0,true]
[2,{"$f":"IF(ROWS(GPS_IMPORT!$1:2)<=COUNTIF(GPS_IMPORT!$A$2:$A$10000,$B$5),INDEX(GPS_IMPORT!$2:$10000,MATCH($B$5,(GPS_IMPORT!$A$2:$A$10000),0)+ROWS($1:2)-1,COLUMN()-1),0)","v":0},{"$f":"IF(ROWS(GPS_IMPORT!$1:2)<=COUNTIF(GPS_IMPORT!$A$2:$A$10000,$B$5),INDEX(GPS_IMPORT!$2:$10000,MATCH($B$5,(GPS_IMPORT!$A$2:$A$10000),0)+ROWS($1:2)-1,COLUMN()-1),0)","v":"00:00:00"},{"$f":"IF(ROWS(GPS_IMPORT!$1:2)<=COUNTIF(GPS_IMPORT!$A$2:$A$10000,$B$5),INDEX(GPS_IMPORT!$2:$10000,MATCH($B$5,(GPS_IMPORT!$A$2:$A$10000),0)+ROWS($1:2)-1,COLUMN()-1),0)","v":"00:00:00"},{"$f":"IF(ROWS(GPS_IMPORT!$1:2)<=COUNTIF(GPS_IMPORT!$A$2:$A$10000,$B$5),INDEX(GPS_IMPORT!$2:$10000,MATCH($B$5,(GPS_IMPORT!$A$2:$A$10000),0)+ROWS($1:2)-1,COLUMN()-1),0)","v":0},{"$f":"IF(ROWS(GPS_IMPORT!$1:2)<=COUNTIF(GPS_IMPORT!$A$2:$A$10000,$B$5),INDEX(GPS_IMPORT!$2:$10000,MATCH($B$5,(GPS_IMPORT!$A$2:$A$10000),0)+ROWS($1:2)-1,COLUMN()-1),0)","v":0},{"$f":"IF(ROWS(GPS_IMPORT!$1:2)<=COUNTIF(GPS_IMPORT!$A$2:$A$10000,$B$5),INDEX(GPS_IMPORT!$2:$10000,MATCH($B$5,(GPS_IMPORT!$A$2:$A$10000),0)+ROWS($1:2)-1,COLUMN()-1),0)","v":0},0,0,0,true]
[3,{"$f":"IF(ROWS(GPS_IMPORT!$1:3)<=COUNTIF(GPS_IMPORT!$A$2:$A$10000,$B$5),INDEX(GPS_IMPORT!$2:$10000,MATCH($B$5,(GPS_IMPORT!$A$2:$A$10000),0)+ROWS($1:3)-1,COLUMN()-1),0)","v":0},{"$f":"IF(ROWS(GPS_IMPORT!$1:3)<=COUNTIF(GPS_IMPORT!$A$2:$A$10000,$B$5),INDEX(GPS_IMPORT!$2:$10000,MATCH($B$5,(GPS_IMPORT!$A$2:$A$10000),0)+ROWS($1:3)-1,COLUMN()-1),0)","v":"00:00:00"},{"$f":"IF(ROWS(GPS_IMPORT!$1:3)<=COUNTIF(GPS_IMPORT!$A$2:$A$10000,$B$5),INDEX(GPS_IMPORT!$2:$10000,MATCH($B$5,(GPS_IMPORT!$A$2:$A$10000),0)+ROWS($1:3)-1,COLUMN()-1),0)","v":"00:00:00"},{"$f":"IF(ROWS(GPS_IMPORT!$1:3)<=COUNTIF(GPS_IMPORT!$A$2:$A$10000,$B$5),INDEX(GPS_IMPORT!$2:$10000,MATCH($B$5,(GPS_IMPORT!$A$2:$A$10000),0)+ROWS($1:3)-1,COLUMN()-1),0)","v":0},{"$f":"IF(ROWS(GPS_IMPORT!$1:3)<=COUNTIF(GPS_IMPORT!$A$2:$A$10000,$B$5),INDEX(GPS_IMPORT!$2:$10000,MATCH($B$5,(GPS_IMPORT!$A$2:$A$10000),0)+ROWS($1:3)-1,COLUMN()-1),0)","v":0},{"$f":"IF(ROWS(GPS_IMPORT!$1:3)<=COUNTIF(GPS_IMPORT!$A$2:$A$10000,$B$5),INDEX(GPS_IMPORT!$2:$10000,MATCH($B$5,(GPS_IMPORT!$A$2:$A$10000),0)+ROWS($1:3)-1,COLUMN()-1),0)","v":0},0,0,0,true]
[4,{"$f":"IF(ROWS(GPS_IMPORT!$1:4)<=COUNTIF(GPS_IMPORT!$A$2:$A$10000,$B$5),INDEX(GPS_IMPORT!$2:$10000,MATCH($B$5,(GPS_IMPORT!$A$2:$A$10000),0)+ROWS($1:4)-1,COLUMN()-1),0)","v":0},{"$f":"IF(ROWS(GPS_IMPORT!$1:4)<=COUNTIF(GPS_IMPORT!$A$2:$A$10000,$B$5),INDEX(GPS_IMPORT!$2:$10000,MATCH($B$5,(GPS_IMPORT!$A$2:$A$10000),0)+ROWS($1:4)-1,COLUMN()-1),0)","v":"00:00:00"},{"$f":"IF(ROWS(GPS_IMPORT!$1:4)<=COUNTIF(GPS_IMPORT!$A$2:$A$10000,$B$5),INDEX(GPS_IMPORT!$2:$10000,MATCH($B$5,(GPS_IMPORT!$A$2:$A$10000),0)+ROWS($1:4)-1,COLUMN()-1),0)","v":"00:00:00"},{"$f":"IF(ROWS(GPS_IMPORT!$1:4)<=COUNTIF(GPS_IMPORT!$A$2:$A$10000,$B$5),INDEX(GPS_IMPORT!$2:$10000,MATCH($B$5,(GPS_IMPORT!$A$2:$A$10000),0)+ROWS($1:4)-1,COLUMN()-1),0)","v":0},{"$f":"IF(ROWS(GPS_IMPORT!$1:4)<=COUNTIF(GPS_IMPORT!$A$2:$A$10000,$B$5),INDEX(GPS_IMPORT!$2:$10000,MATCH($B$5,(GPS_IMPORT!$A$2:$A$10000),0)+ROWS($1:4)-1,COLUMN()-1),0)","v":0},{"$f":"IF(ROWS(GPS_IMPORT!$1:4)<=COUNTIF(GPS_IMPORT!$A$2:$A$10000,$B$5),INDEX(GPS_IMPORT!$2:$10000,MATCH($B$5,(GPS_IMPORT!$A$2:$A$10000),0)+ROWS($1:4)-1,COLUMN()-1),0)","v":0},0,0,0,true]
[5,{"$f":"IF(ROWS(GPS_IMPORT!$1:5)<=COUNTIF(GPS_IMPORT!$A$2:$A$10000,$B$5),INDEX(GPS_IMPORT!$2:$10000,MATCH($B$5,(GPS_IMPORT!$A$2:$A$10000),0)+ROWS($1:5)-1,COLUMN()-1),0)","v":0},{"$f":"IF(ROWS(GPS_IMPORT!$1:5)<=COUNTIF(GPS_IMPORT!$A$2:$A$10000,$B$5),INDEX(GPS_IMPORT!$2:$10000,MATCH($B$5,(GPS_IMPORT!$A$2:$A$10000),0)+ROWS($1:5)-1,COLUMN()-1),0)","v":"00:00:00"},{"$f":"IF(ROWS(GPS_IMPORT!$1:5)<=COUNTIF(GPS_IMPORT!$A$2:$A$10000,$B$5),INDEX(GPS_IMPORT!$2:$10000,MATCH($B$5,(GPS_IMPORT!$A$2:$A$10000),0)+ROWS($1:5)-1,COLUMN()-1),0)","v":"00:00:00"},{"$f":"IF(ROWS(GPS_IMPORT!$1:5)<=COUNTIF(GPS_IMPORT!$A$2:$A$10000,$B$5),INDEX(GPS_IMPORT!$2:$10000,MATCH($B$5,(GPS_IMPORT!$A$2:$A$10000),0)+ROWS($1:5)-1,COLUMN()-1),0)","v":0},{"$f":"IF(ROWS(GPS_IMPORT!$1:5)<=COUNTIF(GPS_IMPORT!$A$2:$A$10000,$B$5),INDEX(GPS_IMPORT!$2:$10000,MATCH($B$5,(GPS_IMPORT!$A$2:$A$10000),0)+ROWS($1:5)-1,COLUMN()-1),0)","v":0},{"$f":"IF(ROWS(GPS_IMPORT!$1:5)<=COUNTIF(GPS_IMPORT!$A$2:$A$10000,$B$5),INDEX(GPS_IMPORT!$2:$10000,MATCH($B$5,(GPS_IMPORT!$A$2:$A$10000),0)+ROWS($1:5)-1,COLUMN()-1),0)","v":0},0,0,0,true]
[6,{"$f":"IF(ROWS(GPS_IMPORT!$1:6)<=COUNTIF(GPS_IMPORT!$A$2:$A$10000,$B$5),INDEX(GPS_IMPORT!$2:$10000,MATCH($B$5,(GPS_IMPORT!$A$2:$A$10000),0)+ROWS($1:6)-1,COLUMN()-1),0)","v":0},{"$f":"IF(ROWS(GPS_IMPORT!$1:6)<=COUNTIF(GPS_IMPORT!$A$2:$A$10000,$B$5),INDEX(GPS_IMPORT!$2:$10000,MATCH($B$5,(GPS_IMPORT!$A$2:$A$10000),0)+ROWS($1:6)-1,COLUMN()-1),0)","v":"00:00:00"},{"$f":"IF(ROWS(GPS_IMPORT!$1:6)<=COUNTIF(GPS_IMPORT!$A$2:$A$10000,$B$5),INDEX(GPS_IMPORT!$2:$10000,MATCH($B$5,(GPS_IMPORT!$A$2:$A$10000),0)+ROWS($1:6)-1,COLUMN()-1),0)","v":"00:00:00"},{"$f":"IF(ROWS(GPS_IMPORT!$1:6)<=COUNTIF(GPS_IMPORT!$A$2:$A$10000,$B$5),INDEX(GPS_IMPORT!$2:$10000,MATCH($B$5,(GPS_IMPORT!$A$2:$A$10000),0)+ROWS($1:6)-1,COLUMN()-1),0)","v":0},{"$f":"IF(ROWS(GPS_IMPORT!$1:6)<=COUNTIF(GPS_IMPORT!$A$2:$A$10000,$B$5),INDEX(GPS_IMPORT!$2:$10000,MATCH($B$5,(GPS_IMPORT!$A$2:$A$10000),0)+ROWS($1:6)-1,COLUMN()-1),0)","v":0},{"$f":"IF(ROWS(GPS_IMPORT!$1:6)<=COUNTIF(GPS_IMPORT!$A$2:$A$10000,$B$5),INDEX(GPS_IMPORT!$2:$10000,MATCH($B$5,(GPS_IMPORT!$A$2:$A$10000),0)+ROWS($1:6)-1,COLUMN()-1),0)","v":0},0,0,0,true]
[7,{"$f":"IF(ROWS(GPS_IMPORT!$1:7)<=COUNTIF(GPS_IMPORT!$A$2:$A$10000,$B$5),INDEX(GPS_IMPORT!$2:$10000,MATCH($B$5,(GPS_IMPORT!$A$2:$A$10000),0)+ROWS($1:7)-1,COLUMN()-1),0)","v":0},{"$f":"IF(ROWS(GPS_IMPORT!$1:7)<=COUNTIF(GPS_IMPORT!$A$2:$A$10000,$B$5),INDEX(GPS_IMPORT!$2:$10000,MATCH($B$5,(GPS_IMPORT!$A$2:$A$10000),0)+ROWS($1:7)-1,COLUMN()-1),0)","v":"00:00:00"},{"$f":"IF(ROWS(GPS_IMPORT!$1:7)<=COUNTIF(GPS_IMPORT!$A$2:$A$10000,$B$5),INDEX(GPS_IMPORT!$2:$10000,MATCH($B$5,(GPS_IMPORT!$A$2:$A$10000),0)+ROWS($1:7)-1,COLUMN()-1),0)","v":"00:00:00"},{"$f":"IF(ROWS(GPS_IMPORT!$1:7)<=COUNTIF(GPS_IMPORT!$A$2:$A$10000,$B$5),INDEX(GPS_IMPORT!$2:$10000,MATCH($B$5,(GPS_IMPORT!$A$2:$A$10000),0)+ROWS($1:7)-1,COLUMN()-1),0)","v":0},{"$f":"IF(ROWS(GPS_IMPORT!$1:7)<=COUNTIF(GPS_IMPORT!$A$2:$A$10000,$B$5),INDEX(GPS_IMPORT!$2:$10000,MATCH($B$5,(GPS_IMPORT!$A$2:$A$10000),0)+ROWS($1:7)-1,COLUMN()-1),0)","v":0},{"$f":"IF(ROWS(GPS_IMPORT!$1:7)<=COUNTIF(GPS_IMPORT!$A$2:$A$10000,$B$5),INDEX(GPS_IMPORT!$2:$10000,MATCH($B$5,(GPS_IMPORT!$A$2:$A$10000),0)+ROWS($1:7)-1,COLUMN()-1),0)","v":0},0,0,0,true]
[8,{"$f":"IF(ROWS(GPS_IMPORT!$1:8)<=COUNTIF(GPS_IMPORT!$A$2:$A$10000,$B$5),INDEX(GPS_IMPORT!$2:$10000,MATCH($B$5,(GPS_IMPORT!$A$2:$A$10000),0)+ROWS($1:8)-1,COLUMN()-1),0)","v":0},{"$f":"IF(ROWS(GPS_IMPORT!$1:8)<=COUNTIF(GPS_IMPORT!$A$2:$A$10000,$B$5),INDEX(GPS_IMPORT!$2:$10000,MATCH($B$5,(GPS_IMPORT!$A$2:$A$10000),0)+ROWS($1:8)-1,COLUMN()-1),0)","v":"00:00:00"},{"$f":"IF(ROWS(GPS_IMPORT!$1:8)<=COUNTIF(GPS_IMPORT!$A$2:$A$10000,$B$5),INDEX(GPS_IMPORT!$2:$10000,MATCH($B$5,(GPS_IMPORT!$A$2:$A$10000),0)+ROWS($1:8)-1,COLUMN()-1),0)","v":"00:00:00"},{"$f":"IF(ROWS(GPS_IMPORT!$1:8)<=COUNTIF(GPS_IMPORT!$A$2:$A$10000,$B$5),INDEX(GPS_IMPORT!$2:$10000,MATCH($B$5,(GPS_IMPORT!$A$2:$A$10000),0)+ROWS($1:8)-1,COLUMN()-1),0)","v":0},{"$f":"IF(ROWS(GPS_IMPORT!$1:8)<=COUNTIF(GPS_IMPORT!$A$2:$A$10000,$B$5),INDEX(GPS_IMPORT!$2:$10000,MATCH($B$5,(GPS_IMPORT!$A$2:$A$10000),0)+ROWS($1:8)-1,COLUMN()-1),0)","v":0},{"$f":"IF(ROWS(GPS_IMPORT!$1:8)<=COUNTIF(GPS_IMPORT!$A$2:$A$10000,$B$5),INDEX(GPS_IMPORT!$2:$10000,MATCH($B$5,(GPS_IMPORT!$A$2:$A$10000),0)+ROWS($1:8)-1,COLUMN()-1),0)","v":0},0,0,0,true]
[9,{"$f":"IF(ROWS(GPS_IMPORT!$1:9)<=COUNTIF(GPS_IMPORT!$A$2:$A$10000,$B$5),INDEX(GPS_IMPORT!$2:$10000,MATCH($B$5,(GPS_IMPORT!$A$2:$A$10000),0)+ROWS($1:9)-1,COLUMN()-1),0)","v":0},{"$f":"IF(ROWS(GPS_IMPORT!$1:9)<=COUNTIF(GPS_IMPORT!$A$2:$A$10000,$B$5),INDEX(GPS_IMPORT!$2:$10000,MATCH($B$5,(GPS_IMPORT!$A$2:$A$10000),0)+ROWS($1:9)-1,COLUMN()-1),0)","v":"00:00:00"},{"$f":"IF(ROWS(GPS_IMPORT!$1:9)<=COUNTIF(GPS_IMPORT!$A$2:$A$10000,$B$5),INDEX(GPS_IMPORT!$2:$10000,MATCH($B$5,(GPS_IMPORT!$A$2:$A$10000),0)+ROWS($1:9)-1,COLUMN()-1),0)","v":"00:00:00"},{"$f":"IF(ROWS(GPS_IMPORT!$1:9)<=COUNTIF(GPS_IMPORT!$A$2:$A$10000,$B$5),INDEX(GPS_IMPORT!$2:$10000,MATCH($B$5,(GPS_IMPORT!$A$2:$A$10000),0)+ROWS($1:9)-1,COLUMN()-1),0)","v":0},{"$f":"IF(ROWS(GPS_IMPORT!$1:9)<=COUNTIF(GPS_IMPORT!$A$2:$A$10000,$B$5),INDEX(GPS_IMPORT!$2:$10000,MATCH($B$5,(GPS_IMPORT!$A$2:$A$10000),0)+ROWS($1:9)-1,COLUMN()-1),0)","v":0},{"$f":"IF(ROWS(GPS_IMPORT!$1:9)<=COUNTIF(GPS_IMPORT!$A$2:$A$10000,$B$5),INDEX(GPS_IMPORT!$2:$10000,MATCH($B$5,(GPS_IMPORT!$A$2:$A$10000),0)+ROWS($1:9)-1,COLUMN()-1),0)","v":0},0,0,0,true]
[10,{"$f":"IF(ROWS(GPS_IMPORT!$1:10)<=COUNTIF(GPS_IMPORT!$A$2:$A$10000,$B$5),INDEX(GPS_IMPORT!$2:$10000,MATCH($B$5,(GPS_IMPORT!$A$2:$A$10000),0)+ROWS($1:10)-1,COLUMN()-1),0)","v":0},{"$f":"IF(ROWS(GPS_IMPORT!$1:10)<=COUNTIF(GPS_IMPORT!$A$2:$A$10000,$B$5),INDEX(GPS_IMPORT!$2:$10000,MATCH($B$5,(GPS_IMPORT!$A$2:$A$10000),0)+ROWS($1:10)-1,COLUMN()-1),0)","v":"00:00:00"},{"$f":"IF(ROWS(GPS_IMPORT!$1:10)<=COUNTIF(GPS_IMPORT!$A$2:$A$10000,$B$5),INDEX(GPS_IMPORT!$2:$10000,MATCH($B$5,(GPS_IMPORT!$A$2:$A$10000),0)+ROWS($1:10)-1,COLUMN()-1),0)","v":"00:00:00"},{"$f":"IF(ROWS(GPS_IMPORT!$1:10)<=COUNTIF(GPS_IMPORT!$A$2:$A$10000,$B$5),INDEX(GPS_IMPORT!$2:$10000,MATCH($B$5,(GPS_IMPORT!$A$2:$A$10000),0)+ROWS($1:10)-1,COLUMN()-1),0)","v":0},{"$f":"IF(ROWS(GPS_IMPORT!$1:10)<=COUNTIF(GPS_IMPORT!$A$2:$A$10000,$B$5),INDEX(GPS_IMPORT!$2:$10000,MATCH($B$5,(GPS_IMPORT!$A$2:$A$10000),0)+ROWS($1:10)-1,COLUMN()-1),0)","v":0},{"$f":"IF(ROWS(GPS_IMPORT!$1:10)<=COUNTIF(GPS_IMPORT!$A$2:$A$10000,$B$5),INDEX(GPS_IMPORT!$2:$10000,MATCH($B$5,(GPS_IMPORT!$A$2:$A$10000),0)+ROWS($1:10)-1,COLUMN()-1),0)","v":0},0,0,0,true]
[11,{"$f":"IF(ROWS(GPS_IMPORT!$1:11)<=COUNTIF(GPS_IMPORT!$A$2:$A$10000,$B$5),INDEX(GPS_IMPORT!$2:$10000,MATCH($B$5,(GPS_IMPORT!$A$2:$A$10000),0)+ROWS($1:11)-1,COLUMN()-1),0)","v":0},{"$f":"IF(ROWS(GPS_IMPORT!$1:11)<=COUNTIF(GPS_IMPORT!$A$2:$A$10000,$B$5),INDEX(GPS_IMPORT!$2:$10000,MATCH($B$5,(GPS_IMPORT!$A$2:$A$10000),0)+ROWS($1:11)-1,COLUMN()-1),0)","v":"00:00:00"},{"$f":"IF(ROWS(GPS_IMPORT!$1:11)<=COUNTIF(GPS_IMPORT!$A$2:$A$10000,$B$5),INDEX(GPS_IMPORT!$2:$10000,MATCH($B$5,(GPS_IMPORT!$A$2:$A$10000),0)+ROWS($1:11)-1,COLUMN()-1),0)","v":"00:00:00"},{"$f":"IF(ROWS(GPS_IMPORT!$1:11)<=COUNTIF(GPS_IMPORT!$A$2:$A$10000,$B$5),INDEX(GPS_IMPORT!$2:$10000,MATCH($B$5,(GPS_IMPORT!$A$2:$A$10000),0)+ROWS($1:11)-1,COLUMN()-1),0)","v":0},{"$f":"IF(ROWS(GPS_IMPORT!$1:11)<=COUNTIF(GPS_IMPORT!$A$2:$A$10000,$B$5),INDEX(GPS_IMPORT!$2:$10000,MATCH($B$5,(GPS_IMPORT!$A$2:$A$10000),0)+ROWS($1:11)-1,COLUMN()-1),0)","v":0},{"$f":"IF(ROWS(GPS_IMPORT!$1:11)<=COUNTIF(GPS_IMPORT!$A$2:$A$10000,$B$5),INDEX(GPS_IMPORT!$2:$10000,MATCH($B$5,(GPS_IMPORT!$A$2:$A$10000),0)+ROWS($1:11)-1,COLUMN()-1),0)","v":0},0,0,0,true]
[12,{"$f":"IF(ROWS(GPS_IMPORT!$1:12)<=COUNTIF(GPS_IMPORT!$A$2:$A$10000,$B$5),INDEX(GPS_IMPORT!$2:$10000,MATCH($B$5,(GPS_IMPORT!$A$2:$A$10000),0)+ROWS($1:12)-1,COLUMN()-1),0)","v":0},{"$f":"IF(ROWS(GPS_IMPORT!$1:12)<=COUNTIF(GPS_IMPORT!$A$2:$A$10000,$B$5),INDEX(GPS_IMPORT!$2:$10000,MATCH($B$5,(GPS_IMPORT!$A$2:$A$10000),0)+ROWS($1:12)-1,COLUMN()-1),0)","v":"00:00:00"},{"$f":"IF(ROWS(GPS_IMPORT!$1:12)<=COUNTIF(GPS_IMPORT!$A$2:$A$10000,$B$5),INDEX(GPS_IMPORT!$2:$10000,MATCH($B$5,(GPS_IMPORT!$A$2:$A$10000),0)+ROWS($1:12)-1,COLUMN()-1),0)","v":"00:00:00"},{"$f":"IF(ROWS(GPS_IMPORT!$1:12)<=COUNTIF(GPS_IMPORT!$A$2:$A$10000,$B$5),INDEX(GPS_IMPORT!$2:$10000,MATCH($B$5,(GPS_IMPORT!$A$2:$A$10000),0)+ROWS($1:12)-1,COLUMN()-1),0)","v":0},{"$f":"IF(ROWS(GPS_IMPORT!$1:12)<=COUNTIF(GPS_IMPORT!$A$2:$A$10000,$B$5),INDEX(GPS_IMPORT!$2:$10000,MATCH($B$5,(GPS_IMPORT!$A$2:$A$10000),0)+ROWS($1:12)-1,COLUMN()-1),0)","v":0},{"$f":"IF(ROWS(GPS_IMPORT!$1:12)<=COUNTIF(GPS_IMPORT!$A$2:$A$10000,$B$5),INDEX(GPS_IMPORT!$2:$10000,MATCH($B$5,(GPS_IMPORT!$A$2:$A$10000),0)+ROWS($1:12)-1,COLUMN()-1),0)","v":0},0,0,0,true]
[13,{"$f":"IF(ROWS(GPS_IMPORT!$1:13)<=COUNTIF(GPS_IMPORT!$A$2:$A$10000,$B$5),INDEX(GPS_IMPORT!$2:$10000,MATCH($B$5,(GPS_IMPORT!$A$2:$A$10000),0)+ROWS($1:13)-1,COLUMN()-1),0)","v":0},{"$f":"IF(ROWS(GPS_IMPORT!$1:13)<=COUNTIF(GPS_IMPORT!$A$2:$A$10000,$B$5),INDEX(GPS_IMPORT!$2:$10000,MATCH($B$5,(GPS_IMPORT!$A$2:$A$10000),0)+ROWS($1:13)-1,COLUMN()-1),0)","v":"00:00:00"},{"$f":"IF(ROWS(GPS_IMPORT!$1:13)<=COUNTIF(GPS_IMPORT!$A$2:$A$10000,$B$5),INDEX(GPS_IMPORT!$2:$10000,MATCH($B$5,(GPS_IMPORT!$A$2:$A$10000),0)+ROWS($1:13)-1,COLUMN()-1),0)","v":"00:00:00"},{"$f":"IF(ROWS(GPS_IMPORT!$1:13)<=COUNTIF(GPS_IMPORT!$A$2:$A$10000,$B$5),INDEX(GPS_IMPORT!$2:$10000,MATCH($B$5,(GPS_IMPORT!$A$2:$A$10000),0)+ROWS($1:13)-1,COLUMN()-1),0)","v":0},{"$f":"IF(ROWS(GPS_IMPORT!$1:13)<=COUNTIF(GPS_IMPORT!$A$2:$A$10000,$B$5),INDEX(GPS_IMPORT!$2:$10000,MATCH($B$5,(GPS_IMPORT!$A$2:$A$10000),0)+ROWS($1:13)-1,COLUMN()-1),0)","v":0},{"$f":"IF(ROWS(GPS_IMPORT!$1:13)<=COUNTIF(GPS_IMPORT!$A$2:$A$10000,$B$5),INDEX(GPS_IMPORT!$2:$10000,MATCH($B$5,(GPS_IMPORT!$A$2:$A$10000),0)+ROWS($1:13)-1,COLUMN()-1),0)","v":0},{"$f":"IF(E19>0,E$22-E19,0)","v":0},0,0,false]
[14,{"$f":"IF(ROWS(GPS_IMPORT!$1:14)<=COUNTIF(GPS_IMPORT!$A$2:$A$10000,$B$5),INDEX(GPS_IMPORT!$2:$10000,MATCH($B$5,(GPS_IMPORT!$A$2:$A$10000),0)+ROWS($1:14)-1,COLUMN()-1),0)","v":0},{"$f":"IF(ROWS(GPS_IMPORT!$1:14)<=COUNTIF(GPS_IMPORT!$A$2:$A$10000,$B$5),INDEX(GPS_IMPORT!$2:$10000,MATCH($B$5,(GPS_IMPORT!$A$2:$A$10000),0)+ROWS($1:14)-1,COLUMN()-1),0)","v":"00:00:00"},{"$f":"IF(ROWS(GPS_IMPORT!$1:14)<=COUNTIF(GPS_IMPORT!$A$2:$A$10000,$B$5),INDEX(GPS_IMPORT!$2:$10000,MATCH($B$5,(GPS_IMPORT!$A$2:$A$10000),0)+ROWS($1:14)-1,COLUMN()-1),0)","v":"00:00:00"},{"$f":"IF(ROWS(GPS_IMPORT!$1:14)<=COUNTIF(GPS_IMPORT!$A$2:$A$10000,$B$5),INDEX(GPS_IMPORT!$2:$10000,MATCH($B$5,(GPS_IMPORT!$A$2:$A$10000),0)+ROWS($1:14)-1,COLUMN()-1),0)","v":0},{"$f":"IF(ROWS(GPS_IMPORT!$1:14)<=COUNTIF(GPS_IMPORT!$A$2:$A$10000,$B$5),INDEX(GPS_IMPORT!$2:$10000,MATCH($B$5,(GPS_IMPORT!$A$2:$A$10000),0)+ROWS($1:14)-1,COLUMN()-1),0)","v":0},{"$f":"IF(ROWS(GPS_IMPORT!$1:14)<=COUNTIF(GPS_IMPORT!$A$2:$A$10000,$B$5),INDEX(GPS_IMPORT!$2:$10000,MATCH($B$5,(GPS_IMPORT!$A$2:$A$10000),0)+ROWS($1:14)-1,COLUMN()-1),0)","v":0},0,0,0,false]
[15,{"$f":"IF(ROWS(GPS_IMPORT!$1:15)<=COUNTIF(GPS_IMPORT!$A$2:$A$10000,$B$5),INDEX(GPS_IMPORT!$2:$10000,MATCH($B$5,(GPS_IMPORT!$A$2:$A$10000),0)+ROWS($1:15)-1,COLUMN()-1),0)","v":0},{"$f":"IF(ROWS(GPS_IMPORT!$1:15)<=COUNTIF(GPS_IMPORT!$A$2:$A$10000,$B$5),INDEX(GPS_IMPORT!$2:$10000,MATCH($B$5,(GPS_IMPORT!$A$2:$A$10000),0)+ROWS($1:15)-1,COLUMN()-1),0)","v":"00:00:00"},{"$f":"IF(ROWS(GPS_IMPORT!$1:15)<=COUNTIF(GPS_IMPORT!$A$2:$A$10000,$B$5),INDEX(GPS_IMPORT!$2:$10000,MATCH($B$5,(GPS_IMPORT!$A$2:$A$10000),0)+ROWS($1:15)-1,COLUMN()-1),0)","v":"00:00:00"},{"$f":"IF(ROWS(GPS_IMPORT!$1:15)<=COUNTIF(GPS_IMPORT!$A$2:$A$10000,$B$5),INDEX(GPS_IMPORT!$2:$10000,MATCH($B$5,(GPS_IMPORT!$A$2:$A$10000),0)+ROWS($1:15)-1,COLUMN()-1),0)","v":0},{"$f":"IF(ROWS(GPS_IMPORT!$1:15)<=COUNTIF(GPS_IMPORT!$A$2:$A$10000,$B$5),INDEX(GPS_IMPORT!$2:$10000,MATCH($B$5,(GPS_IMPORT!$A$2:$A$10000),0)+ROWS($1:15)-1,COLUMN()-1),0)","v":0},{"$f":"IF(ROWS(GPS_IMPORT!$1:15)<=COUNTIF(GPS_IMPORT!$A$2:$A$10000,$B$5),INDEX(GPS_IMPORT!$2:$10000,MATCH($B$5,(GPS_IMPORT!$A$2:$A$10000),0)+ROWS($1:15)-1,COLUMN()-1),0)","v":0},0,0,0,false]
[null,null,null,"AVERAGE",{"$f":"(IF($K$7=TRUE,E7,0)+IF($K$8=TRUE,E8,0)+IF($K$9=TRUE,E9,0)+IF($K$10=TRUE,E10,0)+IF($K$11=TRUE,E11,0)+IF($K$12=TRUE,E12,0)+IF($K$13=TRUE,E13,0)+IF($K$14=TRUE,E14,0)+IF($K$15=TRUE,E15,0)+IF($K$16=TRUE,E16,0)+IF($K$17=TRUE,E17,0)+IF($K$18=TRUE,E18,0)+IF($K$19=TRUE,E19,0)+IF($K$20=TRUE,E20,0)+IF($K$21=TRUE,E21,0))/(IF($K$7=TRUE,1,0)+IF($K$8=TRUE,1,0)+IF($K$9=TRUE,1,0)+IF($K$10=TRUE,1,0)+IF($K$11=TRUE,1,0)+IF($K$12=TRUE,1,0)+IF($K$13=TRUE,1,0)+IF($K$14=TRUE,1,0)+IF($K$15=TRUE,1,0)+IF($K$16=TRUE,1,0)+IF($K$17=TRUE,1,0)+IF($K$18=TRUE,1,0)+IF($K$19=TRUE,1,0)+IF($K$20=TRUE,1,0)+IF($K$21=TRUE,1,0))","v":0},{"$f":"(IF($K$7=TRUE,F7,0)+IF($K$8=TRUE,F8,0)+IF($K$9=TRUE,F9,0)+IF($K$10=TRUE,F10,0)+IF($K$11=TRUE,F11,0)+IF($K$12=TRUE,F12,0)+IF($K$13=TRUE,F13,0)+IF($K$14=TRUE,F14,0)+IF($K$15=TRUE,F15,0)+IF($K$16=TRUE,F16,0)+IF($K$17=TRUE,F17,0)+IF($K$18=TRUE,F18,0)+IF($K$19=TRUE,F19,0)+IF($K$20=TRUE,F20,0)+IF($K$21=TRUE,F21,0))/(IF($K$7=TRUE,1,0)+IF($K$8=TRUE,1,0)+IF($K$9=TRUE,1,0)+IF($K$10=TRUE,1,0)+IF($K$11=TRUE,1,0)+IF($K$12=TRUE,1,0)+IF($K$13=TRUE,1,0)+IF($K$14=TRUE,1,0)+IF($K$15=TRUE,1,0)+IF($K$16=TRUE,1,0)+IF($K$17=TRUE,1,0)+IF($K$18=TRUE,1,0)+IF($K$19=TRUE,1,0)+IF($K$20=TRUE,1,0)+IF($K$21=TRUE,1,0))","v":0},{"$f":"(IF($K$7=TRUE,G7,0)+IF($K$8=TRUE,G8,0)+IF($K$9=TRUE,G9,0)+IF($K$10=TRUE,G10,0)+IF($K$11=TRUE,G11,0)+IF($K$12=TRUE,G12,0)+IF($K$13=TRUE,G13,0)+IF($K$14=TRUE,G14,0)+IF($K$15=TRUE,G15,0)+IF($K$16=TRUE,G16,0)+IF($K$17=TRUE,G17,0)+IF($K$18=TRUE,G18,0)+IF($K$19=TRUE,G19,0)+IF($K$20=TRUE,G20,0)+IF($K$21=TRUE,G21,0))/\n(IF($K$7=TRUE,1,0)+IF($K$8=TRUE,1,0)+IF($K$9=TRUE,1,0)+IF($K$10=TRUE,1,0)+IF($K$11=TRUE,1,0)+IF($K$12=TRUE,1,0)+IF($K$13=TRUE,1,0)+IF($K$14=TRUE,1,0)+IF($K$15=TRUE,1,0)+IF($K$16=TRUE,1,0)+IF($K$17=TRUE,1,0)+IF($K$18=TRUE,1,0)+IF($K$19=TRUE,1,0)+IF($K$20=TRUE,1,0)+IF($K$21=TRUE,1,0))","v":0},"RMSE:","RMSE:","RMSE:"]
[null,null,null,null,null,null,"RMSE IN METRIC:",{"$f":"SQRT((\n(IF($K$7=TRUE,H7^2,0))+(IF($K$8=TRUE,H8^2,0))+(IF($K$9=TRUE,H9^2,0))+(IF($K$10=TRUE,H10^2,0))+(IF($K$11=TRUE,H11^2,0))+(IF($K$12=TRUE,H12^2,0))+(IF($K$13=TRUE,H13^2,0))+(IF($K$14=TRUE,H14^2,0))+(IF($K$15=TRUE,H15^2,0))+(IF($K$16=TRUE,H16^2,0))+(IF($K$17=TRUE,H17^2,0))+(IF($K$18=TRUE,H18^2,0))+(IF($K$19=TRUE,H19^2,0))+(IF($K$20=TRUE,H20^2,0))+(IF($K$21=TRUE,H21^2,0)))/\n(IF($K$7=TRUE,1,0)+IF($K$8=TRUE,1,0)+IF($K$9=TRUE,1,0)+IF($K$10=TRUE,1,0)+IF($K$11=TRUE,1,0)+IF($K$12=TRUE,1,0)+IF($K$13=TRUE,1,0)+IF($K$14=TRUE,1,0)+IF($K$15=TRUE,1,0)+IF($K$16=TRUE,1,0)+IF($K$17=TRUE,1,0)+IF($K$18=TRUE,1,0)+IF($K$19=TRUE,1,0)+IF($K$20=TRUE,1,0)+IF($K$21=TRUE,1,0)))","v":0},{"$f":"SQRT((\n(IF($K$7=TRUE,I7^2,0))+(IF($K$8=TRUE,I8^2,0))+(IF($K$9=TRUE,I9^2,0))+(IF($K$10=TRUE,I10^2,0))+(IF($K$11=TRUE,I11^2,0))+(IF($K$12=TRUE,I12^2,0))+(IF($K$13=TRUE,I13^2,0))+(IF($K$14=TRUE,I14^2,0))+(IF($K$15=TRUE,I15^2,0))+(IF($K$16=TRUE,I16^2,0))+(IF($K$17=TRUE,I17^2,0))+(IF($K$18=TRUE,I18^2,0))+(IF($K$19=TRUE,I19^2,0))+(IF($K$20=TRUE,I20^2,0))+(IF($K$21=TRUE,I21^2,0)))/\n(IF($K$7=TRUE,1,0)+IF($K$8=TRUE,1,0)+IF($K$9=TRUE,1,0)+IF($K$10=TRUE,1,0)+IF($K$11=TRUE,1,0)+IF($K$12=TRUE,1,0)+IF($K$13=TRUE,1,0)+IF($K$14=TRUE,1,0)+IF($K$15=TRUE,1,0)+IF($K$16=TRUE,1,0)+IF($K$17=TRUE,1,0)+IF($K$18=TRUE,1,0)+IF($K$19=TRUE,1,0)+IF($K$20=TRUE,1,0)+IF($K$21=TRUE,1,0)))","v":0},{"$f":"SQRT((\n(IF($K$7=TRUE,J7^2,0))+(IF($K$8=TRUE,J8^2,0))+(IF($K$9=TRUE,J9^2,0))+(IF($K$10=TRUE,J10^2,0))+(IF($K$11=TRUE,J11^2,0))+(IF($K$12=TRUE,J12^2,0))+(IF($K$13=TRUE,J13^2,0))+(IF($K$14=TRUE,J14^2,0))+(IF($K$15=TRUE,J15^2,0))+(IF($K$16=TRUE,J16^2,0))+(IF($K$17=TRUE,J17^2,0))+(IF($K$18=TRUE,J18^2,0))+(IF($K$19=TRUE,J19^2,0))+(IF($K$20=TRUE,J20^2,0))+(IF($K$21=TRUE,J21^2,0)))/\n(IF($K$7=TRUE,1,0)+IF($K$8=TRUE,1,0)+IF($K$9=TRUE,1,0)+IF($K$10=TRUE,1,0)+IF($K$11=TRUE,1,0)+IF($K$12=TRUE,1,0)+IF($K$13=TRUE,1,0)+IF($K$14=TRUE,1,0)+IF($K$15=TRUE,1,0)+IF($K$16=TRUE,1,0)+IF($K$17=TRUE,1,0)+IF($K$18=TRUE,1,0)+IF($K$19=TRUE,1,0)+IF($K$20=TRUE,1,0)+IF($K$21=TRUE,1,0)))","v":0}]
[null,null,"ENGLISH TO METRIC CONVERSION",{"$f":"3937/1200","v":3.2808333333333333},null,null,"RMSE IN US SURVEY FEET:",{"$f":"H23*$D$24","v":0},{"$f":"I23*$D$24","v":0},{"$f":"J23*$D$24","v":0}]
[null,null,"UNITLESS GRID TO GROUND MULTIPLIER",{"$f":"REPORT!C13","v":0},null,null,null,{"$f":"IF(H24<=0.029,\"PASS\",\"FAIL\")","v":"PASS"},{"$f":"IF(I24<=0.029,\"PASS\",\"FAIL\")","v":"PASS"},{"$f":"IF(J24<=0.039,\"PASS\",\"FAIL\")","v":"PASS"}]
[]
["AVERAGED GPS-DERIVED POSITION",null,null,null,null,null,null,null,"Notes:"]
[null,"MONUMENT COORDINATES",null,"NORTHING","EASTING","ORTHO HEIGHT"]
[null,"METERS (GRID)",null,{"$f":"$E$22","v":0},{"$f":"$F$22","v":0},{"$f":"$G$22","v":0}]
[]
["LEVELED ELEVATION"]
["US SURVEY FEET",null,{"$f":"VLOOKUP(B5,'LEVEL RUN'!A8:I59,9,FALSE)","v":{"$error":"#N/A"}},"(Type the leveled elevation or N/A if no leveled elevation is available)"]
["MONUMENT HELD",null,null,"(Type the monument name from which leveling originated)"]
["LEVELED ELEVATION - GPS DERIVED ELEVATION   = ",null,null,null,{"$f":"IF(C32=\"N/A\",\"N/A\",C32-(F29*D24))","v":{"$error":"#N/A"}}]
[]
["FINAL MONUMENT COORDINATES"]
[null,"MONUMENT COORDINATES",null,"NORTHING","EASTING","ELEVATION","FEATURE CODE"]
[null,"US SURVEY FEET (GRID)",null,{"$f":"$E$22*$D$24","v":0},{"$f":"$F$22*$D$24","v":0},{"$f":"IF($C$32=\"N/A\",($G$22*$D$24),$C$32)","v":{"$error":"#N/A"}},"IPINS"]
[null,"US SURVEY FEET (GROUND)",null,{"$f":"$D$38*$D$25","v":0},{"$f":"$E$38*$D$25","v":0},{"$f":"IF($C$32=\"N/A\",($G$22*$D$24),$C$32)","v":{"$error":"#N/A"}},"IPINS"]
[]
["∆ North,  ∆ East, and ∆ Ht. are the difference between the average northing, easting, and height for each observation.",null,null,null,null,null,null,null,"Mask Angle:","13°"]

{"sheet":"CP03","index":9,"n_rows":41,"n_cols":11,"rows_kept":41,"cut":false,"hidden":false,"merged":[[0,0,0,10],[26,0,26,6],[27,1,27,2],[27,8,38,10],[38,1,38,2],[28,1,28,2],[30,0,30,6],[35,0,35,6],[36,1,36,2],[37,1,37,2]]}
["VRS GNSS Project Control Monument Coordinate Analysis"]
[]
["PROJECT:",{"$f":"REPORT!B2","v":"XXX-XXX-XXXX"},"GPS Antenna:","Trimble R6",null,null,null,null,null,"Report Date:",{"$f":"'CP01'!K3","v":"00:00:00"}]
["PID:",{"$f":"REPORT!E2","v":"XXXXX"},"VRS Network:","ODOT VRS",null,null,null,null,null,"Prepared By:",{"$f":"'CP01'!K4","v":0}]
["MONUMENT NUMBER:","CP03","No. of Sessions:",{"$f":"COUNTIF(GPS_IMPORT!A2:A1000,$B$5)","v":0},null,null,null,null,null,"Checked By:",{"$f":"'CP01'!K5","v":0}]
["SESSION #","Point","Observation Date","Start Time","Northing(m)","Easting(m)","Height(m)","∆ Northing(m)","∆ Easting(m)","∆ Height(m)","Include in Solution?"]
[1,{"$f":"IF(ROWS(GPS_IMPORT!$1:1)<=COUNTIF(GPS_IMPORT!$A$2:$A$10000,$B$5),INDEX(GPS_IMPORT!$2:$10000,MATCH($B$5,(GPS_IMPORT!$A$2:$A$10000),0)+ROWS($1:1)-1,COLUMN()-1),0)","v":0},{"$f":"IF(ROWS(GPS_IMPORT!$1:1)<=COUNTIF(GPS_IMPORT!$A$2:$A$10000,$B$5),INDEX(GPS_IMPORT!$2:$10000,MATCH($B$5,(GPS_IMPORT!$A$2:$A$10000),0)+ROWS($1:1)-1,COLUMN()-1),0)","v":"00:00:00"},{"$f":"IF(ROWS(GPS_IMPORT!$1:1)<=COUNTIF(GPS_IMPORT!$A$2:$A$10000,$B$5),INDEX(GPS_IMPORT!$2:$10000,MATCH($B$5,(GPS_IMPORT!$A$2:$A$10000),0)+ROWS($1:1)-1,COLUMN()-1),0)","v":"00:00:00"},{"$f":"IF(ROWS(GPS_IMPORT!$1:1)<=COUNTIF(GPS_IMPORT!$A$2:$A$10000,$B$5),INDEX(GPS_IMPORT!$2:$10000,MATCH($B$5,(GPS_IMPORT!$A$2:$A$10000),0)+ROWS($1:1)-1,COLUMN()-1),0)","v":0},{"$f":"IF(ROWS(GPS_IMPORT!$1:1)<=COUNTIF(GPS_IMPORT!$A$2:$A$10000,$B$5),INDEX(GPS_IMPORT!$2:$10000,MATCH($B$5,(GPS_IMPORT!$A$2:$A$10000),0)+ROWS($1:1)-1,COLUMN()-1),0)","v":0},{"$f":"IF(ROWS(GPS_IMPORT!$1:1)<=COUNTIF(GPS_IMPORT!$A$2:$A$10000,$B$5),INDEX(GPS_IMPORT!$2:$10000,MATCH($B$5,(GPS_IMPORT!$A$2:$A$10000),0)+ROWS($1:1)-1,COLUMN()-1),0)","v":0},{"$f":"IF(E7>0,E$22-E7,0)","v":0},0,0,true]
[2,{"$f":"IF(ROWS(GPS_IMPORT!$1:2)<=COUNTIF(GPS_IMPORT!$A$2:$A$10000,$B$5),INDEX(GPS_IMPORT!$2:$10000,MATCH($B$5,(GPS_IMPORT!$A$2:$A$10000),0)+ROWS($1:2)-1,COLUMN()-1),0)","v":0},{"$f":"IF(ROWS(GPS_IMPORT!$1:2)<=COUNTIF(GPS_IMPORT!$A$2:$A$10000,$B$5),INDEX(GPS_IMPORT!$2:$10000,MATCH($B$5,(GPS_IMPORT!$A$2:$A$10000),0)+ROWS($1:2)-1,COLUMN()-1),0)","v":"00:00:00"},{"$f":"IF(ROWS(GPS_IMPORT!$1:2)<=COUNTIF(GPS_IMPORT!$A$2:$A$10000,$B$5),INDEX(GPS_IMPORT!$2:$10000,MATCH($B$5,(GPS_IMPORT!$A$2:$A$10000),0)+ROWS($1:2)-1,COLUMN()-1),0)","v":"00:00:00"},{"$f":"IF(ROWS(GPS_IMPORT!$1:2)<=COUNTIF(GPS_IMPORT!$A$2:$A$10000,$B$5),INDEX(GPS_IMPORT!$2:$10000,MATCH($B$5,(GPS_IMPORT!$A$2:$A$10000),0)+ROWS($1:2)-1,COLUMN()-1),0)","v":0},{"$f":"IF(ROWS(GPS_IMPORT!$1:2)<=COUNTIF(GPS_IMPORT!$A$2:$A$10000,$B$5),INDEX(GPS_IMPORT!$2:$10000,MATCH($B$5,(GPS_IMPORT!$A$2:$A$10000),0)+ROWS($1:2)-1,COLUMN()-1),0)","v":0},{"$f":"IF(ROWS(GPS_IMPORT!$1:2)<=COUNTIF(GPS_IMPORT!$A$2:$A$10000,$B$5),INDEX(GPS_IMPORT!$2:$10000,MATCH($B$5,(GPS_IMPORT!$A$2:$A$10000),0)+ROWS($1:2)-1,COLUMN()-1),0)","v":0},0,0,0,true]
[3,{"$f":"IF(ROWS(GPS_IMPORT!$1:3)<=COUNTIF(GPS_IMPORT!$A$2:$A$10000,$B$5),INDEX(GPS_IMPORT!$2:$10000,MATCH($B$5,(GPS_IMPORT!$A$2:$A$10000),0)+ROWS($1:3)-1,COLUMN()-1),0)","v":0},{"$f":"IF(ROWS(GPS_IMPORT!$1:3)<=COUNTIF(GPS_IMPORT!$A$2:$A$10000,$B$5),INDEX(GPS_IMPORT!$2:$10000,MATCH($B$5,(GPS_IMPORT!$A$2:$A$10000),0)+ROWS($1:3)-1,COLUMN()-1),0)","v":"00:00:00"},{"$f":"IF(ROWS(GPS_IMPORT!$1:3)<=COUNTIF(GPS_IMPORT!$A$2:$A$10000,$B$5),INDEX(GPS_IMPORT!$2:$10000,MATCH($B$5,(GPS_IMPORT!$A$2:$A$10000),0)+ROWS($1:3)-1,COLUMN()-1),0)","v":"00:00:00"},{"$f":"IF(ROWS(GPS_IMPORT!$1:3)<=COUNTIF(GPS_IMPORT!$A$2:$A$10000,$B$5),INDEX(GPS_IMPORT!$2:$10000,MATCH($B$5,(GPS_IMPORT!$A$2:$A$10000),0)+ROWS($1:3)-1,COLUMN()-1),0)","v":0},{"$f":"IF(ROWS(GPS_IMPORT!$1:3)<=COUNTIF(GPS_IMPORT!$A$2:$A$10000,$B$5),INDEX(GPS_IMPORT!$2:$10000,MATCH($B$5,(GPS_IMPORT!$A$2:$A$10000),0)+ROWS($1:3)-1,COLUMN()-1),0)","v":0},{"$f":"IF(ROWS(GPS_IMPORT!$1:3)<=COUNTIF(GPS_IMPORT!$A$2:$A$10000,$B$5),INDEX(GPS_IMPORT!$2:$10000,MATCH($B$5,(GPS_IMPORT!$A$2:$A$10000),0)+ROWS($1:3)-1,COLUMN()-1),0)","v":0},0,0,0,true]
[4,{"$f":"IF(ROWS(GPS_IMPORT!$1:4)<=COUNTIF(GPS_IMPORT!$A$2:$A$10000,$B$5),INDEX(GPS_IMPORT!$2:$10000,MATCH($B$5,(GPS_IMPORT!$A$2:$A$10000),0)+ROWS($1:4)-1,COLUMN()-1),0)","v":0},{"$f":"IF(ROWS(GPS_IMPORT!$1:4)<=COUNTIF(GPS_IMPORT!$A$2:$A$10000,$B$5),INDEX(GPS_IMPORT!$2:$10000,MATCH($B$5,(GPS_IMPORT!$A$2:$A$10000),0)+ROWS($1:4)-1,COLUMN()-1),0)","v":"00:00:00"},{"$f":"IF(ROWS(GPS_IMPORT!$1:4)<=COUNTIF(GPS_IMPORT!$A$2:$A$10000,$B$5),INDEX(GPS_IMPORT!$2:$10000,MATCH($B$5,(GPS_IMPORT!$A$2:$A$10000),0)+ROWS($1:4)-1,COLUMN()-1),0)","v":"00:00:00"},{"$f":"IF(ROWS(GPS_IMPORT!$1:4)<=COUNTIF(GPS_IMPORT!$A$2:$A$10000,$B$5),INDEX(GPS_IMPORT!$2:$10000,MATCH($B$5,(GPS_IMPORT!$A$2:$A$10000),0)+ROWS($1:4)-1,COLUMN()-1),0)","v":0},{"$f":"IF(ROWS(GPS_IMPORT!$1:4)<=COUNTIF(GPS_IMPORT!$A$2:$A$10000,$B$5),INDEX(GPS_IMPORT!$2:$10000,MATCH($B$5,(GPS_IMPORT!$A$2:$A$10000),0)+ROWS($1:4)-1,COLUMN()-1),0)","v":0},{"$f":"IF(ROWS(GPS_IMPORT!$1:4)<=COUNTIF(GPS_IMPORT!$A$2:$A$10000,$B$5),INDEX(GPS_IMPORT!$2:$10000,MATCH($B$5,(GPS_IMPORT!$A$2:$A$10000),0)+ROWS($1:4)-1,COLUMN()-1),0)","v":0},0,0,0,true]
[5,{"$f":"IF(ROWS(GPS_IMPORT!$1:5)<=COUNTIF(GPS_IMPORT!$A$2:$A$10000,$B$5),INDEX(GPS_IMPORT!$2:$10000,MATCH($B$5,(GPS_IMPORT!$A$2:$A$10000),0)+ROWS($1:5)-1,COLUMN()-1),0)","v":0},{"$f":"IF(ROWS(GPS_IMPORT!$1:5)<=COUNTIF(GPS_IMPORT!$A$2:$A$10000,$B$5),INDEX(GPS_IMPORT!$2:$10000,MATCH($B$5,(GPS_IMPORT!$A$2:$A$10000),0)+ROWS($1:5)-1,COLUMN()-1),0)","v":"00:00:00"},{"$f":"IF(ROWS(GPS_IMPORT!$1:5)<=COUNTIF(GPS_IMPORT!$A$2:$A$10000,$B$5),INDEX(GPS_IMPORT!$2:$10000,MATCH($B$5,(GPS_IMPORT!$A$2:$A$10000),0)+ROWS($1:5)-1,COLUMN()-1),0)","v":"00:00:00"},{"$f":"IF(ROWS(GPS_IMPORT!$1:5)<=COUNTIF(GPS_IMPORT!$A$2:$A$10000,$B$5),INDEX(GPS_IMPORT!$2:$10000,MATCH($B$5,(GPS_IMPORT!$A$2:$A$10000),0)+ROWS($1:5)-1,COLUMN()-1),0)","v":0},{"$f":"IF(ROWS(GPS_IMPORT!$1:5)<=COUNTIF(GPS_IMPORT!$A$2:$A$10000,$B$5),INDEX(GPS_IMPORT!$2:$10000,MATCH($B$5,(GPS_IMPORT!$A$2:$A$10000),0)+ROWS($1:5)-1,COLUMN()-1),0)","v":0},{"$f":"IF(ROWS(GPS_IMPORT!$1:5)<=COUNTIF(GPS_IMPORT!$A$2:$A$10000,$B$5),INDEX(GPS_IMPORT!$2:$10000,MATCH($B$5,(GPS_IMPORT!$A$2:$A$10000),0)+ROWS($1:5)-1,COLUMN()-1),0)","v":0},0,0,0,true]
[6,{"$f":"IF(ROWS(GPS_IMPORT!$1:6)<=COUNTIF(GPS_IMPORT!$A$2:$A$10000,$B$5),INDEX(GPS_IMPORT!$2:$10000,MATCH($B$5,(GPS_IMPORT!$A$2:$A$10000),0)+ROWS($1:6)-1,COLUMN()-1),0)","v":0},{"$f":"IF(ROWS(GPS_IMPORT!$1:6)<=COUNTIF(GPS_IMPORT!$A$2:$A$10000,$B$5),INDEX(GPS_IMPORT!$2:$10000,MATCH($B$5,(GPS_IMPORT!$A$2:$A$10000),0)+ROWS($1:6)-1,COLUMN()-1),0)","v":"00:00:00"},{"$f":"IF(ROWS(GPS_IMPORT!$1:6)<=COUNTIF(GPS_IMPORT!$A$2:$A$10000,$B$5),INDEX(GPS_IMPORT!$2:$10000,MATCH($B$5,(GPS_IMPORT!$A$2:$A$10000),0)+ROWS($1:6)-1,COLUMN()-1),0)","v":"00:00:00"},{"$f":"IF(ROWS(GPS_IMPORT!$1:6)<=COUNTIF(GPS_IMPORT!$A$2:$A$10000,$B$5),INDEX(GPS_IMPORT!$2:$10000,MATCH($B$5,(GPS_IMPORT!$A$2:$A$10000),0)+ROWS($1:6)-1,COLUMN()-1),0)","v":0},{"$f":"IF(ROWS(GPS_IMPORT!$1:6)<=COUNTIF(GPS_IMPORT!$A$2:$A$10000,$B$5),INDEX(GPS_IMPORT!$2:$10000,MATCH($B$5,(GPS_IMPORT!$A$2:$A$10000),0)+ROWS($1:6)-1,COLUMN()-1),0)","v":0},{"$f":"IF(ROWS(GPS_IMPORT!$1:6)<=COUNTIF(GPS_IMPORT!$A$2:$A$10000,$B$5),INDEX(GPS_IMPORT!$2:$10000,MATCH($B$5,(GPS_IMPORT!$A$2:$A$10000),0)+ROWS($1:6)-1,COLUMN()-1),0)","v":0},0,0,0,true]
[7,{"$f":"IF(ROWS(GPS_IMPORT!$1:7)<=COUNTIF(GPS_IMPORT!$A$2:$A$10000,$B$5),INDEX(GPS_IMPORT!$2:$10000,MATCH($B$5,(GPS_IMPORT!$A$2:$A$10000),0)+ROWS($1:7)-1,COLUMN()-1),0)","v":0},{"$f":"IF(ROWS(GPS_IMPORT!$1:7)<=COUNTIF(GPS_IMPORT!$A$2:$A$10000,$B$5),INDEX(GPS_IMPORT!$2:$10000,MATCH($B$5,(GPS_IMPORT!$A$2:$A$10000),0)+ROWS($1:7)-1,COLUMN()-1),0)","v":"00:00:00"},{"$f":"IF(ROWS(GPS_IMPORT!$1:7)<=COUNTIF(GPS_IMPORT!$A$2:$A$10000,$B$5),INDEX(GPS_IMPORT!$2:$10000,MATCH($B$5,(GPS_IMPORT!$A$2:$A$10000),0)+ROWS($1:7)-1,COLUMN()-1),0)","v":"00:00:00"},{"$f":"IF(ROWS(GPS_IMPORT!$1:7)<=COUNTIF(GPS_IMPORT!$A$2:$A$10000,$B$5),INDEX(GPS_IMPORT!$2:$10000,MATCH($B$5,(GPS_IMPORT!$A$2:$A$10000),0)+ROWS($1:7)-1,COLUMN()-1),0)","v":0},{"$f":"IF(ROWS(GPS_IMPORT!$1:7)<=COUNTIF(GPS_IMPORT!$A$2:$A$10000,$B$5),INDEX(GPS_IMPORT!$2:$10000,MATCH($B$5,(GPS_IMPORT!$A$2:$A$10000),0)+ROWS($1:7)-1,COLUMN()-1),0)","v":0},{"$f":"IF(ROWS(GPS_IMPORT!$1:7)<=COUNTIF(GPS_IMPORT!$A$2:$A$10000,$B$5),INDEX(GPS_IMPORT!$2:$10000,MATCH($B$5,(GPS_IMPORT!$A$2:$A$10000),0)+ROWS($1:7)-1,COLUMN()-1),0)","v":0},0,0,0,true]
[8,{"$f":"IF(ROWS(GPS_IMPORT!$1:8)<=COUNTIF(GPS_IMPORT!$A$2:$A$10000,$B$5),INDEX(GPS_IMPORT!$2:$10000,MATCH($B$5,(GPS_IMPORT!$A$2:$A$10000),0)+ROWS($1:8)-1,COLUMN()-1),0)","v":0},{"$f":"IF(ROWS(GPS_IMPORT!$1:8)<=COUNTIF(GPS_IMPORT!$A$2:$A$10000,$B$5),INDEX(GPS_IMPORT!$2:$10000,MATCH($B$5,(GPS_IMPORT!$A$2:$A$10000),0)+ROWS($1:8)-1,COLUMN()-1),0)","v":"00:00:00"},{"$f":"IF(ROWS(GPS_IMPORT!$1:8)<=COUNTIF(GPS_IMPORT!$A$2:$A$10000,$B$5),INDEX(GPS_IMPORT!$2:$10000,MATCH($B$5,(GPS_IMPORT!$A$2:$A$10000),0)+ROWS($1:8)-1,COLUMN()-1),0)","v":"00:00:00"},{"$f":"IF(ROWS(GPS_IMPORT!$1:8)<=COUNTIF(GPS_IMPORT!$A$2:$A$10000,$B$5),INDEX(GPS_IMPORT!$2:$10000,MATCH($B$5,(GPS_IMPORT!$A$2:$A$10000),0)+ROWS($1:8)-1,COLUMN()-1),0)","v":0},{"$f":"IF(ROWS(GPS_IMPORT!$1:8)<=COUNTIF(GPS_IMPORT!$A$2:$A$10000,$B$5),INDEX(GPS_IMPORT!$2:$10000,MATCH($B$5,(GPS_IMPORT!$A$2:$A$10000),0)+ROWS($1:8)-1,COLUMN()-1),0)","v":0},{"$f":"IF(ROWS(GPS_IMPORT!$1:8)<=COUNTIF(GPS_IMPORT!$A$2:$A$10000,$B$5),INDEX(GPS_IMPORT!$2:$10000,MATCH($B$5,(GPS_IMPORT!$A$2:$A$10000),0)+ROWS($1:8)-1,COLUMN()-1),0)","v":0},0,0,0,true]
[9,{"$f":"IF(ROWS(GPS_IMPORT!$1:9)<=COUNTIF(GPS_IMPORT!$A$2:$A$10000,$B$5),INDEX(GPS_IMPORT!$2:$10000,MATCH($B$5,(GPS_IMPORT!$A$2:$A$10000),0)+ROWS($1:9)-1,COLUMN()-1),0)","v":0},{"$f":"IF(ROWS(GPS_IMPORT!$1:9)<=COUNTIF(GPS_IMPORT!$A$2:$A$10000,$B$5),INDEX(GPS_IMPORT!$2:$10000,MATCH($B$5,(GPS_IMPORT!$A$2:$A$10000),0)+ROWS($1:9)-1,COLUMN()-1),0)","v":"00:00:00"},{"$f":"IF(ROWS(GPS_IMPORT!$1:9)<=COUNTIF(GPS_IMPORT!$A$2:$A$10000,$B$5),INDEX(GPS_IMPORT!$2:$10000,MATCH($B$5,(GPS_IMPORT!$A$2:$A$10000),0)+ROWS($1:9)-1,COLUMN()-1),0)","v":"00:00:00"},{"$f":"IF(ROWS(GPS_IMPORT!$1:9)<=COUNTIF(GPS_IMPORT!$A$2:$A$10000,$B$5),INDEX(GPS_IMPORT!$2:$10000,MATCH($B$5,(GPS_IMPORT!$A$2:$A$10000),0)+ROWS($1:9)-1,COLUMN()-1),0)","v":0},{"$f":"IF(ROWS(GPS_IMPORT!$1:9)<=COUNTIF(GPS_IMPORT!$A$2:$A$10000,$B$5),INDEX(GPS_IMPORT!$2:$10000,MATCH($B$5,(GPS_IMPORT!$A$2:$A$10000),0)+ROWS($1:9)-1,COLUMN()-1),0)","v":0},{"$f":"IF(ROWS(GPS_IMPORT!$1:9)<=COUNTIF(GPS_IMPORT!$A$2:$A$10000,$B$5),INDEX(GPS_IMPORT!$2:$10000,MATCH($B$5,(GPS_IMPORT!$A$2:$A$10000),0)+ROWS($1:9)-1,COLUMN()-1),0)","v":0},0,0,0,true]
[10,{"$f":"IF(ROWS(GPS_IMPORT!$1:10)<=COUNTIF(GPS_IMPORT!$A$2:$A$10000,$B$5),INDEX(GPS_IMPORT!$2:$10000,MATCH($B$5,(GPS_IMPORT!$A$2:$A$10000),0)+ROWS($1:10)-1,COLUMN()-1),0)","v":0},{"$f":"IF(ROWS(GPS_IMPORT!$1:10)<=COUNTIF(GPS_IMPORT!$A$2:$A$10000,$B$5),INDEX(GPS_IMPORT!$2:$10000,MATCH($B$5,(GPS_IMPORT!$A$2:$A$10000),0)+ROWS($1:10)-1,COLUMN()-1),0)","v":"00:00:00"},{"$f":"IF(ROWS(GPS_IMPORT!$1:10)<=COUNTIF(GPS_IMPORT!$A$2:$A$10000,$B$5),INDEX(GPS_IMPORT!$2:$10000,MATCH($B$5,(GPS_IMPORT!$A$2:$A$10000),0)+ROWS($1:10)-1,COLUMN()-1),0)","v":"00:00:00"},{"$f":"IF(ROWS(GPS_IMPORT!$1:10)<=COUNTIF(GPS_IMPORT!$A$2:$A$10000,$B$5),INDEX(GPS_IMPORT!$2:$10000,MATCH($B$5,(GPS_IMPORT!$A$2:$A$10000),0)+ROWS($1:10)-1,COLUMN()-1),0)","v":0},{"$f":"IF(ROWS(GPS_IMPORT!$1:10)<=COUNTIF(GPS_IMPORT!$A$2:$A$10000,$B$5),INDEX(GPS_IMPORT!$2:$10000,MATCH($B$5,(GPS_IMPORT!$A$2:$A$10000),0)+ROWS($1:10)-1,COLUMN()-1),0)","v":0},{"$f":"IF(ROWS(GPS_IMPORT!$1:10)<=COUNTIF(GPS_IMPORT!$A$2:$A$10000,$B$5),INDEX(GPS_IMPORT!$2:$10000,MATCH($B$5,(GPS_IMPORT!$A$2:$A$10000),0)+ROWS($1:10)-1,COLUMN()-1),0)","v":0},0,0,0,true]
[11,{"$f":"IF(ROWS(GPS_IMPORT!$1:11)<=COUNTIF(GPS_IMPORT!$A$2:$A$10000,$B$5),INDEX(GPS_IMPORT!$2:$10000,MATCH($B$5,(GPS_IMPORT!$A$2:$A$10000),0)+ROWS($1:11)-1,COLUMN()-1),0)","v":0},{"$f":"IF(ROWS(GPS_IMPORT!$1:11)<=COUNTIF(GPS_IMPORT!$A$2:$A$10000,$B$5),INDEX(GPS_IMPORT!$2:$10000,MATCH($B$5,(GPS_IMPORT!$A$2:$A$10000),0)+ROWS($1:11)-1,COLUMN()-1),0)","v":"00:00:00"},{"$f":"IF(ROWS(GPS_IMPORT!$1:11)<=COUNTIF(GPS_IMPORT!$A$2:$A$10000,$B$5),INDEX(GPS_IMPORT!$2:$10000,MATCH($B$5,(GPS_IMPORT!$A$2:$A$10000),0)+ROWS($1:11)-1,COLUMN()-1),0)","v":"00:00:00"},{"$f":"IF(ROWS(GPS_IMPORT!$1:11)<=COUNTIF(GPS_IMPORT!$A$2:$A$10000,$B$5),INDEX(GPS_IMPORT!$2:$10000,MATCH($B$5,(GPS_IMPORT!$A$2:$A$10000),0)+ROWS($1:11)-1,COLUMN()-1),0)","v":0},{"$f":"IF(ROWS(GPS_IMPORT!$1:11)<=COUNTIF(GPS_IMPORT!$A$2:$A$10000,$B$5),INDEX(GPS_IMPORT!$2:$10000,MATCH($B$5,(GPS_IMPORT!$A$2:$A$10000),0)+ROWS($1:11)-1,COLUMN()-1),0)","v":0},{"$f":"IF(ROWS(GPS_IMPORT!$1:11)<=COUNTIF(GPS_IMPORT!$A$2:$A$10000,$B$5),INDEX(GPS_IMPORT!$2:$10000,MATCH($B$5,(GPS_IMPORT!$A$2:$A$10000),0)+ROWS($1:11)-1,COLUMN()-1),0)","v":0},0,0,0,true]
[12,{"$f":"IF(ROWS(GPS_IMPORT!$1:12)<=COUNTIF(GPS_IMPORT!$A$2:$A$10000,$B$5),INDEX(GPS_IMPORT!$2:$10000,MATCH($B$5,(GPS_IMPORT!$A$2:$A$10000),0)+ROWS($1:12)-1,COLUMN()-1),0)","v":0},{"$f":"IF(ROWS(GPS_IMPORT!$1:12)<=COUNTIF(GPS_IMPORT!$A$2:$A$10000,$B$5),INDEX(GPS_IMPORT!$2:$10000,MATCH($B$5,(GPS_IMPORT!$A$2:$A$10000),0)+ROWS($1:12)-1,COLUMN()-1),0)","v":"00:00:00"},{"$f":"IF(ROWS(GPS_IMPORT!$1:12)<=COUNTIF(GPS_IMPORT!$A$2:$A$10000,$B$5),INDEX(GPS_IMPORT!$2:$10000,MATCH($B$5,(GPS_IMPORT!$A$2:$A$10000),0)+ROWS($1:12)-1,COLUMN()-1),0)","v":"00:00:00"},{"$f":"IF(ROWS(GPS_IMPORT!$1:12)<=COUNTIF(GPS_IMPORT!$A$2:$A$10000,$B$5),INDEX(GPS_IMPORT!$2:$10000,MATCH($B$5,(GPS_IMPORT!$A$2:$A$10000),0)+ROWS($1:12)-1,COLUMN()-1),0)","v":0},{"$f":"IF(ROWS(GPS_IMPORT!$1:12)<=COUNTIF(GPS_IMPORT!$A$2:$A$10000,$B$5),INDEX(GPS_IMPORT!$2:$10000,MATCH($B$5,(GPS_IMPORT!$A$2:$A$10000),0)+ROWS($1:12)-1,COLUMN()-1),0)","v":0},{"$f":"IF(ROWS(GPS_IMPORT!$1:12)<=COUNTIF(GPS_IMPORT!$A$2:$A$10000,$B$5),INDEX(GPS_IMPORT!$2:$10000,MATCH($B$5,(GPS_IMPORT!$A$2:$A$10000),0)+ROWS($1:12)-1,COLUMN()-1),0)","v":0},0,0,0,true]
[13,{"$f":"IF(ROWS(GPS_IMPORT!$1:13)<=COUNTIF(GPS_IMPORT!$A$2:$A$10000,$B$5),INDEX(GPS_IMPORT!$2:$10000,MATCH($B$5,(GPS_IMPORT!$A$2:$A$10000),0)+ROWS($1:13)-1,COLUMN()-1),0)","v":0},{"$f":"IF(ROWS(GPS_IMPORT!$1:13)<=COUNTIF(GPS_IMPORT!$A$2:$A$10000,$B$5),INDEX(GPS_IMPORT!$2:$10000,MATCH($B$5,(GPS_IMPORT!$A$2:$A$10000),0)+ROWS($1:13)-1,COLUMN()-1),0)","v":"00:00:00"},{"$f":"IF(ROWS(GPS_IMPORT!$1:13)<=COUNTIF(GPS_IMPORT!$A$2:$A$10000,$B$5),INDEX(GPS_IMPORT!$2:$10000,MATCH($B$5,(GPS_IMPORT!$A$2:$A$10000),0)+ROWS($1:13)-1,COLUMN()-1),0)","v":"00:00:00"},{"$f":"IF(ROWS(GPS_IMPORT!$1:13)<=COUNTIF(GPS_IMPORT!$A$2:$A$10000,$B$5),INDEX(GPS_IMPORT!$2:$10000,MATCH($B$5,(GPS_IMPORT!$A$2:$A$10000),0)+ROWS($1:13)-1,COLUMN()-1),0)","v":0},{"$f":"IF(ROWS(GPS_IMPORT!$1:13)<=COUNTIF(GPS_IMPORT!$A$2:$A$10000,$B$5),INDEX(GPS_IMPORT!$2:$10000,MATCH($B$5,(GPS_IMPORT!$A$2:$A$10000),0)+ROWS($1:13)-1,COLUMN()-1),0)","v":0},{"$f":"IF(ROWS(GPS_IMPORT!$1:13)<=COUNTIF(GPS_IMPORT!$A$2:$A$10000,$B$5),INDEX(GPS_IMPORT!$2:$10000,MATCH($B$5,(GPS_IMPORT!$A$2:$A$10000),0)+ROWS($1:13)-1,COLUMN()-1),0)","v":0},{"$f":"IF(E19>0,E$22-E19,0)","v":0},0,0,false]
[14,{"$f":"IF(ROWS(GPS_IMPORT!$1:14)<=COUNTIF(GPS_IMPORT!$A$2:$A$10000,$B$5),INDEX(GPS_IMPORT!$2:$10000,MATCH($B$5,(GPS_IMPORT!$A$2:$A$10000),0)+ROWS($1:14)-1,COLUMN()-1),0)","v":0},{"$f":"IF(ROWS(GPS_IMPORT!$1:14)<=COUNTIF(GPS_IMPORT!$A$2:$A$10000,$B$5),INDEX(GPS_IMPORT!$2:$10000,MATCH($B$5,(GPS_IMPORT!$A$2:$A$10000),0)+ROWS($1:14)-1,COLUMN()-1),0)","v":"00:00:00"},{"$f":"IF(ROWS(GPS_IMPORT!$1:14)<=COUNTIF(GPS_IMPORT!$A$2:$A$10000,$B$5),INDEX(GPS_IMPORT!$2:$10000,MATCH($B$5,(GPS_IMPORT!$A$2:$A$10000),0)+ROWS($1:14)-1,COLUMN()-1),0)","v":"00:00:00"},{"$f":"IF(ROWS(GPS_IMPORT!$1:14)<=COUNTIF(GPS_IMPORT!$A$2:$A$10000,$B$5),INDEX(GPS_IMPORT!$2:$10000,MATCH($B$5,(GPS_IMPORT!$A$2:$A$10000),0)+ROWS($1:14)-1,COLUMN()-1),0)","v":0},{"$f":"IF(ROWS(GPS_IMPORT!$1:14)<=COUNTIF(GPS_IMPORT!$A$2:$A$10000,$B$5),INDEX(GPS_IMPORT!$2:$10000,MATCH($B$5,(GPS_IMPORT!$A$2:$A$10000),0)+ROWS($1:14)-1,COLUMN()-1),0)","v":0},{"$f":"IF(ROWS(GPS_IMPORT!$1:14)<=COUNTIF(GPS_IMPORT!$A$2:$A$10000,$B$5),INDEX(GPS_IMPORT!$2:$10000,MATCH($B$5,(GPS_IMPORT!$A$2:$A$10000),0)+ROWS($1:14)-1,COLUMN()-1),0)","v":0},0,0,0,false]
[15,{"$f":"IF(ROWS(GPS_IMPORT!$1:15)<=COUNTIF(GPS_IMPORT!$A$2:$A$10000,$B$5),INDEX(GPS_IMPORT!$2:$10000,MATCH($B$5,(GPS_IMPORT!$A$2:$A$10000),0)+ROWS($1:15)-1,COLUMN()-1),0)","v":0},{"$f":"IF(ROWS(GPS_IMPORT!$1:15)<=COUNTIF(GPS_IMPORT!$A$2:$A$10000,$B$5),INDEX(GPS_IMPORT!$2:$10000,MATCH($B$5,(GPS_IMPORT!$A$2:$A$10000),0)+ROWS($1:15)-1,COLUMN()-1),0)","v":"00:00:00"},{"$f":"IF(ROWS(GPS_IMPORT!$1:15)<=COUNTIF(GPS_IMPORT!$A$2:$A$10000,$B$5),INDEX(GPS_IMPORT!$2:$10000,MATCH($B$5,(GPS_IMPORT!$A$2:$A$10000),0)+ROWS($1:15)-1,COLUMN()-1),0)","v":"00:00:00"},{"$f":"IF(ROWS(GPS_IMPORT!$1:15)<=COUNTIF(GPS_IMPORT!$A$2:$A$10000,$B$5),INDEX(GPS_IMPORT!$2:$10000,MATCH($B$5,(GPS_IMPORT!$A$2:$A$10000),0)+ROWS($1:15)-1,COLUMN()-1),0)","v":0},{"$f":"IF(ROWS(GPS_IMPORT!$1:15)<=COUNTIF(GPS_IMPORT!$A$2:$A$10000,$B$5),INDEX(GPS_IMPORT!$2:$10000,MATCH($B$5,(GPS_IMPORT!$A$2:$A$10000),0)+ROWS($1:15)-1,COLUMN()-1),0)","v":0},{"$f":"IF(ROWS(GPS_IMPORT!$1:15)<=COUNTIF(GPS_IMPORT!$A$2:$A$10000,$B$5),INDEX(GPS_IMPORT!$2:$10000,MATCH($B$5,(GPS_IMPORT!$A$2:$A$10000),0)+ROWS($1:15)-1,COLUMN()-1),0)","v":0},0,0,0,false]
[null,null,null,"AVERAGE",{"$f":"(IF($K$7=TRUE,E7,0)+IF($K$8=TRUE,E8,0)+IF($K$9=TRUE,E9,0)+IF($K$10=TRUE,E10,0)+IF($K$11=TRUE,E11,0)+IF($K$12=TRUE,E12,0)+IF($K$13=TRUE,E13,0)+IF($K$14=TRUE,E14,0)+IF($K$15=TRUE,E15,0)+IF($K$16=TRUE,E16,0)+IF($K$17=TRUE,E17,0)+IF($K$18=TRUE,E18,0)+IF($K$19=TRUE,E19,0)+IF($K$20=TRUE,E20,0)+IF($K$21=TRUE,E21,0))/(IF($K$7=TRUE,1,0)+IF($K$8=TRUE,1,0)+IF($K$9=TRUE,1,0)+IF($K$10=TRUE,1,0)+IF($K$11=TRUE,1,0)+IF($K$12=TRUE,1,0)+IF($K$13=TRUE,1,0)+IF($K$14=TRUE,1,0)+IF($K$15=TRUE,1,0)+IF($K$16=TRUE,1,0)+IF($K$17=TRUE,1,0)+IF($K$18=TRUE,1,0)+IF($K$19=TRUE,1,0)+IF($K$20=TRUE,1,0)+IF($K$21=TRUE,1,0))","v":0},{"$f":"(IF($K$7=TRUE,F7,0)+IF($K$8=TRUE,F8,0)+IF($K$9=TRUE,F9,0)+IF($K$10=TRUE,F10,0)+IF($K$11=TRUE,F11,0)+IF($K$12=TRUE,F12,0)+IF($K$13=TRUE,F13,0)+IF($K$14=TRUE,F14,0)+IF($K$15=TRUE,F15,0)+IF($K$16=TRUE,F16,0)+IF($K$17=TRUE,F17,0)+IF($K$18=TRUE,F18,0)+IF($K$19=TRUE,F19,0)+IF($K$20=TRUE,F20,0)+IF($K$21=TRUE,F21,0))/(IF($K$7=TRUE,1,0)+IF($K$8=TRUE,1,0)+IF($K$9=TRUE,1,0)+IF($K$10=TRUE,1,0)+IF($K$11=TRUE,1,0)+IF($K$12=TRUE,1,0)+IF($K$13=TRUE,1,0)+IF($K$14=TRUE,1,0)+IF($K$15=TRUE,1,0)+IF($K$16=TRUE,1,0)+IF($K$17=TRUE,1,0)+IF($K$18=TRUE,1,0)+IF($K$19=TRUE,1,0)+IF($K$20=TRUE,1,0)+IF($K$21=TRUE,1,0))","v":0},{"$f":"(IF($K$7=TRUE,G7,0)+IF($K$8=TRUE,G8,0)+IF($K$9=TRUE,G9,0)+IF($K$10=TRUE,G10,0)+IF($K$11=TRUE,G11,0)+IF($K$12=TRUE,G12,0)+IF($K$13=TRUE,G13,0)+IF($K$14=TRUE,G14,0)+IF($K$15=TRUE,G15,0)+IF($K$16=TRUE,G16,0)+IF($K$17=TRUE,G17,0)+IF($K$18=TRUE,G18,0)+IF($K$19=TRUE,G19,0)+IF($K$20=TRUE,G20,0)+IF($K$21=TRUE,G21,0))/\n(IF($K$7=TRUE,1,0)+IF($K$8=TRUE,1,0)+IF($K$9=TRUE,1,0)+IF($K$10=TRUE,1,0)+IF($K$11=TRUE,1,0)+IF($K$12=TRUE,1,0)+IF($K$13=TRUE,1,0)+IF($K$14=TRUE,1,0)+IF($K$15=TRUE,1,0)+IF($K$16=TRUE,1,0)+IF($K$17=TRUE,1,0)+IF($K$18=TRUE,1,0)+IF($K$19=TRUE,1,0)+IF($K$20=TRUE,1,0)+IF($K$21=TRUE,1,0))","v":0},"RMSE:","RMSE:","RMSE:"]
[null,null,null,null,null,null,"RMSE IN METRIC:",{"$f":"SQRT((\n(IF($K$7=TRUE,H7^2,0))+(IF($K$8=TRUE,H8^2,0))+(IF($K$9=TRUE,H9^2,0))+(IF($K$10=TRUE,H10^2,0))+(IF($K$11=TRUE,H11^2,0))+(IF($K$12=TRUE,H12^2,0))+(IF($K$13=TRUE,H13^2,0))+(IF($K$14=TRUE,H14^2,0))+(IF($K$15=TRUE,H15^2,0))+(IF($K$16=TRUE,H16^2,0))+(IF($K$17=TRUE,H17^2,0))+(IF($K$18=TRUE,H18^2,0))+(IF($K$19=TRUE,H19^2,0))+(IF($K$20=TRUE,H20^2,0))+(IF($K$21=TRUE,H21^2,0)))/\n(IF($K$7=TRUE,1,0)+IF($K$8=TRUE,1,0)+IF($K$9=TRUE,1,0)+IF($K$10=TRUE,1,0)+IF($K$11=TRUE,1,0)+IF($K$12=TRUE,1,0)+IF($K$13=TRUE,1,0)+IF($K$14=TRUE,1,0)+IF($K$15=TRUE,1,0)+IF($K$16=TRUE,1,0)+IF($K$17=TRUE,1,0)+IF($K$18=TRUE,1,0)+IF($K$19=TRUE,1,0)+IF($K$20=TRUE,1,0)+IF($K$21=TRUE,1,0)))","v":0},{"$f":"SQRT((\n(IF($K$7=TRUE,I7^2,0))+(IF($K$8=TRUE,I8^2,0))+(IF($K$9=TRUE,I9^2,0))+(IF($K$10=TRUE,I10^2,0))+(IF($K$11=TRUE,I11^2,0))+(IF($K$12=TRUE,I12^2,0))+(IF($K$13=TRUE,I13^2,0))+(IF($K$14=TRUE,I14^2,0))+(IF($K$15=TRUE,I15^2,0))+(IF($K$16=TRUE,I16^2,0))+(IF($K$17=TRUE,I17^2,0))+(IF($K$18=TRUE,I18^2,0))+(IF($K$19=TRUE,I19^2,0))+(IF($K$20=TRUE,I20^2,0))+(IF($K$21=TRUE,I21^2,0)))/\n(IF($K$7=TRUE,1,0)+IF($K$8=TRUE,1,0)+IF($K$9=TRUE,1,0)+IF($K$10=TRUE,1,0)+IF($K$11=TRUE,1,0)+IF($K$12=TRUE,1,0)+IF($K$13=TRUE,1,0)+IF($K$14=TRUE,1,0)+IF($K$15=TRUE,1,0)+IF($K$16=TRUE,1,0)+IF($K$17=TRUE,1,0)+IF($K$18=TRUE,1,0)+IF($K$19=TRUE,1,0)+IF($K$20=TRUE,1,0)+IF($K$21=TRUE,1,0)))","v":0},{"$f":"SQRT((\n(IF($K$7=TRUE,J7^2,0))+(IF($K$8=TRUE,J8^2,0))+(IF($K$9=TRUE,J9^2,0))+(IF($K$10=TRUE,J10^2,0))+(IF($K$11=TRUE,J11^2,0))+(IF($K$12=TRUE,J12^2,0))+(IF($K$13=TRUE,J13^2,0))+(IF($K$14=TRUE,J14^2,0))+(IF($K$15=TRUE,J15^2,0))+(IF($K$16=TRUE,J16^2,0))+(IF($K$17=TRUE,J17^2,0))+(IF($K$18=TRUE,J18^2,0))+(IF($K$19=TRUE,J19^2,0))+(IF($K$20=TRUE,J20^2,0))+(IF($K$21=TRUE,J21^2,0)))/\n(IF($K$7=TRUE,1,0)+IF($K$8=TRUE,1,0)+IF($K$9=TRUE,1,0)+IF($K$10=TRUE,1,0)+IF($K$11=TRUE,1,0)+IF($K$12=TRUE,1,0)+IF($K$13=TRUE,1,0)+IF($K$14=TRUE,1,0)+IF($K$15=TRUE,1,0)+IF($K$16=TRUE,1,0)+IF($K$17=TRUE,1,0)+IF($K$18=TRUE,1,0)+IF($K$19=TRUE,1,0)+IF($K$20=TRUE,1,0)+IF($K$21=TRUE,1,0)))","v":0}]
[null,null,"ENGLISH TO METRIC CONVERSION",{"$f":"3937/1200","v":3.2808333333333333},null,null,"RMSE IN US SURVEY FEET:",{"$f":"H23*$D$24","v":0},{"$f":"I23*$D$24","v":0},{"$f":"J23*$D$24","v":0}]
[null,null,"UNITLESS GRID TO GROUND MULTIPLIER",{"$f":"REPORT!C13","v":0},null,null,null,{"$f":"IF(H24<=0.029,\"PASS\",\"FAIL\")","v":"PASS"},{"$f":"IF(I24<=0.029,\"PASS\",\"FAIL\")","v":"PASS"},{"$f":"IF(J24<=0.039,\"PASS\",\"FAIL\")","v":"PASS"}]
[]
["AVERAGED GPS-DERIVED POSITION",null,null,null,null,null,null,null,"Notes:"]
[null,"MONUMENT COORDINATES",null,"NORTHING","EASTING","ORTHO HEIGHT"]
[null,"METERS (GRID)",null,{"$f":"$E$22","v":0},{"$f":"$F$22","v":0},{"$f":"$G$22","v":0}]
[]
["LEVELED ELEVATION"]
["US SURVEY FEET",null,{"$f":"VLOOKUP(B5,'LEVEL RUN'!A8:I59,9,FALSE)","v":{"$error":"#N/A"}},"(Type the leveled elevation or N/A if no leveled elevation is available)"]
["MONUMENT HELD",null,null,"(Type the monument name from which leveling originated)"]
["LEVELED ELEVATION - GPS DERIVED ELEVATION   = ",null,null,null,{"$f":"IF(C32=\"N/A\",\"N/A\",C32-(F29*D24))","v":{"$error":"#N/A"}}]
[]
["FINAL MONUMENT COORDINATES"]
[null,"MONUMENT COORDINATES",null,"NORTHING","EASTING","ELEVATION","FEATURE CODE"]
[null,"US SURVEY FEET (GRID)",null,{"$f":"$E$22*$D$24","v":0},{"$f":"$F$22*$D$24","v":0},{"$f":"IF($C$32=\"N/A\",($G$22*$D$24),$C$32)","v":{"$error":"#N/A"}},"IPINS"]
[null,"US SURVEY FEET (GROUND)",null,{"$f":"$D$38*$D$25","v":0},{"$f":"$E$38*$D$25","v":0},{"$f":"IF($C$32=\"N/A\",($G$22*$D$24),$C$32)","v":{"$error":"#N/A"}},"IPINS"]
[]
["∆ North,  ∆ East, and ∆ Ht. are the difference between the average northing, easting, and height for each observation.",null,null,null,null,null,null,null,"Mask Angle:","13°"]

{"sheet":"CP04","index":10,"n_rows":41,"n_cols":11,"rows_kept":41,"cut":false,"hidden":false,"merged":[[0,0,0,10],[26,0,26,6],[27,1,27,2],[27,8,38,10],[38,1,38,2],[28,1,28,2],[30,0,30,6],[35,0,35,6],[36,1,36,2],[37,1,37,2]]}
["VRS GNSS Project Control Monument Coordinate Analysis"]
[]
["PROJECT:",{"$f":"REPORT!B2","v":"XXX-XXX-XXXX"},"GPS Antenna:","Trimble R6",null,null,null,null,null,"Report Date:",{"$f":"'CP01'!K3","v":"00:00:00"}]
["PID:",{"$f":"REPORT!E2","v":"XXXXX"},"VRS Network:","ODOT VRS",null,null,null,null,null,"Prepared By:",{"$f":"'CP01'!K4","v":0}]
["MONUMENT NUMBER:","CP04","No. of Sessions:",{"$f":"COUNTIF(GPS_IMPORT!A2:A1000,$B$5)","v":0},null,null,null,null,null,"Checked By:",{"$f":"'CP01'!K5","v":0}]
["SESSION #","Point","Observation Date","Start Time","Northing(m)","Easting(m)","Height(m)","∆ Northing(m)","∆ Easting(m)","∆ Height(m)","Include in Solution?"]
[1,{"$f":"IF(ROWS(GPS_IMPORT!$1:1)<=COUNTIF(GPS_IMPORT!$A$2:$A$10000,$B$5),INDEX(GPS_IMPORT!$2:$10000,MATCH($B$5,(GPS_IMPORT!$A$2:$A$10000),0)+ROWS($1:1)-1,COLUMN()-1),0)","v":0},{"$f":"IF(ROWS(GPS_IMPORT!$1:1)<=COUNTIF(GPS_IMPORT!$A$2:$A$10000,$B$5),INDEX(GPS_IMPORT!$2:$10000,MATCH($B$5,(GPS_IMPORT!$A$2:$A$10000),0)+ROWS($1:1)-1,COLUMN()-1),0)","v":"00:00:00"},{"$f":"IF(ROWS(GPS_IMPORT!$1:1)<=COUNTIF(GPS_IMPORT!$A$2:$A$10000,$B$5),INDEX(GPS_IMPORT!$2:$10000,MATCH($B$5,(GPS_IMPORT!$A$2:$A$10000),0)+ROWS($1:1)-1,COLUMN()-1),0)","v":"00:00:00"},{"$f":"IF(ROWS(GPS_IMPORT!$1:1)<=COUNTIF(GPS_IMPORT!$A$2:$A$10000,$B$5),INDEX(GPS_IMPORT!$2:$10000,MATCH($B$5,(GPS_IMPORT!$A$2:$A$10000),0)+ROWS($1:1)-1,COLUMN()-1),0)","v":0},{"$f":"IF(ROWS(GPS_IMPORT!$1:1)<=COUNTIF(GPS_IMPORT!$A$2:$A$10000,$B$5),INDEX(GPS_IMPORT!$2:$10000,MATCH($B$5,(GPS_IMPORT!$A$2:$A$10000),0)+ROWS($1:1)-1,COLUMN()-1),0)","v":0},{"$f":"IF(ROWS(GPS_IMPORT!$1:1)<=COUNTIF(GPS_IMPORT!$A$2:$A$10000,$B$5),INDEX(GPS_IMPORT!$2:$10000,MATCH($B$5,(GPS_IMPORT!$A$2:$A$10000),0)+ROWS($1:1)-1,COLUMN()-1),0)","v":0},{"$f":"IF(E7>0,E$22-E7,0)","v":0},0,0,true]
[2,{"$f":"IF(ROWS(GPS_IMPORT!$1:2)<=COUNTIF(GPS_IMPORT!$A$2:$A$10000,$B$5),INDEX(GPS_IMPORT!$2:$10000,MATCH($B$5,(GPS_IMPORT!$A$2:$A$10000),0)+ROWS($1:2)-1,COLUMN()-1),0)","v":0},{"$f":"IF(ROWS(GPS_IMPORT!$1:2)<=COUNTIF(GPS_IMPORT!$A$2:$A$10000,$B$5),INDEX(GPS_IMPORT!$2:$10000,MATCH($B$5,(GPS_IMPORT!$A$2:$A$10000),0)+ROWS($1:2)-1,COLUMN()-1),0)","v":"00:00:00"},{"$f":"IF(ROWS(GPS_IMPORT!$1:2)<=COUNTIF(GPS_IMPORT!$A$2:$A$10000,$B$5),INDEX(GPS_IMPORT!$2:$10000,MATCH($B$5,(GPS_IMPORT!$A$2:$A$10000),0)+ROWS($1:2)-1,COLUMN()-1),0)","v":"00:00:00"},{"$f":"IF(ROWS(GPS_IMPORT!$1:2)<=COUNTIF(GPS_IMPORT!$A$2:$A$10000,$B$5),INDEX(GPS_IMPORT!$2:$10000,MATCH($B$5,(GPS_IMPORT!$A$2:$A$10000),0)+ROWS($1:2)-1,COLUMN()-1),0)","v":0},{"$f":"IF(ROWS(GPS_IMPORT!$1:2)<=COUNTIF(GPS_IMPORT!$A$2:$A$10000,$B$5),INDEX(GPS_IMPORT!$2:$10000,MATCH($B$5,(GPS_IMPORT!$A$2:$A$10000),0)+ROWS($1:2)-1,COLUMN()-1),0)","v":0},{"$f":"IF(ROWS(GPS_IMPORT!$1:2)<=COUNTIF(GPS_IMPORT!$A$2:$A$10000,$B$5),INDEX(GPS_IMPORT!$2:$10000,MATCH($B$5,(GPS_IMPORT!$A$2:$A$10000),0)+ROWS($1:2)-1,COLUMN()-1),0)","v":0},0,0,0,true]
[3,{"$f":"IF(ROWS(GPS_IMPORT!$1:3)<=COUNTIF(GPS_IMPORT!$A$2:$A$10000,$B$5),INDEX(GPS_IMPORT!$2:$10000,MATCH($B$5,(GPS_IMPORT!$A$2:$A$10000),0)+ROWS($1:3)-1,COLUMN()-1),0)","v":0},{"$f":"IF(ROWS(GPS_IMPORT!$1:3)<=COUNTIF(GPS_IMPORT!$A$2:$A$10000,$B$5),INDEX(GPS_IMPORT!$2:$10000,MATCH($B$5,(GPS_IMPORT!$A$2:$A$10000),0)+ROWS($1:3)-1,COLUMN()-1),0)","v":"00:00:00"},{"$f":"IF(ROWS(GPS_IMPORT!$1:3)<=COUNTIF(GPS_IMPORT!$A$2:$A$10000,$B$5),INDEX(GPS_IMPORT!$2:$10000,MATCH($B$5,(GPS_IMPORT!$A$2:$A$10000),0)+ROWS($1:3)-1,COLUMN()-1),0)","v":"00:00:00"},{"$f":"IF(ROWS(GPS_IMPORT!$1:3)<=COUNTIF(GPS_IMPORT!$A$2:$A$10000,$B$5),INDEX(GPS_IMPORT!$2:$10000,MATCH($B$5,(GPS_IMPORT!$A$2:$A$10000),0)+ROWS($1:3)-1,COLUMN()-1),0)","v":0},{"$f":"IF(ROWS(GPS_IMPORT!$1:3)<=COUNTIF(GPS_IMPORT!$A$2:$A$10000,$B$5),INDEX(GPS_IMPORT!$2:$10000,MATCH($B$5,(GPS_IMPORT!$A$2:$A$10000),0)+ROWS($1:3)-1,COLUMN()-1),0)","v":0},{"$f":"IF(ROWS(GPS_IMPORT!$1:3)<=COUNTIF(GPS_IMPORT!$A$2:$A$10000,$B$5),INDEX(GPS_IMPORT!$2:$10000,MATCH($B$5,(GPS_IMPORT!$A$2:$A$10000),0)+ROWS($1:3)-1,COLUMN()-1),0)","v":0},0,0,0,true]
[4,{"$f":"IF(ROWS(GPS_IMPORT!$1:4)<=COUNTIF(GPS_IMPORT!$A$2:$A$10000,$B$5),INDEX(GPS_IMPORT!$2:$10000,MATCH($B$5,(GPS_IMPORT!$A$2:$A$10000),0)+ROWS($1:4)-1,COLUMN()-1),0)","v":0},{"$f":"IF(ROWS(GPS_IMPORT!$1:4)<=COUNTIF(GPS_IMPORT!$A$2:$A$10000,$B$5),INDEX(GPS_IMPORT!$2:$10000,MATCH($B$5,(GPS_IMPORT!$A$2:$A$10000),0)+ROWS($1:4)-1,COLUMN()-1),0)","v":"00:00:00"},{"$f":"IF(ROWS(GPS_IMPORT!$1:4)<=COUNTIF(GPS_IMPORT!$A$2:$A$10000,$B$5),INDEX(GPS_IMPORT!$2:$10000,MATCH($B$5,(GPS_IMPORT!$A$2:$A$10000),0)+ROWS($1:4)-1,COLUMN()-1),0)","v":"00:00:00"},{"$f":"IF(ROWS(GPS_IMPORT!$1:4)<=COUNTIF(GPS_IMPORT!$A$2:$A$10000,$B$5),INDEX(GPS_IMPORT!$2:$10000,MATCH($B$5,(GPS_IMPORT!$A$2:$A$10000),0)+ROWS($1:4)-1,COLUMN()-1),0)","v":0},{"$f":"IF(ROWS(GPS_IMPORT!$1:4)<=COUNTIF(GPS_IMPORT!$A$2:$A$10000,$B$5),INDEX(GPS_IMPORT!$2:$10000,MATCH($B$5,(GPS_IMPORT!$A$2:$A$10000),0)+ROWS($1:4)-1,COLUMN()-1),0)","v":0},{"$f":"IF(ROWS(GPS_IMPORT!$1:4)<=COUNTIF(GPS_IMPORT!$A$2:$A$10000,$B$5),INDEX(GPS_IMPORT!$2:$10000,MATCH($B$5,(GPS_IMPORT!$A$2:$A$10000),0)+ROWS($1:4)-1,COLUMN()-1),0)","v":0},0,0,0,true]
[5,{"$f":"IF(ROWS(GPS_IMPORT!$1:5)<=COUNTIF(GPS_IMPORT!$A$2:$A$10000,$B$5),INDEX(GPS_IMPORT!$2:$10000,MATCH($B$5,(GPS_IMPORT!$A$2:$A$10000),0)+ROWS($1:5)-1,COLUMN()-1),0)","v":0},{"$f":"IF(ROWS(GPS_IMPORT!$1:5)<=COUNTIF(GPS_IMPORT!$A$2:$A$10000,$B$5),INDEX(GPS_IMPORT!$2:$10000,MATCH($B$5,(GPS_IMPORT!$A$2:$A$10000),0)+ROWS($1:5)-1,COLUMN()-1),0)","v":"00:00:00"},{"$f":"IF(ROWS(GPS_IMPORT!$1:5)<=COUNTIF(GPS_IMPORT!$A$2:$A$10000,$B$5),INDEX(GPS_IMPORT!$2:$10000,MATCH($B$5,(GPS_IMPORT!$A$2:$A$10000),0)+ROWS($1:5)-1,COLUMN()-1),0)","v":"00:00:00"},{"$f":"IF(ROWS(GPS_IMPORT!$1:5)<=COUNTIF(GPS_IMPORT!$A$2:$A$10000,$B$5),INDEX(GPS_IMPORT!$2:$10000,MATCH($B$5,(GPS_IMPORT!$A$2:$A$10000),0)+ROWS($1:5)-1,COLUMN()-1),0)","v":0},{"$f":"IF(ROWS(GPS_IMPORT!$1:5)<=COUNTIF(GPS_IMPORT!$A$2:$A$10000,$B$5),INDEX(GPS_IMPORT!$2:$10000,MATCH($B$5,(GPS_IMPORT!$A$2:$A$10000),0)+ROWS($1:5)-1,COLUMN()-1),0)","v":0},{"$f":"IF(ROWS(GPS_IMPORT!$1:5)<=COUNTIF(GPS_IMPORT!$A$2:$A$10000,$B$5),INDEX(GPS_IMPORT!$2:$10000,MATCH($B$5,(GPS_IMPORT!$A$2:$A$10000),0)+ROWS($1:5)-1,COLUMN()-1),0)","v":0},0,0,0,true]
[6,{"$f":"IF(ROWS(GPS_IMPORT!$1:6)<=COUNTIF(GPS_IMPORT!$A$2:$A$10000,$B$5),INDEX(GPS_IMPORT!$2:$10000,MATCH($B$5,(GPS_IMPORT!$A$2:$A$10000),0)+ROWS($1:6)-1,COLUMN()-1),0)","v":0},{"$f":"IF(ROWS(GPS_IMPORT!$1:6)<=COUNTIF(GPS_IMPORT!$A$2:$A$10000,$B$5),INDEX(GPS_IMPORT!$2:$10000,MATCH($B$5,(GPS_IMPORT!$A$2:$A$10000),0)+ROWS($1:6)-1,COLUMN()-1),0)","v":"00:00:00"},{"$f":"IF(ROWS(GPS_IMPORT!$1:6)<=COUNTIF(GPS_IMPORT!$A$2:$A$10000,$B$5),INDEX(GPS_IMPORT!$2:$10000,MATCH($B$5,(GPS_IMPORT!$A$2:$A$10000),0)+ROWS($1:6)-1,COLUMN()-1),0)","v":"00:00:00"},{"$f":"IF(ROWS(GPS_IMPORT!$1:6)<=COUNTIF(GPS_IMPORT!$A$2:$A$10000,$B$5),INDEX(GPS_IMPORT!$2:$10000,MATCH($B$5,(GPS_IMPORT!$A$2:$A$10000),0)+ROWS($1:6)-1,COLUMN()-1),0)","v":0},{"$f":"IF(ROWS(GPS_IMPORT!$1:6)<=COUNTIF(GPS_IMPORT!$A$2:$A$10000,$B$5),INDEX(GPS_IMPORT!$2:$10000,MATCH($B$5,(GPS_IMPORT!$A$2:$A$10000),0)+ROWS($1:6)-1,COLUMN()-1),0)","v":0},{"$f":"IF(ROWS(GPS_IMPORT!$1:6)<=COUNTIF(GPS_IMPORT!$A$2:$A$10000,$B$5),INDEX(GPS_IMPORT!$2:$10000,MATCH($B$5,(GPS_IMPORT!$A$2:$A$10000),0)+ROWS($1:6)-1,COLUMN()-1),0)","v":0},0,0,0,true]
[7,{"$f":"IF(ROWS(GPS_IMPORT!$1:7)<=COUNTIF(GPS_IMPORT!$A$2:$A$10000,$B$5),INDEX(GPS_IMPORT!$2:$10000,MATCH($B$5,(GPS_IMPORT!$A$2:$A$10000),0)+ROWS($1:7)-1,COLUMN()-1),0)","v":0},{"$f":"IF(ROWS(GPS_IMPORT!$1:7)<=COUNTIF(GPS_IMPORT!$A$2:$A$10000,$B$5),INDEX(GPS_IMPORT!$2:$10000,MATCH($B$5,(GPS_IMPORT!$A$2:$A$10000),0)+ROWS($1:7)-1,COLUMN()-1),0)","v":"00:00:00"},{"$f":"IF(ROWS(GPS_IMPORT!$1:7)<=COUNTIF(GPS_IMPORT!$A$2:$A$10000,$B$5),INDEX(GPS_IMPORT!$2:$10000,MATCH($B$5,(GPS_IMPORT!$A$2:$A$10000),0)+ROWS($1:7)-1,COLUMN()-1),0)","v":"00:00:00"},{"$f":"IF(ROWS(GPS_IMPORT!$1:7)<=COUNTIF(GPS_IMPORT!$A$2:$A$10000,$B$5),INDEX(GPS_IMPORT!$2:$10000,MATCH($B$5,(GPS_IMPORT!$A$2:$A$10000),0)+ROWS($1:7)-1,COLUMN()-1),0)","v":0},{"$f":"IF(ROWS(GPS_IMPORT!$1:7)<=COUNTIF(GPS_IMPORT!$A$2:$A$10000,$B$5),INDEX(GPS_IMPORT!$2:$10000,MATCH($B$5,(GPS_IMPORT!$A$2:$A$10000),0)+ROWS($1:7)-1,COLUMN()-1),0)","v":0},{"$f":"IF(ROWS(GPS_IMPORT!$1:7)<=COUNTIF(GPS_IMPORT!$A$2:$A$10000,$B$5),INDEX(GPS_IMPORT!$2:$10000,MATCH($B$5,(GPS_IMPORT!$A$2:$A$10000),0)+ROWS($1:7)-1,COLUMN()-1),0)","v":0},0,0,0,true]
[8,{"$f":"IF(ROWS(GPS_IMPORT!$1:8)<=COUNTIF(GPS_IMPORT!$A$2:$A$10000,$B$5),INDEX(GPS_IMPORT!$2:$10000,MATCH($B$5,(GPS_IMPORT!$A$2:$A$10000),0)+ROWS($1:8)-1,COLUMN()-1),0)","v":0},{"$f":"IF(ROWS(GPS_IMPORT!$1:8)<=COUNTIF(GPS_IMPORT!$A$2:$A$10000,$B$5),INDEX(GPS_IMPORT!$2:$10000,MATCH($B$5,(GPS_IMPORT!$A$2:$A$10000),0)+ROWS($1:8)-1,COLUMN()-1),0)","v":"00:00:00"},{"$f":"IF(ROWS(GPS_IMPORT!$1:8)<=COUNTIF(GPS_IMPORT!$A$2:$A$10000,$B$5),INDEX(GPS_IMPORT!$2:$10000,MATCH($B$5,(GPS_IMPORT!$A$2:$A$10000),0)+ROWS($1:8)-1,COLUMN()-1),0)","v":"00:00:00"},{"$f":"IF(ROWS(GPS_IMPORT!$1:8)<=COUNTIF(GPS_IMPORT!$A$2:$A$10000,$B$5),INDEX(GPS_IMPORT!$2:$10000,MATCH($B$5,(GPS_IMPORT!$A$2:$A$10000),0)+ROWS($1:8)-1,COLUMN()-1),0)","v":0},{"$f":"IF(ROWS(GPS_IMPORT!$1:8)<=COUNTIF(GPS_IMPORT!$A$2:$A$10000,$B$5),INDEX(GPS_IMPORT!$2:$10000,MATCH($B$5,(GPS_IMPORT!$A$2:$A$10000),0)+ROWS($1:8)-1,COLUMN()-1),0)","v":0},{"$f":"IF(ROWS(GPS_IMPORT!$1:8)<=COUNTIF(GPS_IMPORT!$A$2:$A$10000,$B$5),INDEX(GPS_IMPORT!$2:$10000,MATCH($B$5,(GPS_IMPORT!$A$2:$A$10000),0)+ROWS($1:8)-1,COLUMN()-1),0)","v":0},0,0,0,true]
[9,{"$f":"IF(ROWS(GPS_IMPORT!$1:9)<=COUNTIF(GPS_IMPORT!$A$2:$A$10000,$B$5),INDEX(GPS_IMPORT!$2:$10000,MATCH($B$5,(GPS_IMPORT!$A$2:$A$10000),0)+ROWS($1:9)-1,COLUMN()-1),0)","v":0},{"$f":"IF(ROWS(GPS_IMPORT!$1:9)<=COUNTIF(GPS_IMPORT!$A$2:$A$10000,$B$5),INDEX(GPS_IMPORT!$2:$10000,MATCH($B$5,(GPS_IMPORT!$A$2:$A$10000),0)+ROWS($1:9)-1,COLUMN()-1),0)","v":"00:00:00"},{"$f":"IF(ROWS(GPS_IMPORT!$1:9)<=COUNTIF(GPS_IMPORT!$A$2:$A$10000,$B$5),INDEX(GPS_IMPORT!$2:$10000,MATCH($B$5,(GPS_IMPORT!$A$2:$A$10000),0)+ROWS($1:9)-1,COLUMN()-1),0)","v":"00:00:00"},{"$f":"IF(ROWS(GPS_IMPORT!$1:9)<=COUNTIF(GPS_IMPORT!$A$2:$A$10000,$B$5),INDEX(GPS_IMPORT!$2:$10000,MATCH($B$5,(GPS_IMPORT!$A$2:$A$10000),0)+ROWS($1:9)-1,COLUMN()-1),0)","v":0},{"$f":"IF(ROWS(GPS_IMPORT!$1:9)<=COUNTIF(GPS_IMPORT!$A$2:$A$10000,$B$5),INDEX(GPS_IMPORT!$2:$10000,MATCH($B$5,(GPS_IMPORT!$A$2:$A$10000),0)+ROWS($1:9)-1,COLUMN()-1),0)","v":0},{"$f":"IF(ROWS(GPS_IMPORT!$1:9)<=COUNTIF(GPS_IMPORT!$A$2:$A$10000,$B$5),INDEX(GPS_IMPORT!$2:$10000,MATCH($B$5,(GPS_IMPORT!$A$2:$A$10000),0)+ROWS($1:9)-1,COLUMN()-1),0)","v":0},0,0,0,true]
[10,{"$f":"IF(ROWS(GPS_IMPORT!$1:10)<=COUNTIF(GPS_IMPORT!$A$2:$A$10000,$B$5),INDEX(GPS_IMPORT!$2:$10000,MATCH($B$5,(GPS_IMPORT!$A$2:$A$10000),0)+ROWS($1:10)-1,COLUMN()-1),0)","v":0},{"$f":"IF(ROWS(GPS_IMPORT!$1:10)<=COUNTIF(GPS_IMPORT!$A$2:$A$10000,$B$5),INDEX(GPS_IMPORT!$2:$10000,MATCH($B$5,(GPS_IMPORT!$A$2:$A$10000),0)+ROWS($1:10)-1,COLUMN()-1),0)","v":"00:00:00"},{"$f":"IF(ROWS(GPS_IMPORT!$1:10)<=COUNTIF(GPS_IMPORT!$A$2:$A$10000,$B$5),INDEX(GPS_IMPORT!$2:$10000,MATCH($B$5,(GPS_IMPORT!$A$2:$A$10000),0)+ROWS($1:10)-1,COLUMN()-1),0)","v":"00:00:00"},{"$f":"IF(ROWS(GPS_IMPORT!$1:10)<=COUNTIF(GPS_IMPORT!$A$2:$A$10000,$B$5),INDEX(GPS_IMPORT!$2:$10000,MATCH($B$5,(GPS_IMPORT!$A$2:$A$10000),0)+ROWS($1:10)-1,COLUMN()-1),0)","v":0},{"$f":"IF(ROWS(GPS_IMPORT!$1:10)<=COUNTIF(GPS_IMPORT!$A$2:$A$10000,$B$5),INDEX(GPS_IMPORT!$2:$10000,MATCH($B$5,(GPS_IMPORT!$A$2:$A$10000),0)+ROWS($1:10)-1,COLUMN()-1),0)","v":0},{"$f":"IF(ROWS(GPS_IMPORT!$1:10)<=COUNTIF(GPS_IMPORT!$A$2:$A$10000,$B$5),INDEX(GPS_IMPORT!$2:$10000,MATCH($B$5,(GPS_IMPORT!$A$2:$A$10000),0)+ROWS($1:10)-1,COLUMN()-1),0)","v":0},0,0,0,true]
[11,{"$f":"IF(ROWS(GPS_IMPORT!$1:11)<=COUNTIF(GPS_IMPORT!$A$2:$A$10000,$B$5),INDEX(GPS_IMPORT!$2:$10000,MATCH($B$5,(GPS_IMPORT!$A$2:$A$10000),0)+ROWS($1:11)-1,COLUMN()-1),0)","v":0},{"$f":"IF(ROWS(GPS_IMPORT!$1:11)<=COUNTIF(GPS_IMPORT!$A$2:$A$10000,$B$5),INDEX(GPS_IMPORT!$2:$10000,MATCH($B$5,(GPS_IMPORT!$A$2:$A$10000),0)+ROWS($1:11)-1,COLUMN()-1),0)","v":"00:00:00"},{"$f":"IF(ROWS(GPS_IMPORT!$1:11)<=COUNTIF(GPS_IMPORT!$A$2:$A$10000,$B$5),INDEX(GPS_IMPORT!$2:$10000,MATCH($B$5,(GPS_IMPORT!$A$2:$A$10000),0)+ROWS($1:11)-1,COLUMN()-1),0)","v":"00:00:00"},{"$f":"IF(ROWS(GPS_IMPORT!$1:11)<=COUNTIF(GPS_IMPORT!$A$2:$A$10000,$B$5),INDEX(GPS_IMPORT!$2:$10000,MATCH($B$5,(GPS_IMPORT!$A$2:$A$10000),0)+ROWS($1:11)-1,COLUMN()-1),0)","v":0},{"$f":"IF(ROWS(GPS_IMPORT!$1:11)<=COUNTIF(GPS_IMPORT!$A$2:$A$10000,$B$5),INDEX(GPS_IMPORT!$2:$10000,MATCH($B$5,(GPS_IMPORT!$A$2:$A$10000),0)+ROWS($1:11)-1,COLUMN()-1),0)","v":0},{"$f":"IF(ROWS(GPS_IMPORT!$1:11)<=COUNTIF(GPS_IMPORT!$A$2:$A$10000,$B$5),INDEX(GPS_IMPORT!$2:$10000,MATCH($B$5,(GPS_IMPORT!$A$2:$A$10000),0)+ROWS($1:11)-1,COLUMN()-1),0)","v":0},0,0,0,true]
[12,{"$f":"IF(ROWS(GPS_IMPORT!$1:12)<=COUNTIF(GPS_IMPORT!$A$2:$A$10000,$B$5),INDEX(GPS_IMPORT!$2:$10000,MATCH($B$5,(GPS_IMPORT!$A$2:$A$10000),0)+ROWS($1:12)-1,COLUMN()-1),0)","v":0},{"$f":"IF(ROWS(GPS_IMPORT!$1:12)<=COUNTIF(GPS_IMPORT!$A$2:$A$10000,$B$5),INDEX(GPS_IMPORT!$2:$10000,MATCH($B$5,(GPS_IMPORT!$A$2:$A$10000),0)+ROWS($1:12)-1,COLUMN()-1),0)","v":"00:00:00"},{"$f":"IF(ROWS(GPS_IMPORT!$1:12)<=COUNTIF(GPS_IMPORT!$A$2:$A$10000,$B$5),INDEX(GPS_IMPORT!$2:$10000,MATCH($B$5,(GPS_IMPORT!$A$2:$A$10000),0)+ROWS($1:12)-1,COLUMN()-1),0)","v":"00:00:00"},{"$f":"IF(ROWS(GPS_IMPORT!$1:12)<=COUNTIF(GPS_IMPORT!$A$2:$A$10000,$B$5),INDEX(GPS_IMPORT!$2:$10000,MATCH($B$5,(GPS_IMPORT!$A$2:$A$10000),0)+ROWS($1:12)-1,COLUMN()-1),0)","v":0},{"$f":"IF(ROWS(GPS_IMPORT!$1:12)<=COUNTIF(GPS_IMPORT!$A$2:$A$10000,$B$5),INDEX(GPS_IMPORT!$2:$10000,MATCH($B$5,(GPS_IMPORT!$A$2:$A$10000),0)+ROWS($1:12)-1,COLUMN()-1),0)","v":0},{"$f":"IF(ROWS(GPS_IMPORT!$1:12)<=COUNTIF(GPS_IMPORT!$A$2:$A$10000,$B$5),INDEX(GPS_IMPORT!$2:$10000,MATCH($B$5,(GPS_IMPORT!$A$2:$A$10000),0)+ROWS($1:12)-1,COLUMN()-1),0)","v":0},0,0,0,true]
[13,{"$f":"IF(ROWS(GPS_IMPORT!$1:13)<=COUNTIF(GPS_IMPORT!$A$2:$A$10000,$B$5),INDEX(GPS_IMPORT!$2:$10000,MATCH($B$5,(GPS_IMPORT!$A$2:$A$10000),0)+ROWS($1:13)-1,COLUMN()-1),0)","v":0},{"$f":"IF(ROWS(GPS_IMPORT!$1:13)<=COUNTIF(GPS_IMPORT!$A$2:$A$10000,$B$5),INDEX(GPS_IMPORT!$2:$10000,MATCH($B$5,(GPS_IMPORT!$A$2:$A$10000),0)+ROWS($1:13)-1,COLUMN()-1),0)","v":"00:00:00"},{"$f":"IF(ROWS(GPS_IMPORT!$1:13)<=COUNTIF(GPS_IMPORT!$A$2:$A$10000,$B$5),INDEX(GPS_IMPORT!$2:$10000,MATCH($B$5,(GPS_IMPORT!$A$2:$A$10000),0)+ROWS($1:13)-1,COLUMN()-1),0)","v":"00:00:00"},{"$f":"IF(ROWS(GPS_IMPORT!$1:13)<=COUNTIF(GPS_IMPORT!$A$2:$A$10000,$B$5),INDEX(GPS_IMPORT!$2:$10000,MATCH($B$5,(GPS_IMPORT!$A$2:$A$10000),0)+ROWS($1:13)-1,COLUMN()-1),0)","v":0},{"$f":"IF(ROWS(GPS_IMPORT!$1:13)<=COUNTIF(GPS_IMPORT!$A$2:$A$10000,$B$5),INDEX(GPS_IMPORT!$2:$10000,MATCH($B$5,(GPS_IMPORT!$A$2:$A$10000),0)+ROWS($1:13)-1,COLUMN()-1),0)","v":0},{"$f":"IF(ROWS(GPS_IMPORT!$1:13)<=COUNTIF(GPS_IMPORT!$A$2:$A$10000,$B$5),INDEX(GPS_IMPORT!$2:$10000,MATCH($B$5,(GPS_IMPORT!$A$2:$A$10000),0)+ROWS($1:13)-1,COLUMN()-1),0)","v":0},{"$f":"IF(E19>0,E$22-E19,0)","v":0},0,0,false]
[14,{"$f":"IF(ROWS(GPS_IMPORT!$1:14)<=COUNTIF(GPS_IMPORT!$A$2:$A$10000,$B$5),INDEX(GPS_IMPORT!$2:$10000,MATCH($B$5,(GPS_IMPORT!$A$2:$A$10000),0)+ROWS($1:14)-1,COLUMN()-1),0)","v":0},{"$f":"IF(ROWS(GPS_IMPORT!$1:14)<=COUNTIF(GPS_IMPORT!$A$2:$A$10000,$B$5),INDEX(GPS_IMPORT!$2:$10000,MATCH($B$5,(GPS_IMPORT!$A$2:$A$10000),0)+ROWS($1:14)-1,COLUMN()-1),0)","v":"00:00:00"},{"$f":"IF(ROWS(GPS_IMPORT!$1:14)<=COUNTIF(GPS_IMPORT!$A$2:$A$10000,$B$5),INDEX(GPS_IMPORT!$2:$10000,MATCH($B$5,(GPS_IMPORT!$A$2:$A$10000),0)+ROWS($1:14)-1,COLUMN()-1),0)","v":"00:00:00"},{"$f":"IF(ROWS(GPS_IMPORT!$1:14)<=COUNTIF(GPS_IMPORT!$A$2:$A$10000,$B$5),INDEX(GPS_IMPORT!$2:$10000,MATCH($B$5,(GPS_IMPORT!$A$2:$A$10000),0)+ROWS($1:14)-1,COLUMN()-1),0)","v":0},{"$f":"IF(ROWS(GPS_IMPORT!$1:14)<=COUNTIF(GPS_IMPORT!$A$2:$A$10000,$B$5),INDEX(GPS_IMPORT!$2:$10000,MATCH($B$5,(GPS_IMPORT!$A$2:$A$10000),0)+ROWS($1:14)-1,COLUMN()-1),0)","v":0},{"$f":"IF(ROWS(GPS_IMPORT!$1:14)<=COUNTIF(GPS_IMPORT!$A$2:$A$10000,$B$5),INDEX(GPS_IMPORT!$2:$10000,MATCH($B$5,(GPS_IMPORT!$A$2:$A$10000),0)+ROWS($1:14)-1,COLUMN()-1),0)","v":0},0,0,0,false]
[15,{"$f":"IF(ROWS(GPS_IMPORT!$1:15)<=COUNTIF(GPS_IMPORT!$A$2:$A$10000,$B$5),INDEX(GPS_IMPORT!$2:$10000,MATCH($B$5,(GPS_IMPORT!$A$2:$A$10000),0)+ROWS($1:15)-1,COLUMN()-1),0)","v":0},{"$f":"IF(ROWS(GPS_IMPORT!$1:15)<=COUNTIF(GPS_IMPORT!$A$2:$A$10000,$B$5),INDEX(GPS_IMPORT!$2:$10000,MATCH($B$5,(GPS_IMPORT!$A$2:$A$10000),0)+ROWS($1:15)-1,COLUMN()-1),0)","v":"00:00:00"},{"$f":"IF(ROWS(GPS_IMPORT!$1:15)<=COUNTIF(GPS_IMPORT!$A$2:$A$10000,$B$5),INDEX(GPS_IMPORT!$2:$10000,MATCH($B$5,(GPS_IMPORT!$A$2:$A$10000),0)+ROWS($1:15)-1,COLUMN()-1),0)","v":"00:00:00"},{"$f":"IF(ROWS(GPS_IMPORT!$1:15)<=COUNTIF(GPS_IMPORT!$A$2:$A$10000,$B$5),INDEX(GPS_IMPORT!$2:$10000,MATCH($B$5,(GPS_IMPORT!$A$2:$A$10000),0)+ROWS($1:15)-1,COLUMN()-1),0)","v":0},{"$f":"IF(ROWS(GPS_IMPORT!$1:15)<=COUNTIF(GPS_IMPORT!$A$2:$A$10000,$B$5),INDEX(GPS_IMPORT!$2:$10000,MATCH($B$5,(GPS_IMPORT!$A$2:$A$10000),0)+ROWS($1:15)-1,COLUMN()-1),0)","v":0},{"$f":"IF(ROWS(GPS_IMPORT!$1:15)<=COUNTIF(GPS_IMPORT!$A$2:$A$10000,$B$5),INDEX(GPS_IMPORT!$2:$10000,MATCH($B$5,(GPS_IMPORT!$A$2:$A$10000),0)+ROWS($1:15)-1,COLUMN()-1),0)","v":0},0,0,0,false]
[null,null,null,"AVERAGE",{"$f":"(IF($K$7=TRUE,E7,0)+IF($K$8=TRUE,E8,0)+IF($K$9=TRUE,E9,0)+IF($K$10=TRUE,E10,0)+IF($K$11=TRUE,E11,0)+IF($K$12=TRUE,E12,0)+IF($K$13=TRUE,E13,0)+IF($K$14=TRUE,E14,0)+IF($K$15=TRUE,E15,0)+IF($K$16=TRUE,E16,0)+IF($K$17=TRUE,E17,0)+IF($K$18=TRUE,E18,0)+IF($K$19=TRUE,E19,0)+IF($K$20=TRUE,E20,0)+IF($K$21=TRUE,E21,0))/(IF($K$7=TRUE,1,0)+IF($K$8=TRUE,1,0)+IF($K$9=TRUE,1,0)+IF($K$10=TRUE,1,0)+IF($K$11=TRUE,1,0)+IF($K$12=TRUE,1,0)+IF($K$13=TRUE,1,0)+IF($K$14=TRUE,1,0)+IF($K$15=TRUE,1,0)+IF($K$16=TRUE,1,0)+IF($K$17=TRUE,1,0)+IF($K$18=TRUE,1,0)+IF($K$19=TRUE,1,0)+IF($K$20=TRUE,1,0)+IF($K$21=TRUE,1,0))","v":0},{"$f":"(IF($K$7=TRUE,F7,0)+IF($K$8=TRUE,F8,0)+IF($K$9=TRUE,F9,0)+IF($K$10=TRUE,F10,0)+IF($K$11=TRUE,F11,0)+IF($K$12=TRUE,F12,0)+IF($K$13=TRUE,F13,0)+IF($K$14=TRUE,F14,0)+IF($K$15=TRUE,F15,0)+IF($K$16=TRUE,F16,0)+IF($K$17=TRUE,F17,0)+IF($K$18=TRUE,F18,0)+IF($K$19=TRUE,F19,0)+IF($K$20=TRUE,F20,0)+IF($K$21=TRUE,F21,0))/(IF($K$7=TRUE,1,0)+IF($K$8=TRUE,1,0)+IF($K$9=TRUE,1,0)+IF($K$10=TRUE,1,0)+IF($K$11=TRUE,1,0)+IF($K$12=TRUE,1,0)+IF($K$13=TRUE,1,0)+IF($K$14=TRUE,1,0)+IF($K$15=TRUE,1,0)+IF($K$16=TRUE,1,0)+IF($K$17=TRUE,1,0)+IF($K$18=TRUE,1,0)+IF($K$19=TRUE,1,0)+IF($K$20=TRUE,1,0)+IF($K$21=TRUE,1,0))","v":0},{"$f":"(IF($K$7=TRUE,G7,0)+IF($K$8=TRUE,G8,0)+IF($K$9=TRUE,G9,0)+IF($K$10=TRUE,G10,0)+IF($K$11=TRUE,G11,0)+IF($K$12=TRUE,G12,0)+IF($K$13=TRUE,G13,0)+IF($K$14=TRUE,G14,0)+IF($K$15=TRUE,G15,0)+IF($K$16=TRUE,G16,0)+IF($K$17=TRUE,G17,0)+IF($K$18=TRUE,G18,0)+IF($K$19=TRUE,G19,0)+IF($K$20=TRUE,G20,0)+IF($K$21=TRUE,G21,0))/\n(IF($K$7=TRUE,1,0)+IF($K$8=TRUE,1,0)+IF($K$9=TRUE,1,0)+IF($K$10=TRUE,1,0)+IF($K$11=TRUE,1,0)+IF($K$12=TRUE,1,0)+IF($K$13=TRUE,1,0)+IF($K$14=TRUE,1,0)+IF($K$15=TRUE,1,0)+IF($K$16=TRUE,1,0)+IF($K$17=TRUE,1,0)+IF($K$18=TRUE,1,0)+IF($K$19=TRUE,1,0)+IF($K$20=TRUE,1,0)+IF($K$21=TRUE,1,0))","v":0},"RMSE:","RMSE:","RMSE:"]
[null,null,null,null,null,null,"RMSE IN METRIC:",{"$f":"SQRT((\n(IF($K$7=TRUE,H7^2,0))+(IF($K$8=TRUE,H8^2,0))+(IF($K$9=TRUE,H9^2,0))+(IF($K$10=TRUE,H10^2,0))+(IF($K$11=TRUE,H11^2,0))+(IF($K$12=TRUE,H12^2,0))+(IF($K$13=TRUE,H13^2,0))+(IF($K$14=TRUE,H14^2,0))+(IF($K$15=TRUE,H15^2,0))+(IF($K$16=TRUE,H16^2,0))+(IF($K$17=TRUE,H17^2,0))+(IF($K$18=TRUE,H18^2,0))+(IF($K$19=TRUE,H19^2,0))+(IF($K$20=TRUE,H20^2,0))+(IF($K$21=TRUE,H21^2,0)))/\n(IF($K$7=TRUE,1,0)+IF($K$8=TRUE,1,0)+IF($K$9=TRUE,1,0)+IF($K$10=TRUE,1,0)+IF($K$11=TRUE,1,0)+IF($K$12=TRUE,1,0)+IF($K$13=TRUE,1,0)+IF($K$14=TRUE,1,0)+IF($K$15=TRUE,1,0)+IF($K$16=TRUE,1,0)+IF($K$17=TRUE,1,0)+IF($K$18=TRUE,1,0)+IF($K$19=TRUE,1,0)+IF($K$20=TRUE,1,0)+IF($K$21=TRUE,1,0)))","v":0},{"$f":"SQRT((\n(IF($K$7=TRUE,I7^2,0))+(IF($K$8=TRUE,I8^2,0))+(IF($K$9=TRUE,I9^2,0))+(IF($K$10=TRUE,I10^2,0))+(IF($K$11=TRUE,I11^2,0))+(IF($K$12=TRUE,I12^2,0))+(IF($K$13=TRUE,I13^2,0))+(IF($K$14=TRUE,I14^2,0))+(IF($K$15=TRUE,I15^2,0))+(IF($K$16=TRUE,I16^2,0))+(IF($K$17=TRUE,I17^2,0))+(IF($K$18=TRUE,I18^2,0))+(IF($K$19=TRUE,I19^2,0))+(IF($K$20=TRUE,I20^2,0))+(IF($K$21=TRUE,I21^2,0)))/\n(IF($K$7=TRUE,1,0)+IF($K$8=TRUE,1,0)+IF($K$9=TRUE,1,0)+IF($K$10=TRUE,1,0)+IF($K$11=TRUE,1,0)+IF($K$12=TRUE,1,0)+IF($K$13=TRUE,1,0)+IF($K$14=TRUE,1,0)+IF($K$15=TRUE,1,0)+IF($K$16=TRUE,1,0)+IF($K$17=TRUE,1,0)+IF($K$18=TRUE,1,0)+IF($K$19=TRUE,1,0)+IF($K$20=TRUE,1,0)+IF($K$21=TRUE,1,0)))","v":0},{"$f":"SQRT((\n(IF($K$7=TRUE,J7^2,0))+(IF($K$8=TRUE,J8^2,0))+(IF($K$9=TRUE,J9^2,0))+(IF($K$10=TRUE,J10^2,0))+(IF($K$11=TRUE,J11^2,0))+(IF($K$12=TRUE,J12^2,0))+(IF($K$13=TRUE,J13^2,0))+(IF($K$14=TRUE,J14^2,0))+(IF($K$15=TRUE,J15^2,0))+(IF($K$16=TRUE,J16^2,0))+(IF($K$17=TRUE,J17^2,0))+(IF($K$18=TRUE,J18^2,0))+(IF($K$19=TRUE,J19^2,0))+(IF($K$20=TRUE,J20^2,0))+(IF($K$21=TRUE,J21^2,0)))/\n(IF($K$7=TRUE,1,0)+IF($K$8=TRUE,1,0)+IF($K$9=TRUE,1,0)+IF($K$10=TRUE,1,0)+IF($K$11=TRUE,1,0)+IF($K$12=TRUE,1,0)+IF($K$13=TRUE,1,0)+IF($K$14=TRUE,1,0)+IF($K$15=TRUE,1,0)+IF($K$16=TRUE,1,0)+IF($K$17=TRUE,1,0)+IF($K$18=TRUE,1,0)+IF($K$19=TRUE,1,0)+IF($K$20=TRUE,1,0)+IF($K$21=TRUE,1,0)))","v":0}]
[null,null,"ENGLISH TO METRIC CONVERSION",{"$f":"3937/1200","v":3.2808333333333333},null,null,"RMSE IN US SURVEY FEET:",{"$f":"H23*$D$24","v":0},{"$f":"I23*$D$24","v":0},{"$f":"J23*$D$24","v":0}]
[null,null,"UNITLESS GRID TO GROUND MULTIPLIER",{"$f":"REPORT!C13","v":0},null,null,null,{"$f":"IF(H24<=0.029,\"PASS\",\"FAIL\")","v":"PASS"},{"$f":"IF(I24<=0.029,\"PASS\",\"FAIL\")","v":"PASS"},{"$f":"IF(J24<=0.039,\"PASS\",\"FAIL\")","v":"PASS"}]
[]
["AVERAGED GPS-DERIVED POSITION",null,null,null,null,null,null,null,"Notes:"]
[null,"MONUMENT COORDINATES",null,"NORTHING","EASTING","ORTHO HEIGHT"]
[null,"METERS (GRID)",null,{"$f":"$E$22","v":0},{"$f":"$F$22","v":0},{"$f":"$G$22","v":0}]
[]
["LEVELED ELEVATION"]
["US SURVEY FEET",null,{"$f":"VLOOKUP(B5,'LEVEL RUN'!A8:I59,9,FALSE)","v":{"$error":"#N/A"}},"(Type the leveled elevation or N/A if no leveled elevation is available)"]
["MONUMENT HELD",null,null,"(Type the monument name from which leveling originated)"]
["LEVELED ELEVATION - GPS DERIVED ELEVATION   = ",null,null,null,{"$f":"IF(C32=\"N/A\",\"N/A\",C32-(F29*D24))","v":{"$error":"#N/A"}}]
[]
["FINAL MONUMENT COORDINATES"]
[null,"MONUMENT COORDINATES",null,"NORTHING","EASTING","ELEVATION","FEATURE CODE"]
[null,"US SURVEY FEET (GRID)",null,{"$f":"$E$22*$D$24","v":0},{"$f":"$F$22*$D$24","v":0},{"$f":"IF($C$32=\"N/A\",($G$22*$D$24),$C$32)","v":{"$error":"#N/A"}},"IPINS"]
[null,"US SURVEY FEET (GROUND)",null,{"$f":"$D$38*$D$25","v":0},{"$f":"$E$38*$D$25","v":0},{"$f":"IF($C$32=\"N/A\",($G$22*$D$24),$C$32)","v":{"$error":"#N/A"}},"IPINS"]
[]
["∆ North,  ∆ East, and ∆ Ht. are the difference between the average northing, easting, and height for each observation.",null,null,null,null,null,null,null,"Mask Angle:","13°"]

{"sheet":"LEVEL RUN","index":11,"n_rows":204,"n_cols":13,"rows_kept":204,"cut":false,"hidden":false,"merged":[[13,9,13,12],[14,9,14,12],[15,9,15,12],[6,9,6,12],[7,9,7,12],[8,9,8,12],[9,9,9,12],[10,9,10,12],[0,0,0,10],[5,9,5,12],[1,4,1,5],[2,4,2,5],[1,6,1,7],[2,6,2,7],[3,6,3,7],[11,9,11,12],[12,9,12,12],[22,9,22,12],[23,9,23,12],[24,9,24,12],[25,9,25,12],[16,9,16,12],[17,9,17,12],[18,9,18,12],[19,9,19,12],[20,9,20,12],[21,9,21,12],[31,9,31,12],[32,9,32,12],[33,9,33,12],[34,9,34,12],[35,9,35,12],[26,9,26,12],[27,9,27,12],[28,9,28,12],[29,9,29,12],[30,9,30,12],[41,9,41,12],[42,9,42,12],[43,9,43,12],[44,9,44,12],[45,9,45,12],[36,9,36,12],[37,9,37,12],[38,9,38,12],[39,9,39,12],[40,9,40,12],[51,9,51,12],[52,9,52,12],[53,9,53,12],[54,9,54,12],[55,9,55,12],[46,9,46,12],[47,9,47,12],[48,9,48,12],[49,9,49,12],[50,9,50,12],[61,9,61,12],[62,9,62,12],[63,9,63,12],[64,9,64,12],[65,9,65,12],[56,9,56,12],[57,9,57,12],[58,9,58,12],[59,9,59,12],[60,9,60,12],[71,9,71,12],[72,9,72,12],[73,9,73,12],[74,9,74,12],[75,9,75,12],[66,9,66,12],[67,9,67,12],[68,9,68,12],[69,9,69,12],[70,9,70,12],[81,9,81,12],[82,9,82,12],[83,9,83,12],[84,9,84,12],[85,9,85,12],[76,9,76,12],[77,9,77,12],[78,9,78,12],[79,9,79,12],[80,9,80,12],[91,9,91,12],[92,9,92,12],[93,9,93,12],[94,9,94,12],[95,9,95,12],[86,9,86,12],[87,9,87,12],[88,9,88,12],[89,9,89,12],[90,9,90,12],[101,9,101,12],[102,9,102,12],[103,9,103,12],[104,9,104,12],[105,9,105,12],[96,9,96,12],[97,9,97,12],[98,9,98,12],[99,9,99,12],[100,9,100,12],[111,9,111,12],[112,9,112,12],[113,9,113,12],[114,9,114,12],[115,9,115,12],[106,9,106,12],[107,9,107,12],[108,9,108,12],[109,9,109,12],[110,9,110,12],[121,9,121,12],[122,9,122,12],[123,9,123,12],[124,9,124,12],[125,9,125,12],[116,9,116,12],[117,9,117,12],[118,9,118,12],[119,9,119,12],[120,9,120,12],[131,9,131,12],[132,9,132,12],[133,9,133,12],[134,9,134,12],[135,9,135,12],[126,9,126,12],[127,9,127,12],[128,9,128,12],[129,9,129,12],[130,9,130,12],[141,9,141,12],[142,9,142,12],[143,9,143,12],[144,9,144,12],[145,9,145,12],[136,9,136,12],[137,9,137,12],[138,9,138,12],[139,9,139,12],[140,9,140,12],[151,9,151,12],[152,9,152,12],[153,9,153,12],[154,9,154,12],[155,9,155,12],[146,9,146,12],[147,9,147,12],[148,9,148,12],[149,9,149,12],[150,9,150,12],[161,9,161,12],[162,9,162,12],[163,9,163,12],[164,9,164,12],[165,9,165,12],[156,9,156,12],[157,9,157,12],[158,9,158,12],[159,9,159,12],[160,9,160,12],[171,9,171,12],[172,9,172,12],[173,9,173,12],[174,9,174,12],[175,9,175,12],[166,9,166,12],[167,9,167,12],[168,9,168,12],[169,9,169,12],[170,9,170,12],[181,9,181,12],[182,9,182,12],[183,9,183,12],[184,9,184,12],[185,9,185,12],[176,9,176,12],[177,9,177,12],[178,9,178,12],[179,9,179,12],[180,9,180,12],[196,9,196,12],[197,9,197,12],[198,9,198,12],[191,9,191,12],[192,9,192,12],[193,9,193,12],[194,9,194,12],[195,9,195,12],[186,9,186,12],[187,9,187,12],[188,9,188,12],[189,9,189,12],[190,9,190,12]]}
[{"$f":"REPORT!B2","v":"XXX-XXX-XXXX"},null,null,null,null,null,null,null,null,null,null,"PID:",{"$f":"REPORT!E2","v":"XXXXX"}]
["Adjustment factor only works for closed level loops.",null,null,null,"Instrument Used:",null,"Length in Miles:",null,0,"Instrument:",null,"Date:"]
["SUM BS:",{"$f":"SUM(B7:B205)","v":977.69380000000046},"SUM FS:",{"$f":"SUM(E8:E205)","v":977.68809999999951},"Topcon DL-503",null,"Misclosure:",null,{"$f":"B3-D3","v":5.7000000009566065E-3},"Notes:",null,"Weather:"]
["Misclosure must not exceed 0.04 ft x √E where E=Length of loop (miles)",null,null,null,null,null,"Adj Factor:",null,{"$f":"(I3/(COUNTA(B7:B205)))*-1","v":-2.8934010157140135E-5},"Rod:",null,"Temperature:"]
["Please DELETE unused rows before printing!"]
["POINT","BS","HI","FS","SUMFS","ELEV","REC ELEV","ADJ","ADJ ELEV","DESCRIPTION"]
["SV1",6.9292999999999996,{"$f":"F7+B7","v":632.1173},null,{"$f":"IF(D7>0,IF(B7>0,D7,0),\" \")","v":" "},625.18799999999999,null,null,"-"]
["SV2",3.1791,{"$f":"IF(D8<>\"\",IF(OR(B8<>\"\",INDIRECT(\"D9\")=0),IF(B7<>\"\",F7+B7,VLOOKUP(INDEX($B$7:B7,MATCH(9.99999999999999E+307,$B$7:B7)),$B$7:F7,5,FALSE)+INDEX($B$7:B7,MATCH(9.99999999999999E+307,$B$7:B7))),(VLOOKUP(INDEX($B$7:B7,MATCH(9.99999999999999E+307,$B$7:B7)),$B$7:F7,5,FALSE))+(INDEX($B$7:B7,MATCH(9.99999999999999E+307,$B$7:B7)))),\"\")","v":632.1173},4.4809999999999999,{"$f":"IF(D8<>\"\",IF(OR(B8<>\"\",INDIRECT(\"D9\")=0),D8,0),\"\")","v":4.4809999999999999},{"$f":"IF(D8<>\"\",C8-D8,\"\")","v":627.63630000000001},null,{"$f":"IF(D8<>\"\",IF(AND(B8<>\"\",B7<>\"\"),$I$4+H7,VLOOKUP(INDEX($B$7:B7,MATCH(9.99999999999999E+307,$B$7:B7)),$B$7:H7,7,FALSE)+$I$4),\"\")","v":-2.8934010157140135E-5},{"$f":"IF(D8<>\"\",(F8+H8),\"\")","v":627.63627106598983}]
["TP1",3.2437999999999998,{"$f":"IF(D9<>\"\",IF(OR(B9<>\"\",INDIRECT(\"D10\")=0),IF(B8<>\"\",F8+B8,VLOOKUP(INDEX($B$7:B8,MATCH(9.99999999999999E+307,$B$7:B8)),$B$7:F8,5,FALSE)+INDEX($B$7:B8,MATCH(9.99999999999999E+307,$B$7:B8))),(VLOOKUP(INDEX($B$7:B8,MATCH(9.99999999999999E+307,$B$7:B8)),$B$7:F8,5,FALSE))+(INDEX($B$7:B8,MATCH(9.99999999999999E+307,$B$7:B8)))),\"\")","v":630.81539999999995},3.9723999999999999,{"$f":"IF(D9<>\"\",IF(OR(B9<>\"\",INDIRECT(\"D10\")=0),D9,0),\"\")","v":3.9723999999999999},{"$f":"IF(D9<>\"\",C9-D9,\"\")","v":626.84299999999996},null,{"$f":"IF(D9<>\"\",IF(AND(B9<>\"\",B8<>\"\"),$I$4+H8,VLOOKUP(INDEX($B$7:B8,MATCH(9.99999999999999E+307,$B$7:B8)),$B$7:H8,7,FALSE)+$I$4),\"\")","v":-5.7868020314280269E-5},{"$f":"IF(D9<>\"\",(F9+H9),\"\")","v":626.84294213197961}]
["TP2",4.2009999999999996,{"$f":"IF(D10<>\"\",IF(OR(B10<>\"\",INDIRECT(\"D11\")=0),IF(B9<>\"\",F9+B9,VLOOKUP(INDEX($B$7:B9,MATCH(9.99999999999999E+307,$B$7:B9)),$B$7:F9,5,FALSE)+INDEX($B$7:B9,MATCH(9.99999999999999E+307,$B$7:B9))),(VLOOKUP(INDEX($B$7:B9,MATCH(9.99999999999999E+307,$B$7:B9)),$B$7:F9,5,FALSE))+(INDEX($B$7:B9,MATCH(9.99999999999999E+307,$B$7:B9)))),\"\")","v":630.08679999999993},6.1542000000000003,{"$f":"IF(D10<>\"\",IF(OR(B10<>\"\",INDIRECT(\"D11\")=0),D10,0),\"\")","v":6.1542000000000003},623.93259999999998,null,{"$f":"IF(D10<>\"\",IF(AND(B10<>\"\",B9<>\"\"),$I$4+H9,VLOOKUP(INDEX($B$7:B9,MATCH(9.99999999999999E+307,$B$7:B9)),$B$7:H9,7,FALSE)+$I$4),\"\")","v":-8.6802030471420404E-5},623.93251319796946]
["TP3",4.1757,{"$f":"IF(D11<>\"\",IF(OR(B11<>\"\",INDIRECT(\"D12\")=0),IF(B10<>\"\",F10+B10,VLOOKUP(INDEX($B$7:B10,MATCH(9.99999999999999E+307,$B$7:B10)),$B$7:F10,5,FALSE)+INDEX($B$7:B10,MATCH(9.99999999999999E+307,$B$7:B10))),(VLOOKUP(INDEX($B$7:B10,MATCH(9.99999999999999E+307,$B$7:B10)),$B$7:F10,5,FALSE))+(INDEX($B$7:B10,MATCH(9.99999999999999E+307,$B$7:B10)))),\"\")","v":628.1336},5.9711999999999996,{"$f":"IF(D11<>\"\",IF(OR(B11<>\"\",INDIRECT(\"D12\")=0),D11,0),\"\")","v":5.9711999999999996},622.16240000000005,null,{"$f":"IF(D11<>\"\",IF(AND(B11<>\"\",B10<>\"\"),$I$4+H10,VLOOKUP(INDEX($B$7:B10,MATCH(9.99999999999999E+307,$B$7:B10)),$B$7:H10,7,FALSE)+$I$4),\"\")","v":-1.1573604062856054E-4},622.16228426395946]
["TP4",6.2862999999999998,{"$f":"IF(D12<>\"\",IF(OR(B12<>\"\",INDIRECT(\"D13\")=0),IF(B11<>\"\",F11+B11,VLOOKUP(INDEX($B$7:B11,MATCH(9.99999999999999E+307,$B$7:B11)),$B$7:F11,5,FALSE)+INDEX($B$7:B11,MATCH(9.99999999999999E+307,$B$7:B11))),(VLOOKUP(INDEX($B$7:B11,MATCH(9.99999999999999E+307,$B$7:B11)),$B$7:F11,5,FALSE))+(INDEX($B$7:B11,MATCH(9.99999999999999E+307,$B$7:B11)))),\"\")","v":626.33810000000005},5.7840999999999996,{"$f":"IF(D12<>\"\",IF(OR(B12<>\"\",INDIRECT(\"D13\")=0),D12,0),\"\")","v":5.7840999999999996},620.55400000000009,null,{"$f":"IF(D12<>\"\",IF(AND(B12<>\"\",B11<>\"\"),$I$4+H11,VLOOKUP(INDEX($B$7:B11,MATCH(9.99999999999999E+307,$B$7:B11)),$B$7:H11,7,FALSE)+$I$4),\"\")","v":-1.4467005078570069E-4},620.55385532994933]
["TP5",5.2667000000000002,{"$f":"IF(D13<>\"\",IF(OR(B13<>\"\",INDIRECT(\"D14\")=0),IF(B12<>\"\",F12+B12,VLOOKUP(INDEX($B$7:B12,MATCH(9.99999999999999E+307,$B$7:B12)),$B$7:F12,5,FALSE)+INDEX($B$7:B12,MATCH(9.99999999999999E+307,$B$7:B12))),(VLOOKUP(INDEX($B$7:B12,MATCH(9.99999999999999E+307,$B$7:B12)),$B$7:F12,5,FALSE))+(INDEX($B$7:B12,MATCH(9.99999999999999E+307,$B$7:B12)))),\"\")","v":626.84030000000007},4.1494999999999997,{"$f":"IF(D13<>\"\",IF(OR(B13<>\"\",INDIRECT(\"D14\")=0),D13,0),\"\")","v":4.1494999999999997},622.69080000000008,null,{"$f":"IF(D13<>\"\",IF(AND(B13<>\"\",B12<>\"\"),$I$4+H12,VLOOKUP(INDEX($B$7:B12,MATCH(9.99999999999999E+307,$B$7:B12)),$B$7:H12,7,FALSE)+$I$4),\"\")","v":-1.7360406094284083E-4},622.69062639593915]
["SV3",7.2873999999999999,{"$f":"IF(D14<>\"\",IF(OR(B14<>\"\",INDIRECT(\"D15\")=0),IF(B13<>\"\",F13+B13,VLOOKUP(INDEX($B$7:B13,MATCH(9.99999999999999E+307,$B$7:B13)),$B$7:F13,5,FALSE)+INDEX($B$7:B13,MATCH(9.99999999999999E+307,$B$7:B13))),(VLOOKUP(INDEX($B$7:B13,MATCH(9.99999999999999E+307,$B$7:B13)),$B$7:F13,5,FALSE))+(INDEX($B$7:B13,MATCH(9.99999999999999E+307,$B$7:B13)))),\"\")","v":627.9575000000001},4.6257000000000001,{"$f":"IF(D14<>\"\",IF(OR(B14<>\"\",INDIRECT(\"D15\")=0),D14,0),\"\")","v":4.6257000000000001},623.33180000000004,null,{"$f":"IF(D14<>\"\",IF(AND(B14<>\"\",B13<>\"\"),$I$4+H13,VLOOKUP(INDEX($B$7:B13,MATCH(9.99999999999999E+307,$B$7:B13)),$B$7:H13,7,FALSE)+$I$4),\"\")","v":-2.0253807109998098E-4},623.33159746192894]
["SV4",8.0062999999999995,{"$f":"IF(D15<>\"\",IF(OR(B15<>\"\",INDIRECT(\"D16\")=0),IF(B14<>\"\",F14+B14,VLOOKUP(INDEX($B$7:B14,MATCH(9.99999999999999E+307,$B$7:B14)),$B$7:F14,5,FALSE)+INDEX($B$7:B14,MATCH(9.99999999999999E+307,$B$7:B14))),(VLOOKUP(INDEX($B$7:B14,MATCH(9.99999999999999E+307,$B$7:B14)),$B$7:F14,5,FALSE))+(INDEX($B$7:B14,MATCH(9.99999999999999E+307,$B$7:B14)))),\"\")","v":630.61920000000009},4.5602999999999998,{"$f":"IF(D15<>\"\",IF(OR(B15<>\"\",INDIRECT(\"D16\")=0),D15,0),\"\")","v":4.5602999999999998},626.05890000000011,null,{"$f":"IF(D15<>\"\",IF(AND(B15<>\"\",B14<>\"\"),$I$4+H14,VLOOKUP(INDEX($B$7:B14,MATCH(9.99999999999999E+307,$B$7:B14)),$B$7:H14,7,FALSE)+$I$4),\"\")","v":-2.3147208125712113E-4},626.05866852791883]
["TP6",7.8632999999999997,{"$f":"IF(D16<>\"\",IF(OR(B16<>\"\",INDIRECT(\"D17\")=0),IF(B15<>\"\",F15+B15,VLOOKUP(INDEX($B$7:B15,MATCH(9.99999999999999E+307,$B$7:B15)),$B$7:F15,5,FALSE)+INDEX($B$7:B15,MATCH(9.99999999999999E+307,$B$7:B15))),(VLOOKUP(INDEX($B$7:B15,MATCH(9.99999999999999E+307,$B$7:B15)),$B$7:F15,5,FALSE))+(INDEX($B$7:B15,MATCH(9.99999999999999E+307,$B$7:B15)))),\"\")","v":634.06520000000012},1.889,{"$f":"IF(D16<>\"\",IF(OR(B16<>\"\",INDIRECT(\"D17\")=0),D16,0),\"\")","v":1.889},632.17620000000011,null,{"$f":"IF(D16<>\"\",IF(AND(B16<>\"\",B15<>\"\"),$I$4+H15,VLOOKUP(INDEX($B$7:B15,MATCH(9.99999999999999E+307,$B$7:B15)),$B$7:H15,7,FALSE)+$I$4),\"\")","v":-2.6040609141426128E-4},632.17593959390865]
["TP7",6.6468999999999996,{"$f":"IF(D17<>\"\",IF(OR(B17<>\"\",INDIRECT(\"D18\")=0),IF(B16<>\"\",F16+B16,VLOOKUP(INDEX($B$7:B16,MATCH(9.99999999999999E+307,$B$7:B16)),$B$7:F16,5,FALSE)+INDEX($B$7:B16,MATCH(9.99999999999999E+307,$B$7:B16))),(VLOOKUP(INDEX($B$7:B16,MATCH(9.99999999999999E+307,$B$7:B16)),$B$7:F16,5,FALSE))+(INDEX($B$7:B16,MATCH(9.99999999999999E+307,$B$7:B16)))),\"\")","v":640.03950000000009},2.5989,{"$f":"IF(D17<>\"\",IF(OR(B17<>\"\",INDIRECT(\"D18\")=0),D17,0),\"\")","v":2.5989},637.44060000000013,null,{"$f":"IF(D17<>\"\",IF(AND(B17<>\"\",B16<>\"\"),$I$4+H16,VLOOKUP(INDEX($B$7:B16,MATCH(9.99999999999999E+307,$B$7:B16)),$B$7:H16,7,FALSE)+$I$4),\"\")","v":-2.8934010157140143E-4},637.44031065989861]
["TP8",6.7039999999999997,{"$f":"IF(D18<>\"\",IF(OR(B18<>\"\",INDIRECT(\"D19\")=0),IF(B17<>\"\",F17+B17,VLOOKUP(INDEX($B$7:B17,MATCH(9.99999999999999E+307,$B$7:B17)),$B$7:F17,5,FALSE)+INDEX($B$7:B17,MATCH(9.99999999999999E+307,$B$7:B17))),(VLOOKUP(INDEX($B$7:B17,MATCH(9.99999999999999E+307,$B$7:B17)),$B$7:F17,5,FALSE))+(INDEX($B$7:B17,MATCH(9.99999999999999E+307,$B$7:B17)))),\"\")","v":644.08750000000009},4.5138999999999996,{"$f":"IF(D18<>\"\",IF(OR(B18<>\"\",INDIRECT(\"D19\")=0),D18,0),\"\")","v":4.5138999999999996},639.57360000000006,null,{"$f":"IF(D18<>\"\",IF(AND(B18<>\"\",B17<>\"\"),$I$4+H17,VLOOKUP(INDEX($B$7:B17,MATCH(9.99999999999999E+307,$B$7:B17)),$B$7:H17,7,FALSE)+$I$4),\"\")","v":-3.1827411172854158E-4},639.57328172588836]
["TP9",4.0509000000000004,{"$f":"IF(D19<>\"\",IF(OR(B19<>\"\",INDIRECT(\"D20\")=0),IF(B18<>\"\",F18+B18,VLOOKUP(INDEX($B$7:B18,MATCH(9.99999999999999E+307,$B$7:B18)),$B$7:F18,5,FALSE)+INDEX($B$7:B18,MATCH(9.99999999999999E+307,$B$7:B18))),(VLOOKUP(INDEX($B$7:B18,MATCH(9.99999999999999E+307,$B$7:B18)),$B$7:F18,5,FALSE))+(INDEX($B$7:B18,MATCH(9.99999999999999E+307,$B$7:B18)))),\"\")","v":646.27760000000001},5.5861999999999998,{"$f":"IF(D19<>\"\",IF(OR(B19<>\"\",INDIRECT(\"D20\")=0),D19,0),\"\")","v":5.5861999999999998},640.69140000000004,null,{"$f":"IF(D19<>\"\",IF(AND(B19<>\"\",B18<>\"\"),$I$4+H18,VLOOKUP(INDEX($B$7:B18,MATCH(9.99999999999999E+307,$B$7:B18)),$B$7:H18,7,FALSE)+$I$4),\"\")","v":-3.4720812188568172E-4},640.69105279187818]
["TP10",4.9198000000000004,{"$f":"IF(D20<>\"\",IF(OR(B20<>\"\",INDIRECT(\"D21\")=0),IF(B19<>\"\",F19+B19,VLOOKUP(INDEX($B$7:B19,MATCH(9.99999999999999E+307,$B$7:B19)),$B$7:F19,5,FALSE)+INDEX($B$7:B19,MATCH(9.99999999999999E+307,$B$7:B19))),(VLOOKUP(INDEX($B$7:B19,MATCH(9.99999999999999E+307,$B$7:B19)),$B$7:F19,5,FALSE))+(INDEX($B$7:B19,MATCH(9.99999999999999E+307,$B$7:B19)))),\"\")","v":644.7423},6.6710000000000003,{"$f":"IF(D20<>\"\",IF(OR(B20<>\"\",INDIRECT(\"D21\")=0),D20,0),\"\")","v":6.6710000000000003},638.07129999999995,null,{"$f":"IF(D20<>\"\",IF(AND(B20<>\"\",B19<>\"\"),$I$4+H19,VLOOKUP(INDEX($B$7:B19,MATCH(9.99999999999999E+307,$B$7:B19)),$B$7:H19,7,FALSE)+$I$4),\"\")","v":-3.7614213204282187E-4},638.07092385786791]
["SV5",4.4757999999999996,{"$f":"IF(D21<>\"\",IF(OR(B21<>\"\",INDIRECT(\"D22\")=0),IF(B20<>\"\",F20+B20,VLOOKUP(INDEX($B$7:B20,MATCH(9.99999999999999E+307,$B$7:B20)),$B$7:F20,5,FALSE)+INDEX($B$7:B20,MATCH(9.99999999999999E+307,$B$7:B20))),(VLOOKUP(INDEX($B$7:B20,MATCH(9.99999999999999E+307,$B$7:B20)),$B$7:F20,5,FALSE))+(INDEX($B$7:B20,MATCH(9.99999999999999E+307,$B$7:B20)))),\"\")","v":642.99109999999996},5.5039999999999996,{"$f":"IF(D21<>\"\",IF(OR(B21<>\"\",INDIRECT(\"D22\")=0),D21,0),\"\")","v":5.5039999999999996},637.48709999999994,null,{"$f":"IF(D21<>\"\",IF(AND(B21<>\"\",B20<>\"\"),$I$4+H20,VLOOKUP(INDEX($B$7:B20,MATCH(9.99999999999999E+307,$B$7:B20)),$B$7:H20,7,FALSE)+$I$4),\"\")","v":-4.0507614219996202E-4},637.48669492385773]
["TP21",4.7534000000000001,{"$f":"IF(D22<>\"\",IF(OR(B22<>\"\",INDIRECT(\"D23\")=0),IF(B21<>\"\",F21+B21,VLOOKUP(INDEX($B$7:B21,MATCH(9.99999999999999E+307,$B$7:B21)),$B$7:F21,5,FALSE)+INDEX($B$7:B21,MATCH(9.99999999999999E+307,$B$7:B21))),(VLOOKUP(INDEX($B$7:B21,MATCH(9.99999999999999E+307,$B$7:B21)),$B$7:F21,5,FALSE))+(INDEX($B$7:B21,MATCH(9.99999999999999E+307,$B$7:B21)))),\"\")","v":641.96289999999999},5.5975000000000001,{"$f":"IF(D22<>\"\",IF(OR(B22<>\"\",INDIRECT(\"D23\")=0),D22,0),\"\")","v":5.5975000000000001},636.36540000000002,null,{"$f":"IF(D22<>\"\",IF(AND(B22<>\"\",B21<>\"\"),$I$4+H21,VLOOKUP(INDEX($B$7:B21,MATCH(9.99999999999999E+307,$B$7:B21)),$B$7:H21,7,FALSE)+$I$4),\"\")","v":-4.3401015235710217E-4},636.36496598984763]
["SV6",4.5053000000000001,{"$f":"IF(D23<>\"\",IF(OR(B23<>\"\",INDIRECT(\"D24\")=0),IF(B22<>\"\",F22+B22,VLOOKUP(INDEX($B$7:B22,MATCH(9.99999999999999E+307,$B$7:B22)),$B$7:F22,5,FALSE)+INDEX($B$7:B22,MATCH(9.99999999999999E+307,$B$7:B22))),(VLOOKUP(INDEX($B$7:B22,MATCH(9.99999999999999E+307,$B$7:B22)),$B$7:F22,5,FALSE))+(INDEX($B$7:B22,MATCH(9.99999999999999E+307,$B$7:B22)))),\"\")","v":641.11880000000008},6.2382999999999997,{"$f":"IF(D23<>\"\",IF(OR(B23<>\"\",INDIRECT(\"D24\")=0),D23,0),\"\")","v":6.2382999999999997},634.8805000000001,null,{"$f":"IF(D23<>\"\",IF(AND(B23<>\"\",B22<>\"\"),$I$4+H22,VLOOKUP(INDEX($B$7:B22,MATCH(9.99999999999999E+307,$B$7:B22)),$B$7:H22,7,FALSE)+$I$4),\"\")","v":-4.6294416251424232E-4},634.88003705583753]
["TP22",5.9798,{"$f":"IF(D24<>\"\",IF(OR(B24<>\"\",INDIRECT(\"D25\")=0),IF(B23<>\"\",F23+B23,VLOOKUP(INDEX($B$7:B23,MATCH(9.99999999999999E+307,$B$7:B23)),$B$7:F23,5,FALSE)+INDEX($B$7:B23,MATCH(9.99999999999999E+307,$B$7:B23))),(VLOOKUP(INDEX($B$7:B23,MATCH(9.99999999999999E+307,$B$7:B23)),$B$7:F23,5,FALSE))+(INDEX($B$7:B23,MATCH(9.99999999999999E+307,$B$7:B23)))),\"\")","v":639.38580000000013},5.5732999999999997,{"$f":"IF(D24<>\"\",IF(OR(B24<>\"\",INDIRECT(\"D25\")=0),D24,0),\"\")","v":5.5732999999999997},633.81250000000011,null,{"$f":"IF(D24<>\"\",IF(AND(B24<>\"\",B23<>\"\"),$I$4+H23,VLOOKUP(INDEX($B$7:B23,MATCH(9.99999999999999E+307,$B$7:B23)),$B$7:H23,7,FALSE)+$I$4),\"\")","v":-4.9187817267138246E-4},633.81200812182749]
["TP23",6.2390999999999996,{"$f":"IF(D25<>\"\",IF(OR(B25<>\"\",INDIRECT(\"D26\")=0),IF(B24<>\"\",F24+B24,VLOOKUP(INDEX($B$7:B24,MATCH(9.99999999999999E+307,$B$7:B24)),$B$7:F24,5,FALSE)+INDEX($B$7:B24,MATCH(9.99999999999999E+307,$B$7:B24))),(VLOOKUP(INDEX($B$7:B24,MATCH(9.99999999999999E+307,$B$7:B24)),$B$7:F24,5,FALSE))+(INDEX($B$7:B24,MATCH(9.99999999999999E+307,$B$7:B24)))),\"\")","v":639.79230000000007},4.8719000000000001,{"$f":"IF(D25<>\"\",IF(OR(B25<>\"\",INDIRECT(\"D26\")=0),D25,0),\"\")","v":4.8719000000000001},634.92040000000009,null,{"$f":"IF(D25<>\"\",IF(AND(B25<>\"\",B24<>\"\"),$I$4+H24,VLOOKUP(INDEX($B$7:B24,MATCH(9.99999999999999E+307,$B$7:B24)),$B$7:H24,7,FALSE)+$I$4),\"\")","v":-5.2081218282852256E-4},634.91987918781729]
["TP24",6.9466000000000001,{"$f":"IF(D26<>\"\",IF(OR(B26<>\"\",INDIRECT(\"D27\")=0),IF(B25<>\"\",F25+B25,VLOOKUP(INDEX($B$7:B25,MATCH(9.99999999999999E+307,$B$7:B25)),$B$7:F25,5,FALSE)+INDEX($B$7:B25,MATCH(9.99999999999999E+307,$B$7:B25))),(VLOOKUP(INDEX($B$7:B25,MATCH(9.99999999999999E+307,$B$7:B25)),$B$7:F25,5,FALSE))+(INDEX($B$7:B25,MATCH(9.99999999999999E+307,$B$7:B25)))),\"\")","v":641.15950000000009},5.1772999999999998,{"$f":"IF(D26<>\"\",IF(OR(B26<>\"\",INDIRECT(\"D27\")=0),D26,0),\"\")","v":5.1772999999999998},635.98220000000015,null,{"$f":"IF(D26<>\"\",IF(AND(B26<>\"\",B25<>\"\"),$I$4+H25,VLOOKUP(INDEX($B$7:B25,MATCH(9.99999999999999E+307,$B$7:B25)),$B$7:H25,7,FALSE)+$I$4),\"\")","v":-5.4974619298566265E-4},635.98165025380717]
["TP25",6.1841999999999997,{"$f":"IF(D27<>\"\",IF(OR(B27<>\"\",INDIRECT(\"D28\")=0),IF(B26<>\"\",F26+B26,VLOOKUP(INDEX($B$7:B26,MATCH(9.99999999999999E+307,$B$7:B26)),$B$7:F26,5,FALSE)+INDEX($B$7:B26,MATCH(9.99999999999999E+307,$B$7:B26))),(VLOOKUP(INDEX($B$7:B26,MATCH(9.99999999999999E+307,$B$7:B26)),$B$7:F26,5,FALSE))+(INDEX($B$7:B26,MATCH(9.99999999999999E+307,$B$7:B26)))),\"\")","v":642.92880000000014},4.6379000000000001,{"$f":"IF(D27<>\"\",IF(OR(B27<>\"\",INDIRECT(\"D28\")=0),D27,0),\"\")","v":4.6379000000000001},638.29090000000019,null,{"$f":"IF(D27<>\"\",IF(AND(B27<>\"\",B26<>\"\"),$I$4+H26,VLOOKUP(INDEX($B$7:B26,MATCH(9.99999999999999E+307,$B$7:B26)),$B$7:H26,7,FALSE)+$I$4),\"\")","v":-5.7868020314280275E-4},638.29032131979704]
["TP26",7.1473000000000004,{"$f":"IF(D28<>\"\",IF(OR(B28<>\"\",INDIRECT(\"D29\")=0),IF(B27<>\"\",F27+B27,VLOOKUP(INDEX($B$7:B27,MATCH(9.99999999999999E+307,$B$7:B27)),$B$7:F27,5,FALSE)+INDEX($B$7:B27,MATCH(9.99999999999999E+307,$B$7:B27))),(VLOOKUP(INDEX($B$7:B27,MATCH(9.99999999999999E+307,$B$7:B27)),$B$7:F27,5,FALSE))+(INDEX($B$7:B27,MATCH(9.99999999999999E+307,$B$7:B27)))),\"\")","v":644.47510000000023},3.0312999999999999,{"$f":"IF(D28<>\"\",IF(OR(B28<>\"\",INDIRECT(\"D29\")=0),D28,0),\"\")","v":3.0312999999999999},641.44380000000024,null,{"$f":"IF(D28<>\"\",IF(AND(B28<>\"\",B27<>\"\"),$I$4+H27,VLOOKUP(INDEX($B$7:B27,MATCH(9.99999999999999E+307,$B$7:B27)),$B$7:H27,7,FALSE)+$I$4),\"\")","v":-6.0761421329994284E-4},641.44319238578692]
["TP27",7.3465999999999996,{"$f":"IF(D29<>\"\",IF(OR(B29<>\"\",INDIRECT(\"D30\")=0),IF(B28<>\"\",F28+B28,VLOOKUP(INDEX($B$7:B28,MATCH(9.99999999999999E+307,$B$7:B28)),$B$7:F28,5,FALSE)+INDEX($B$7:B28,MATCH(9.99999999999999E+307,$B$7:B28))),(VLOOKUP(INDEX($B$7:B28,MATCH(9.99999999999999E+307,$B$7:B28)),$B$7:F28,5,FALSE))+(INDEX($B$7:B28,MATCH(9.99999999999999E+307,$B$7:B28)))),\"\")","v":648.59110000000021},2.0217000000000001,{"$f":"IF(D29<>\"\",IF(OR(B29<>\"\",INDIRECT(\"D30\")=0),D29,0),\"\")","v":2.0217000000000001},646.5694000000002,null,{"$f":"IF(D29<>\"\",IF(AND(B29<>\"\",B28<>\"\"),$I$4+H28,VLOOKUP(INDEX($B$7:B28,MATCH(9.99999999999999E+307,$B$7:B28)),$B$7:H28,7,FALSE)+$I$4),\"\")","v":-6.3654822345708293E-4},646.5687634517767]
["SV101",5.9539,{"$f":"IF(D30<>\"\",IF(OR(B30<>\"\",INDIRECT(\"D31\")=0),IF(B29<>\"\",F29+B29,VLOOKUP(INDEX($B$7:B29,MATCH(9.99999999999999E+307,$B$7:B29)),$B$7:F29,5,FALSE)+INDEX($B$7:B29,MATCH(9.99999999999999E+307,$B$7:B29))),(VLOOKUP(INDEX($B$7:B29,MATCH(9.99999999999999E+307,$B$7:B29)),$B$7:F29,5,FALSE))+(INDEX($B$7:B29,MATCH(9.99999999999999E+307,$B$7:B29)))),\"\")","v":653.91600000000017},4.6208999999999998,{"$f":"IF(D30<>\"\",IF(OR(B30<>\"\",INDIRECT(\"D31\")=0),D30,0),\"\")","v":4.6208999999999998},649.29510000000016,null,{"$f":"IF(D30<>\"\",IF(AND(B30<>\"\",B29<>\"\"),$I$4+H29,VLOOKUP(INDEX($B$7:B29,MATCH(9.99999999999999E+307,$B$7:B29)),$B$7:H29,7,FALSE)+$I$4),\"\")","v":-6.6548223361422303E-4},649.2944345177666]
["TP28",4.5519999999999996,{"$f":"IF(D31<>\"\",IF(OR(B31<>\"\",INDIRECT(\"D32\")=0),IF(B30<>\"\",F30+B30,VLOOKUP(INDEX($B$7:B30,MATCH(9.99999999999999E+307,$B$7:B30)),$B$7:F30,5,FALSE)+INDEX($B$7:B30,MATCH(9.99999999999999E+307,$B$7:B30))),(VLOOKUP(INDEX($B$7:B30,MATCH(9.99999999999999E+307,$B$7:B30)),$B$7:F30,5,FALSE))+(INDEX($B$7:B30,MATCH(9.99999999999999E+307,$B$7:B30)))),\"\")","v":655.24900000000014},5.7278000000000002,{"$f":"IF(D31<>\"\",IF(OR(B31<>\"\",INDIRECT(\"D32\")=0),D31,0),\"\")","v":5.7278000000000002},649.52120000000014,null,{"$f":"IF(D31<>\"\",IF(AND(B31<>\"\",B30<>\"\"),$I$4+H30,VLOOKUP(INDEX($B$7:B30,MATCH(9.99999999999999E+307,$B$7:B30)),$B$7:H30,7,FALSE)+$I$4),\"\")","v":-6.9441624377136312E-4},649.5205055837564]
["SV7",4.6117999999999997,{"$f":"IF(D32<>\"\",IF(OR(B32<>\"\",INDIRECT(\"D33\")=0),IF(B31<>\"\",F31+B31,VLOOKUP(INDEX($B$7:B31,MATCH(9.99999999999999E+307,$B$7:B31)),$B$7:F31,5,FALSE)+INDEX($B$7:B31,MATCH(9.99999999999999E+307,$B$7:B31))),(VLOOKUP(INDEX($B$7:B31,MATCH(9.99999999999999E+307,$B$7:B31)),$B$7:F31,5,FALSE))+(INDEX($B$7:B31,MATCH(9.99999999999999E+307,$B$7:B31)))),\"\")","v":654.07320000000016},5.8715000000000002,{"$f":"IF(D32<>\"\",IF(OR(B32<>\"\",INDIRECT(\"D33\")=0),D32,0),\"\")","v":5.8715000000000002},648.20170000000019,null,{"$f":"IF(D32<>\"\",IF(AND(B32<>\"\",B31<>\"\"),$I$4+H31,VLOOKUP(INDEX($B$7:B31,MATCH(9.99999999999999E+307,$B$7:B31)),$B$7:H31,7,FALSE)+$I$4),\"\")","v":-7.2335025392850322E-4},648.20097664974628]
["TP29",2.6551,{"$f":"IF(D33<>\"\",IF(OR(B33<>\"\",INDIRECT(\"D34\")=0),IF(B32<>\"\",F32+B32,VLOOKUP(INDEX($B$7:B32,MATCH(9.99999999999999E+307,$B$7:B32)),$B$7:F32,5,FALSE)+INDEX($B$7:B32,MATCH(9.99999999999999E+307,$B$7:B32))),(VLOOKUP(INDEX($B$7:B32,MATCH(9.99999999999999E+307,$B$7:B32)),$B$7:F32,5,FALSE))+(INDEX($B$7:B32,MATCH(9.99999999999999E+307,$B$7:B32)))),\"\")","v":652.8135000000002},4.7164000000000001,{"$f":"IF(D33<>\"\",IF(OR(B33<>\"\",INDIRECT(\"D34\")=0),D33,0),\"\")","v":4.7164000000000001},648.09710000000018,null,{"$f":"IF(D33<>\"\",IF(AND(B33<>\"\",B32<>\"\"),$I$4+H32,VLOOKUP(INDEX($B$7:B32,MATCH(9.99999999999999E+307,$B$7:B32)),$B$7:H32,7,FALSE)+$I$4),\"\")","v":-7.5228426408564331E-4},648.0963477157361]
["TP30",2.7503000000000002,{"$f":"IF(D34<>\"\",IF(OR(B34<>\"\",INDIRECT(\"D35\")=0),IF(B33<>\"\",F33+B33,VLOOKUP(INDEX($B$7:B33,MATCH(9.99999999999999E+307,$B$7:B33)),$B$7:F33,5,FALSE)+INDEX($B$7:B33,MATCH(9.99999999999999E+307,$B$7:B33))),(VLOOKUP(INDEX($B$7:B33,MATCH(9.99999999999999E+307,$B$7:B33)),$B$7:F33,5,FALSE))+(INDEX($B$7:B33,MATCH(9.99999999999999E+307,$B$7:B33)))),\"\")","v":650.75220000000013},6.4295,{"$f":"IF(D34<>\"\",IF(OR(B34<>\"\",INDIRECT(\"D35\")=0),D34,0),\"\")","v":6.4295},644.32270000000017,null,{"$f":"IF(D34<>\"\",IF(AND(B34<>\"\",B33<>\"\"),$I$4+H33,VLOOKUP(INDEX($B$7:B33,MATCH(9.99999999999999E+307,$B$7:B33)),$B$7:H33,7,FALSE)+$I$4),\"\")","v":-7.812182742427834E-4},644.32191878172591]
["TP31",2.5192000000000001,{"$f":"IF(D35<>\"\",IF(OR(B35<>\"\",INDIRECT(\"D36\")=0),IF(B34<>\"\",F34+B34,VLOOKUP(INDEX($B$7:B34,MATCH(9.99999999999999E+307,$B$7:B34)),$B$7:F34,5,FALSE)+INDEX($B$7:B34,MATCH(9.99999999999999E+307,$B$7:B34))),(VLOOKUP(INDEX($B$7:B34,MATCH(9.99999999999999E+307,$B$7:B34)),$B$7:F34,5,FALSE))+(INDEX($B$7:B34,MATCH(9.99999999999999E+307,$B$7:B34)))),\"\")","v":647.07300000000021},6.4805000000000001,{"$f":"IF(D35<>\"\",IF(OR(B35<>\"\",INDIRECT(\"D36\")=0),D35,0),\"\")","v":6.4805000000000001},640.5925000000002,null,{"$f":"IF(D35<>\"\",IF(AND(B35<>\"\",B34<>\"\"),$I$4+H34,VLOOKUP(INDEX($B$7:B34,MATCH(9.99999999999999E+307,$B$7:B34)),$B$7:H34,7,FALSE)+$I$4),\"\")","v":-8.101522843999235E-4},640.59168984771577]
["TP32",7.3620000000000001,{"$f":"IF(D36<>\"\",IF(OR(B36<>\"\",INDIRECT(\"D37\")=0),IF(B35<>\"\",F35+B35,VLOOKUP(INDEX($B$7:B35,MATCH(9.99999999999999E+307,$B$7:B35)),$B$7:F35,5,FALSE)+INDEX($B$7:B35,MATCH(9.99999999999999E+307,$B$7:B35))),(VLOOKUP(INDEX($B$7:B35,MATCH(9.99999999999999E+307,$B$7:B35)),$B$7:F35,5,FALSE))+(INDEX($B$7:B35,MATCH(9.99999999999999E+307,$B$7:B35)))),\"\")","v":643.11170000000016},6.8085000000000004,{"$f":"IF(D36<>\"\",IF(OR(B36<>\"\",INDIRECT(\"D37\")=0),D36,0),\"\")","v":6.8085000000000004},636.30320000000017,null,{"$f":"IF(D36<>\"\",IF(AND(B36<>\"\",B35<>\"\"),$I$4+H35,VLOOKUP(INDEX($B$7:B35,MATCH(9.99999999999999E+307,$B$7:B35)),$B$7:H35,7,FALSE)+$I$4),\"\")","v":-8.3908629455706359E-4},636.30236091370557]
["TP33",8.7205999999999992,{"$f":"IF(D37<>\"\",IF(OR(B37<>\"\",INDIRECT(\"D38\")=0),IF(B36<>\"\",F36+B36,VLOOKUP(INDEX($B$7:B36,MATCH(9.99999999999999E+307,$B$7:B36)),$B$7:F36,5,FALSE)+INDEX($B$7:B36,MATCH(9.99999999999999E+307,$B$7:B36))),(VLOOKUP(INDEX($B$7:B36,MATCH(9.99999999999999E+307,$B$7:B36)),$B$7:F36,5,FALSE))+(INDEX($B$7:B36,MATCH(9.99999999999999E+307,$B$7:B36)))),\"\")","v":643.66520000000014},4.1672000000000002,{"$f":"IF(D37<>\"\",IF(OR(B37<>\"\",INDIRECT(\"D38\")=0),D37,0),\"\")","v":4.1672000000000002},639.49800000000016,null,{"$f":"IF(D37<>\"\",IF(AND(B37<>\"\",B36<>\"\"),$I$4+H36,VLOOKUP(INDEX($B$7:B36,MATCH(9.99999999999999E+307,$B$7:B36)),$B$7:H36,7,FALSE)+$I$4),\"\")","v":-8.6802030471420369E-4},639.4971319796955]
["TP34",7.0838999999999999,{"$f":"IF(D38<>\"\",IF(OR(B38<>\"\",INDIRECT(\"D39\")=0),IF(B37<>\"\",F37+B37,VLOOKUP(INDEX($B$7:B37,MATCH(9.99999999999999E+307,$B$7:B37)),$B$7:F37,5,FALSE)+INDEX($B$7:B37,MATCH(9.99999999999999E+307,$B$7:B37))),(VLOOKUP(INDEX($B$7:B37,MATCH(9.99999999999999E+307,$B$7:B37)),$B$7:F37,5,FALSE))+(INDEX($B$7:B37,MATCH(9.99999999999999E+307,$B$7:B37)))),\"\")","v":648.21860000000015},0.55549999999999999,{"$f":"IF(D38<>\"\",IF(OR(B38<>\"\",INDIRECT(\"D39\")=0),D38,0),\"\")","v":0.55549999999999999},647.6631000000001,null,{"$f":"IF(D38<>\"\",IF(AND(B38<>\"\",B37<>\"\"),$I$4+H37,VLOOKUP(INDEX($B$7:B37,MATCH(9.99999999999999E+307,$B$7:B37)),$B$7:H37,7,FALSE)+$I$4),\"\")","v":-8.9695431487134378E-4},647.66220304568526]
["SV8",8.6767000000000003,{"$f":"IF(D39<>\"\",IF(OR(B39<>\"\",INDIRECT(\"D40\")=0),IF(B38<>\"\",F38+B38,VLOOKUP(INDEX($B$7:B38,MATCH(9.99999999999999E+307,$B$7:B38)),$B$7:F38,5,FALSE)+INDEX($B$7:B38,MATCH(9.99999999999999E+307,$B$7:B38))),(VLOOKUP(INDEX($B$7:B38,MATCH(9.99999999999999E+307,$B$7:B38)),$B$7:F38,5,FALSE))+(INDEX($B$7:B38,MATCH(9.99999999999999E+307,$B$7:B38)))),\"\")","v":654.74700000000007},2.7433999999999998,{"$f":"IF(D39<>\"\",IF(OR(B39<>\"\",INDIRECT(\"D40\")=0),D39,0),\"\")","v":2.7433999999999998},652.00360000000012,null,{"$f":"IF(D39<>\"\",IF(AND(B39<>\"\",B38<>\"\"),$I$4+H38,VLOOKUP(INDEX($B$7:B38,MATCH(9.99999999999999E+307,$B$7:B38)),$B$7:H38,7,FALSE)+$I$4),\"\")","v":-9.2588832502848387E-4},652.00267411167511]
["TP35",4.3147000000000002,{"$f":"IF(D40<>\"\",IF(OR(B40<>\"\",INDIRECT(\"D41\")=0),IF(B39<>\"\",F39+B39,VLOOKUP(INDEX($B$7:B39,MATCH(9.99999999999999E+307,$B$7:B39)),$B$7:F39,5,FALSE)+INDEX($B$7:B39,MATCH(9.99999999999999E+307,$B$7:B39))),(VLOOKUP(INDEX($B$7:B39,MATCH(9.99999999999999E+307,$B$7:B39)),$B$7:F39,5,FALSE))+(INDEX($B$7:B39,MATCH(9.99999999999999E+307,$B$7:B39)))),\"\")","v":660.6803000000001},2.0865,{"$f":"IF(D40<>\"\",IF(OR(B40<>\"\",INDIRECT(\"D41\")=0),D40,0),\"\")","v":2.0865},658.5938000000001,null,{"$f":"IF(D40<>\"\",IF(AND(B40<>\"\",B39<>\"\"),$I$4+H39,VLOOKUP(INDEX($B$7:B39,MATCH(9.99999999999999E+307,$B$7:B39)),$B$7:H39,7,FALSE)+$I$4),\"\")","v":-9.5482233518562397E-4},658.59284517766491]
["SV9",2.9899,{"$f":"IF(D41<>\"\",IF(OR(B41<>\"\",INDIRECT(\"D42\")=0),IF(B40<>\"\",F40+B40,VLOOKUP(INDEX($B$7:B40,MATCH(9.99999999999999E+307,$B$7:B40)),$B$7:F40,5,FALSE)+INDEX($B$7:B40,MATCH(9.99999999999999E+307,$B$7:B40))),(VLOOKUP(INDEX($B$7:B40,MATCH(9.99999999999999E+307,$B$7:B40)),$B$7:F40,5,FALSE))+(INDEX($B$7:B40,MATCH(9.99999999999999E+307,$B$7:B40)))),\"\")","v":662.90850000000012},5.4322999999999997,{"$f":"IF(D41<>\"\",IF(OR(B41<>\"\",INDIRECT(\"D42\")=0),D41,0),\"\")","v":5.4322999999999997},657.47620000000006,null,{"$f":"IF(D41<>\"\",IF(AND(B41<>\"\",B40<>\"\"),$I$4+H40,VLOOKUP(INDEX($B$7:B40,MATCH(9.99999999999999E+307,$B$7:B40)),$B$7:H40,7,FALSE)+$I$4),\"\")","v":-9.8375634534276406E-4},657.4752162436547]
["TP36",1.6306,{"$f":"IF(D42<>\"\",IF(OR(B42<>\"\",INDIRECT(\"D43\")=0),IF(B41<>\"\",F41+B41,VLOOKUP(INDEX($B$7:B41,MATCH(9.99999999999999E+307,$B$7:B41)),$B$7:F41,5,FALSE)+INDEX($B$7:B41,MATCH(9.99999999999999E+307,$B$7:B41))),(VLOOKUP(INDEX($B$7:B41,MATCH(9.99999999999999E+307,$B$7:B41)),$B$7:F41,5,FALSE))+(INDEX($B$7:B41,MATCH(9.99999999999999E+307,$B$7:B41)))),\"\")","v":660.4661000000001},7.7732000000000001,{"$f":"IF(D42<>\"\",IF(OR(B42<>\"\",INDIRECT(\"D43\")=0),D42,0),\"\")","v":7.7732000000000001},652.69290000000012,null,{"$f":"IF(D42<>\"\",IF(AND(B42<>\"\",B41<>\"\"),$I$4+H41,VLOOKUP(INDEX($B$7:B41,MATCH(9.99999999999999E+307,$B$7:B41)),$B$7:H41,7,FALSE)+$I$4),\"\")","v":-1.0126903554999042E-3},652.69188730964459]
["TP37",2.6757,{"$f":"IF(D43<>\"\",IF(OR(B43<>\"\",INDIRECT(\"D44\")=0),IF(B42<>\"\",F42+B42,VLOOKUP(INDEX($B$7:B42,MATCH(9.99999999999999E+307,$B$7:B42)),$B$7:F42,5,FALSE)+INDEX($B$7:B42,MATCH(9.99999999999999E+307,$B$7:B42))),(VLOOKUP(INDEX($B$7:B42,MATCH(9.99999999999999E+307,$B$7:B42)),$B$7:F42,5,FALSE))+(INDEX($B$7:B42,MATCH(9.99999999999999E+307,$B$7:B42)))),\"\")","v":654.32350000000008},7.7382,{"$f":"IF(D43<>\"\",IF(OR(B43<>\"\",INDIRECT(\"D44\")=0),D43,0),\"\")","v":7.7382},646.58530000000007,null,{"$f":"IF(D43<>\"\",IF(AND(B43<>\"\",B42<>\"\"),$I$4+H42,VLOOKUP(INDEX($B$7:B42,MATCH(9.99999999999999E+307,$B$7:B42)),$B$7:H42,7,FALSE)+$I$4),\"\")","v":-1.0416243656570442E-3},646.58425837563436]
["TP38",3.5297000000000001,{"$f":"IF(D44<>\"\",IF(OR(B44<>\"\",INDIRECT(\"D45\")=0),IF(B43<>\"\",F43+B43,VLOOKUP(INDEX($B$7:B43,MATCH(9.99999999999999E+307,$B$7:B43)),$B$7:F43,5,FALSE)+INDEX($B$7:B43,MATCH(9.99999999999999E+307,$B$7:B43))),(VLOOKUP(INDEX($B$7:B43,MATCH(9.99999999999999E+307,$B$7:B43)),$B$7:F43,5,FALSE))+(INDEX($B$7:B43,MATCH(9.99999999999999E+307,$B$7:B43)))),\"\")","v":649.26100000000008},6.1283000000000003,{"$f":"IF(D44<>\"\",IF(OR(B44<>\"\",INDIRECT(\"D45\")=0),D44,0),\"\")","v":6.1283000000000003},643.13270000000011,null,{"$f":"IF(D44<>\"\",IF(AND(B44<>\"\",B43<>\"\"),$I$4+H43,VLOOKUP(INDEX($B$7:B43,MATCH(9.99999999999999E+307,$B$7:B43)),$B$7:H43,7,FALSE)+$I$4),\"\")","v":-1.0705583758141843E-3},643.13162944162434]
["TP39",3.0924,{"$f":"IF(D45<>\"\",IF(OR(B45<>\"\",INDIRECT(\"D46\")=0),IF(B44<>\"\",F44+B44,VLOOKUP(INDEX($B$7:B44,MATCH(9.99999999999999E+307,$B$7:B44)),$B$7:F44,5,FALSE)+INDEX($B$7:B44,MATCH(9.99999999999999E+307,$B$7:B44))),(VLOOKUP(INDEX($B$7:B44,MATCH(9.99999999999999E+307,$B$7:B44)),$B$7:F44,5,FALSE))+(INDEX($B$7:B44,MATCH(9.99999999999999E+307,$B$7:B44)))),\"\")","v":646.66240000000016},6.2367999999999997,{"$f":"IF(D45<>\"\",IF(OR(B45<>\"\",INDIRECT(\"D46\")=0),D45,0),\"\")","v":6.2367999999999997},640.42560000000014,null,{"$f":"IF(D45<>\"\",IF(AND(B45<>\"\",B44<>\"\"),$I$4+H44,VLOOKUP(INDEX($B$7:B44,MATCH(9.99999999999999E+307,$B$7:B44)),$B$7:H44,7,FALSE)+$I$4),\"\")","v":-1.0994923859713244E-3},640.4245005076142]
["TP40",2.9870000000000001,{"$f":"IF(D46<>\"\",IF(OR(B46<>\"\",INDIRECT(\"D47\")=0),IF(B45<>\"\",F45+B45,VLOOKUP(INDEX($B$7:B45,MATCH(9.99999999999999E+307,$B$7:B45)),$B$7:F45,5,FALSE)+INDEX($B$7:B45,MATCH(9.99999999999999E+307,$B$7:B45))),(VLOOKUP(INDEX($B$7:B45,MATCH(9.99999999999999E+307,$B$7:B45)),$B$7:F45,5,FALSE))+(INDEX($B$7:B45,MATCH(9.99999999999999E+307,$B$7:B45)))),\"\")","v":643.51800000000014},6.2264999999999997,{"$f":"IF(D46<>\"\",IF(OR(B46<>\"\",INDIRECT(\"D47\")=0),D46,0),\"\")","v":6.2264999999999997},637.29150000000016,null,{"$f":"IF(D46<>\"\",IF(AND(B46<>\"\",B45<>\"\"),$I$4+H45,VLOOKUP(INDEX($B$7:B45,MATCH(9.99999999999999E+307,$B$7:B45)),$B$7:H45,7,FALSE)+$I$4),\"\")","v":-1.1284263961284645E-3},637.29037157360403]
["TP41",3.7605,{"$f":"IF(D47<>\"\",IF(OR(B47<>\"\",INDIRECT(\"D48\")=0),IF(B46<>\"\",F46+B46,VLOOKUP(INDEX($B$7:B46,MATCH(9.99999999999999E+307,$B$7:B46)),$B$7:F46,5,FALSE)+INDEX($B$7:B46,MATCH(9.99999999999999E+307,$B$7:B46))),(VLOOKUP(INDEX($B$7:B46,MATCH(9.99999999999999E+307,$B$7:B46)),$B$7:F46,5,FALSE))+(INDEX($B$7:B46,MATCH(9.99999999999999E+307,$B$7:B46)))),\"\")","v":640.27850000000012},5.2449000000000003,{"$f":"IF(D47<>\"\",IF(OR(B47<>\"\",INDIRECT(\"D48\")=0),D47,0),\"\")","v":5.2449000000000003},635.03360000000009,null,{"$f":"IF(D47<>\"\",IF(AND(B47<>\"\",B46<>\"\"),$I$4+H46,VLOOKUP(INDEX($B$7:B46,MATCH(9.99999999999999E+307,$B$7:B46)),$B$7:H46,7,FALSE)+$I$4),\"\")","v":-1.1573604062856046E-3},635.0324426395938]
["SV10",6.2549999999999999,{"$f":"IF(D48<>\"\",IF(OR(B48<>\"\",INDIRECT(\"D49\")=0),IF(B47<>\"\",F47+B47,VLOOKUP(INDEX($B$7:B47,MATCH(9.99999999999999E+307,$B$7:B47)),$B$7:F47,5,FALSE)+INDEX($B$7:B47,MATCH(9.99999999999999E+307,$B$7:B47))),(VLOOKUP(INDEX($B$7:B47,MATCH(9.99999999999999E+307,$B$7:B47)),$B$7:F47,5,FALSE))+(INDEX($B$7:B47,MATCH(9.99999999999999E+307,$B$7:B47)))),\"\")","v":638.79410000000007},5.5313999999999997,{"$f":"IF(D48<>\"\",IF(OR(B48<>\"\",INDIRECT(\"D49\")=0),D48,0),\"\")","v":5.5313999999999997},633.26270000000011,null,{"$f":"IF(D48<>\"\",IF(AND(B48<>\"\",B47<>\"\"),$I$4+H47,VLOOKUP(INDEX($B$7:B47,MATCH(9.99999999999999E+307,$B$7:B47)),$B$7:H47,7,FALSE)+$I$4),\"\")","v":-1.1862944164427447E-3},633.26151370558364]
["TP42",5.1543000000000001,{"$f":"IF(D49<>\"\",IF(OR(B49<>\"\",INDIRECT(\"D50\")=0),IF(B48<>\"\",F48+B48,VLOOKUP(INDEX($B$7:B48,MATCH(9.99999999999999E+307,$B$7:B48)),$B$7:F48,5,FALSE)+INDEX($B$7:B48,MATCH(9.99999999999999E+307,$B$7:B48))),(VLOOKUP(INDEX($B$7:B48,MATCH(9.99999999999999E+307,$B$7:B48)),$B$7:F48,5,FALSE))+(INDEX($B$7:B48,MATCH(9.99999999999999E+307,$B$7:B48)))),\"\")","v":639.5177000000001},3.7086000000000001,{"$f":"IF(D49<>\"\",IF(OR(B49<>\"\",INDIRECT(\"D50\")=0),D49,0),\"\")","v":3.7086000000000001},635.80910000000006,null,{"$f":"IF(D49<>\"\",IF(AND(B49<>\"\",B48<>\"\"),$I$4+H48,VLOOKUP(INDEX($B$7:B48,MATCH(9.99999999999999E+307,$B$7:B48)),$B$7:H48,7,FALSE)+$I$4),\"\")","v":-1.2152284265998848E-3},635.80788477157341]
["SV11",6.6544999999999996,{"$f":"IF(D50<>\"\",IF(OR(B50<>\"\",INDIRECT(\"D51\")=0),IF(B49<>\"\",F49+B49,VLOOKUP(INDEX($B$7:B49,MATCH(9.99999999999999E+307,$B$7:B49)),$B$7:F49,5,FALSE)+INDEX($B$7:B49,MATCH(9.99999999999999E+307,$B$7:B49))),(VLOOKUP(INDEX($B$7:B49,MATCH(9.99999999999999E+307,$B$7:B49)),$B$7:F49,5,FALSE))+(INDEX($B$7:B49,MATCH(9.99999999999999E+307,$B$7:B49)))),\"\")","v":640.96340000000009},4.4557000000000002,{"$f":"IF(D50<>\"\",IF(OR(B50<>\"\",INDIRECT(\"D51\")=0),D50,0),\"\")","v":4.4557000000000002},636.50770000000011,null,{"$f":"IF(D50<>\"\",IF(AND(B50<>\"\",B49<>\"\"),$I$4+H49,VLOOKUP(INDEX($B$7:B49,MATCH(9.99999999999999E+307,$B$7:B49)),$B$7:H49,7,FALSE)+$I$4),\"\")","v":-1.2441624367570249E-3},636.50645583756341]
["TP43",3.8376000000000001,{"$f":"IF(D51<>\"\",IF(OR(B51<>\"\",INDIRECT(\"D52\")=0),IF(B50<>\"\",F50+B50,VLOOKUP(INDEX($B$7:B50,MATCH(9.99999999999999E+307,$B$7:B50)),$B$7:F50,5,FALSE)+INDEX($B$7:B50,MATCH(9.99999999999999E+307,$B$7:B50))),(VLOOKUP(INDEX($B$7:B50,MATCH(9.99999999999999E+307,$B$7:B50)),$B$7:F50,5,FALSE))+(INDEX($B$7:B50,MATCH(9.99999999999999E+307,$B$7:B50)))),\"\")","v":643.1622000000001},4.4352999999999998,{"$f":"IF(D51<>\"\",IF(OR(B51<>\"\",INDIRECT(\"D52\")=0),D51,0),\"\")","v":4.4352999999999998},638.72690000000011,null,{"$f":"IF(D51<>\"\",IF(AND(B51<>\"\",B50<>\"\"),$I$4+H50,VLOOKUP(INDEX($B$7:B50,MATCH(9.99999999999999E+307,$B$7:B50)),$B$7:H50,7,FALSE)+$I$4),\"\")","v":-1.273096446914165E-3},638.72562690355323]
["TP44",4.7076000000000002,{"$f":"IF(D52<>\"\",IF(OR(B52<>\"\",INDIRECT(\"D53\")=0),IF(B51<>\"\",F51+B51,VLOOKUP(INDEX($B$7:B51,MATCH(9.99999999999999E+307,$B$7:B51)),$B$7:F51,5,FALSE)+INDEX($B$7:B51,MATCH(9.99999999999999E+307,$B$7:B51))),(VLOOKUP(INDEX($B$7:B51,MATCH(9.99999999999999E+307,$B$7:B51)),$B$7:F51,5,FALSE))+(INDEX($B$7:B51,MATCH(9.99999999999999E+307,$B$7:B51)))),\"\")","v":642.56450000000007},5.7628000000000004,{"$f":"IF(D52<>\"\",IF(OR(B52<>\"\",INDIRECT(\"D53\")=0),D52,0),\"\")","v":5.7628000000000004},636.8017000000001,null,{"$f":"IF(D52<>\"\",IF(AND(B52<>\"\",B51<>\"\"),$I$4+H51,VLOOKUP(INDEX($B$7:B51,MATCH(9.99999999999999E+307,$B$7:B51)),$B$7:H51,7,FALSE)+$I$4),\"\")","v":-1.3020304570713051E-3},636.80039796954304]
["TP45",4.9229000000000003,{"$f":"IF(D53<>\"\",IF(OR(B53<>\"\",INDIRECT(\"D54\")=0),IF(B52<>\"\",F52+B52,VLOOKUP(INDEX($B$7:B52,MATCH(9.99999999999999E+307,$B$7:B52)),$B$7:F52,5,FALSE)+INDEX($B$7:B52,MATCH(9.99999999999999E+307,$B$7:B52))),(VLOOKUP(INDEX($B$7:B52,MATCH(9.99999999999999E+307,$B$7:B52)),$B$7:F52,5,FALSE))+(INDEX($B$7:B52,MATCH(9.99999999999999E+307,$B$7:B52)))),\"\")","v":641.50930000000005},4.3091999999999997,{"$f":"IF(D53<>\"\",IF(OR(B53<>\"\",INDIRECT(\"D54\")=0),D53,0),\"\")","v":4.3091999999999997},637.20010000000002,null,{"$f":"IF(D53<>\"\",IF(AND(B53<>\"\",B52<>\"\"),$I$4+H52,VLOOKUP(INDEX($B$7:B52,MATCH(9.99999999999999E+307,$B$7:B52)),$B$7:H52,7,FALSE)+$I$4),\"\")","v":-1.3309644672284452E-3},637.19876903553279]
["TP46",1.5757000000000001,{"$f":"IF(D54<>\"\",IF(OR(B54<>\"\",INDIRECT(\"D55\")=0),IF(B53<>\"\",F53+B53,VLOOKUP(INDEX($B$7:B53,MATCH(9.99999999999999E+307,$B$7:B53)),$B$7:F53,5,FALSE)+INDEX($B$7:B53,MATCH(9.99999999999999E+307,$B$7:B53))),(VLOOKUP(INDEX($B$7:B53,MATCH(9.99999999999999E+307,$B$7:B53)),$B$7:F53,5,FALSE))+(INDEX($B$7:B53,MATCH(9.99999999999999E+307,$B$7:B53)))),\"\")","v":642.12300000000005},5.83,{"$f":"IF(D54<>\"\",IF(OR(B54<>\"\",INDIRECT(\"D55\")=0),D54,0),\"\")","v":5.83},636.29300000000001,null,{"$f":"IF(D54<>\"\",IF(AND(B54<>\"\",B53<>\"\"),$I$4+H53,VLOOKUP(INDEX($B$7:B53,MATCH(9.99999999999999E+307,$B$7:B53)),$B$7:H53,7,FALSE)+$I$4),\"\")","v":-1.3598984773855853E-3},636.2916401015226]
["TP47",2.7151999999999998,{"$f":"IF(D55<>\"\",IF(OR(B55<>\"\",INDIRECT(\"D56\")=0),IF(B54<>\"\",F54+B54,VLOOKUP(INDEX($B$7:B54,MATCH(9.99999999999999E+307,$B$7:B54)),$B$7:F54,5,FALSE)+INDEX($B$7:B54,MATCH(9.99999999999999E+307,$B$7:B54))),(VLOOKUP(INDEX($B$7:B54,MATCH(9.99999999999999E+307,$B$7:B54)),$B$7:F54,5,FALSE))+(INDEX($B$7:B54,MATCH(9.99999999999999E+307,$B$7:B54)))),\"\")","v":637.86869999999999},5.8358999999999996,{"$f":"IF(D55<>\"\",IF(OR(B55<>\"\",INDIRECT(\"D56\")=0),D55,0),\"\")","v":5.8358999999999996},632.03279999999995,null,{"$f":"IF(D55<>\"\",IF(AND(B55<>\"\",B54<>\"\"),$I$4+H54,VLOOKUP(INDEX($B$7:B54,MATCH(9.99999999999999E+307,$B$7:B54)),$B$7:H54,7,FALSE)+$I$4),\"\")","v":-1.3888324875427254E-3},632.03141116751237]
["SV102",4.1085000000000003,{"$f":"IF(D56<>\"\",IF(OR(B56<>\"\",INDIRECT(\"D57\")=0),IF(B55<>\"\",F55+B55,VLOOKUP(INDEX($B$7:B55,MATCH(9.99999999999999E+307,$B$7:B55)),$B$7:F55,5,FALSE)+INDEX($B$7:B55,MATCH(9.99999999999999E+307,$B$7:B55))),(VLOOKUP(INDEX($B$7:B55,MATCH(9.99999999999999E+307,$B$7:B55)),$B$7:F55,5,FALSE))+(INDEX($B$7:B55,MATCH(9.99999999999999E+307,$B$7:B55)))),\"\")","v":634.74799999999993},5.8617999999999997,{"$f":"IF(D56<>\"\",IF(OR(B56<>\"\",INDIRECT(\"D57\")=0),D56,0),\"\")","v":5.8617999999999997},628.88619999999992,null,{"$f":"IF(D56<>\"\",IF(AND(B56<>\"\",B55<>\"\"),$I$4+H55,VLOOKUP(INDEX($B$7:B55,MATCH(9.99999999999999E+307,$B$7:B55)),$B$7:H55,7,FALSE)+$I$4),\"\")","v":-1.4177664976998655E-3},628.88478223350216]
["TP48",4.0639000000000003,{"$f":"IF(D57<>\"\",IF(OR(B57<>\"\",INDIRECT(\"D58\")=0),IF(B56<>\"\",F56+B56,VLOOKUP(INDEX($B$7:B56,MATCH(9.99999999999999E+307,$B$7:B56)),$B$7:F56,5,FALSE)+INDEX($B$7:B56,MATCH(9.99999999999999E+307,$B$7:B56))),(VLOOKUP(INDEX($B$7:B56,MATCH(9.99999999999999E+307,$B$7:B56)),$B$7:F56,5,FALSE))+(INDEX($B$7:B56,MATCH(9.99999999999999E+307,$B$7:B56)))),\"\")","v":632.99469999999997},6.2743000000000002,{"$f":"IF(D57<>\"\",IF(OR(B57<>\"\",INDIRECT(\"D58\")=0),D57,0),\"\")","v":6.2743000000000002},626.72039999999993,null,{"$f":"IF(D57<>\"\",IF(AND(B57<>\"\",B56<>\"\"),$I$4+H56,VLOOKUP(INDEX($B$7:B56,MATCH(9.99999999999999E+307,$B$7:B56)),$B$7:H56,7,FALSE)+$I$4),\"\")","v":-1.4467005078570056E-3},626.71895329949211]
["SV12",6.0137999999999998,{"$f":"IF(D58<>\"\",IF(OR(B58<>\"\",INDIRECT(\"D59\")=0),IF(B57<>\"\",F57+B57,VLOOKUP(INDEX($B$7:B57,MATCH(9.99999999999999E+307,$B$7:B57)),$B$7:F57,5,FALSE)+INDEX($B$7:B57,MATCH(9.99999999999999E+307,$B$7:B57))),(VLOOKUP(INDEX($B$7:B57,MATCH(9.99999999999999E+307,$B$7:B57)),$B$7:F57,5,FALSE))+(INDEX($B$7:B57,MATCH(9.99999999999999E+307,$B$7:B57)))),\"\")","v":630.78429999999992},6.0042,{"$f":"IF(D58<>\"\",IF(OR(B58<>\"\",INDIRECT(\"D59\")=0),D58,0),\"\")","v":6.0042},624.78009999999995,null,{"$f":"IF(D58<>\"\",IF(AND(B58<>\"\",B57<>\"\"),$I$4+H57,VLOOKUP(INDEX($B$7:B57,MATCH(9.99999999999999E+307,$B$7:B57)),$B$7:H57,7,FALSE)+$I$4),\"\")","v":-1.4756345180141457E-3},624.77862436548196]
["TP49",5.1642000000000001,{"$f":"IF(D59<>\"\",IF(OR(B59<>\"\",INDIRECT(\"D60\")=0),IF(B58<>\"\",F58+B58,VLOOKUP(INDEX($B$7:B58,MATCH(9.99999999999999E+307,$B$7:B58)),$B$7:F58,5,FALSE)+INDEX($B$7:B58,MATCH(9.99999999999999E+307,$B$7:B58))),(VLOOKUP(INDEX($B$7:B58,MATCH(9.99999999999999E+307,$B$7:B58)),$B$7:F58,5,FALSE))+(INDEX($B$7:B58,MATCH(9.99999999999999E+307,$B$7:B58)))),\"\")","v":630.79389999999989},3.4325000000000001,{"$f":"IF(D59<>\"\",IF(OR(B59<>\"\",INDIRECT(\"D60\")=0),D59,0),\"\")","v":3.4325000000000001},627.36139999999989,null,{"$f":"IF(D59<>\"\",IF(AND(B59<>\"\",B58<>\"\"),$I$4+H58,VLOOKUP(INDEX($B$7:B58,MATCH(9.99999999999999E+307,$B$7:B58)),$B$7:H58,7,FALSE)+$I$4),\"\")","v":-1.5045685281712858E-3},627.35989543147173]
["TP50",5.5327999999999999,{"$f":"IF(D60<>\"\",IF(OR(B60<>\"\",INDIRECT(\"D61\")=0),IF(B59<>\"\",F59+B59,VLOOKUP(INDEX($B$7:B59,MATCH(9.99999999999999E+307,$B$7:B59)),$B$7:F59,5,FALSE)+INDEX($B$7:B59,MATCH(9.99999999999999E+307,$B$7:B59))),(VLOOKUP(INDEX($B$7:B59,MATCH(9.99999999999999E+307,$B$7:B59)),$B$7:F59,5,FALSE))+(INDEX($B$7:B59,MATCH(9.99999999999999E+307,$B$7:B59)))),\"\")","v":632.52559999999994},4.1814,{"$f":"IF(D60<>\"\",IF(OR(B60<>\"\",INDIRECT(\"D61\")=0),D60,0),\"\")","v":4.1814},628.34419999999989,null,{"$f":"IF(D60<>\"\",IF(AND(B60<>\"\",B59<>\"\"),$I$4+H59,VLOOKUP(INDEX($B$7:B59,MATCH(9.99999999999999E+307,$B$7:B59)),$B$7:H59,7,FALSE)+$I$4),\"\")","v":-1.5335025383284258E-3},628.34266649746155]
["TP51",4.1207000000000003,{"$f":"IF(D61<>\"\",IF(OR(B61<>\"\",INDIRECT(\"D62\")=0),IF(B60<>\"\",F60+B60,VLOOKUP(INDEX($B$7:B60,MATCH(9.99999999999999E+307,$B$7:B60)),$B$7:F60,5,FALSE)+INDEX($B$7:B60,MATCH(9.99999999999999E+307,$B$7:B60))),(VLOOKUP(INDEX($B$7:B60,MATCH(9.99999999999999E+307,$B$7:B60)),$B$7:F60,5,FALSE))+(INDEX($B$7:B60,MATCH(9.99999999999999E+307,$B$7:B60)))),\"\")","v":633.87699999999984},5.4916999999999998,{"$f":"IF(D61<>\"\",IF(OR(B61<>\"\",INDIRECT(\"D62\")=0),D61,0),\"\")","v":5.4916999999999998},628.3852999999998,null,{"$f":"IF(D61<>\"\",IF(AND(B61<>\"\",B60<>\"\"),$I$4+H60,VLOOKUP(INDEX($B$7:B60,MATCH(9.99999999999999E+307,$B$7:B60)),$B$7:H60,7,FALSE)+$I$4),\"\")","v":-1.5624365484855659E-3},628.38373756345129]
["TP52",3.5451999999999999,{"$f":"IF(D62<>\"\",IF(OR(B62<>\"\",INDIRECT(\"D63\")=0),IF(B61<>\"\",F61+B61,VLOOKUP(INDEX($B$7:B61,MATCH(9.99999999999999E+307,$B$7:B61)),$B$7:F61,5,FALSE)+INDEX($B$7:B61,MATCH(9.99999999999999E+307,$B$7:B61))),(VLOOKUP(INDEX($B$7:B61,MATCH(9.99999999999999E+307,$B$7:B61)),$B$7:F61,5,FALSE))+(INDEX($B$7:B61,MATCH(9.99999999999999E+307,$B$7:B61)))),\"\")","v":632.50599999999986},5.3795999999999999,{"$f":"IF(D62<>\"\",IF(OR(B62<>\"\",INDIRECT(\"D63\")=0),D62,0),\"\")","v":5.3795999999999999},627.12639999999988,null,{"$f":"IF(D62<>\"\",IF(AND(B62<>\"\",B61<>\"\"),$I$4+H61,VLOOKUP(INDEX($B$7:B61,MATCH(9.99999999999999E+307,$B$7:B61)),$B$7:H61,7,FALSE)+$I$4),\"\")","v":-1.591370558642706E-3},627.12480862944119]
["TP53",3.9249999999999998,{"$f":"IF(D63<>\"\",IF(OR(B63<>\"\",INDIRECT(\"D64\")=0),IF(B62<>\"\",F62+B62,VLOOKUP(INDEX($B$7:B62,MATCH(9.99999999999999E+307,$B$7:B62)),$B$7:F62,5,FALSE)+INDEX($B$7:B62,MATCH(9.99999999999999E+307,$B$7:B62))),(VLOOKUP(INDEX($B$7:B62,MATCH(9.99999999999999E+307,$B$7:B62)),$B$7:F62,5,FALSE))+(INDEX($B$7:B62,MATCH(9.99999999999999E+307,$B$7:B62)))),\"\")","v":630.6715999999999},5.3936000000000002,{"$f":"IF(D63<>\"\",IF(OR(B63<>\"\",INDIRECT(\"D64\")=0),D63,0),\"\")","v":5.3936000000000002},625.27799999999991,null,{"$f":"IF(D63<>\"\",IF(AND(B63<>\"\",B62<>\"\"),$I$4+H62,VLOOKUP(INDEX($B$7:B62,MATCH(9.99999999999999E+307,$B$7:B62)),$B$7:H62,7,FALSE)+$I$4),\"\")","v":-1.6203045687998461E-3},625.27637969543116]
["TP54",5.4774000000000003,{"$f":"IF(D64<>\"\",IF(OR(B64<>\"\",INDIRECT(\"D65\")=0),IF(B63<>\"\",F63+B63,VLOOKUP(INDEX($B$7:B63,MATCH(9.99999999999999E+307,$B$7:B63)),$B$7:F63,5,FALSE)+INDEX($B$7:B63,MATCH(9.99999999999999E+307,$B$7:B63))),(VLOOKUP(INDEX($B$7:B63,MATCH(9.99999999999999E+307,$B$7:B63)),$B$7:F63,5,FALSE))+(INDEX($B$7:B63,MATCH(9.99999999999999E+307,$B$7:B63)))),\"\")","v":629.20299999999986},4.9066000000000001,{"$f":"IF(D64<>\"\",IF(OR(B64<>\"\",INDIRECT(\"D65\")=0),D64,0),\"\")","v":4.9066000000000001},624.29639999999984,null,{"$f":"IF(D64<>\"\",IF(AND(B64<>\"\",B63<>\"\"),$I$4+H63,VLOOKUP(INDEX($B$7:B63,MATCH(9.99999999999999E+307,$B$7:B63)),$B$7:H63,7,FALSE)+$I$4),\"\")","v":-1.6492385789569862E-3},624.29475076142091]
["SV13",7.9306999999999999,{"$f":"IF(D65<>\"\",IF(OR(B65<>\"\",INDIRECT(\"D66\")=0),IF(B64<>\"\",F64+B64,VLOOKUP(INDEX($B$7:B64,MATCH(9.99999999999999E+307,$B$7:B64)),$B$7:F64,5,FALSE)+INDEX($B$7:B64,MATCH(9.99999999999999E+307,$B$7:B64))),(VLOOKUP(INDEX($B$7:B64,MATCH(9.99999999999999E+307,$B$7:B64)),$B$7:F64,5,FALSE))+(INDEX($B$7:B64,MATCH(9.99999999999999E+307,$B$7:B64)))),\"\")","v":629.77379999999982},5.8556999999999997,{"$f":"IF(D65<>\"\",IF(OR(B65<>\"\",INDIRECT(\"D66\")=0),D65,0),\"\")","v":5.8556999999999997},623.91809999999987,null,{"$f":"IF(D65<>\"\",IF(AND(B65<>\"\",B64<>\"\"),$I$4+H64,VLOOKUP(INDEX($B$7:B64,MATCH(9.99999999999999E+307,$B$7:B64)),$B$7:H64,7,FALSE)+$I$4),\"\")","v":-1.6781725891141263E-3},623.91642182741077]
["TP89",5.7946999999999997,{"$f":"IF(D66<>\"\",IF(OR(B66<>\"\",INDIRECT(\"D67\")=0),IF(B65<>\"\",F65+B65,VLOOKUP(INDEX($B$7:B65,MATCH(9.99999999999999E+307,$B$7:B65)),$B$7:F65,5,FALSE)+INDEX($B$7:B65,MATCH(9.99999999999999E+307,$B$7:B65))),(VLOOKUP(INDEX($B$7:B65,MATCH(9.99999999999999E+307,$B$7:B65)),$B$7:F65,5,FALSE))+(INDEX($B$7:B65,MATCH(9.99999999999999E+307,$B$7:B65)))),\"\")","v":631.84879999999987},0.6482,{"$f":"IF(D66<>\"\",IF(OR(B66<>\"\",INDIRECT(\"D67\")=0),D66,0),\"\")","v":0.6482},631.20059999999989,null,{"$f":"IF(D66<>\"\",IF(AND(B66<>\"\",B65<>\"\"),$I$4+H65,VLOOKUP(INDEX($B$7:B65,MATCH(9.99999999999999E+307,$B$7:B65)),$B$7:H65,7,FALSE)+$I$4),\"\")","v":-1.7071065992712664E-3},631.19889289340063]
["SV14",8.0760000000000005,{"$f":"IF(D67<>\"\",IF(OR(B67<>\"\",INDIRECT(\"D68\")=0),IF(B66<>\"\",F66+B66,VLOOKUP(INDEX($B$7:B66,MATCH(9.99999999999999E+307,$B$7:B66)),$B$7:F66,5,FALSE)+INDEX($B$7:B66,MATCH(9.99999999999999E+307,$B$7:B66))),(VLOOKUP(INDEX($B$7:B66,MATCH(9.99999999999999E+307,$B$7:B66)),$B$7:F66,5,FALSE))+(INDEX($B$7:B66,MATCH(9.99999999999999E+307,$B$7:B66)))),\"\")","v":636.99529999999993},4.0991,{"$f":"IF(D67<>\"\",IF(OR(B67<>\"\",INDIRECT(\"D68\")=0),D67,0),\"\")","v":4.0991},632.89619999999991,null,{"$f":"IF(D67<>\"\",IF(AND(B67<>\"\",B66<>\"\"),$I$4+H66,VLOOKUP(INDEX($B$7:B66,MATCH(9.99999999999999E+307,$B$7:B66)),$B$7:H66,7,FALSE)+$I$4),\"\")","v":-1.7360406094284065E-3},632.89446395939046]
["TP90",3.7793999999999999,{"$f":"IF(D68<>\"\",IF(OR(B68<>\"\",INDIRECT(\"D69\")=0),IF(B67<>\"\",F67+B67,VLOOKUP(INDEX($B$7:B67,MATCH(9.99999999999999E+307,$B$7:B67)),$B$7:F67,5,FALSE)+INDEX($B$7:B67,MATCH(9.99999999999999E+307,$B$7:B67))),(VLOOKUP(INDEX($B$7:B67,MATCH(9.99999999999999E+307,$B$7:B67)),$B$7:F67,5,FALSE))+(INDEX($B$7:B67,MATCH(9.99999999999999E+307,$B$7:B67)))),\"\")","v":640.97219999999993},3.9096000000000002,{"$f":"IF(D68<>\"\",IF(OR(B68<>\"\",INDIRECT(\"D69\")=0),D68,0),\"\")","v":3.9096000000000002},637.06259999999997,null,{"$f":"IF(D68<>\"\",IF(AND(B68<>\"\",B67<>\"\"),$I$4+H67,VLOOKUP(INDEX($B$7:B67,MATCH(9.99999999999999E+307,$B$7:B67)),$B$7:H67,7,FALSE)+$I$4),\"\")","v":-1.7649746195855466E-3},637.06083502538036]
["TP91",2.5280999999999998,{"$f":"IF(D69<>\"\",IF(OR(B69<>\"\",INDIRECT(\"D70\")=0),IF(B68<>\"\",F68+B68,VLOOKUP(INDEX($B$7:B68,MATCH(9.99999999999999E+307,$B$7:B68)),$B$7:F68,5,FALSE)+INDEX($B$7:B68,MATCH(9.99999999999999E+307,$B$7:B68))),(VLOOKUP(INDEX($B$7:B68,MATCH(9.99999999999999E+307,$B$7:B68)),$B$7:F68,5,FALSE))+(INDEX($B$7:B68,MATCH(9.99999999999999E+307,$B$7:B68)))),\"\")","v":640.84199999999998},5.9604999999999997,{"$f":"IF(D69<>\"\",IF(OR(B69<>\"\",INDIRECT(\"D70\")=0),D69,0),\"\")","v":5.9604999999999997},634.88149999999996,null,{"$f":"IF(D69<>\"\",IF(AND(B69<>\"\",B68<>\"\"),$I$4+H68,VLOOKUP(INDEX($B$7:B68,MATCH(9.99999999999999E+307,$B$7:B68)),$B$7:H68,7,FALSE)+$I$4),\"\")","v":-1.7939086297426867E-3},634.87970609137017]
["TP92",2.7921,{"$f":"IF(D70<>\"\",IF(OR(B70<>\"\",INDIRECT(\"D71\")=0),IF(B69<>\"\",F69+B69,VLOOKUP(INDEX($B$7:B69,MATCH(9.99999999999999E+307,$B$7:B69)),$B$7:F69,5,FALSE)+INDEX($B$7:B69,MATCH(9.99999999999999E+307,$B$7:B69))),(VLOOKUP(INDEX($B$7:B69,MATCH(9.99999999999999E+307,$B$7:B69)),$B$7:F69,5,FALSE))+(INDEX($B$7:B69,MATCH(9.99999999999999E+307,$B$7:B69)))),\"\")","v":637.40959999999995},5.9958999999999998,{"$f":"IF(D70<>\"\",IF(OR(B70<>\"\",INDIRECT(\"D71\")=0),D70,0),\"\")","v":5.9958999999999998},631.41369999999995,null,{"$f":"IF(D70<>\"\",IF(AND(B70<>\"\",B69<>\"\"),$I$4+H69,VLOOKUP(INDEX($B$7:B69,MATCH(9.99999999999999E+307,$B$7:B69)),$B$7:H69,7,FALSE)+$I$4),\"\")","v":-1.8228426398998268E-3},631.4118771573601]
["TP93",6.13,{"$f":"IF(D71<>\"\",IF(OR(B71<>\"\",INDIRECT(\"D72\")=0),IF(B70<>\"\",F70+B70,VLOOKUP(INDEX($B$7:B70,MATCH(9.99999999999999E+307,$B$7:B70)),$B$7:F70,5,FALSE)+INDEX($B$7:B70,MATCH(9.99999999999999E+307,$B$7:B70))),(VLOOKUP(INDEX($B$7:B70,MATCH(9.99999999999999E+307,$B$7:B70)),$B$7:F70,5,FALSE))+(INDEX($B$7:B70,MATCH(9.99999999999999E+307,$B$7:B70)))),\"\")","v":634.20579999999995},5.9478,{"$f":"IF(D71<>\"\",IF(OR(B71<>\"\",INDIRECT(\"D72\")=0),D71,0),\"\")","v":5.9478},628.25799999999992,null,{"$f":"IF(D71<>\"\",IF(AND(B71<>\"\",B70<>\"\"),$I$4+H70,VLOOKUP(INDEX($B$7:B70,MATCH(9.99999999999999E+307,$B$7:B70)),$B$7:H70,7,FALSE)+$I$4),\"\")","v":-1.8517766500569669E-3},628.2561482233499]
["TP94",7.5675999999999997,{"$f":"IF(D72<>\"\",IF(OR(B72<>\"\",INDIRECT(\"D73\")=0),IF(B71<>\"\",F71+B71,VLOOKUP(INDEX($B$7:B71,MATCH(9.99999999999999E+307,$B$7:B71)),$B$7:F71,5,FALSE)+INDEX($B$7:B71,MATCH(9.99999999999999E+307,$B$7:B71))),(VLOOKUP(INDEX($B$7:B71,MATCH(9.99999999999999E+307,$B$7:B71)),$B$7:F71,5,FALSE))+(INDEX($B$7:B71,MATCH(9.99999999999999E+307,$B$7:B71)))),\"\")","v":634.38799999999992},2.9253,{"$f":"IF(D72<>\"\",IF(OR(B72<>\"\",INDIRECT(\"D73\")=0),D72,0),\"\")","v":2.9253},631.46269999999993,null,{"$f":"IF(D72<>\"\",IF(AND(B72<>\"\",B71<>\"\"),$I$4+H71,VLOOKUP(INDEX($B$7:B71,MATCH(9.99999999999999E+307,$B$7:B71)),$B$7:H71,7,FALSE)+$I$4),\"\")","v":-1.880710660214107E-3},631.46081928933972]
["TP95",4.8910999999999998,{"$f":"IF(D73<>\"\",IF(OR(B73<>\"\",INDIRECT(\"D74\")=0),IF(B72<>\"\",F72+B72,VLOOKUP(INDEX($B$7:B72,MATCH(9.99999999999999E+307,$B$7:B72)),$B$7:F72,5,FALSE)+INDEX($B$7:B72,MATCH(9.99999999999999E+307,$B$7:B72))),(VLOOKUP(INDEX($B$7:B72,MATCH(9.99999999999999E+307,$B$7:B72)),$B$7:F72,5,FALSE))+(INDEX($B$7:B72,MATCH(9.99999999999999E+307,$B$7:B72)))),\"\")","v":639.0302999999999},3.2357999999999998,{"$f":"IF(D73<>\"\",IF(OR(B73<>\"\",INDIRECT(\"D74\")=0),D73,0),\"\")","v":3.2357999999999998},{"$f":"IF(D73<>\"\",C73-D73,\"\")","v":635.79449999999986},null,{"$f":"IF(D73<>\"\",IF(AND(B73<>\"\",B72<>\"\"),$I$4+H72,VLOOKUP(INDEX($B$7:B72,MATCH(9.99999999999999E+307,$B$7:B72)),$B$7:H72,7,FALSE)+$I$4),\"\")","v":-1.9096446703712471E-3},{"$f":"IF(D73<>\"\",(F73+H73),\"\")","v":635.79259035532948}]
["SV15",7.6931000000000003,{"$f":"IF(D74<>\"\",IF(OR(B74<>\"\",INDIRECT(\"D75\")=0),IF(B73<>\"\",F73+B73,VLOOKUP(INDEX($B$7:B73,MATCH(9.99999999999999E+307,$B$7:B73)),$B$7:F73,5,FALSE)+INDEX($B$7:B73,MATCH(9.99999999999999E+307,$B$7:B73))),(VLOOKUP(INDEX($B$7:B73,MATCH(9.99999999999999E+307,$B$7:B73)),$B$7:F73,5,FALSE))+(INDEX($B$7:B73,MATCH(9.99999999999999E+307,$B$7:B73)))),\"\")","v":640.68559999999991},2.7845,{"$f":"IF(D74<>\"\",IF(OR(B74<>\"\",INDIRECT(\"D75\")=0),D74,0),\"\")","v":2.7845},637.90109999999993,null,{"$f":"IF(D74<>\"\",IF(AND(B74<>\"\",B73<>\"\"),$I$4+H73,VLOOKUP(INDEX($B$7:B73,MATCH(9.99999999999999E+307,$B$7:B73)),$B$7:H73,7,FALSE)+$I$4),\"\")","v":-1.9385786805283872E-3},637.89916142131938]
["TP96",5.3867000000000003,{"$f":"IF(D75<>\"\",IF(OR(B75<>\"\",INDIRECT(\"D76\")=0),IF(B74<>\"\",F74+B74,VLOOKUP(INDEX($B$7:B74,MATCH(9.99999999999999E+307,$B$7:B74)),$B$7:F74,5,FALSE)+INDEX($B$7:B74,MATCH(9.99999999999999E+307,$B$7:B74))),(VLOOKUP(INDEX($B$7:B74,MATCH(9.99999999999999E+307,$B$7:B74)),$B$7:F74,5,FALSE))+(INDEX($B$7:B74,MATCH(9.99999999999999E+307,$B$7:B74)))),\"\")","v":645.59419999999989},2.2002999999999999,{"$f":"IF(D75<>\"\",IF(OR(B75<>\"\",INDIRECT(\"D76\")=0),D75,0),\"\")","v":2.2002999999999999},643.39389999999992,null,{"$f":"IF(D75<>\"\",IF(AND(B75<>\"\",B74<>\"\"),$I$4+H74,VLOOKUP(INDEX($B$7:B74,MATCH(9.99999999999999E+307,$B$7:B74)),$B$7:H74,7,FALSE)+$I$4),\"\")","v":-1.9675126906855273E-3},643.39193248730919]
["SV16",6.7862999999999998,{"$f":"IF(D76<>\"\",IF(OR(B76<>\"\",INDIRECT(\"D77\")=0),IF(B75<>\"\",F75+B75,VLOOKUP(INDEX($B$7:B75,MATCH(9.99999999999999E+307,$B$7:B75)),$B$7:F75,5,FALSE)+INDEX($B$7:B75,MATCH(9.99999999999999E+307,$B$7:B75))),(VLOOKUP(INDEX($B$7:B75,MATCH(9.99999999999999E+307,$B$7:B75)),$B$7:F75,5,FALSE))+(INDEX($B$7:B75,MATCH(9.99999999999999E+307,$B$7:B75)))),\"\")","v":648.78059999999994},4.7484000000000002,{"$f":"IF(D76<>\"\",IF(OR(B76<>\"\",INDIRECT(\"D77\")=0),D76,0),\"\")","v":4.7484000000000002},644.03219999999999,null,{"$f":"IF(D76<>\"\",IF(AND(B76<>\"\",B75<>\"\"),$I$4+H75,VLOOKUP(INDEX($B$7:B75,MATCH(9.99999999999999E+307,$B$7:B75)),$B$7:H75,7,FALSE)+$I$4),\"\")","v":-1.9964467008426676E-3},644.0302035532992]
["TP97",3.6444000000000001,{"$f":"IF(D77<>\"\",IF(OR(B77<>\"\",INDIRECT(\"D78\")=0),IF(B76<>\"\",F76+B76,VLOOKUP(INDEX($B$7:B76,MATCH(9.99999999999999E+307,$B$7:B76)),$B$7:F76,5,FALSE)+INDEX($B$7:B76,MATCH(9.99999999999999E+307,$B$7:B76))),(VLOOKUP(INDEX($B$7:B76,MATCH(9.99999999999999E+307,$B$7:B76)),$B$7:F76,5,FALSE))+(INDEX($B$7:B76,MATCH(9.99999999999999E+307,$B$7:B76)))),\"\")","v":650.81849999999997},4.5693999999999999,{"$f":"IF(D77<>\"\",IF(OR(B77<>\"\",INDIRECT(\"D78\")=0),D77,0),\"\")","v":4.5693999999999999},646.2491,null,{"$f":"IF(D77<>\"\",IF(AND(B77<>\"\",B76<>\"\"),$I$4+H76,VLOOKUP(INDEX($B$7:B76,MATCH(9.99999999999999E+307,$B$7:B76)),$B$7:H76,7,FALSE)+$I$4),\"\")","v":-2.0253807109998079E-3},646.24707461928904]
["TP98",2.298,{"$f":"IF(D78<>\"\",IF(OR(B78<>\"\",INDIRECT(\"D79\")=0),IF(B77<>\"\",F77+B77,VLOOKUP(INDEX($B$7:B77,MATCH(9.99999999999999E+307,$B$7:B77)),$B$7:F77,5,FALSE)+INDEX($B$7:B77,MATCH(9.99999999999999E+307,$B$7:B77))),(VLOOKUP(INDEX($B$7:B77,MATCH(9.99999999999999E+307,$B$7:B77)),$B$7:F77,5,FALSE))+(INDEX($B$7:B77,MATCH(9.99999999999999E+307,$B$7:B77)))),\"\")","v":649.89350000000002},8.2796000000000003,{"$f":"IF(D78<>\"\",IF(OR(B78<>\"\",INDIRECT(\"D79\")=0),D78,0),\"\")","v":8.2796000000000003},641.61390000000006,null,{"$f":"IF(D78<>\"\",IF(AND(B78<>\"\",B77<>\"\"),$I$4+H77,VLOOKUP(INDEX($B$7:B77,MATCH(9.99999999999999E+307,$B$7:B77)),$B$7:H77,7,FALSE)+$I$4),\"\")","v":-2.0543147211569482E-3},641.61184568527892]
["TP99",2.3199000000000001,{"$f":"IF(D79<>\"\",IF(OR(B79<>\"\",INDIRECT(\"D80\")=0),IF(B78<>\"\",F78+B78,VLOOKUP(INDEX($B$7:B78,MATCH(9.99999999999999E+307,$B$7:B78)),$B$7:F78,5,FALSE)+INDEX($B$7:B78,MATCH(9.99999999999999E+307,$B$7:B78))),(VLOOKUP(INDEX($B$7:B78,MATCH(9.99999999999999E+307,$B$7:B78)),$B$7:F78,5,FALSE))+(INDEX($B$7:B78,MATCH(9.99999999999999E+307,$B$7:B78)))),\"\")","v":643.91190000000006},6.9875999999999996,{"$f":"IF(D79<>\"\",IF(OR(B79<>\"\",INDIRECT(\"D80\")=0),D79,0),\"\")","v":6.9875999999999996},636.92430000000002,null,{"$f":"IF(D79<>\"\",IF(AND(B79<>\"\",B78<>\"\"),$I$4+H78,VLOOKUP(INDEX($B$7:B78,MATCH(9.99999999999999E+307,$B$7:B78)),$B$7:H78,7,FALSE)+$I$4),\"\")","v":-2.0832487313140885E-3},636.92221675126871]
["TP100",2.7130000000000001,{"$f":"IF(D80<>\"\",IF(OR(B80<>\"\",INDIRECT(\"D81\")=0),IF(B79<>\"\",F79+B79,VLOOKUP(INDEX($B$7:B79,MATCH(9.99999999999999E+307,$B$7:B79)),$B$7:F79,5,FALSE)+INDEX($B$7:B79,MATCH(9.99999999999999E+307,$B$7:B79))),(VLOOKUP(INDEX($B$7:B79,MATCH(9.99999999999999E+307,$B$7:B79)),$B$7:F79,5,FALSE))+(INDEX($B$7:B79,MATCH(9.99999999999999E+307,$B$7:B79)))),\"\")","v":639.24419999999998},6.64,{"$f":"IF(D80<>\"\",IF(OR(B80<>\"\",INDIRECT(\"D81\")=0),D80,0),\"\")","v":6.64},632.60419999999999,null,{"$f":"IF(D80<>\"\",IF(AND(B80<>\"\",B79<>\"\"),$I$4+H79,VLOOKUP(INDEX($B$7:B79,MATCH(9.99999999999999E+307,$B$7:B79)),$B$7:H79,7,FALSE)+$I$4),\"\")","v":-2.1121827414712288E-3},632.60208781725851]
["TP101",4.2637,{"$f":"IF(D81<>\"\",IF(OR(B81<>\"\",INDIRECT(\"D82\")=0),IF(B80<>\"\",F80+B80,VLOOKUP(INDEX($B$7:B80,MATCH(9.99999999999999E+307,$B$7:B80)),$B$7:F80,5,FALSE)+INDEX($B$7:B80,MATCH(9.99999999999999E+307,$B$7:B80))),(VLOOKUP(INDEX($B$7:B80,MATCH(9.99999999999999E+307,$B$7:B80)),$B$7:F80,5,FALSE))+(INDEX($B$7:B80,MATCH(9.99999999999999E+307,$B$7:B80)))),\"\")","v":635.31719999999996},6.9958,{"$f":"IF(D81<>\"\",IF(OR(B81<>\"\",INDIRECT(\"D82\")=0),D81,0),\"\")","v":6.9958},628.32139999999993,null,{"$f":"IF(D81<>\"\",IF(AND(B81<>\"\",B80<>\"\"),$I$4+H80,VLOOKUP(INDEX($B$7:B80,MATCH(9.99999999999999E+307,$B$7:B80)),$B$7:H80,7,FALSE)+$I$4),\"\")","v":-2.1411167516283691E-3},628.31925888324827]
["SV103",7.7744999999999997,{"$f":"IF(D82<>\"\",IF(OR(B82<>\"\",INDIRECT(\"D83\")=0),IF(B81<>\"\",F81+B81,VLOOKUP(INDEX($B$7:B81,MATCH(9.99999999999999E+307,$B$7:B81)),$B$7:F81,5,FALSE)+INDEX($B$7:B81,MATCH(9.99999999999999E+307,$B$7:B81))),(VLOOKUP(INDEX($B$7:B81,MATCH(9.99999999999999E+307,$B$7:B81)),$B$7:F81,5,FALSE))+(INDEX($B$7:B81,MATCH(9.99999999999999E+307,$B$7:B81)))),\"\")","v":632.5850999999999},3.9668000000000001,{"$f":"IF(D82<>\"\",IF(OR(B82<>\"\",INDIRECT(\"D83\")=0),D82,0),\"\")","v":3.9668000000000001},628.61829999999986,null,{"$f":"IF(D82<>\"\",IF(AND(B82<>\"\",B81<>\"\"),$I$4+H81,VLOOKUP(INDEX($B$7:B81,MATCH(9.99999999999999E+307,$B$7:B81)),$B$7:H81,7,FALSE)+$I$4),\"\")","v":-2.1700507617855094E-3},628.61612994923803]
["TP102",7.6646000000000001,{"$f":"IF(D83<>\"\",IF(OR(B83<>\"\",INDIRECT(\"D84\")=0),IF(B82<>\"\",F82+B82,VLOOKUP(INDEX($B$7:B82,MATCH(9.99999999999999E+307,$B$7:B82)),$B$7:F82,5,FALSE)+INDEX($B$7:B82,MATCH(9.99999999999999E+307,$B$7:B82))),(VLOOKUP(INDEX($B$7:B82,MATCH(9.99999999999999E+307,$B$7:B82)),$B$7:F82,5,FALSE))+(INDEX($B$7:B82,MATCH(9.99999999999999E+307,$B$7:B82)))),\"\")","v":636.39279999999985},0.89410000000000001,{"$f":"IF(D83<>\"\",IF(OR(B83<>\"\",INDIRECT(\"D84\")=0),D83,0),\"\")","v":0.89410000000000001},635.49869999999987,null,{"$f":"IF(D83<>\"\",IF(AND(B83<>\"\",B82<>\"\"),$I$4+H82,VLOOKUP(INDEX($B$7:B82,MATCH(9.99999999999999E+307,$B$7:B82)),$B$7:H82,7,FALSE)+$I$4),\"\")","v":-2.1989847719426497E-3},635.49650101522798]
["SV17",8.3076000000000008,{"$f":"IF(D84<>\"\",IF(OR(B84<>\"\",INDIRECT(\"D85\")=0),IF(B83<>\"\",F83+B83,VLOOKUP(INDEX($B$7:B83,MATCH(9.99999999999999E+307,$B$7:B83)),$B$7:F83,5,FALSE)+INDEX($B$7:B83,MATCH(9.99999999999999E+307,$B$7:B83))),(VLOOKUP(INDEX($B$7:B83,MATCH(9.99999999999999E+307,$B$7:B83)),$B$7:F83,5,FALSE))+(INDEX($B$7:B83,MATCH(9.99999999999999E+307,$B$7:B83)))),\"\")","v":643.16329999999982},3.9167000000000001,{"$f":"IF(D84<>\"\",IF(OR(B84<>\"\",INDIRECT(\"D85\")=0),D84,0),\"\")","v":3.9167000000000001},639.24659999999983,null,{"$f":"IF(D84<>\"\",IF(AND(B84<>\"\",B83<>\"\"),$I$4+H83,VLOOKUP(INDEX($B$7:B83,MATCH(9.99999999999999E+307,$B$7:B83)),$B$7:H83,7,FALSE)+$I$4),\"\")","v":-2.2279187820997901E-3},639.24437208121776]
["TP103",4.8590999999999998,{"$f":"IF(D85<>\"\",IF(OR(B85<>\"\",INDIRECT(\"D86\")=0),IF(B84<>\"\",F84+B84,VLOOKUP(INDEX($B$7:B84,MATCH(9.99999999999999E+307,$B$7:B84)),$B$7:F84,5,FALSE)+INDEX($B$7:B84,MATCH(9.99999999999999E+307,$B$7:B84))),(VLOOKUP(INDEX($B$7:B84,MATCH(9.99999999999999E+307,$B$7:B84)),$B$7:F84,5,FALSE))+(INDEX($B$7:B84,MATCH(9.99999999999999E+307,$B$7:B84)))),\"\")","v":647.55419999999981},4.4623999999999997,{"$f":"IF(D85<>\"\",IF(OR(B85<>\"\",INDIRECT(\"D86\")=0),D85,0),\"\")","v":4.4623999999999997},643.09179999999981,null,{"$f":"IF(D85<>\"\",IF(AND(B85<>\"\",B84<>\"\"),$I$4+H84,VLOOKUP(INDEX($B$7:B84,MATCH(9.99999999999999E+307,$B$7:B84)),$B$7:H84,7,FALSE)+$I$4),\"\")","v":-2.2568527922569304E-3},643.08954314720756]
["TP104",1.3949,{"$f":"IF(D86<>\"\",IF(OR(B86<>\"\",INDIRECT(\"D87\")=0),IF(B85<>\"\",F85+B85,VLOOKUP(INDEX($B$7:B85,MATCH(9.99999999999999E+307,$B$7:B85)),$B$7:F85,5,FALSE)+INDEX($B$7:B85,MATCH(9.99999999999999E+307,$B$7:B85))),(VLOOKUP(INDEX($B$7:B85,MATCH(9.99999999999999E+307,$B$7:B85)),$B$7:F85,5,FALSE))+(INDEX($B$7:B85,MATCH(9.99999999999999E+307,$B$7:B85)))),\"\")","v":647.95089999999982},7.3832000000000004,{"$f":"IF(D86<>\"\",IF(OR(B86<>\"\",INDIRECT(\"D87\")=0),D86,0),\"\")","v":7.3832000000000004},640.56769999999983,null,{"$f":"IF(D86<>\"\",IF(AND(B86<>\"\",B85<>\"\"),$I$4+H85,VLOOKUP(INDEX($B$7:B85,MATCH(9.99999999999999E+307,$B$7:B85)),$B$7:H85,7,FALSE)+$I$4),\"\")","v":-2.2857868024140707E-3},640.56541421319741]
["TP105",1.8358000000000001,{"$f":"IF(D87<>\"\",IF(OR(B87<>\"\",INDIRECT(\"D88\")=0),IF(B86<>\"\",F86+B86,VLOOKUP(INDEX($B$7:B86,MATCH(9.99999999999999E+307,$B$7:B86)),$B$7:F86,5,FALSE)+INDEX($B$7:B86,MATCH(9.99999999999999E+307,$B$7:B86))),(VLOOKUP(INDEX($B$7:B86,MATCH(9.99999999999999E+307,$B$7:B86)),$B$7:F86,5,FALSE))+(INDEX($B$7:B86,MATCH(9.99999999999999E+307,$B$7:B86)))),\"\")","v":641.96259999999984},8.3748000000000005,{"$f":"IF(D87<>\"\",IF(OR(B87<>\"\",INDIRECT(\"D88\")=0),D87,0),\"\")","v":8.3748000000000005},633.58779999999979,null,{"$f":"IF(D87<>\"\",IF(AND(B87<>\"\",B86<>\"\"),$I$4+H86,VLOOKUP(INDEX($B$7:B86,MATCH(9.99999999999999E+307,$B$7:B86)),$B$7:H86,7,FALSE)+$I$4),\"\")","v":-2.314720812571211E-3},633.5854852791872]
["TP106",4.0789,{"$f":"IF(D88<>\"\",IF(OR(B88<>\"\",INDIRECT(\"D89\")=0),IF(B87<>\"\",F87+B87,VLOOKUP(INDEX($B$7:B87,MATCH(9.99999999999999E+307,$B$7:B87)),$B$7:F87,5,FALSE)+INDEX($B$7:B87,MATCH(9.99999999999999E+307,$B$7:B87))),(VLOOKUP(INDEX($B$7:B87,MATCH(9.99999999999999E+307,$B$7:B87)),$B$7:F87,5,FALSE))+(INDEX($B$7:B87,MATCH(9.99999999999999E+307,$B$7:B87)))),\"\")","v":635.42359999999974},6.5838999999999999,{"$f":"IF(D88<>\"\",IF(OR(B88<>\"\",INDIRECT(\"D89\")=0),D88,0),\"\")","v":6.5838999999999999},628.83969999999977,null,{"$f":"IF(D88<>\"\",IF(AND(B88<>\"\",B87<>\"\"),$I$4+H87,VLOOKUP(INDEX($B$7:B87,MATCH(9.99999999999999E+307,$B$7:B87)),$B$7:H87,7,FALSE)+$I$4),\"\")","v":-2.3436548227283513E-3},628.837356345177]
["TP107",6.3101000000000003,{"$f":"IF(D89<>\"\",IF(OR(B89<>\"\",INDIRECT(\"D90\")=0),IF(B88<>\"\",F88+B88,VLOOKUP(INDEX($B$7:B88,MATCH(9.99999999999999E+307,$B$7:B88)),$B$7:F88,5,FALSE)+INDEX($B$7:B88,MATCH(9.99999999999999E+307,$B$7:B88))),(VLOOKUP(INDEX($B$7:B88,MATCH(9.99999999999999E+307,$B$7:B88)),$B$7:F88,5,FALSE))+(INDEX($B$7:B88,MATCH(9.99999999999999E+307,$B$7:B88)))),\"\")","v":632.91859999999974},3.6722000000000001,{"$f":"IF(D89<>\"\",IF(OR(B89<>\"\",INDIRECT(\"D90\")=0),D89,0),\"\")","v":3.6722000000000001},629.24639999999977,null,{"$f":"IF(D89<>\"\",IF(AND(B89<>\"\",B88<>\"\"),$I$4+H88,VLOOKUP(INDEX($B$7:B88,MATCH(9.99999999999999E+307,$B$7:B88)),$B$7:H88,7,FALSE)+$I$4),\"\")","v":-2.3725888328854916E-3},629.24402741116683]
["TP108",4.7542999999999997,{"$f":"IF(D90<>\"\",IF(OR(B90<>\"\",INDIRECT(\"D91\")=0),IF(B89<>\"\",F89+B89,VLOOKUP(INDEX($B$7:B89,MATCH(9.99999999999999E+307,$B$7:B89)),$B$7:F89,5,FALSE)+INDEX($B$7:B89,MATCH(9.99999999999999E+307,$B$7:B89))),(VLOOKUP(INDEX($B$7:B89,MATCH(9.99999999999999E+307,$B$7:B89)),$B$7:F89,5,FALSE))+(INDEX($B$7:B89,MATCH(9.99999999999999E+307,$B$7:B89)))),\"\")","v":635.5564999999998},3.0308999999999999,{"$f":"IF(D90<>\"\",IF(OR(B90<>\"\",INDIRECT(\"D91\")=0),D90,0),\"\")","v":3.0308999999999999},632.52559999999983,null,{"$f":"IF(D90<>\"\",IF(AND(B90<>\"\",B89<>\"\"),$I$4+H89,VLOOKUP(INDEX($B$7:B89,MATCH(9.99999999999999E+307,$B$7:B89)),$B$7:H89,7,FALSE)+$I$4),\"\")","v":-2.4015228430426319E-3},632.52319847715682]
["SV18",5.4733000000000001,{"$f":"IF(D91<>\"\",IF(OR(B91<>\"\",INDIRECT(\"D92\")=0),IF(B90<>\"\",F90+B90,VLOOKUP(INDEX($B$7:B90,MATCH(9.99999999999999E+307,$B$7:B90)),$B$7:F90,5,FALSE)+INDEX($B$7:B90,MATCH(9.99999999999999E+307,$B$7:B90))),(VLOOKUP(INDEX($B$7:B90,MATCH(9.99999999999999E+307,$B$7:B90)),$B$7:F90,5,FALSE))+(INDEX($B$7:B90,MATCH(9.99999999999999E+307,$B$7:B90)))),\"\")","v":637.27989999999977},4.9031000000000002,{"$f":"IF(D91<>\"\",IF(OR(B91<>\"\",INDIRECT(\"D92\")=0),D91,0),\"\")","v":4.9031000000000002},632.37679999999978,null,{"$f":"IF(D91<>\"\",IF(AND(B91<>\"\",B90<>\"\"),$I$4+H90,VLOOKUP(INDEX($B$7:B90,MATCH(9.99999999999999E+307,$B$7:B90)),$B$7:H90,7,FALSE)+$I$4),\"\")","v":-2.4304568531997722E-3},632.3743695431466]
["TP109",3.7134999999999998,{"$f":"IF(D92<>\"\",IF(OR(B92<>\"\",INDIRECT(\"D93\")=0),IF(B91<>\"\",F91+B91,VLOOKUP(INDEX($B$7:B91,MATCH(9.99999999999999E+307,$B$7:B91)),$B$7:F91,5,FALSE)+INDEX($B$7:B91,MATCH(9.99999999999999E+307,$B$7:B91))),(VLOOKUP(INDEX($B$7:B91,MATCH(9.99999999999999E+307,$B$7:B91)),$B$7:F91,5,FALSE))+(INDEX($B$7:B91,MATCH(9.99999999999999E+307,$B$7:B91)))),\"\")","v":637.85009999999977},4.8781999999999996,{"$f":"IF(D92<>\"\",IF(OR(B92<>\"\",INDIRECT(\"D93\")=0),D92,0),\"\")","v":4.8781999999999996},632.97189999999978,null,{"$f":"IF(D92<>\"\",IF(AND(B92<>\"\",B91<>\"\"),$I$4+H91,VLOOKUP(INDEX($B$7:B91,MATCH(9.99999999999999E+307,$B$7:B91)),$B$7:H91,7,FALSE)+$I$4),\"\")","v":-2.4593908633569125E-3},632.96944060913643]
["SV19",4.3513000000000002,{"$f":"IF(D93<>\"\",IF(OR(B93<>\"\",INDIRECT(\"D94\")=0),IF(B92<>\"\",F92+B92,VLOOKUP(INDEX($B$7:B92,MATCH(9.99999999999999E+307,$B$7:B92)),$B$7:F92,5,FALSE)+INDEX($B$7:B92,MATCH(9.99999999999999E+307,$B$7:B92))),(VLOOKUP(INDEX($B$7:B92,MATCH(9.99999999999999E+307,$B$7:B92)),$B$7:F92,5,FALSE))+(INDEX($B$7:B92,MATCH(9.99999999999999E+307,$B$7:B92)))),\"\")","v":636.68539999999973},6.3926999999999996,{"$f":"IF(D93<>\"\",IF(OR(B93<>\"\",INDIRECT(\"D94\")=0),D93,0),\"\")","v":6.3926999999999996},630.29269999999974,null,{"$f":"IF(D93<>\"\",IF(AND(B93<>\"\",B92<>\"\"),$I$4+H92,VLOOKUP(INDEX($B$7:B92,MATCH(9.99999999999999E+307,$B$7:B92)),$B$7:H92,7,FALSE)+$I$4),\"\")","v":-2.4883248735140528E-3},630.29021167512622]
["TP110",4.0213999999999999,{"$f":"IF(D94<>\"\",IF(OR(B94<>\"\",INDIRECT(\"D95\")=0),IF(B93<>\"\",F93+B93,VLOOKUP(INDEX($B$7:B93,MATCH(9.99999999999999E+307,$B$7:B93)),$B$7:F93,5,FALSE)+INDEX($B$7:B93,MATCH(9.99999999999999E+307,$B$7:B93))),(VLOOKUP(INDEX($B$7:B93,MATCH(9.99999999999999E+307,$B$7:B93)),$B$7:F93,5,FALSE))+(INDEX($B$7:B93,MATCH(9.99999999999999E+307,$B$7:B93)))),\"\")","v":634.64399999999978},5.2603,{"$f":"IF(D94<>\"\",IF(OR(B94<>\"\",INDIRECT(\"D95\")=0),D94,0),\"\")","v":5.2603},629.38369999999975,null,{"$f":"IF(D94<>\"\",IF(AND(B94<>\"\",B93<>\"\"),$I$4+H93,VLOOKUP(INDEX($B$7:B93,MATCH(9.99999999999999E+307,$B$7:B93)),$B$7:H93,7,FALSE)+$I$4),\"\")","v":-2.5172588836711932E-3},629.38118274111605]
["TP111",4.1334999999999997,{"$f":"IF(D95<>\"\",IF(OR(B95<>\"\",INDIRECT(\"D96\")=0),IF(B94<>\"\",F94+B94,VLOOKUP(INDEX($B$7:B94,MATCH(9.99999999999999E+307,$B$7:B94)),$B$7:F94,5,FALSE)+INDEX($B$7:B94,MATCH(9.99999999999999E+307,$B$7:B94))),(VLOOKUP(INDEX($B$7:B94,MATCH(9.99999999999999E+307,$B$7:B94)),$B$7:F94,5,FALSE))+(INDEX($B$7:B94,MATCH(9.99999999999999E+307,$B$7:B94)))),\"\")","v":633.40509999999972},5.6520999999999999,{"$f":"IF(D95<>\"\",IF(OR(B95<>\"\",INDIRECT(\"D96\")=0),D95,0),\"\")","v":5.6520999999999999},627.7529999999997,null,{"$f":"IF(D95<>\"\",IF(AND(B95<>\"\",B94<>\"\"),$I$4+H94,VLOOKUP(INDEX($B$7:B94,MATCH(9.99999999999999E+307,$B$7:B94)),$B$7:H94,7,FALSE)+$I$4),\"\")","v":-2.5461928938283335E-3},627.75045380710583]
["TP112",7.5903,{"$f":"IF(D96<>\"\",IF(OR(B96<>\"\",INDIRECT(\"D97\")=0),IF(B95<>\"\",F95+B95,VLOOKUP(INDEX($B$7:B95,MATCH(9.99999999999999E+307,$B$7:B95)),$B$7:F95,5,FALSE)+INDEX($B$7:B95,MATCH(9.99999999999999E+307,$B$7:B95))),(VLOOKUP(INDEX($B$7:B95,MATCH(9.99999999999999E+307,$B$7:B95)),$B$7:F95,5,FALSE))+(INDEX($B$7:B95,MATCH(9.99999999999999E+307,$B$7:B95)))),\"\")","v":631.88649999999973},3.7461000000000002,{"$f":"IF(D96<>\"\",IF(OR(B96<>\"\",INDIRECT(\"D97\")=0),D96,0),\"\")","v":3.7461000000000002},628.14039999999977,null,{"$f":"IF(D96<>\"\",IF(AND(B96<>\"\",B95<>\"\"),$I$4+H95,VLOOKUP(INDEX($B$7:B95,MATCH(9.99999999999999E+307,$B$7:B95)),$B$7:H95,7,FALSE)+$I$4),\"\")","v":-2.5751269039854738E-3},628.13782487309584]
["TP113",8.5798000000000005,{"$f":"IF(D97<>\"\",IF(OR(B97<>\"\",INDIRECT(\"D98\")=0),IF(B96<>\"\",F96+B96,VLOOKUP(INDEX($B$7:B96,MATCH(9.99999999999999E+307,$B$7:B96)),$B$7:F96,5,FALSE)+INDEX($B$7:B96,MATCH(9.99999999999999E+307,$B$7:B96))),(VLOOKUP(INDEX($B$7:B96,MATCH(9.99999999999999E+307,$B$7:B96)),$B$7:F96,5,FALSE))+(INDEX($B$7:B96,MATCH(9.99999999999999E+307,$B$7:B96)))),\"\")","v":635.73069999999973},0.37809999999999999,{"$f":"IF(D97<>\"\",IF(OR(B97<>\"\",INDIRECT(\"D98\")=0),D97,0),\"\")","v":0.37809999999999999},635.35259999999971,null,{"$f":"IF(D97<>\"\",IF(AND(B97<>\"\",B96<>\"\"),$I$4+H96,VLOOKUP(INDEX($B$7:B96,MATCH(9.99999999999999E+307,$B$7:B96)),$B$7:H96,7,FALSE)+$I$4),\"\")","v":-2.6040609141426141E-3},635.3499959390856]
["TP114",8.6494,{"$f":"IF(D98<>\"\",IF(OR(B98<>\"\",INDIRECT(\"D99\")=0),IF(B97<>\"\",F97+B97,VLOOKUP(INDEX($B$7:B97,MATCH(9.99999999999999E+307,$B$7:B97)),$B$7:F97,5,FALSE)+INDEX($B$7:B97,MATCH(9.99999999999999E+307,$B$7:B97))),(VLOOKUP(INDEX($B$7:B97,MATCH(9.99999999999999E+307,$B$7:B97)),$B$7:F97,5,FALSE))+(INDEX($B$7:B97,MATCH(9.99999999999999E+307,$B$7:B97)))),\"\")","v":643.93239999999969},0.37790000000000001,{"$f":"IF(D98<>\"\",IF(OR(B98<>\"\",INDIRECT(\"D99\")=0),D98,0),\"\")","v":0.37790000000000001},643.55449999999973,null,{"$f":"IF(D98<>\"\",IF(AND(B98<>\"\",B97<>\"\"),$I$4+H97,VLOOKUP(INDEX($B$7:B97,MATCH(9.99999999999999E+307,$B$7:B97)),$B$7:H97,7,FALSE)+$I$4),\"\")","v":-2.6329949242997544E-3},643.55186700507545]
["TP115",8.6782000000000004,{"$f":"IF(D99<>\"\",IF(OR(B99<>\"\",INDIRECT(\"D100\")=0),IF(B98<>\"\",F98+B98,VLOOKUP(INDEX($B$7:B98,MATCH(9.99999999999999E+307,$B$7:B98)),$B$7:F98,5,FALSE)+INDEX($B$7:B98,MATCH(9.99999999999999E+307,$B$7:B98))),(VLOOKUP(INDEX($B$7:B98,MATCH(9.99999999999999E+307,$B$7:B98)),$B$7:F98,5,FALSE))+(INDEX($B$7:B98,MATCH(9.99999999999999E+307,$B$7:B98)))),\"\")","v":652.20389999999975},0.64459999999999995,{"$f":"IF(D99<>\"\",IF(OR(B99<>\"\",INDIRECT(\"D100\")=0),D99,0),\"\")","v":0.64459999999999995},651.55929999999978,null,{"$f":"IF(D99<>\"\",IF(AND(B99<>\"\",B98<>\"\"),$I$4+H98,VLOOKUP(INDEX($B$7:B98,MATCH(9.99999999999999E+307,$B$7:B98)),$B$7:H98,7,FALSE)+$I$4),\"\")","v":-2.6619289344568947E-3},651.55663807106532]
["TP116",7.1436999999999999,{"$f":"IF(D100<>\"\",IF(OR(B100<>\"\",INDIRECT(\"D101\")=0),IF(B99<>\"\",F99+B99,VLOOKUP(INDEX($B$7:B99,MATCH(9.99999999999999E+307,$B$7:B99)),$B$7:F99,5,FALSE)+INDEX($B$7:B99,MATCH(9.99999999999999E+307,$B$7:B99))),(VLOOKUP(INDEX($B$7:B99,MATCH(9.99999999999999E+307,$B$7:B99)),$B$7:F99,5,FALSE))+(INDEX($B$7:B99,MATCH(9.99999999999999E+307,$B$7:B99)))),\"\")","v":660.23749999999973},0.33900000000000002,{"$f":"IF(D100<>\"\",IF(OR(B100<>\"\",INDIRECT(\"D101\")=0),D100,0),\"\")","v":0.33900000000000002},659.89849999999967,null,{"$f":"IF(D100<>\"\",IF(AND(B100<>\"\",B99<>\"\"),$I$4+H99,VLOOKUP(INDEX($B$7:B99,MATCH(9.99999999999999E+307,$B$7:B99)),$B$7:H99,7,FALSE)+$I$4),\"\")","v":-2.690862944614035E-3},659.89580913705504]
["SV20",7.5697000000000001,{"$f":"IF(D101<>\"\",IF(OR(B101<>\"\",INDIRECT(\"D102\")=0),IF(B100<>\"\",F100+B100,VLOOKUP(INDEX($B$7:B100,MATCH(9.99999999999999E+307,$B$7:B100)),$B$7:F100,5,FALSE)+INDEX($B$7:B100,MATCH(9.99999999999999E+307,$B$7:B100))),(VLOOKUP(INDEX($B$7:B100,MATCH(9.99999999999999E+307,$B$7:B100)),$B$7:F100,5,FALSE))+(INDEX($B$7:B100,MATCH(9.99999999999999E+307,$B$7:B100)))),\"\")","v":667.04219999999964},3.5640999999999998,{"$f":"IF(D101<>\"\",IF(OR(B101<>\"\",INDIRECT(\"D102\")=0),D101,0),\"\")","v":3.5640999999999998},663.47809999999959,null,{"$f":"IF(D101<>\"\",IF(AND(B101<>\"\",B100<>\"\"),$I$4+H100,VLOOKUP(INDEX($B$7:B100,MATCH(9.99999999999999E+307,$B$7:B100)),$B$7:H100,7,FALSE)+$I$4),\"\")","v":-2.7197969547711753E-3},663.47538020304478]
["TP117",4.7199,{"$f":"IF(D102<>\"\",IF(OR(B102<>\"\",INDIRECT(\"D103\")=0),IF(B101<>\"\",F101+B101,VLOOKUP(INDEX($B$7:B101,MATCH(9.99999999999999E+307,$B$7:B101)),$B$7:F101,5,FALSE)+INDEX($B$7:B101,MATCH(9.99999999999999E+307,$B$7:B101))),(VLOOKUP(INDEX($B$7:B101,MATCH(9.99999999999999E+307,$B$7:B101)),$B$7:F101,5,FALSE))+(INDEX($B$7:B101,MATCH(9.99999999999999E+307,$B$7:B101)))),\"\")","v":671.0477999999996},3.6049000000000002,{"$f":"IF(D102<>\"\",IF(OR(B102<>\"\",INDIRECT(\"D103\")=0),D102,0),\"\")","v":3.6049000000000002},667.44289999999955,null,{"$f":"IF(D102<>\"\",IF(AND(B102<>\"\",B101<>\"\"),$I$4+H101,VLOOKUP(INDEX($B$7:B101,MATCH(9.99999999999999E+307,$B$7:B101)),$B$7:H101,7,FALSE)+$I$4),\"\")","v":-2.7487309649283156E-3},667.44015126903457]
["SV21",6.6859000000000002,{"$f":"IF(D103<>\"\",IF(OR(B103<>\"\",INDIRECT(\"D104\")=0),IF(B102<>\"\",F102+B102,VLOOKUP(INDEX($B$7:B102,MATCH(9.99999999999999E+307,$B$7:B102)),$B$7:F102,5,FALSE)+INDEX($B$7:B102,MATCH(9.99999999999999E+307,$B$7:B102))),(VLOOKUP(INDEX($B$7:B102,MATCH(9.99999999999999E+307,$B$7:B102)),$B$7:F102,5,FALSE))+(INDEX($B$7:B102,MATCH(9.99999999999999E+307,$B$7:B102)))),\"\")","v":672.16279999999961},5.0353000000000003,{"$f":"IF(D103<>\"\",IF(OR(B103<>\"\",INDIRECT(\"D104\")=0),D103,0),\"\")","v":5.0353000000000003},667.1274999999996,null,{"$f":"IF(D103<>\"\",IF(AND(B103<>\"\",B102<>\"\"),$I$4+H102,VLOOKUP(INDEX($B$7:B102,MATCH(9.99999999999999E+307,$B$7:B102)),$B$7:H102,7,FALSE)+$I$4),\"\")","v":-2.777664975085456E-3},667.12472233502456]
["TP118",5.6101999999999999,{"$f":"IF(D104<>\"\",IF(OR(B104<>\"\",INDIRECT(\"D105\")=0),IF(B103<>\"\",F103+B103,VLOOKUP(INDEX($B$7:B103,MATCH(9.99999999999999E+307,$B$7:B103)),$B$7:F103,5,FALSE)+INDEX($B$7:B103,MATCH(9.99999999999999E+307,$B$7:B103))),(VLOOKUP(INDEX($B$7:B103,MATCH(9.99999999999999E+307,$B$7:B103)),$B$7:F103,5,FALSE))+(INDEX($B$7:B103,MATCH(9.99999999999999E+307,$B$7:B103)))),\"\")","v":673.81339999999955},0.7712,{"$f":"IF(D104<>\"\",IF(OR(B104<>\"\",INDIRECT(\"D105\")=0),D104,0),\"\")","v":0.7712},673.04219999999953,null,{"$f":"IF(D104<>\"\",IF(AND(B104<>\"\",B103<>\"\"),$I$4+H103,VLOOKUP(INDEX($B$7:B103,MATCH(9.99999999999999E+307,$B$7:B103)),$B$7:H103,7,FALSE)+$I$4),\"\")","v":-2.8065989852425963E-3},673.03939340101431]
["SV22",4.5388999999999999,{"$f":"IF(D105<>\"\",IF(OR(B105<>\"\",INDIRECT(\"D106\")=0),IF(B104<>\"\",F104+B104,VLOOKUP(INDEX($B$7:B104,MATCH(9.99999999999999E+307,$B$7:B104)),$B$7:F104,5,FALSE)+INDEX($B$7:B104,MATCH(9.99999999999999E+307,$B$7:B104))),(VLOOKUP(INDEX($B$7:B104,MATCH(9.99999999999999E+307,$B$7:B104)),$B$7:F104,5,FALSE))+(INDEX($B$7:B104,MATCH(9.99999999999999E+307,$B$7:B104)))),\"\")","v":678.65239999999949},4.6073000000000004,{"$f":"IF(D105<>\"\",IF(OR(B105<>\"\",INDIRECT(\"D106\")=0),D105,0),\"\")","v":4.6073000000000004},674.04509999999948,null,{"$f":"IF(D105<>\"\",IF(AND(B105<>\"\",B104<>\"\"),$I$4+H104,VLOOKUP(INDEX($B$7:B104,MATCH(9.99999999999999E+307,$B$7:B104)),$B$7:H104,7,FALSE)+$I$4),\"\")","v":-2.8355329953997366E-3},674.04226446700409]
["TP119",0.7984,{"$f":"IF(D106<>\"\",IF(OR(B106<>\"\",INDIRECT(\"D107\")=0),IF(B105<>\"\",F105+B105,VLOOKUP(INDEX($B$7:B105,MATCH(9.99999999999999E+307,$B$7:B105)),$B$7:F105,5,FALSE)+INDEX($B$7:B105,MATCH(9.99999999999999E+307,$B$7:B105))),(VLOOKUP(INDEX($B$7:B105,MATCH(9.99999999999999E+307,$B$7:B105)),$B$7:F105,5,FALSE))+(INDEX($B$7:B105,MATCH(9.99999999999999E+307,$B$7:B105)))),\"\")","v":678.58399999999949},5.4687999999999999,{"$f":"IF(D106<>\"\",IF(OR(B106<>\"\",INDIRECT(\"D107\")=0),D106,0),\"\")","v":5.4687999999999999},673.1151999999995,null,{"$f":"IF(D106<>\"\",IF(AND(B106<>\"\",B105<>\"\"),$I$4+H105,VLOOKUP(INDEX($B$7:B105,MATCH(9.99999999999999E+307,$B$7:B105)),$B$7:H105,7,FALSE)+$I$4),\"\")","v":-2.8644670055568769E-3},673.11233553299394]
["SV21",5.2411000000000003,{"$f":"IF(D107<>\"\",IF(OR(B107<>\"\",INDIRECT(\"D108\")=0),IF(B106<>\"\",F106+B106,VLOOKUP(INDEX($B$7:B106,MATCH(9.99999999999999E+307,$B$7:B106)),$B$7:F106,5,FALSE)+INDEX($B$7:B106,MATCH(9.99999999999999E+307,$B$7:B106))),(VLOOKUP(INDEX($B$7:B106,MATCH(9.99999999999999E+307,$B$7:B106)),$B$7:F106,5,FALSE))+(INDEX($B$7:B106,MATCH(9.99999999999999E+307,$B$7:B106)))),\"\")","v":673.91359999999952},6.7888999999999999,{"$f":"IF(D107<>\"\",IF(OR(B107<>\"\",INDIRECT(\"D108\")=0),D107,0),\"\")","v":6.7888999999999999},667.12469999999951,null,{"$f":"IF(D107<>\"\",IF(AND(B107<>\"\",B106<>\"\"),$I$4+H106,VLOOKUP(INDEX($B$7:B106,MATCH(9.99999999999999E+307,$B$7:B106)),$B$7:H106,7,FALSE)+$I$4),\"\")","v":-2.8934010157140172E-3},667.12180659898377]
["TP120",3.6648000000000001,{"$f":"IF(D108<>\"\",IF(OR(B108<>\"\",INDIRECT(\"D109\")=0),IF(B107<>\"\",F107+B107,VLOOKUP(INDEX($B$7:B107,MATCH(9.99999999999999E+307,$B$7:B107)),$B$7:F107,5,FALSE)+INDEX($B$7:B107,MATCH(9.99999999999999E+307,$B$7:B107))),(VLOOKUP(INDEX($B$7:B107,MATCH(9.99999999999999E+307,$B$7:B107)),$B$7:F107,5,FALSE))+(INDEX($B$7:B107,MATCH(9.99999999999999E+307,$B$7:B107)))),\"\")","v":672.36579999999947},4.8361999999999998,{"$f":"IF(D108<>\"\",IF(OR(B108<>\"\",INDIRECT(\"D109\")=0),D108,0),\"\")","v":4.8361999999999998},667.5295999999995,null,{"$f":"IF(D108<>\"\",IF(AND(B108<>\"\",B107<>\"\"),$I$4+H107,VLOOKUP(INDEX($B$7:B107,MATCH(9.99999999999999E+307,$B$7:B107)),$B$7:H107,7,FALSE)+$I$4),\"\")","v":-2.9223350258711575E-3},667.52667766497359]
["SV20",3.6280999999999999,{"$f":"IF(D109<>\"\",IF(OR(B109<>\"\",INDIRECT(\"D110\")=0),IF(B108<>\"\",F108+B108,VLOOKUP(INDEX($B$7:B108,MATCH(9.99999999999999E+307,$B$7:B108)),$B$7:F108,5,FALSE)+INDEX($B$7:B108,MATCH(9.99999999999999E+307,$B$7:B108))),(VLOOKUP(INDEX($B$7:B108,MATCH(9.99999999999999E+307,$B$7:B108)),$B$7:F108,5,FALSE))+(INDEX($B$7:B108,MATCH(9.99999999999999E+307,$B$7:B108)))),\"\")","v":671.19439999999952},7.7215999999999996,{"$f":"IF(D109<>\"\",IF(OR(B109<>\"\",INDIRECT(\"D110\")=0),D109,0),\"\")","v":7.7215999999999996},663.47279999999955,null,{"$f":"IF(D109<>\"\",IF(AND(B109<>\"\",B108<>\"\"),$I$4+H108,VLOOKUP(INDEX($B$7:B108,MATCH(9.99999999999999E+307,$B$7:B108)),$B$7:H108,7,FALSE)+$I$4),\"\")","v":-2.9512690360282978E-3},663.46984873096358]
["TP121",1.0629,{"$f":"IF(D110<>\"\",IF(OR(B110<>\"\",INDIRECT(\"D111\")=0),IF(B109<>\"\",F109+B109,VLOOKUP(INDEX($B$7:B109,MATCH(9.99999999999999E+307,$B$7:B109)),$B$7:F109,5,FALSE)+INDEX($B$7:B109,MATCH(9.99999999999999E+307,$B$7:B109))),(VLOOKUP(INDEX($B$7:B109,MATCH(9.99999999999999E+307,$B$7:B109)),$B$7:F109,5,FALSE))+(INDEX($B$7:B109,MATCH(9.99999999999999E+307,$B$7:B109)))),\"\")","v":667.10089999999957},7.2760999999999996,{"$f":"IF(D110<>\"\",IF(OR(B110<>\"\",INDIRECT(\"D111\")=0),D110,0),\"\")","v":7.2760999999999996},659.82479999999953,null,{"$f":"IF(D110<>\"\",IF(AND(B110<>\"\",B109<>\"\"),$I$4+H109,VLOOKUP(INDEX($B$7:B109,MATCH(9.99999999999999E+307,$B$7:B109)),$B$7:H109,7,FALSE)+$I$4),\"\")","v":-2.9802030461854381E-3},659.82181979695338]
["TP122",0.43009999999999998,{"$f":"IF(D111<>\"\",IF(OR(B111<>\"\",INDIRECT(\"D112\")=0),IF(B110<>\"\",F110+B110,VLOOKUP(INDEX($B$7:B110,MATCH(9.99999999999999E+307,$B$7:B110)),$B$7:F110,5,FALSE)+INDEX($B$7:B110,MATCH(9.99999999999999E+307,$B$7:B110))),(VLOOKUP(INDEX($B$7:B110,MATCH(9.99999999999999E+307,$B$7:B110)),$B$7:F110,5,FALSE))+(INDEX($B$7:B110,MATCH(9.99999999999999E+307,$B$7:B110)))),\"\")","v":660.88769999999954},8.5233000000000008,{"$f":"IF(D111<>\"\",IF(OR(B111<>\"\",INDIRECT(\"D112\")=0),D111,0),\"\")","v":8.5233000000000008},652.36439999999959,null,{"$f":"IF(D111<>\"\",IF(AND(B111<>\"\",B110<>\"\"),$I$4+H110,VLOOKUP(INDEX($B$7:B110,MATCH(9.99999999999999E+307,$B$7:B110)),$B$7:H110,7,FALSE)+$I$4),\"\")","v":-3.0091370563425784E-3},652.36139086294327]
["TP123",0.15160000000000001,{"$f":"IF(D112<>\"\",IF(OR(B112<>\"\",INDIRECT(\"D113\")=0),IF(B111<>\"\",F111+B111,VLOOKUP(INDEX($B$7:B111,MATCH(9.99999999999999E+307,$B$7:B111)),$B$7:F111,5,FALSE)+INDEX($B$7:B111,MATCH(9.99999999999999E+307,$B$7:B111))),(VLOOKUP(INDEX($B$7:B111,MATCH(9.99999999999999E+307,$B$7:B111)),$B$7:F111,5,FALSE))+(INDEX($B$7:B111,MATCH(9.99999999999999E+307,$B$7:B111)))),\"\")","v":652.79449999999963},8.3413000000000004,{"$f":"IF(D112<>\"\",IF(OR(B112<>\"\",INDIRECT(\"D113\")=0),D112,0),\"\")","v":8.3413000000000004},644.45319999999958,null,{"$f":"IF(D112<>\"\",IF(AND(B112<>\"\",B111<>\"\"),$I$4+H111,VLOOKUP(INDEX($B$7:B111,MATCH(9.99999999999999E+307,$B$7:B111)),$B$7:H111,7,FALSE)+$I$4),\"\")","v":-3.0380710664997188E-3},644.45016192893308]
["TP124",0.29310000000000003,{"$f":"IF(D113<>\"\",IF(OR(B113<>\"\",INDIRECT(\"D114\")=0),IF(B112<>\"\",F112+B112,VLOOKUP(INDEX($B$7:B112,MATCH(9.99999999999999E+307,$B$7:B112)),$B$7:F112,5,FALSE)+INDEX($B$7:B112,MATCH(9.99999999999999E+307,$B$7:B112))),(VLOOKUP(INDEX($B$7:B112,MATCH(9.99999999999999E+307,$B$7:B112)),$B$7:F112,5,FALSE))+(INDEX($B$7:B112,MATCH(9.99999999999999E+307,$B$7:B112)))),\"\")","v":644.60479999999961},8.4274000000000004,{"$f":"IF(D113<>\"\",IF(OR(B113<>\"\",INDIRECT(\"D114\")=0),D113,0),\"\")","v":8.4274000000000004},636.17739999999958,null,{"$f":"IF(D113<>\"\",IF(AND(B113<>\"\",B112<>\"\"),$I$4+H112,VLOOKUP(INDEX($B$7:B112,MATCH(9.99999999999999E+307,$B$7:B112)),$B$7:H112,7,FALSE)+$I$4),\"\")","v":-3.0670050766568591E-3},636.17433299492291]
["TP125",3.9706000000000001,{"$f":"IF(D114<>\"\",IF(OR(B114<>\"\",INDIRECT(\"D115\")=0),IF(B113<>\"\",F113+B113,VLOOKUP(INDEX($B$7:B113,MATCH(9.99999999999999E+307,$B$7:B113)),$B$7:F113,5,FALSE)+INDEX($B$7:B113,MATCH(9.99999999999999E+307,$B$7:B113))),(VLOOKUP(INDEX($B$7:B113,MATCH(9.99999999999999E+307,$B$7:B113)),$B$7:F113,5,FALSE))+(INDEX($B$7:B113,MATCH(9.99999999999999E+307,$B$7:B113)))),\"\")","v":636.47049999999956},8.4627999999999997,{"$f":"IF(D114<>\"\",IF(OR(B114<>\"\",INDIRECT(\"D115\")=0),D114,0),\"\")","v":8.4627999999999997},628.00769999999955,null,{"$f":"IF(D114<>\"\",IF(AND(B114<>\"\",B113<>\"\"),$I$4+H113,VLOOKUP(INDEX($B$7:B113,MATCH(9.99999999999999E+307,$B$7:B113)),$B$7:H113,7,FALSE)+$I$4),\"\")","v":-3.0959390868139994E-3},628.0046040609127]
["TP126",5.7558999999999996,{"$f":"IF(D115<>\"\",IF(OR(B115<>\"\",INDIRECT(\"D116\")=0),IF(B114<>\"\",F114+B114,VLOOKUP(INDEX($B$7:B114,MATCH(9.99999999999999E+307,$B$7:B114)),$B$7:F114,5,FALSE)+INDEX($B$7:B114,MATCH(9.99999999999999E+307,$B$7:B114))),(VLOOKUP(INDEX($B$7:B114,MATCH(9.99999999999999E+307,$B$7:B114)),$B$7:F114,5,FALSE))+(INDEX($B$7:B114,MATCH(9.99999999999999E+307,$B$7:B114)))),\"\")","v":631.97829999999954},4.1890000000000001,{"$f":"IF(D115<>\"\",IF(OR(B115<>\"\",INDIRECT(\"D116\")=0),D115,0),\"\")","v":4.1890000000000001},627.78929999999957,null,{"$f":"IF(D115<>\"\",IF(AND(B115<>\"\",B114<>\"\"),$I$4+H114,VLOOKUP(INDEX($B$7:B114,MATCH(9.99999999999999E+307,$B$7:B114)),$B$7:H114,7,FALSE)+$I$4),\"\")","v":-3.1248730969711397E-3},627.78617512690255]
["TP127",5.0891999999999999,{"$f":"IF(D116<>\"\",IF(OR(B116<>\"\",INDIRECT(\"D117\")=0),IF(B115<>\"\",F115+B115,VLOOKUP(INDEX($B$7:B115,MATCH(9.99999999999999E+307,$B$7:B115)),$B$7:F115,5,FALSE)+INDEX($B$7:B115,MATCH(9.99999999999999E+307,$B$7:B115))),(VLOOKUP(INDEX($B$7:B115,MATCH(9.99999999999999E+307,$B$7:B115)),$B$7:F115,5,FALSE))+(INDEX($B$7:B115,MATCH(9.99999999999999E+307,$B$7:B115)))),\"\")","v":633.54519999999957},3.8146,{"$f":"IF(D116<>\"\",IF(OR(B116<>\"\",INDIRECT(\"D117\")=0),D116,0),\"\")","v":3.8146},629.73059999999953,null,{"$f":"IF(D116<>\"\",IF(AND(B116<>\"\",B115<>\"\"),$I$4+H115,VLOOKUP(INDEX($B$7:B115,MATCH(9.99999999999999E+307,$B$7:B115)),$B$7:H115,7,FALSE)+$I$4),\"\")","v":-3.15380710712828E-3},629.72744619289244]
["SV19",6.4043999999999999,{"$f":"IF(D117<>\"\",IF(OR(B117<>\"\",INDIRECT(\"D118\")=0),IF(B116<>\"\",F116+B116,VLOOKUP(INDEX($B$7:B116,MATCH(9.99999999999999E+307,$B$7:B116)),$B$7:F116,5,FALSE)+INDEX($B$7:B116,MATCH(9.99999999999999E+307,$B$7:B116))),(VLOOKUP(INDEX($B$7:B116,MATCH(9.99999999999999E+307,$B$7:B116)),$B$7:F116,5,FALSE))+(INDEX($B$7:B116,MATCH(9.99999999999999E+307,$B$7:B116)))),\"\")","v":634.81979999999953},4.5339,{"$f":"IF(D117<>\"\",IF(OR(B117<>\"\",INDIRECT(\"D118\")=0),D117,0),\"\")","v":4.5339},630.28589999999951,null,{"$f":"IF(D117<>\"\",IF(AND(B117<>\"\",B116<>\"\"),$I$4+H116,VLOOKUP(INDEX($B$7:B116,MATCH(9.99999999999999E+307,$B$7:B116)),$B$7:H116,7,FALSE)+$I$4),\"\")","v":-3.1827411172854203E-3},630.28271725888226]
["TP128",5.2351999999999999,{"$f":"IF(D118<>\"\",IF(OR(B118<>\"\",INDIRECT(\"D119\")=0),IF(B117<>\"\",F117+B117,VLOOKUP(INDEX($B$7:B117,MATCH(9.99999999999999E+307,$B$7:B117)),$B$7:F117,5,FALSE)+INDEX($B$7:B117,MATCH(9.99999999999999E+307,$B$7:B117))),(VLOOKUP(INDEX($B$7:B117,MATCH(9.99999999999999E+307,$B$7:B117)),$B$7:F117,5,FALSE))+(INDEX($B$7:B117,MATCH(9.99999999999999E+307,$B$7:B117)))),\"\")","v":636.69029999999952},4.0594999999999999,{"$f":"IF(D118<>\"\",IF(OR(B118<>\"\",INDIRECT(\"D119\")=0),D118,0),\"\")","v":4.0594999999999999},632.63079999999957,null,{"$f":"IF(D118<>\"\",IF(AND(B118<>\"\",B117<>\"\"),$I$4+H117,VLOOKUP(INDEX($B$7:B117,MATCH(9.99999999999999E+307,$B$7:B117)),$B$7:H117,7,FALSE)+$I$4),\"\")","v":-3.2116751274425606E-3},632.62758832487214]
["SV18",4.9635999999999996,{"$f":"IF(D119<>\"\",IF(OR(B119<>\"\",INDIRECT(\"D120\")=0),IF(B118<>\"\",F118+B118,VLOOKUP(INDEX($B$7:B118,MATCH(9.99999999999999E+307,$B$7:B118)),$B$7:F118,5,FALSE)+INDEX($B$7:B118,MATCH(9.99999999999999E+307,$B$7:B118))),(VLOOKUP(INDEX($B$7:B118,MATCH(9.99999999999999E+307,$B$7:B118)),$B$7:F118,5,FALSE))+(INDEX($B$7:B118,MATCH(9.99999999999999E+307,$B$7:B118)))),\"\")","v":637.86599999999953},5.4946000000000002,{"$f":"IF(D119<>\"\",IF(OR(B119<>\"\",INDIRECT(\"D120\")=0),D119,0),\"\")","v":5.4946000000000002},632.37139999999954,null,{"$f":"IF(D119<>\"\",IF(AND(B119<>\"\",B118<>\"\"),$I$4+H118,VLOOKUP(INDEX($B$7:B118,MATCH(9.99999999999999E+307,$B$7:B118)),$B$7:H118,7,FALSE)+$I$4),\"\")","v":-3.2406091375997009E-3},632.36815939086193]
["TP129",3.5051999999999999,{"$f":"IF(D120<>\"\",IF(OR(B120<>\"\",INDIRECT(\"D121\")=0),IF(B119<>\"\",F119+B119,VLOOKUP(INDEX($B$7:B119,MATCH(9.99999999999999E+307,$B$7:B119)),$B$7:F119,5,FALSE)+INDEX($B$7:B119,MATCH(9.99999999999999E+307,$B$7:B119))),(VLOOKUP(INDEX($B$7:B119,MATCH(9.99999999999999E+307,$B$7:B119)),$B$7:F119,5,FALSE))+(INDEX($B$7:B119,MATCH(9.99999999999999E+307,$B$7:B119)))),\"\")","v":637.33499999999958},4.8483999999999998,{"$f":"IF(D120<>\"\",IF(OR(B120<>\"\",INDIRECT(\"D121\")=0),D120,0),\"\")","v":4.8483999999999998},632.48659999999961,null,{"$f":"IF(D120<>\"\",IF(AND(B120<>\"\",B119<>\"\"),$I$4+H119,VLOOKUP(INDEX($B$7:B119,MATCH(9.99999999999999E+307,$B$7:B119)),$B$7:H119,7,FALSE)+$I$4),\"\")","v":-3.2695431477568412E-3},632.48333045685183]
["TP130",3.7231000000000001,{"$f":"IF(D121<>\"\",IF(OR(B121<>\"\",INDIRECT(\"D122\")=0),IF(B120<>\"\",F120+B120,VLOOKUP(INDEX($B$7:B120,MATCH(9.99999999999999E+307,$B$7:B120)),$B$7:F120,5,FALSE)+INDEX($B$7:B120,MATCH(9.99999999999999E+307,$B$7:B120))),(VLOOKUP(INDEX($B$7:B120,MATCH(9.99999999999999E+307,$B$7:B120)),$B$7:F120,5,FALSE))+(INDEX($B$7:B120,MATCH(9.99999999999999E+307,$B$7:B120)))),\"\")","v":635.99179999999956},6.7030000000000003,{"$f":"IF(D121<>\"\",IF(OR(B121<>\"\",INDIRECT(\"D122\")=0),D121,0),\"\")","v":6.7030000000000003},629.28879999999958,null,{"$f":"IF(D121<>\"\",IF(AND(B121<>\"\",B120<>\"\"),$I$4+H120,VLOOKUP(INDEX($B$7:B120,MATCH(9.99999999999999E+307,$B$7:B120)),$B$7:H120,7,FALSE)+$I$4),\"\")","v":-3.2984771579139816E-3},629.28550152284163]
["TP131",6.5915999999999997,{"$f":"IF(D122<>\"\",IF(OR(B122<>\"\",INDIRECT(\"D123\")=0),IF(B121<>\"\",F121+B121,VLOOKUP(INDEX($B$7:B121,MATCH(9.99999999999999E+307,$B$7:B121)),$B$7:F121,5,FALSE)+INDEX($B$7:B121,MATCH(9.99999999999999E+307,$B$7:B121))),(VLOOKUP(INDEX($B$7:B121,MATCH(9.99999999999999E+307,$B$7:B121)),$B$7:F121,5,FALSE))+(INDEX($B$7:B121,MATCH(9.99999999999999E+307,$B$7:B121)))),\"\")","v":633.01189999999963},4.0655999999999999,{"$f":"IF(D122<>\"\",IF(OR(B122<>\"\",INDIRECT(\"D123\")=0),D122,0),\"\")","v":4.0655999999999999},628.94629999999961,null,{"$f":"IF(D122<>\"\",IF(AND(B122<>\"\",B121<>\"\"),$I$4+H121,VLOOKUP(INDEX($B$7:B121,MATCH(9.99999999999999E+307,$B$7:B121)),$B$7:H121,7,FALSE)+$I$4),\"\")","v":-3.3274111680711219E-3},628.94297258883159]
["TP132",8.3849,{"$f":"IF(D123<>\"\",IF(OR(B123<>\"\",INDIRECT(\"D124\")=0),IF(B122<>\"\",F122+B122,VLOOKUP(INDEX($B$7:B122,MATCH(9.99999999999999E+307,$B$7:B122)),$B$7:F122,5,FALSE)+INDEX($B$7:B122,MATCH(9.99999999999999E+307,$B$7:B122))),(VLOOKUP(INDEX($B$7:B122,MATCH(9.99999999999999E+307,$B$7:B122)),$B$7:F122,5,FALSE))+(INDEX($B$7:B122,MATCH(9.99999999999999E+307,$B$7:B122)))),\"\")","v":635.53789999999958},1.8246,{"$f":"IF(D123<>\"\",IF(OR(B123<>\"\",INDIRECT(\"D124\")=0),D123,0),\"\")","v":1.8246},633.71329999999955,null,{"$f":"IF(D123<>\"\",IF(AND(B123<>\"\",B122<>\"\"),$I$4+H122,VLOOKUP(INDEX($B$7:B122,MATCH(9.99999999999999E+307,$B$7:B122)),$B$7:H122,7,FALSE)+$I$4),\"\")","v":-3.3563451782282622E-3},633.70994365482136]
["TP133",7.5004999999999997,{"$f":"IF(D124<>\"\",IF(OR(B124<>\"\",INDIRECT(\"D125\")=0),IF(B123<>\"\",F123+B123,VLOOKUP(INDEX($B$7:B123,MATCH(9.99999999999999E+307,$B$7:B123)),$B$7:F123,5,FALSE)+INDEX($B$7:B123,MATCH(9.99999999999999E+307,$B$7:B123))),(VLOOKUP(INDEX($B$7:B123,MATCH(9.99999999999999E+307,$B$7:B123)),$B$7:F123,5,FALSE))+(INDEX($B$7:B123,MATCH(9.99999999999999E+307,$B$7:B123)))),\"\")","v":642.09819999999957},1.5404,{"$f":"IF(D124<>\"\",IF(OR(B124<>\"\",INDIRECT(\"D125\")=0),D124,0),\"\")","v":1.5404},640.55779999999959,null,{"$f":"IF(D124<>\"\",IF(AND(B124<>\"\",B123<>\"\"),$I$4+H123,VLOOKUP(INDEX($B$7:B123,MATCH(9.99999999999999E+307,$B$7:B123)),$B$7:H123,7,FALSE)+$I$4),\"\")","v":-3.3852791883854025E-3},640.55441472081122]
["TP134",4.4181999999999997,{"$f":"IF(D125<>\"\",IF(OR(B125<>\"\",INDIRECT(\"D126\")=0),IF(B124<>\"\",F124+B124,VLOOKUP(INDEX($B$7:B124,MATCH(9.99999999999999E+307,$B$7:B124)),$B$7:F124,5,FALSE)+INDEX($B$7:B124,MATCH(9.99999999999999E+307,$B$7:B124))),(VLOOKUP(INDEX($B$7:B124,MATCH(9.99999999999999E+307,$B$7:B124)),$B$7:F124,5,FALSE))+(INDEX($B$7:B124,MATCH(9.99999999999999E+307,$B$7:B124)))),\"\")","v":648.05829999999958},4.8787000000000003,{"$f":"IF(D125<>\"\",IF(OR(B125<>\"\",INDIRECT(\"D126\")=0),D125,0),\"\")","v":4.8787000000000003},643.1795999999996,null,{"$f":"IF(D125<>\"\",IF(AND(B125<>\"\",B124<>\"\"),$I$4+H124,VLOOKUP(INDEX($B$7:B124,MATCH(9.99999999999999E+307,$B$7:B124)),$B$7:H124,7,FALSE)+$I$4),\"\")","v":-3.4142131985425428E-3},643.17618578680106]
["SV17",3.9413,{"$f":"IF(D126<>\"\",IF(OR(B126<>\"\",INDIRECT(\"D127\")=0),IF(B125<>\"\",F125+B125,VLOOKUP(INDEX($B$7:B125,MATCH(9.99999999999999E+307,$B$7:B125)),$B$7:F125,5,FALSE)+INDEX($B$7:B125,MATCH(9.99999999999999E+307,$B$7:B125))),(VLOOKUP(INDEX($B$7:B125,MATCH(9.99999999999999E+307,$B$7:B125)),$B$7:F125,5,FALSE))+(INDEX($B$7:B125,MATCH(9.99999999999999E+307,$B$7:B125)))),\"\")","v":647.59779999999955},8.3536000000000001,{"$f":"IF(D126<>\"\",IF(OR(B126<>\"\",INDIRECT(\"D127\")=0),D126,0),\"\")","v":8.3536000000000001},639.24419999999952,null,{"$f":"IF(D126<>\"\",IF(AND(B126<>\"\",B125<>\"\"),$I$4+H125,VLOOKUP(INDEX($B$7:B125,MATCH(9.99999999999999E+307,$B$7:B125)),$B$7:H125,7,FALSE)+$I$4),\"\")","v":-3.4431472086996831E-3},639.24075685279081]
["TP135",1.2156,{"$f":"IF(D127<>\"\",IF(OR(B127<>\"\",INDIRECT(\"D128\")=0),IF(B126<>\"\",F126+B126,VLOOKUP(INDEX($B$7:B126,MATCH(9.99999999999999E+307,$B$7:B126)),$B$7:F126,5,FALSE)+INDEX($B$7:B126,MATCH(9.99999999999999E+307,$B$7:B126))),(VLOOKUP(INDEX($B$7:B126,MATCH(9.99999999999999E+307,$B$7:B126)),$B$7:F126,5,FALSE))+(INDEX($B$7:B126,MATCH(9.99999999999999E+307,$B$7:B126)))),\"\")","v":643.18549999999948},7.6612999999999998,{"$f":"IF(D127<>\"\",IF(OR(B127<>\"\",INDIRECT(\"D128\")=0),D127,0),\"\")","v":7.6612999999999998},635.5241999999995,null,{"$f":"IF(D127<>\"\",IF(AND(B127<>\"\",B126<>\"\"),$I$4+H126,VLOOKUP(INDEX($B$7:B126,MATCH(9.99999999999999E+307,$B$7:B126)),$B$7:H126,7,FALSE)+$I$4),\"\")","v":-3.4720812188568234E-3},635.52072791878061]
["SV103",3.8898000000000001,{"$f":"IF(D128<>\"\",IF(OR(B128<>\"\",INDIRECT(\"D129\")=0),IF(B127<>\"\",F127+B127,VLOOKUP(INDEX($B$7:B127,MATCH(9.99999999999999E+307,$B$7:B127)),$B$7:F127,5,FALSE)+INDEX($B$7:B127,MATCH(9.99999999999999E+307,$B$7:B127))),(VLOOKUP(INDEX($B$7:B127,MATCH(9.99999999999999E+307,$B$7:B127)),$B$7:F127,5,FALSE))+(INDEX($B$7:B127,MATCH(9.99999999999999E+307,$B$7:B127)))),\"\")","v":636.73979999999949},8.1257999999999999,{"$f":"IF(D128<>\"\",IF(OR(B128<>\"\",INDIRECT(\"D129\")=0),D128,0),\"\")","v":8.1257999999999999},628.61399999999946,null,{"$f":"IF(D128<>\"\",IF(AND(B128<>\"\",B127<>\"\"),$I$4+H127,VLOOKUP(INDEX($B$7:B127,MATCH(9.99999999999999E+307,$B$7:B127)),$B$7:H127,7,FALSE)+$I$4),\"\")","v":-3.5010152290139637E-3},628.6104989847704]
["TP136",6.7470999999999997,{"$f":"IF(D129<>\"\",IF(OR(B129<>\"\",INDIRECT(\"D130\")=0),IF(B128<>\"\",F128+B128,VLOOKUP(INDEX($B$7:B128,MATCH(9.99999999999999E+307,$B$7:B128)),$B$7:F128,5,FALSE)+INDEX($B$7:B128,MATCH(9.99999999999999E+307,$B$7:B128))),(VLOOKUP(INDEX($B$7:B128,MATCH(9.99999999999999E+307,$B$7:B128)),$B$7:F128,5,FALSE))+(INDEX($B$7:B128,MATCH(9.99999999999999E+307,$B$7:B128)))),\"\")","v":632.5037999999995},4.1013999999999999,{"$f":"IF(D129<>\"\",IF(OR(B129<>\"\",INDIRECT(\"D130\")=0),D129,0),\"\")","v":4.1013999999999999},628.40239999999949,null,{"$f":"IF(D129<>\"\",IF(AND(B129<>\"\",B128<>\"\"),$I$4+H128,VLOOKUP(INDEX($B$7:B128,MATCH(9.99999999999999E+307,$B$7:B128)),$B$7:H128,7,FALSE)+$I$4),\"\")","v":-3.529949239171104E-3},628.39887005076037]
["TP137",7.5223000000000004,{"$f":"IF(D130<>\"\",IF(OR(B130<>\"\",INDIRECT(\"D131\")=0),IF(B129<>\"\",F129+B129,VLOOKUP(INDEX($B$7:B129,MATCH(9.99999999999999E+307,$B$7:B129)),$B$7:F129,5,FALSE)+INDEX($B$7:B129,MATCH(9.99999999999999E+307,$B$7:B129))),(VLOOKUP(INDEX($B$7:B129,MATCH(9.99999999999999E+307,$B$7:B129)),$B$7:F129,5,FALSE))+(INDEX($B$7:B129,MATCH(9.99999999999999E+307,$B$7:B129)))),\"\")","v":635.14949999999953},2.5989,{"$f":"IF(D130<>\"\",IF(OR(B130<>\"\",INDIRECT(\"D131\")=0),D130,0),\"\")","v":2.5989},632.55059999999958,null,{"$f":"IF(D130<>\"\",IF(AND(B130<>\"\",B129<>\"\"),$I$4+H129,VLOOKUP(INDEX($B$7:B129,MATCH(9.99999999999999E+307,$B$7:B129)),$B$7:H129,7,FALSE)+$I$4),\"\")","v":-3.5588832493282443E-3},632.54704111675028]
["TP138",7.5221999999999998,{"$f":"IF(D131<>\"\",IF(OR(B131<>\"\",INDIRECT(\"D132\")=0),IF(B130<>\"\",F130+B130,VLOOKUP(INDEX($B$7:B130,MATCH(9.99999999999999E+307,$B$7:B130)),$B$7:F130,5,FALSE)+INDEX($B$7:B130,MATCH(9.99999999999999E+307,$B$7:B130))),(VLOOKUP(INDEX($B$7:B130,MATCH(9.99999999999999E+307,$B$7:B130)),$B$7:F130,5,FALSE))+(INDEX($B$7:B130,MATCH(9.99999999999999E+307,$B$7:B130)))),\"\")","v":640.07289999999955},3.1623999999999999,{"$f":"IF(D131<>\"\",IF(OR(B131<>\"\",INDIRECT(\"D132\")=0),D131,0),\"\")","v":3.1623999999999999},636.9104999999995,null,{"$f":"IF(D131<>\"\",IF(AND(B131<>\"\",B130<>\"\"),$I$4+H130,VLOOKUP(INDEX($B$7:B130,MATCH(9.99999999999999E+307,$B$7:B130)),$B$7:H130,7,FALSE)+$I$4),\"\")","v":-3.5878172594853847E-3},636.90691218274003]
["TP139",8.3826999999999998,{"$f":"IF(D132<>\"\",IF(OR(B132<>\"\",INDIRECT(\"D133\")=0),IF(B131<>\"\",F131+B131,VLOOKUP(INDEX($B$7:B131,MATCH(9.99999999999999E+307,$B$7:B131)),$B$7:F131,5,FALSE)+INDEX($B$7:B131,MATCH(9.99999999999999E+307,$B$7:B131))),(VLOOKUP(INDEX($B$7:B131,MATCH(9.99999999999999E+307,$B$7:B131)),$B$7:F131,5,FALSE))+(INDEX($B$7:B131,MATCH(9.99999999999999E+307,$B$7:B131)))),\"\")","v":644.4326999999995},2.6436999999999999,{"$f":"IF(D132<>\"\",IF(OR(B132<>\"\",INDIRECT(\"D133\")=0),D132,0),\"\")","v":2.6436999999999999},641.78899999999953,null,{"$f":"IF(D132<>\"\",IF(AND(B132<>\"\",B131<>\"\"),$I$4+H131,VLOOKUP(INDEX($B$7:B131,MATCH(9.99999999999999E+307,$B$7:B131)),$B$7:H131,7,FALSE)+$I$4),\"\")","v":-3.616751269642525E-3},641.78538324872989]
["TP140",4.5590000000000002,{"$f":"IF(D133<>\"\",IF(OR(B133<>\"\",INDIRECT(\"D134\")=0),IF(B132<>\"\",F132+B132,VLOOKUP(INDEX($B$7:B132,MATCH(9.99999999999999E+307,$B$7:B132)),$B$7:F132,5,FALSE)+INDEX($B$7:B132,MATCH(9.99999999999999E+307,$B$7:B132))),(VLOOKUP(INDEX($B$7:B132,MATCH(9.99999999999999E+307,$B$7:B132)),$B$7:F132,5,FALSE))+(INDEX($B$7:B132,MATCH(9.99999999999999E+307,$B$7:B132)))),\"\")","v":650.17169999999953},3.9218999999999999,{"$f":"IF(D133<>\"\",IF(OR(B133<>\"\",INDIRECT(\"D134\")=0),D133,0),\"\")","v":3.9218999999999999},646.24979999999948,null,{"$f":"IF(D133<>\"\",IF(AND(B133<>\"\",B132<>\"\"),$I$4+H132,VLOOKUP(INDEX($B$7:B132,MATCH(9.99999999999999E+307,$B$7:B132)),$B$7:H132,7,FALSE)+$I$4),\"\")","v":-3.6456852797996653E-3},646.24615431471966]
["SV16",5.0118999999999998,{"$f":"IF(D134<>\"\",IF(OR(B134<>\"\",INDIRECT(\"D135\")=0),IF(B133<>\"\",F133+B133,VLOOKUP(INDEX($B$7:B133,MATCH(9.99999999999999E+307,$B$7:B133)),$B$7:F133,5,FALSE)+INDEX($B$7:B133,MATCH(9.99999999999999E+307,$B$7:B133))),(VLOOKUP(INDEX($B$7:B133,MATCH(9.99999999999999E+307,$B$7:B133)),$B$7:F133,5,FALSE))+(INDEX($B$7:B133,MATCH(9.99999999999999E+307,$B$7:B133)))),\"\")","v":650.80879999999945},6.7704000000000004,{"$f":"IF(D134<>\"\",IF(OR(B134<>\"\",INDIRECT(\"D135\")=0),D134,0),\"\")","v":6.7704000000000004},644.03839999999946,null,{"$f":"IF(D134<>\"\",IF(AND(B134<>\"\",B133<>\"\"),$I$4+H133,VLOOKUP(INDEX($B$7:B133,MATCH(9.99999999999999E+307,$B$7:B133)),$B$7:H133,7,FALSE)+$I$4),\"\")","v":-3.6746192899568056E-3},644.03472538070946]
["TP141",2.5327000000000002,{"$f":"IF(D135<>\"\",IF(OR(B135<>\"\",INDIRECT(\"D136\")=0),IF(B134<>\"\",F134+B134,VLOOKUP(INDEX($B$7:B134,MATCH(9.99999999999999E+307,$B$7:B134)),$B$7:F134,5,FALSE)+INDEX($B$7:B134,MATCH(9.99999999999999E+307,$B$7:B134))),(VLOOKUP(INDEX($B$7:B134,MATCH(9.99999999999999E+307,$B$7:B134)),$B$7:F134,5,FALSE))+(INDEX($B$7:B134,MATCH(9.99999999999999E+307,$B$7:B134)))),\"\")","v":649.05029999999942},5.6710000000000003,{"$f":"IF(D135<>\"\",IF(OR(B135<>\"\",INDIRECT(\"D136\")=0),D135,0),\"\")","v":5.6710000000000003},643.37929999999938,null,{"$f":"IF(D135<>\"\",IF(AND(B135<>\"\",B134<>\"\"),$I$4+H134,VLOOKUP(INDEX($B$7:B134,MATCH(9.99999999999999E+307,$B$7:B134)),$B$7:H134,7,FALSE)+$I$4),\"\")","v":-3.7035533001139459E-3},643.37559644669921]
["SV15",4.0212000000000003,{"$f":"IF(D136<>\"\",IF(OR(B136<>\"\",INDIRECT(\"D137\")=0),IF(B135<>\"\",F135+B135,VLOOKUP(INDEX($B$7:B135,MATCH(9.99999999999999E+307,$B$7:B135)),$B$7:F135,5,FALSE)+INDEX($B$7:B135,MATCH(9.99999999999999E+307,$B$7:B135))),(VLOOKUP(INDEX($B$7:B135,MATCH(9.99999999999999E+307,$B$7:B135)),$B$7:F135,5,FALSE))+(INDEX($B$7:B135,MATCH(9.99999999999999E+307,$B$7:B135)))),\"\")","v":645.91199999999935},7.9992000000000001,{"$f":"IF(D136<>\"\",IF(OR(B136<>\"\",INDIRECT(\"D137\")=0),D136,0),\"\")","v":7.9992000000000001},637.91279999999938,null,{"$f":"IF(D136<>\"\",IF(AND(B136<>\"\",B135<>\"\"),$I$4+H135,VLOOKUP(INDEX($B$7:B135,MATCH(9.99999999999999E+307,$B$7:B135)),$B$7:H135,7,FALSE)+$I$4),\"\")","v":-3.7324873102710862E-3},637.90906751268915]
["TP142",3.4674999999999998,{"$f":"IF(D137<>\"\",IF(OR(B137<>\"\",INDIRECT(\"D138\")=0),IF(B136<>\"\",F136+B136,VLOOKUP(INDEX($B$7:B136,MATCH(9.99999999999999E+307,$B$7:B136)),$B$7:F136,5,FALSE)+INDEX($B$7:B136,MATCH(9.99999999999999E+307,$B$7:B136))),(VLOOKUP(INDEX($B$7:B136,MATCH(9.99999999999999E+307,$B$7:B136)),$B$7:F136,5,FALSE))+(INDEX($B$7:B136,MATCH(9.99999999999999E+307,$B$7:B136)))),\"\")","v":641.9339999999994},6.0438999999999998,{"$f":"IF(D137<>\"\",IF(OR(B137<>\"\",INDIRECT(\"D138\")=0),D137,0),\"\")","v":6.0438999999999998},{"$f":"IF(D137<>\"\",C137-D137,\"\")","v":635.89009999999939},null,{"$f":"IF(D137<>\"\",IF(AND(B137<>\"\",B136<>\"\"),$I$4+H136,VLOOKUP(INDEX($B$7:B136,MATCH(9.99999999999999E+307,$B$7:B136)),$B$7:H136,7,FALSE)+$I$4),\"\")","v":-3.7614213204282265E-3},{"$f":"IF(D137<>\"\",(F137+H137),\"\")","v":635.88633857867899}]
["TP143",3.3058999999999998,{"$f":"IF(D138<>\"\",IF(OR(B138<>\"\",INDIRECT(\"D139\")=0),IF(B137<>\"\",F137+B137,VLOOKUP(INDEX($B$7:B137,MATCH(9.99999999999999E+307,$B$7:B137)),$B$7:F137,5,FALSE)+INDEX($B$7:B137,MATCH(9.99999999999999E+307,$B$7:B137))),(VLOOKUP(INDEX($B$7:B137,MATCH(9.99999999999999E+307,$B$7:B137)),$B$7:F137,5,FALSE))+(INDEX($B$7:B137,MATCH(9.99999999999999E+307,$B$7:B137)))),\"\")","v":639.35759999999937},7.9260999999999999,{"$f":"IF(D138<>\"\",IF(OR(B138<>\"\",INDIRECT(\"D139\")=0),D138,0),\"\")","v":7.9260999999999999},631.43149999999935,null,{"$f":"IF(D138<>\"\",IF(AND(B138<>\"\",B137<>\"\"),$I$4+H137,VLOOKUP(INDEX($B$7:B137,MATCH(9.99999999999999E+307,$B$7:B137)),$B$7:H137,7,FALSE)+$I$4),\"\")","v":-3.7903553305853668E-3},631.42770964466877]
["TP144",6.2092999999999998,{"$f":"IF(D139<>\"\",IF(OR(B139<>\"\",INDIRECT(\"D140\")=0),IF(B138<>\"\",F138+B138,VLOOKUP(INDEX($B$7:B138,MATCH(9.99999999999999E+307,$B$7:B138)),$B$7:F138,5,FALSE)+INDEX($B$7:B138,MATCH(9.99999999999999E+307,$B$7:B138))),(VLOOKUP(INDEX($B$7:B138,MATCH(9.99999999999999E+307,$B$7:B138)),$B$7:F138,5,FALSE))+(INDEX($B$7:B138,MATCH(9.99999999999999E+307,$B$7:B138)))),\"\")","v":634.7373999999993},6.3253000000000004,{"$f":"IF(D139<>\"\",IF(OR(B139<>\"\",INDIRECT(\"D140\")=0),D139,0),\"\")","v":6.3253000000000004},628.41209999999933,null,{"$f":"IF(D139<>\"\",IF(AND(B139<>\"\",B138<>\"\"),$I$4+H138,VLOOKUP(INDEX($B$7:B138,MATCH(9.99999999999999E+307,$B$7:B138)),$B$7:H138,7,FALSE)+$I$4),\"\")","v":-3.8192893407425071E-3},628.40828071065857]
["TP145",6.4680999999999997,{"$f":"IF(D140<>\"\",IF(OR(B140<>\"\",INDIRECT(\"D141\")=0),IF(B139<>\"\",F139+B139,VLOOKUP(INDEX($B$7:B139,MATCH(9.99999999999999E+307,$B$7:B139)),$B$7:F139,5,FALSE)+INDEX($B$7:B139,MATCH(9.99999999999999E+307,$B$7:B139))),(VLOOKUP(INDEX($B$7:B139,MATCH(9.99999999999999E+307,$B$7:B139)),$B$7:F139,5,FALSE))+(INDEX($B$7:B139,MATCH(9.99999999999999E+307,$B$7:B139)))),\"\")","v":634.62139999999931},3.5146999999999999,{"$f":"IF(D140<>\"\",IF(OR(B140<>\"\",INDIRECT(\"D141\")=0),D140,0),\"\")","v":3.5146999999999999},631.10669999999936,null,{"$f":"IF(D140<>\"\",IF(AND(B140<>\"\",B139<>\"\"),$I$4+H139,VLOOKUP(INDEX($B$7:B139,MATCH(9.99999999999999E+307,$B$7:B139)),$B$7:H139,7,FALSE)+$I$4),\"\")","v":-3.8482233508996475E-3},631.10285177664844]
["TP146",6.1113,{"$f":"IF(D141<>\"\",IF(OR(B141<>\"\",INDIRECT(\"D142\")=0),IF(B140<>\"\",F140+B140,VLOOKUP(INDEX($B$7:B140,MATCH(9.99999999999999E+307,$B$7:B140)),$B$7:F140,5,FALSE)+INDEX($B$7:B140,MATCH(9.99999999999999E+307,$B$7:B140))),(VLOOKUP(INDEX($B$7:B140,MATCH(9.99999999999999E+307,$B$7:B140)),$B$7:F140,5,FALSE))+(INDEX($B$7:B140,MATCH(9.99999999999999E+307,$B$7:B140)))),\"\")","v":637.57479999999941},2.6890999999999998,{"$f":"IF(D141<>\"\",IF(OR(B141<>\"\",INDIRECT(\"D142\")=0),D141,0),\"\")","v":2.6890999999999998},634.88569999999936,null,{"$f":"IF(D141<>\"\",IF(AND(B141<>\"\",B140<>\"\"),$I$4+H140,VLOOKUP(INDEX($B$7:B140,MATCH(9.99999999999999E+307,$B$7:B140)),$B$7:H140,7,FALSE)+$I$4),\"\")","v":-3.8771573610567878E-3},634.88182284263826]
["TP147",4.1809000000000003,{"$f":"IF(D142<>\"\",IF(OR(B142<>\"\",INDIRECT(\"D143\")=0),IF(B141<>\"\",F141+B141,VLOOKUP(INDEX($B$7:B141,MATCH(9.99999999999999E+307,$B$7:B141)),$B$7:F141,5,FALSE)+INDEX($B$7:B141,MATCH(9.99999999999999E+307,$B$7:B141))),(VLOOKUP(INDEX($B$7:B141,MATCH(9.99999999999999E+307,$B$7:B141)),$B$7:F141,5,FALSE))+(INDEX($B$7:B141,MATCH(9.99999999999999E+307,$B$7:B141)))),\"\")","v":640.99699999999939},4.1040000000000001,{"$f":"IF(D142<>\"\",IF(OR(B142<>\"\",INDIRECT(\"D143\")=0),D142,0),\"\")","v":4.1040000000000001},636.89299999999935,null,{"$f":"IF(D142<>\"\",IF(AND(B142<>\"\",B141<>\"\"),$I$4+H141,VLOOKUP(INDEX($B$7:B141,MATCH(9.99999999999999E+307,$B$7:B141)),$B$7:H141,7,FALSE)+$I$4),\"\")","v":-3.9060913712139281E-3},636.88909390862818]
["SV14",4.3620000000000001,{"$f":"IF(D143<>\"\",IF(OR(B143<>\"\",INDIRECT(\"D144\")=0),IF(B142<>\"\",F142+B142,VLOOKUP(INDEX($B$7:B142,MATCH(9.99999999999999E+307,$B$7:B142)),$B$7:F142,5,FALSE)+INDEX($B$7:B142,MATCH(9.99999999999999E+307,$B$7:B142))),(VLOOKUP(INDEX($B$7:B142,MATCH(9.99999999999999E+307,$B$7:B142)),$B$7:F142,5,FALSE))+(INDEX($B$7:B142,MATCH(9.99999999999999E+307,$B$7:B142)))),\"\")","v":641.0738999999993},8.1491000000000007,{"$f":"IF(D143<>\"\",IF(OR(B143<>\"\",INDIRECT(\"D144\")=0),D143,0),\"\")","v":8.1491000000000007},632.92479999999932,null,{"$f":"IF(D143<>\"\",IF(AND(B143<>\"\",B142<>\"\"),$I$4+H142,VLOOKUP(INDEX($B$7:B142,MATCH(9.99999999999999E+307,$B$7:B142)),$B$7:H142,7,FALSE)+$I$4),\"\")","v":-3.9350253813710684E-3},632.92086497461798]
["TP148",1.4895,{"$f":"IF(D144<>\"\",IF(OR(B144<>\"\",INDIRECT(\"D145\")=0),IF(B143<>\"\",F143+B143,VLOOKUP(INDEX($B$7:B143,MATCH(9.99999999999999E+307,$B$7:B143)),$B$7:F143,5,FALSE)+INDEX($B$7:B143,MATCH(9.99999999999999E+307,$B$7:B143))),(VLOOKUP(INDEX($B$7:B143,MATCH(9.99999999999999E+307,$B$7:B143)),$B$7:F143,5,FALSE))+(INDEX($B$7:B143,MATCH(9.99999999999999E+307,$B$7:B143)))),\"\")","v":637.28679999999929},6.2847,{"$f":"IF(D144<>\"\",IF(OR(B144<>\"\",INDIRECT(\"D145\")=0),D144,0),\"\")","v":6.2847},631.00209999999925,null,{"$f":"IF(D144<>\"\",IF(AND(B144<>\"\",B143<>\"\"),$I$4+H143,VLOOKUP(INDEX($B$7:B143,MATCH(9.99999999999999E+307,$B$7:B143)),$B$7:H143,7,FALSE)+$I$4),\"\")","v":-3.9639593915282087E-3},630.99813604060773]
["SV13",6.1268000000000002,{"$f":"IF(D145<>\"\",IF(OR(B145<>\"\",INDIRECT(\"D146\")=0),IF(B144<>\"\",F144+B144,VLOOKUP(INDEX($B$7:B144,MATCH(9.99999999999999E+307,$B$7:B144)),$B$7:F144,5,FALSE)+INDEX($B$7:B144,MATCH(9.99999999999999E+307,$B$7:B144))),(VLOOKUP(INDEX($B$7:B144,MATCH(9.99999999999999E+307,$B$7:B144)),$B$7:F144,5,FALSE))+(INDEX($B$7:B144,MATCH(9.99999999999999E+307,$B$7:B144)))),\"\")","v":632.49159999999927},8.5533999999999999,{"$f":"IF(D145<>\"\",IF(OR(B145<>\"\",INDIRECT(\"D146\")=0),D145,0),\"\")","v":8.5533999999999999},623.93819999999926,null,{"$f":"IF(D145<>\"\",IF(AND(B145<>\"\",B144<>\"\"),$I$4+H144,VLOOKUP(INDEX($B$7:B144,MATCH(9.99999999999999E+307,$B$7:B144)),$B$7:H144,7,FALSE)+$I$4),\"\")","v":-3.992893401685349E-3},623.93420710659757]
["TP55",5.2633999999999999,{"$f":"IF(D146<>\"\",IF(OR(B146<>\"\",INDIRECT(\"D147\")=0),IF(B145<>\"\",F145+B145,VLOOKUP(INDEX($B$7:B145,MATCH(9.99999999999999E+307,$B$7:B145)),$B$7:F145,5,FALSE)+INDEX($B$7:B145,MATCH(9.99999999999999E+307,$B$7:B145))),(VLOOKUP(INDEX($B$7:B145,MATCH(9.99999999999999E+307,$B$7:B145)),$B$7:F145,5,FALSE))+(INDEX($B$7:B145,MATCH(9.99999999999999E+307,$B$7:B145)))),\"\")","v":630.06499999999926},5.8737000000000004,{"$f":"IF(D146<>\"\",IF(OR(B146<>\"\",INDIRECT(\"D147\")=0),D146,0),\"\")","v":5.8737000000000004},624.19129999999927,null,{"$f":"IF(D146<>\"\",IF(AND(B146<>\"\",B145<>\"\"),$I$4+H145,VLOOKUP(INDEX($B$7:B145,MATCH(9.99999999999999E+307,$B$7:B145)),$B$7:H145,7,FALSE)+$I$4),\"\")","v":-4.0218274118424893E-3},624.18727817258741]
["TP56",5.7217000000000002,{"$f":"IF(D147<>\"\",IF(OR(B147<>\"\",INDIRECT(\"D148\")=0),IF(B146<>\"\",F146+B146,VLOOKUP(INDEX($B$7:B146,MATCH(9.99999999999999E+307,$B$7:B146)),$B$7:F146,5,FALSE)+INDEX($B$7:B146,MATCH(9.99999999999999E+307,$B$7:B146))),(VLOOKUP(INDEX($B$7:B146,MATCH(9.99999999999999E+307,$B$7:B146)),$B$7:F146,5,FALSE))+(INDEX($B$7:B146,MATCH(9.99999999999999E+307,$B$7:B146)))),\"\")","v":629.45469999999932},4.2708000000000004,{"$f":"IF(D147<>\"\",IF(OR(B147<>\"\",INDIRECT(\"D148\")=0),D147,0),\"\")","v":4.2708000000000004},625.18389999999931,null,{"$f":"IF(D147<>\"\",IF(AND(B147<>\"\",B146<>\"\"),$I$4+H146,VLOOKUP(INDEX($B$7:B146,MATCH(9.99999999999999E+307,$B$7:B146)),$B$7:H146,7,FALSE)+$I$4),\"\")","v":-4.0507614219996296E-3},625.17984923857728]
["TP57",5.5903999999999998,{"$f":"IF(D148<>\"\",IF(OR(B148<>\"\",INDIRECT(\"D149\")=0),IF(B147<>\"\",F147+B147,VLOOKUP(INDEX($B$7:B147,MATCH(9.99999999999999E+307,$B$7:B147)),$B$7:F147,5,FALSE)+INDEX($B$7:B147,MATCH(9.99999999999999E+307,$B$7:B147))),(VLOOKUP(INDEX($B$7:B147,MATCH(9.99999999999999E+307,$B$7:B147)),$B$7:F147,5,FALSE))+(INDEX($B$7:B147,MATCH(9.99999999999999E+307,$B$7:B147)))),\"\")","v":630.90559999999937},3.8046000000000002,{"$f":"IF(D148<>\"\",IF(OR(B148<>\"\",INDIRECT(\"D149\")=0),D148,0),\"\")","v":3.8046000000000002},627.10099999999932,null,{"$f":"IF(D148<>\"\",IF(AND(B148<>\"\",B147<>\"\"),$I$4+H147,VLOOKUP(INDEX($B$7:B147,MATCH(9.99999999999999E+307,$B$7:B147)),$B$7:H147,7,FALSE)+$I$4),\"\")","v":-4.0796954321567699E-3},627.09692030456711]
["TP58",5.5324,{"$f":"IF(D149<>\"\",IF(OR(B149<>\"\",INDIRECT(\"D150\")=0),IF(B148<>\"\",F148+B148,VLOOKUP(INDEX($B$7:B148,MATCH(9.99999999999999E+307,$B$7:B148)),$B$7:F148,5,FALSE)+INDEX($B$7:B148,MATCH(9.99999999999999E+307,$B$7:B148))),(VLOOKUP(INDEX($B$7:B148,MATCH(9.99999999999999E+307,$B$7:B148)),$B$7:F148,5,FALSE))+(INDEX($B$7:B148,MATCH(9.99999999999999E+307,$B$7:B148)))),\"\")","v":632.69139999999936},4.2643000000000004,{"$f":"IF(D149<>\"\",IF(OR(B149<>\"\",INDIRECT(\"D150\")=0),D149,0),\"\")","v":4.2643000000000004},628.42709999999931,null,{"$f":"IF(D149<>\"\",IF(AND(B149<>\"\",B148<>\"\"),$I$4+H148,VLOOKUP(INDEX($B$7:B148,MATCH(9.99999999999999E+307,$B$7:B148)),$B$7:H148,7,FALSE)+$I$4),\"\")","v":-4.1086294423139103E-3},628.42299137055704]
["TP59",4.3345000000000002,{"$f":"IF(D150<>\"\",IF(OR(B150<>\"\",INDIRECT(\"D151\")=0),IF(B149<>\"\",F149+B149,VLOOKUP(INDEX($B$7:B149,MATCH(9.99999999999999E+307,$B$7:B149)),$B$7:F149,5,FALSE)+INDEX($B$7:B149,MATCH(9.99999999999999E+307,$B$7:B149))),(VLOOKUP(INDEX($B$7:B149,MATCH(9.99999999999999E+307,$B$7:B149)),$B$7:F149,5,FALSE))+(INDEX($B$7:B149,MATCH(9.99999999999999E+307,$B$7:B149)))),\"\")","v":633.95949999999937},5.5902000000000003,{"$f":"IF(D150<>\"\",IF(OR(B150<>\"\",INDIRECT(\"D151\")=0),D150,0),\"\")","v":5.5902000000000003},628.36929999999938,null,{"$f":"IF(D150<>\"\",IF(AND(B150<>\"\",B149<>\"\"),$I$4+H149,VLOOKUP(INDEX($B$7:B149,MATCH(9.99999999999999E+307,$B$7:B149)),$B$7:H149,7,FALSE)+$I$4),\"\")","v":-4.1375634524710506E-3},628.36516243654694]
["TP60",3.6478000000000002,{"$f":"IF(D151<>\"\",IF(OR(B151<>\"\",INDIRECT(\"D152\")=0),IF(B150<>\"\",F150+B150,VLOOKUP(INDEX($B$7:B150,MATCH(9.99999999999999E+307,$B$7:B150)),$B$7:F150,5,FALSE)+INDEX($B$7:B150,MATCH(9.99999999999999E+307,$B$7:B150))),(VLOOKUP(INDEX($B$7:B150,MATCH(9.99999999999999E+307,$B$7:B150)),$B$7:F150,5,FALSE))+(INDEX($B$7:B150,MATCH(9.99999999999999E+307,$B$7:B150)))),\"\")","v":632.70379999999943},5.4226000000000001,{"$f":"IF(D151<>\"\",IF(OR(B151<>\"\",INDIRECT(\"D152\")=0),D151,0),\"\")","v":5.4226000000000001},627.28119999999944,null,{"$f":"IF(D151<>\"\",IF(AND(B151<>\"\",B150<>\"\"),$I$4+H150,VLOOKUP(INDEX($B$7:B150,MATCH(9.99999999999999E+307,$B$7:B150)),$B$7:H150,7,FALSE)+$I$4),\"\")","v":-4.1664974626281909E-3},627.27703350253682]
["SV12",6.1745000000000001,{"$f":"IF(D152<>\"\",IF(OR(B152<>\"\",INDIRECT(\"D153\")=0),IF(B151<>\"\",F151+B151,VLOOKUP(INDEX($B$7:B151,MATCH(9.99999999999999E+307,$B$7:B151)),$B$7:F151,5,FALSE)+INDEX($B$7:B151,MATCH(9.99999999999999E+307,$B$7:B151))),(VLOOKUP(INDEX($B$7:B151,MATCH(9.99999999999999E+307,$B$7:B151)),$B$7:F151,5,FALSE))+(INDEX($B$7:B151,MATCH(9.99999999999999E+307,$B$7:B151)))),\"\")","v":630.92899999999941},6.1323999999999996,{"$f":"IF(D152<>\"\",IF(OR(B152<>\"\",INDIRECT(\"D153\")=0),D152,0),\"\")","v":6.1323999999999996},624.79659999999944,null,{"$f":"IF(D152<>\"\",IF(AND(B152<>\"\",B151<>\"\"),$I$4+H151,VLOOKUP(INDEX($B$7:B151,MATCH(9.99999999999999E+307,$B$7:B151)),$B$7:H151,7,FALSE)+$I$4),\"\")","v":-4.1954314727853312E-3},624.79240456852665]
["TP61",5.2126000000000001,{"$f":"IF(D153<>\"\",IF(OR(B153<>\"\",INDIRECT(\"D154\")=0),IF(B152<>\"\",F152+B152,VLOOKUP(INDEX($B$7:B152,MATCH(9.99999999999999E+307,$B$7:B152)),$B$7:F152,5,FALSE)+INDEX($B$7:B152,MATCH(9.99999999999999E+307,$B$7:B152))),(VLOOKUP(INDEX($B$7:B152,MATCH(9.99999999999999E+307,$B$7:B152)),$B$7:F152,5,FALSE))+(INDEX($B$7:B152,MATCH(9.99999999999999E+307,$B$7:B152)))),\"\")","v":630.97109999999941},4.1044,{"$f":"IF(D153<>\"\",IF(OR(B153<>\"\",INDIRECT(\"D154\")=0),D153,0),\"\")","v":4.1044},626.86669999999935,null,{"$f":"IF(D153<>\"\",IF(AND(B153<>\"\",B152<>\"\"),$I$4+H152,VLOOKUP(INDEX($B$7:B152,MATCH(9.99999999999999E+307,$B$7:B152)),$B$7:H152,7,FALSE)+$I$4),\"\")","v":-4.2243654829424715E-3},626.86247563451639]
["SV102",6.0164999999999997,{"$f":"IF(D154<>\"\",IF(OR(B154<>\"\",INDIRECT(\"D155\")=0),IF(B153<>\"\",F153+B153,VLOOKUP(INDEX($B$7:B153,MATCH(9.99999999999999E+307,$B$7:B153)),$B$7:F153,5,FALSE)+INDEX($B$7:B153,MATCH(9.99999999999999E+307,$B$7:B153))),(VLOOKUP(INDEX($B$7:B153,MATCH(9.99999999999999E+307,$B$7:B153)),$B$7:F153,5,FALSE))+(INDEX($B$7:B153,MATCH(9.99999999999999E+307,$B$7:B153)))),\"\")","v":632.07929999999931},3.1758999999999999,{"$f":"IF(D154<>\"\",IF(OR(B154<>\"\",INDIRECT(\"D155\")=0),D154,0),\"\")","v":3.1758999999999999},628.90339999999935,null,{"$f":"IF(D154<>\"\",IF(AND(B154<>\"\",B153<>\"\"),$I$4+H153,VLOOKUP(INDEX($B$7:B153,MATCH(9.99999999999999E+307,$B$7:B153)),$B$7:H153,7,FALSE)+$I$4),\"\")","v":-4.2532994930996118E-3},628.89914670050621]
["TP62",7.2107000000000001,{"$f":"IF(D155<>\"\",IF(OR(B155<>\"\",INDIRECT(\"D156\")=0),IF(B154<>\"\",F154+B154,VLOOKUP(INDEX($B$7:B154,MATCH(9.99999999999999E+307,$B$7:B154)),$B$7:F154,5,FALSE)+INDEX($B$7:B154,MATCH(9.99999999999999E+307,$B$7:B154))),(VLOOKUP(INDEX($B$7:B154,MATCH(9.99999999999999E+307,$B$7:B154)),$B$7:F154,5,FALSE))+(INDEX($B$7:B154,MATCH(9.99999999999999E+307,$B$7:B154)))),\"\")","v":634.9198999999993},2.8813,{"$f":"IF(D155<>\"\",IF(OR(B155<>\"\",INDIRECT(\"D156\")=0),D155,0),\"\")","v":2.8813},632.03859999999929,null,{"$f":"IF(D155<>\"\",IF(AND(B155<>\"\",B154<>\"\"),$I$4+H154,VLOOKUP(INDEX($B$7:B154,MATCH(9.99999999999999E+307,$B$7:B154)),$B$7:H154,7,FALSE)+$I$4),\"\")","v":-4.2822335032567521E-3},632.03431776649609]
["TP63",6.4672999999999998,{"$f":"IF(D156<>\"\",IF(OR(B156<>\"\",INDIRECT(\"D157\")=0),IF(B155<>\"\",F155+B155,VLOOKUP(INDEX($B$7:B155,MATCH(9.99999999999999E+307,$B$7:B155)),$B$7:F155,5,FALSE)+INDEX($B$7:B155,MATCH(9.99999999999999E+307,$B$7:B155))),(VLOOKUP(INDEX($B$7:B155,MATCH(9.99999999999999E+307,$B$7:B155)),$B$7:F155,5,FALSE))+(INDEX($B$7:B155,MATCH(9.99999999999999E+307,$B$7:B155)))),\"\")","v":639.24929999999927},3.3984999999999999,{"$f":"IF(D156<>\"\",IF(OR(B156<>\"\",INDIRECT(\"D157\")=0),D156,0),\"\")","v":3.3984999999999999},635.85079999999925,null,{"$f":"IF(D156<>\"\",IF(AND(B156<>\"\",B155<>\"\"),$I$4+H155,VLOOKUP(INDEX($B$7:B155,MATCH(9.99999999999999E+307,$B$7:B155)),$B$7:H155,7,FALSE)+$I$4),\"\")","v":-4.3111675134138924E-3},635.84648883248587]
["TP64",4.6125999999999996,{"$f":"IF(D157<>\"\",IF(OR(B157<>\"\",INDIRECT(\"D158\")=0),IF(B156<>\"\",F156+B156,VLOOKUP(INDEX($B$7:B156,MATCH(9.99999999999999E+307,$B$7:B156)),$B$7:F156,5,FALSE)+INDEX($B$7:B156,MATCH(9.99999999999999E+307,$B$7:B156))),(VLOOKUP(INDEX($B$7:B156,MATCH(9.99999999999999E+307,$B$7:B156)),$B$7:F156,5,FALSE))+(INDEX($B$7:B156,MATCH(9.99999999999999E+307,$B$7:B156)))),\"\")","v":642.31809999999928},5.0994000000000002,{"$f":"IF(D157<>\"\",IF(OR(B157<>\"\",INDIRECT(\"D158\")=0),D157,0),\"\")","v":5.0994000000000002},637.21869999999933,null,{"$f":"IF(D157<>\"\",IF(AND(B157<>\"\",B156<>\"\"),$I$4+H156,VLOOKUP(INDEX($B$7:B156,MATCH(9.99999999999999E+307,$B$7:B156)),$B$7:H156,7,FALSE)+$I$4),\"\")","v":-4.3401015235710327E-3},637.21435989847578]
["TP65",6.2323000000000004,{"$f":"IF(D158<>\"\",IF(OR(B158<>\"\",INDIRECT(\"D159\")=0),IF(B157<>\"\",F157+B157,VLOOKUP(INDEX($B$7:B157,MATCH(9.99999999999999E+307,$B$7:B157)),$B$7:F157,5,FALSE)+INDEX($B$7:B157,MATCH(9.99999999999999E+307,$B$7:B157))),(VLOOKUP(INDEX($B$7:B157,MATCH(9.99999999999999E+307,$B$7:B157)),$B$7:F157,5,FALSE))+(INDEX($B$7:B157,MATCH(9.99999999999999E+307,$B$7:B157)))),\"\")","v":641.83129999999937},5.0273000000000003,{"$f":"IF(D158<>\"\",IF(OR(B158<>\"\",INDIRECT(\"D159\")=0),D158,0),\"\")","v":5.0273000000000003},636.80399999999941,null,{"$f":"IF(D158<>\"\",IF(AND(B158<>\"\",B157<>\"\"),$I$4+H157,VLOOKUP(INDEX($B$7:B157,MATCH(9.99999999999999E+307,$B$7:B157)),$B$7:H157,7,FALSE)+$I$4),\"\")","v":-4.369035533728173E-3},636.79963096446568]
["TP66",4.5115999999999996,{"$f":"IF(D159<>\"\",IF(OR(B159<>\"\",INDIRECT(\"D160\")=0),IF(B158<>\"\",F158+B158,VLOOKUP(INDEX($B$7:B158,MATCH(9.99999999999999E+307,$B$7:B158)),$B$7:F158,5,FALSE)+INDEX($B$7:B158,MATCH(9.99999999999999E+307,$B$7:B158))),(VLOOKUP(INDEX($B$7:B158,MATCH(9.99999999999999E+307,$B$7:B158)),$B$7:F158,5,FALSE))+(INDEX($B$7:B158,MATCH(9.99999999999999E+307,$B$7:B158)))),\"\")","v":643.03629999999941},4.2276999999999996,{"$f":"IF(D159<>\"\",IF(OR(B159<>\"\",INDIRECT(\"D160\")=0),D159,0),\"\")","v":4.2276999999999996},638.80859999999939,null,{"$f":"IF(D159<>\"\",IF(AND(B159<>\"\",B158<>\"\"),$I$4+H158,VLOOKUP(INDEX($B$7:B158,MATCH(9.99999999999999E+307,$B$7:B158)),$B$7:H158,7,FALSE)+$I$4),\"\")","v":-4.3979695438853134E-3},638.80420203045549]
["SV11",4.4852999999999996,{"$f":"IF(D160<>\"\",IF(OR(B160<>\"\",INDIRECT(\"D161\")=0),IF(B159<>\"\",F159+B159,VLOOKUP(INDEX($B$7:B159,MATCH(9.99999999999999E+307,$B$7:B159)),$B$7:F159,5,FALSE)+INDEX($B$7:B159,MATCH(9.99999999999999E+307,$B$7:B159))),(VLOOKUP(INDEX($B$7:B159,MATCH(9.99999999999999E+307,$B$7:B159)),$B$7:F159,5,FALSE))+(INDEX($B$7:B159,MATCH(9.99999999999999E+307,$B$7:B159)))),\"\")","v":643.32019999999943},6.7972000000000001,{"$f":"IF(D160<>\"\",IF(OR(B160<>\"\",INDIRECT(\"D161\")=0),D160,0),\"\")","v":6.7972000000000001},636.52299999999946,null,{"$f":"IF(D160<>\"\",IF(AND(B160<>\"\",B159<>\"\"),$I$4+H159,VLOOKUP(INDEX($B$7:B159,MATCH(9.99999999999999E+307,$B$7:B159)),$B$7:H159,7,FALSE)+$I$4),\"\")","v":-4.4269035540424537E-3},636.51857309644538]
["TP67",3.3752,{"$f":"IF(D161<>\"\",IF(OR(B161<>\"\",INDIRECT(\"D162\")=0),IF(B160<>\"\",F160+B160,VLOOKUP(INDEX($B$7:B160,MATCH(9.99999999999999E+307,$B$7:B160)),$B$7:F160,5,FALSE)+INDEX($B$7:B160,MATCH(9.99999999999999E+307,$B$7:B160))),(VLOOKUP(INDEX($B$7:B160,MATCH(9.99999999999999E+307,$B$7:B160)),$B$7:F160,5,FALSE))+(INDEX($B$7:B160,MATCH(9.99999999999999E+307,$B$7:B160)))),\"\")","v":641.00829999999951},4.7283999999999997,{"$f":"IF(D161<>\"\",IF(OR(B161<>\"\",INDIRECT(\"D162\")=0),D161,0),\"\")","v":4.7283999999999997},636.27989999999954,null,{"$f":"IF(D161<>\"\",IF(AND(B161<>\"\",B160<>\"\"),$I$4+H160,VLOOKUP(INDEX($B$7:B160,MATCH(9.99999999999999E+307,$B$7:B160)),$B$7:H160,7,FALSE)+$I$4),\"\")","v":-4.455837564199594E-3},636.27544416243529]
["SV10",5.7760999999999996,{"$f":"IF(D162<>\"\",IF(OR(B162<>\"\",INDIRECT(\"D163\")=0),IF(B161<>\"\",F161+B161,VLOOKUP(INDEX($B$7:B161,MATCH(9.99999999999999E+307,$B$7:B161)),$B$7:F161,5,FALSE)+INDEX($B$7:B161,MATCH(9.99999999999999E+307,$B$7:B161))),(VLOOKUP(INDEX($B$7:B161,MATCH(9.99999999999999E+307,$B$7:B161)),$B$7:F161,5,FALSE))+(INDEX($B$7:B161,MATCH(9.99999999999999E+307,$B$7:B161)))),\"\")","v":639.65509999999949},6.3761000000000001,{"$f":"IF(D162<>\"\",IF(OR(B162<>\"\",INDIRECT(\"D163\")=0),D162,0),\"\")","v":6.3761000000000001},633.27899999999954,null,{"$f":"IF(D162<>\"\",IF(AND(B162<>\"\",B161<>\"\"),$I$4+H161,VLOOKUP(INDEX($B$7:B161,MATCH(9.99999999999999E+307,$B$7:B161)),$B$7:H161,7,FALSE)+$I$4),\"\")","v":-4.4847715743567343E-3},633.27451522842523]
["TP68",5.3531000000000004,{"$f":"IF(D163<>\"\",IF(OR(B163<>\"\",INDIRECT(\"D164\")=0),IF(B162<>\"\",F162+B162,VLOOKUP(INDEX($B$7:B162,MATCH(9.99999999999999E+307,$B$7:B162)),$B$7:F162,5,FALSE)+INDEX($B$7:B162,MATCH(9.99999999999999E+307,$B$7:B162))),(VLOOKUP(INDEX($B$7:B162,MATCH(9.99999999999999E+307,$B$7:B162)),$B$7:F162,5,FALSE))+(INDEX($B$7:B162,MATCH(9.99999999999999E+307,$B$7:B162)))),\"\")","v":639.05509999999958},4.1097999999999999,{"$f":"IF(D163<>\"\",IF(OR(B163<>\"\",INDIRECT(\"D164\")=0),D163,0),\"\")","v":4.1097999999999999},634.94529999999963,null,{"$f":"IF(D163<>\"\",IF(AND(B163<>\"\",B162<>\"\"),$I$4+H162,VLOOKUP(INDEX($B$7:B162,MATCH(9.99999999999999E+307,$B$7:B162)),$B$7:H162,7,FALSE)+$I$4),\"\")","v":-4.5137055845138746E-3},634.94078629441515]
["TP69",6.1516000000000002,{"$f":"IF(D164<>\"\",IF(OR(B164<>\"\",INDIRECT(\"D165\")=0),IF(B163<>\"\",F163+B163,VLOOKUP(INDEX($B$7:B163,MATCH(9.99999999999999E+307,$B$7:B163)),$B$7:F163,5,FALSE)+INDEX($B$7:B163,MATCH(9.99999999999999E+307,$B$7:B163))),(VLOOKUP(INDEX($B$7:B163,MATCH(9.99999999999999E+307,$B$7:B163)),$B$7:F163,5,FALSE))+(INDEX($B$7:B163,MATCH(9.99999999999999E+307,$B$7:B163)))),\"\")","v":640.29839999999967},2.7361,{"$f":"IF(D164<>\"\",IF(OR(B164<>\"\",INDIRECT(\"D165\")=0),D164,0),\"\")","v":2.7361},637.56229999999971,null,{"$f":"IF(D164<>\"\",IF(AND(B164<>\"\",B163<>\"\"),$I$4+H163,VLOOKUP(INDEX($B$7:B163,MATCH(9.99999999999999E+307,$B$7:B163)),$B$7:H163,7,FALSE)+$I$4),\"\")","v":-4.5426395946710149E-3},637.55775736040505]
["TP70",6.1237000000000004,{"$f":"IF(D165<>\"\",IF(OR(B165<>\"\",INDIRECT(\"D166\")=0),IF(B164<>\"\",F164+B164,VLOOKUP(INDEX($B$7:B164,MATCH(9.99999999999999E+307,$B$7:B164)),$B$7:F164,5,FALSE)+INDEX($B$7:B164,MATCH(9.99999999999999E+307,$B$7:B164))),(VLOOKUP(INDEX($B$7:B164,MATCH(9.99999999999999E+307,$B$7:B164)),$B$7:F164,5,FALSE))+(INDEX($B$7:B164,MATCH(9.99999999999999E+307,$B$7:B164)))),\"\")","v":643.71389999999974},3.1596000000000002,{"$f":"IF(D165<>\"\",IF(OR(B165<>\"\",INDIRECT(\"D166\")=0),D165,0),\"\")","v":3.1596000000000002},640.55429999999978,null,{"$f":"IF(D165<>\"\",IF(AND(B165<>\"\",B164<>\"\"),$I$4+H164,VLOOKUP(INDEX($B$7:B164,MATCH(9.99999999999999E+307,$B$7:B164)),$B$7:H164,7,FALSE)+$I$4),\"\")","v":-4.5715736048281552E-3},640.54972842639495]
["TP71",6.0660999999999996,{"$f":"IF(D166<>\"\",IF(OR(B166<>\"\",INDIRECT(\"D167\")=0),IF(B165<>\"\",F165+B165,VLOOKUP(INDEX($B$7:B165,MATCH(9.99999999999999E+307,$B$7:B165)),$B$7:F165,5,FALSE)+INDEX($B$7:B165,MATCH(9.99999999999999E+307,$B$7:B165))),(VLOOKUP(INDEX($B$7:B165,MATCH(9.99999999999999E+307,$B$7:B165)),$B$7:F165,5,FALSE))+(INDEX($B$7:B165,MATCH(9.99999999999999E+307,$B$7:B165)))),\"\")","v":646.67799999999977},3.4077000000000002,{"$f":"IF(D166<>\"\",IF(OR(B166<>\"\",INDIRECT(\"D167\")=0),D166,0),\"\")","v":3.4077000000000002},643.27029999999979,null,{"$f":"IF(D166<>\"\",IF(AND(B166<>\"\",B165<>\"\"),$I$4+H165,VLOOKUP(INDEX($B$7:B165,MATCH(9.99999999999999E+307,$B$7:B165)),$B$7:H165,7,FALSE)+$I$4),\"\")","v":-4.6005076149852955E-3},643.26569949238478]
["TP72",6.3037000000000001,{"$f":"IF(D167<>\"\",IF(OR(B167<>\"\",INDIRECT(\"D168\")=0),IF(B166<>\"\",F166+B166,VLOOKUP(INDEX($B$7:B166,MATCH(9.99999999999999E+307,$B$7:B166)),$B$7:F166,5,FALSE)+INDEX($B$7:B166,MATCH(9.99999999999999E+307,$B$7:B166))),(VLOOKUP(INDEX($B$7:B166,MATCH(9.99999999999999E+307,$B$7:B166)),$B$7:F166,5,FALSE))+(INDEX($B$7:B166,MATCH(9.99999999999999E+307,$B$7:B166)))),\"\")","v":649.3363999999998},2.7212000000000001,{"$f":"IF(D167<>\"\",IF(OR(B167<>\"\",INDIRECT(\"D168\")=0),D167,0),\"\")","v":2.7212000000000001},646.61519999999985,null,{"$f":"IF(D167<>\"\",IF(AND(B167<>\"\",B166<>\"\"),$I$4+H166,VLOOKUP(INDEX($B$7:B166,MATCH(9.99999999999999E+307,$B$7:B166)),$B$7:H166,7,FALSE)+$I$4),\"\")","v":-4.6294416251424358E-3},646.61057055837466]
["TP73",7.7121000000000004,{"$f":"IF(D168<>\"\",IF(OR(B168<>\"\",INDIRECT(\"D169\")=0),IF(B167<>\"\",F167+B167,VLOOKUP(INDEX($B$7:B167,MATCH(9.99999999999999E+307,$B$7:B167)),$B$7:F167,5,FALSE)+INDEX($B$7:B167,MATCH(9.99999999999999E+307,$B$7:B167))),(VLOOKUP(INDEX($B$7:B167,MATCH(9.99999999999999E+307,$B$7:B167)),$B$7:F167,5,FALSE))+(INDEX($B$7:B167,MATCH(9.99999999999999E+307,$B$7:B167)))),\"\")","v":652.91889999999989},0.2467,{"$f":"IF(D168<>\"\",IF(OR(B168<>\"\",INDIRECT(\"D169\")=0),D168,0),\"\")","v":0.2467},652.67219999999986,null,{"$f":"IF(D168<>\"\",IF(AND(B168<>\"\",B167<>\"\"),$I$4+H167,VLOOKUP(INDEX($B$7:B167,MATCH(9.99999999999999E+307,$B$7:B167)),$B$7:H167,7,FALSE)+$I$4),\"\")","v":-4.6583756352995762E-3},652.66754162436462]
["SV9",5.6847000000000003,{"$f":"IF(D169<>\"\",IF(OR(B169<>\"\",INDIRECT(\"D170\")=0),IF(B168<>\"\",F168+B168,VLOOKUP(INDEX($B$7:B168,MATCH(9.99999999999999E+307,$B$7:B168)),$B$7:F168,5,FALSE)+INDEX($B$7:B168,MATCH(9.99999999999999E+307,$B$7:B168))),(VLOOKUP(INDEX($B$7:B168,MATCH(9.99999999999999E+307,$B$7:B168)),$B$7:F168,5,FALSE))+(INDEX($B$7:B168,MATCH(9.99999999999999E+307,$B$7:B168)))),\"\")","v":660.38429999999983},2.9001999999999999,{"$f":"IF(D169<>\"\",IF(OR(B169<>\"\",INDIRECT(\"D170\")=0),D169,0),\"\")","v":2.9001999999999999},657.48409999999978,null,{"$f":"IF(D169<>\"\",IF(AND(B169<>\"\",B168<>\"\"),$I$4+H168,VLOOKUP(INDEX($B$7:B168,MATCH(9.99999999999999E+307,$B$7:B168)),$B$7:H168,7,FALSE)+$I$4),\"\")","v":-4.6873096454567165E-3},657.47941269035437]
["TP74",1.8911,{"$f":"IF(D170<>\"\",IF(OR(B170<>\"\",INDIRECT(\"D171\")=0),IF(B169<>\"\",F169+B169,VLOOKUP(INDEX($B$7:B169,MATCH(9.99999999999999E+307,$B$7:B169)),$B$7:F169,5,FALSE)+INDEX($B$7:B169,MATCH(9.99999999999999E+307,$B$7:B169))),(VLOOKUP(INDEX($B$7:B169,MATCH(9.99999999999999E+307,$B$7:B169)),$B$7:F169,5,FALSE))+(INDEX($B$7:B169,MATCH(9.99999999999999E+307,$B$7:B169)))),\"\")","v":663.16879999999981},4.4593999999999996,{"$f":"IF(D170<>\"\",IF(OR(B170<>\"\",INDIRECT(\"D171\")=0),D170,0),\"\")","v":4.4593999999999996},658.70939999999985,null,{"$f":"IF(D170<>\"\",IF(AND(B170<>\"\",B169<>\"\"),$I$4+H169,VLOOKUP(INDEX($B$7:B169,MATCH(9.99999999999999E+307,$B$7:B169)),$B$7:H169,7,FALSE)+$I$4),\"\")","v":-4.7162436556138568E-3},658.70468375634425]
["SV8",2.5960000000000001,{"$f":"IF(D171<>\"\",IF(OR(B171<>\"\",INDIRECT(\"D172\")=0),IF(B170<>\"\",F170+B170,VLOOKUP(INDEX($B$7:B170,MATCH(9.99999999999999E+307,$B$7:B170)),$B$7:F170,5,FALSE)+INDEX($B$7:B170,MATCH(9.99999999999999E+307,$B$7:B170))),(VLOOKUP(INDEX($B$7:B170,MATCH(9.99999999999999E+307,$B$7:B170)),$B$7:F170,5,FALSE))+(INDEX($B$7:B170,MATCH(9.99999999999999E+307,$B$7:B170)))),\"\")","v":660.6004999999999},8.5867000000000004,{"$f":"IF(D171<>\"\",IF(OR(B171<>\"\",INDIRECT(\"D172\")=0),D171,0),\"\")","v":8.5867000000000004},652.01379999999995,null,{"$f":"IF(D171<>\"\",IF(AND(B171<>\"\",B170<>\"\"),$I$4+H170,VLOOKUP(INDEX($B$7:B170,MATCH(9.99999999999999E+307,$B$7:B170)),$B$7:H170,7,FALSE)+$I$4),\"\")","v":-4.7451776657709971E-3},652.00905482233418]
["TP75",0.9929,{"$f":"IF(D172<>\"\",IF(OR(B172<>\"\",INDIRECT(\"D173\")=0),IF(B171<>\"\",F171+B171,VLOOKUP(INDEX($B$7:B171,MATCH(9.99999999999999E+307,$B$7:B171)),$B$7:F171,5,FALSE)+INDEX($B$7:B171,MATCH(9.99999999999999E+307,$B$7:B171))),(VLOOKUP(INDEX($B$7:B171,MATCH(9.99999999999999E+307,$B$7:B171)),$B$7:F171,5,FALSE))+(INDEX($B$7:B171,MATCH(9.99999999999999E+307,$B$7:B171)))),\"\")","v":654.60979999999995},7.0971000000000002,{"$f":"IF(D172<>\"\",IF(OR(B172<>\"\",INDIRECT(\"D173\")=0),D172,0),\"\")","v":7.0971000000000002},647.5127,null,{"$f":"IF(D172<>\"\",IF(AND(B172<>\"\",B171<>\"\"),$I$4+H171,VLOOKUP(INDEX($B$7:B171,MATCH(9.99999999999999E+307,$B$7:B171)),$B$7:H171,7,FALSE)+$I$4),\"\")","v":-4.7741116759281374E-3},647.50792588832405]
["TP76",3.7806999999999999,{"$f":"IF(D173<>\"\",IF(OR(B173<>\"\",INDIRECT(\"D174\")=0),IF(B172<>\"\",F172+B172,VLOOKUP(INDEX($B$7:B172,MATCH(9.99999999999999E+307,$B$7:B172)),$B$7:F172,5,FALSE)+INDEX($B$7:B172,MATCH(9.99999999999999E+307,$B$7:B172))),(VLOOKUP(INDEX($B$7:B172,MATCH(9.99999999999999E+307,$B$7:B172)),$B$7:F172,5,FALSE))+(INDEX($B$7:B172,MATCH(9.99999999999999E+307,$B$7:B172)))),\"\")","v":648.50559999999996},8.7182999999999993,{"$f":"IF(D173<>\"\",IF(OR(B173<>\"\",INDIRECT(\"D174\")=0),D173,0),\"\")","v":8.7182999999999993},639.78729999999996,null,{"$f":"IF(D173<>\"\",IF(AND(B173<>\"\",B172<>\"\"),$I$4+H172,VLOOKUP(INDEX($B$7:B172,MATCH(9.99999999999999E+307,$B$7:B172)),$B$7:H172,7,FALSE)+$I$4),\"\")","v":-4.8030456860852777E-3},639.78249695431384]
["TP77",6.8574999999999999,{"$f":"IF(D174<>\"\",IF(OR(B174<>\"\",INDIRECT(\"D175\")=0),IF(B173<>\"\",F173+B173,VLOOKUP(INDEX($B$7:B173,MATCH(9.99999999999999E+307,$B$7:B173)),$B$7:F173,5,FALSE)+INDEX($B$7:B173,MATCH(9.99999999999999E+307,$B$7:B173))),(VLOOKUP(INDEX($B$7:B173,MATCH(9.99999999999999E+307,$B$7:B173)),$B$7:F173,5,FALSE))+(INDEX($B$7:B173,MATCH(9.99999999999999E+307,$B$7:B173)))),\"\")","v":643.56799999999998},7.1451000000000002,{"$f":"IF(D174<>\"\",IF(OR(B174<>\"\",INDIRECT(\"D175\")=0),D174,0),\"\")","v":7.1451000000000002},636.42290000000003,null,{"$f":"IF(D174<>\"\",IF(AND(B174<>\"\",B173<>\"\"),$I$4+H173,VLOOKUP(INDEX($B$7:B173,MATCH(9.99999999999999E+307,$B$7:B173)),$B$7:H173,7,FALSE)+$I$4),\"\")","v":-4.831979696242418E-3},636.41806802030374]
["TP78",6.3834,{"$f":"IF(D175<>\"\",IF(OR(B175<>\"\",INDIRECT(\"D176\")=0),IF(B174<>\"\",F174+B174,VLOOKUP(INDEX($B$7:B174,MATCH(9.99999999999999E+307,$B$7:B174)),$B$7:F174,5,FALSE)+INDEX($B$7:B174,MATCH(9.99999999999999E+307,$B$7:B174))),(VLOOKUP(INDEX($B$7:B174,MATCH(9.99999999999999E+307,$B$7:B174)),$B$7:F174,5,FALSE))+(INDEX($B$7:B174,MATCH(9.99999999999999E+307,$B$7:B174)))),\"\")","v":643.28039999999999},2.6715,{"$f":"IF(D175<>\"\",IF(OR(B175<>\"\",INDIRECT(\"D176\")=0),D175,0),\"\")","v":2.6715},640.60889999999995,null,{"$f":"IF(D175<>\"\",IF(AND(B175<>\"\",B174<>\"\"),$I$4+H174,VLOOKUP(INDEX($B$7:B174,MATCH(9.99999999999999E+307,$B$7:B174)),$B$7:H174,7,FALSE)+$I$4),\"\")","v":-4.8609137063995583E-3},640.6040390862936]
["TP79",6.1935000000000002,{"$f":"IF(D176<>\"\",IF(OR(B176<>\"\",INDIRECT(\"D177\")=0),IF(B175<>\"\",F175+B175,VLOOKUP(INDEX($B$7:B175,MATCH(9.99999999999999E+307,$B$7:B175)),$B$7:F175,5,FALSE)+INDEX($B$7:B175,MATCH(9.99999999999999E+307,$B$7:B175))),(VLOOKUP(INDEX($B$7:B175,MATCH(9.99999999999999E+307,$B$7:B175)),$B$7:F175,5,FALSE))+(INDEX($B$7:B175,MATCH(9.99999999999999E+307,$B$7:B175)))),\"\")","v":646.9923},2.6027,{"$f":"IF(D176<>\"\",IF(OR(B176<>\"\",INDIRECT(\"D177\")=0),D176,0),\"\")","v":2.6027},644.38959999999997,null,{"$f":"IF(D176<>\"\",IF(AND(B176<>\"\",B175<>\"\"),$I$4+H175,VLOOKUP(INDEX($B$7:B175,MATCH(9.99999999999999E+307,$B$7:B175)),$B$7:H175,7,FALSE)+$I$4),\"\")","v":-4.8898477165566986E-3},644.38471015228345]
["TP80",4.6584000000000003,{"$f":"IF(D177<>\"\",IF(OR(B177<>\"\",INDIRECT(\"D178\")=0),IF(B176<>\"\",F176+B176,VLOOKUP(INDEX($B$7:B176,MATCH(9.99999999999999E+307,$B$7:B176)),$B$7:F176,5,FALSE)+INDEX($B$7:B176,MATCH(9.99999999999999E+307,$B$7:B176))),(VLOOKUP(INDEX($B$7:B176,MATCH(9.99999999999999E+307,$B$7:B176)),$B$7:F176,5,FALSE))+(INDEX($B$7:B176,MATCH(9.99999999999999E+307,$B$7:B176)))),\"\")","v":650.58309999999994},2.4845999999999999,{"$f":"IF(D177<>\"\",IF(OR(B177<>\"\",INDIRECT(\"D178\")=0),D177,0),\"\")","v":2.4845999999999999},648.09849999999994,null,{"$f":"IF(D177<>\"\",IF(AND(B177<>\"\",B176<>\"\"),$I$4+H176,VLOOKUP(INDEX($B$7:B176,MATCH(9.99999999999999E+307,$B$7:B176)),$B$7:H176,7,FALSE)+$I$4),\"\")","v":-4.918781726713839E-3},648.09358121827324]
["SV7",5.5083000000000002,{"$f":"IF(D178<>\"\",IF(OR(B178<>\"\",INDIRECT(\"D179\")=0),IF(B177<>\"\",F177+B177,VLOOKUP(INDEX($B$7:B177,MATCH(9.99999999999999E+307,$B$7:B177)),$B$7:F177,5,FALSE)+INDEX($B$7:B177,MATCH(9.99999999999999E+307,$B$7:B177))),(VLOOKUP(INDEX($B$7:B177,MATCH(9.99999999999999E+307,$B$7:B177)),$B$7:F177,5,FALSE))+(INDEX($B$7:B177,MATCH(9.99999999999999E+307,$B$7:B177)))),\"\")","v":652.75689999999997},4.5469999999999997,{"$f":"IF(D178<>\"\",IF(OR(B178<>\"\",INDIRECT(\"D179\")=0),D178,0),\"\")","v":4.5469999999999997},648.20989999999995,null,{"$f":"IF(D178<>\"\",IF(AND(B178<>\"\",B177<>\"\"),$I$4+H177,VLOOKUP(INDEX($B$7:B177,MATCH(9.99999999999999E+307,$B$7:B177)),$B$7:H177,7,FALSE)+$I$4),\"\")","v":-4.9477157368709793E-3},648.20495228426307]
["TP81",4.3752000000000004,{"$f":"IF(D179<>\"\",IF(OR(B179<>\"\",INDIRECT(\"D180\")=0),IF(B178<>\"\",F178+B178,VLOOKUP(INDEX($B$7:B178,MATCH(9.99999999999999E+307,$B$7:B178)),$B$7:F178,5,FALSE)+INDEX($B$7:B178,MATCH(9.99999999999999E+307,$B$7:B178))),(VLOOKUP(INDEX($B$7:B178,MATCH(9.99999999999999E+307,$B$7:B178)),$B$7:F178,5,FALSE))+(INDEX($B$7:B178,MATCH(9.99999999999999E+307,$B$7:B178)))),\"\")","v":653.71819999999991},3.8134000000000001,{"$f":"IF(D179<>\"\",IF(OR(B179<>\"\",INDIRECT(\"D180\")=0),D179,0),\"\")","v":3.8134000000000001},649.90479999999991,null,{"$f":"IF(D179<>\"\",IF(AND(B179<>\"\",B178<>\"\"),$I$4+H178,VLOOKUP(INDEX($B$7:B178,MATCH(9.99999999999999E+307,$B$7:B178)),$B$7:H178,7,FALSE)+$I$4),\"\")","v":-4.9766497470281196E-3},649.89982335025286]
["SV101",4.5362999999999998,{"$f":"IF(D180<>\"\",IF(OR(B180<>\"\",INDIRECT(\"D181\")=0),IF(B179<>\"\",F179+B179,VLOOKUP(INDEX($B$7:B179,MATCH(9.99999999999999E+307,$B$7:B179)),$B$7:F179,5,FALSE)+INDEX($B$7:B179,MATCH(9.99999999999999E+307,$B$7:B179))),(VLOOKUP(INDEX($B$7:B179,MATCH(9.99999999999999E+307,$B$7:B179)),$B$7:F179,5,FALSE))+(INDEX($B$7:B179,MATCH(9.99999999999999E+307,$B$7:B179)))),\"\")","v":654.27999999999986},4.9743000000000004,{"$f":"IF(D180<>\"\",IF(OR(B180<>\"\",INDIRECT(\"D181\")=0),D180,0),\"\")","v":4.9743000000000004},649.30569999999989,null,{"$f":"IF(D180<>\"\",IF(AND(B180<>\"\",B179<>\"\"),$I$4+H179,VLOOKUP(INDEX($B$7:B179,MATCH(9.99999999999999E+307,$B$7:B179)),$B$7:H179,7,FALSE)+$I$4),\"\")","v":-5.0055837571852599E-3},649.30069441624266]
["TP82",1.6319999999999999,{"$f":"IF(D181<>\"\",IF(OR(B181<>\"\",INDIRECT(\"D182\")=0),IF(B180<>\"\",F180+B180,VLOOKUP(INDEX($B$7:B180,MATCH(9.99999999999999E+307,$B$7:B180)),$B$7:F180,5,FALSE)+INDEX($B$7:B180,MATCH(9.99999999999999E+307,$B$7:B180))),(VLOOKUP(INDEX($B$7:B180,MATCH(9.99999999999999E+307,$B$7:B180)),$B$7:F180,5,FALSE))+(INDEX($B$7:B180,MATCH(9.99999999999999E+307,$B$7:B180)))),\"\")","v":653.84199999999987},7.2847,{"$f":"IF(D181<>\"\",IF(OR(B181<>\"\",INDIRECT(\"D182\")=0),D181,0),\"\")","v":7.2847},646.55729999999983,null,{"$f":"IF(D181<>\"\",IF(AND(B181<>\"\",B180<>\"\"),$I$4+H180,VLOOKUP(INDEX($B$7:B180,MATCH(9.99999999999999E+307,$B$7:B180)),$B$7:H180,7,FALSE)+$I$4),\"\")","v":-5.0345177673424002E-3},646.55226548223243]
["TP83",2.2122000000000002,{"$f":"IF(D182<>\"\",IF(OR(B182<>\"\",INDIRECT(\"D183\")=0),IF(B181<>\"\",F181+B181,VLOOKUP(INDEX($B$7:B181,MATCH(9.99999999999999E+307,$B$7:B181)),$B$7:F181,5,FALSE)+INDEX($B$7:B181,MATCH(9.99999999999999E+307,$B$7:B181))),(VLOOKUP(INDEX($B$7:B181,MATCH(9.99999999999999E+307,$B$7:B181)),$B$7:F181,5,FALSE))+(INDEX($B$7:B181,MATCH(9.99999999999999E+307,$B$7:B181)))),\"\")","v":648.18929999999978},6.2079000000000004,{"$f":"IF(D182<>\"\",IF(OR(B182<>\"\",INDIRECT(\"D183\")=0),D182,0),\"\")","v":6.2079000000000004},641.98139999999978,null,{"$f":"IF(D182<>\"\",IF(AND(B182<>\"\",B181<>\"\"),$I$4+H181,VLOOKUP(INDEX($B$7:B181,MATCH(9.99999999999999E+307,$B$7:B181)),$B$7:H181,7,FALSE)+$I$4),\"\")","v":-5.0634517774995405E-3},641.97633654822232]
["TP84",4.5347,{"$f":"IF(D183<>\"\",IF(OR(B183<>\"\",INDIRECT(\"D184\")=0),IF(B182<>\"\",F182+B182,VLOOKUP(INDEX($B$7:B182,MATCH(9.99999999999999E+307,$B$7:B182)),$B$7:F182,5,FALSE)+INDEX($B$7:B182,MATCH(9.99999999999999E+307,$B$7:B182))),(VLOOKUP(INDEX($B$7:B182,MATCH(9.99999999999999E+307,$B$7:B182)),$B$7:F182,5,FALSE))+(INDEX($B$7:B182,MATCH(9.99999999999999E+307,$B$7:B182)))),\"\")","v":644.19359999999983},5.8758999999999997,{"$f":"IF(D183<>\"\",IF(OR(B183<>\"\",INDIRECT(\"D184\")=0),D183,0),\"\")","v":5.8758999999999997},638.31769999999983,null,{"$f":"IF(D183<>\"\",IF(AND(B183<>\"\",B182<>\"\"),$I$4+H182,VLOOKUP(INDEX($B$7:B182,MATCH(9.99999999999999E+307,$B$7:B182)),$B$7:H182,7,FALSE)+$I$4),\"\")","v":-5.0923857876566808E-3},638.3126076142122]
["TP85",5.056,{"$f":"IF(D184<>\"\",IF(OR(B184<>\"\",INDIRECT(\"D185\")=0),IF(B183<>\"\",F183+B183,VLOOKUP(INDEX($B$7:B183,MATCH(9.99999999999999E+307,$B$7:B183)),$B$7:F183,5,FALSE)+INDEX($B$7:B183,MATCH(9.99999999999999E+307,$B$7:B183))),(VLOOKUP(INDEX($B$7:B183,MATCH(9.99999999999999E+307,$B$7:B183)),$B$7:F183,5,FALSE))+(INDEX($B$7:B183,MATCH(9.99999999999999E+307,$B$7:B183)))),\"\")","v":642.85239999999988},6.8373999999999997,{"$f":"IF(D184<>\"\",IF(OR(B184<>\"\",INDIRECT(\"D185\")=0),D184,0),\"\")","v":6.8373999999999997},636.01499999999987,null,{"$f":"IF(D184<>\"\",IF(AND(B184<>\"\",B183<>\"\"),$I$4+H183,VLOOKUP(INDEX($B$7:B183,MATCH(9.99999999999999E+307,$B$7:B183)),$B$7:H183,7,FALSE)+$I$4),\"\")","v":-5.1213197978138211E-3},636.00987868020206]
["TP86",5.6646999999999998,{"$f":"IF(D185<>\"\",IF(OR(B185<>\"\",INDIRECT(\"D186\")=0),IF(B184<>\"\",F184+B184,VLOOKUP(INDEX($B$7:B184,MATCH(9.99999999999999E+307,$B$7:B184)),$B$7:F184,5,FALSE)+INDEX($B$7:B184,MATCH(9.99999999999999E+307,$B$7:B184))),(VLOOKUP(INDEX($B$7:B184,MATCH(9.99999999999999E+307,$B$7:B184)),$B$7:F184,5,FALSE))+(INDEX($B$7:B184,MATCH(9.99999999999999E+307,$B$7:B184)))),\"\")","v":641.07099999999991},6.2057000000000002,{"$f":"IF(D185<>\"\",IF(OR(B185<>\"\",INDIRECT(\"D186\")=0),D185,0),\"\")","v":6.2057000000000002},634.86529999999993,null,{"$f":"IF(D185<>\"\",IF(AND(B185<>\"\",B184<>\"\"),$I$4+H184,VLOOKUP(INDEX($B$7:B184,MATCH(9.99999999999999E+307,$B$7:B184)),$B$7:H184,7,FALSE)+$I$4),\"\")","v":-5.1502538079709614E-3},634.86014974619195]
["TP87",6.2572999999999999,{"$f":"IF(D186<>\"\",IF(OR(B186<>\"\",INDIRECT(\"D187\")=0),IF(B185<>\"\",F185+B185,VLOOKUP(INDEX($B$7:B185,MATCH(9.99999999999999E+307,$B$7:B185)),$B$7:F185,5,FALSE)+INDEX($B$7:B185,MATCH(9.99999999999999E+307,$B$7:B185))),(VLOOKUP(INDEX($B$7:B185,MATCH(9.99999999999999E+307,$B$7:B185)),$B$7:F185,5,FALSE))+(INDEX($B$7:B185,MATCH(9.99999999999999E+307,$B$7:B185)))),\"\")","v":640.53},5.6132,{"$f":"IF(D186<>\"\",IF(OR(B186<>\"\",INDIRECT(\"D187\")=0),D186,0),\"\")","v":5.6132},634.91679999999997,null,{"$f":"IF(D186<>\"\",IF(AND(B186<>\"\",B185<>\"\"),$I$4+H185,VLOOKUP(INDEX($B$7:B185,MATCH(9.99999999999999E+307,$B$7:B185)),$B$7:H185,7,FALSE)+$I$4),\"\")","v":-5.1791878181281018E-3},634.91162081218181]
["SV6",6.4588000000000001,{"$f":"IF(D187<>\"\",IF(OR(B187<>\"\",INDIRECT(\"D188\")=0),IF(B186<>\"\",F186+B186,VLOOKUP(INDEX($B$7:B186,MATCH(9.99999999999999E+307,$B$7:B186)),$B$7:F186,5,FALSE)+INDEX($B$7:B186,MATCH(9.99999999999999E+307,$B$7:B186))),(VLOOKUP(INDEX($B$7:B186,MATCH(9.99999999999999E+307,$B$7:B186)),$B$7:F186,5,FALSE))+(INDEX($B$7:B186,MATCH(9.99999999999999E+307,$B$7:B186)))),\"\")","v":641.17409999999995},6.2808000000000002,{"$f":"IF(D187<>\"\",IF(OR(B187<>\"\",INDIRECT(\"D188\")=0),D187,0),\"\")","v":6.2808000000000002},634.89329999999995,null,{"$f":"IF(D187<>\"\",IF(AND(B187<>\"\",B186<>\"\"),$I$4+H186,VLOOKUP(INDEX($B$7:B186,MATCH(9.99999999999999E+307,$B$7:B186)),$B$7:H186,7,FALSE)+$I$4),\"\")","v":-5.2081218282852421E-3},634.88809187817162]
["TP88",5.8391999999999999,{"$f":"IF(D188<>\"\",IF(OR(B188<>\"\",INDIRECT(\"D189\")=0),IF(B187<>\"\",F187+B187,VLOOKUP(INDEX($B$7:B187,MATCH(9.99999999999999E+307,$B$7:B187)),$B$7:F187,5,FALSE)+INDEX($B$7:B187,MATCH(9.99999999999999E+307,$B$7:B187))),(VLOOKUP(INDEX($B$7:B187,MATCH(9.99999999999999E+307,$B$7:B187)),$B$7:F187,5,FALSE))+(INDEX($B$7:B187,MATCH(9.99999999999999E+307,$B$7:B187)))),\"\")","v":641.35209999999995},5.1980000000000004,{"$f":"IF(D188<>\"\",IF(OR(B188<>\"\",INDIRECT(\"D189\")=0),D188,0),\"\")","v":5.1980000000000004},636.15409999999997,null,{"$f":"IF(D188<>\"\",IF(AND(B188<>\"\",B187<>\"\"),$I$4+H187,VLOOKUP(INDEX($B$7:B187,MATCH(9.99999999999999E+307,$B$7:B187)),$B$7:H187,7,FALSE)+$I$4),\"\")","v":-5.2370558384423824E-3},636.14886294416158]
["SV5",5.6543000000000001,{"$f":"IF(D189<>\"\",IF(OR(B189<>\"\",INDIRECT(\"D190\")=0),IF(B188<>\"\",F188+B188,VLOOKUP(INDEX($B$7:B188,MATCH(9.99999999999999E+307,$B$7:B188)),$B$7:F188,5,FALSE)+INDEX($B$7:B188,MATCH(9.99999999999999E+307,$B$7:B188))),(VLOOKUP(INDEX($B$7:B188,MATCH(9.99999999999999E+307,$B$7:B188)),$B$7:F188,5,FALSE))+(INDEX($B$7:B188,MATCH(9.99999999999999E+307,$B$7:B188)))),\"\")","v":641.99329999999998},4.4942000000000002,{"$f":"IF(D189<>\"\",IF(OR(B189<>\"\",INDIRECT(\"D190\")=0),D189,0),\"\")","v":4.4942000000000002},637.4991,null,{"$f":"IF(D189<>\"\",IF(AND(B189<>\"\",B188<>\"\"),$I$4+H188,VLOOKUP(INDEX($B$7:B188,MATCH(9.99999999999999E+307,$B$7:B188)),$B$7:H188,7,FALSE)+$I$4),\"\")","v":-5.2659898485995227E-3},637.49383401015143]
["TP11",6.8493000000000004,{"$f":"IF(D190<>\"\",IF(OR(B190<>\"\",INDIRECT(\"D191\")=0),IF(B189<>\"\",F189+B189,VLOOKUP(INDEX($B$7:B189,MATCH(9.99999999999999E+307,$B$7:B189)),$B$7:F189,5,FALSE)+INDEX($B$7:B189,MATCH(9.99999999999999E+307,$B$7:B189))),(VLOOKUP(INDEX($B$7:B189,MATCH(9.99999999999999E+307,$B$7:B189)),$B$7:F189,5,FALSE))+(INDEX($B$7:B189,MATCH(9.99999999999999E+307,$B$7:B189)))),\"\")","v":643.15340000000003},5.2125000000000004,{"$f":"IF(D190<>\"\",IF(OR(B190<>\"\",INDIRECT(\"D191\")=0),D190,0),\"\")","v":5.2125000000000004},637.94090000000006,null,{"$f":"IF(D190<>\"\",IF(AND(B190<>\"\",B189<>\"\"),$I$4+H189,VLOOKUP(INDEX($B$7:B189,MATCH(9.99999999999999E+307,$B$7:B189)),$B$7:H189,7,FALSE)+$I$4),\"\")","v":-5.294923858756663E-3},637.93560507614131]
["TP12",5.8978999999999999,{"$f":"IF(D191<>\"\",IF(OR(B191<>\"\",INDIRECT(\"D192\")=0),IF(B190<>\"\",F190+B190,VLOOKUP(INDEX($B$7:B190,MATCH(9.99999999999999E+307,$B$7:B190)),$B$7:F190,5,FALSE)+INDEX($B$7:B190,MATCH(9.99999999999999E+307,$B$7:B190))),(VLOOKUP(INDEX($B$7:B190,MATCH(9.99999999999999E+307,$B$7:B190)),$B$7:F190,5,FALSE))+(INDEX($B$7:B190,MATCH(9.99999999999999E+307,$B$7:B190)))),\"\")","v":644.79020000000003},4.2188999999999997,{"$f":"IF(D191<>\"\",IF(OR(B191<>\"\",INDIRECT(\"D192\")=0),D191,0),\"\")","v":4.2188999999999997},640.57130000000006,null,{"$f":"IF(D191<>\"\",IF(AND(B191<>\"\",B190<>\"\"),$I$4+H190,VLOOKUP(INDEX($B$7:B190,MATCH(9.99999999999999E+307,$B$7:B190)),$B$7:H190,7,FALSE)+$I$4),\"\")","v":-5.3238578689138033E-3},640.56597614213115]
["TP13",4.4805999999999999,{"$f":"IF(D192<>\"\",IF(OR(B192<>\"\",INDIRECT(\"D193\")=0),IF(B191<>\"\",F191+B191,VLOOKUP(INDEX($B$7:B191,MATCH(9.99999999999999E+307,$B$7:B191)),$B$7:F191,5,FALSE)+INDEX($B$7:B191,MATCH(9.99999999999999E+307,$B$7:B191))),(VLOOKUP(INDEX($B$7:B191,MATCH(9.99999999999999E+307,$B$7:B191)),$B$7:F191,5,FALSE))+(INDEX($B$7:B191,MATCH(9.99999999999999E+307,$B$7:B191)))),\"\")","v":646.46920000000011},6.8606999999999996,{"$f":"IF(D192<>\"\",IF(OR(B192<>\"\",INDIRECT(\"D193\")=0),D192,0),\"\")","v":6.8606999999999996},639.60850000000016,null,{"$f":"IF(D192<>\"\",IF(AND(B192<>\"\",B191<>\"\"),$I$4+H191,VLOOKUP(INDEX($B$7:B191,MATCH(9.99999999999999E+307,$B$7:B191)),$B$7:H191,7,FALSE)+$I$4),\"\")","v":-5.3527918790709436E-3},639.60314720812107]
["TP14",2.6892999999999998,{"$f":"IF(D193<>\"\",IF(OR(B193<>\"\",INDIRECT(\"D194\")=0),IF(B192<>\"\",F192+B192,VLOOKUP(INDEX($B$7:B192,MATCH(9.99999999999999E+307,$B$7:B192)),$B$7:F192,5,FALSE)+INDEX($B$7:B192,MATCH(9.99999999999999E+307,$B$7:B192))),(VLOOKUP(INDEX($B$7:B192,MATCH(9.99999999999999E+307,$B$7:B192)),$B$7:F192,5,FALSE))+(INDEX($B$7:B192,MATCH(9.99999999999999E+307,$B$7:B192)))),\"\")","v":644.08910000000014},6.8878000000000004,{"$f":"IF(D193<>\"\",IF(OR(B193<>\"\",INDIRECT(\"D194\")=0),D193,0),\"\")","v":6.8878000000000004},637.20130000000017,null,{"$f":"IF(D193<>\"\",IF(AND(B193<>\"\",B192<>\"\"),$I$4+H192,VLOOKUP(INDEX($B$7:B192,MATCH(9.99999999999999E+307,$B$7:B192)),$B$7:H192,7,FALSE)+$I$4),\"\")","v":-5.3817258892280839E-3},637.19591827411091]
["TP15",2.1000999999999999,{"$f":"IF(D194<>\"\",IF(OR(B194<>\"\",INDIRECT(\"D195\")=0),IF(B193<>\"\",F193+B193,VLOOKUP(INDEX($B$7:B193,MATCH(9.99999999999999E+307,$B$7:B193)),$B$7:F193,5,FALSE)+INDEX($B$7:B193,MATCH(9.99999999999999E+307,$B$7:B193))),(VLOOKUP(INDEX($B$7:B193,MATCH(9.99999999999999E+307,$B$7:B193)),$B$7:F193,5,FALSE))+(INDEX($B$7:B193,MATCH(9.99999999999999E+307,$B$7:B193)))),\"\")","v":639.89060000000018},7.8215000000000003,{"$f":"IF(D194<>\"\",IF(OR(B194<>\"\",INDIRECT(\"D195\")=0),D194,0),\"\")","v":7.8215000000000003},632.06910000000016,null,{"$f":"IF(D194<>\"\",IF(AND(B194<>\"\",B193<>\"\"),$I$4+H193,VLOOKUP(INDEX($B$7:B193,MATCH(9.99999999999999E+307,$B$7:B193)),$B$7:H193,7,FALSE)+$I$4),\"\")","v":-5.4106598993852242E-3},632.06368934010072]
["SV4",4.3422999999999998,{"$f":"IF(D195<>\"\",IF(OR(B195<>\"\",INDIRECT(\"D196\")=0),IF(B194<>\"\",F194+B194,VLOOKUP(INDEX($B$7:B194,MATCH(9.99999999999999E+307,$B$7:B194)),$B$7:F194,5,FALSE)+INDEX($B$7:B194,MATCH(9.99999999999999E+307,$B$7:B194))),(VLOOKUP(INDEX($B$7:B194,MATCH(9.99999999999999E+307,$B$7:B194)),$B$7:F194,5,FALSE))+(INDEX($B$7:B194,MATCH(9.99999999999999E+307,$B$7:B194)))),\"\")","v":634.16920000000016},8.0957000000000008,{"$f":"IF(D195<>\"\",IF(OR(B195<>\"\",INDIRECT(\"D196\")=0),D195,0),\"\")","v":8.0957000000000008},626.07350000000019,null,{"$f":"IF(D195<>\"\",IF(AND(B195<>\"\",B194<>\"\"),$I$4+H194,VLOOKUP(INDEX($B$7:B194,MATCH(9.99999999999999E+307,$B$7:B194)),$B$7:H194,7,FALSE)+$I$4),\"\")","v":-5.4395939095423645E-3},626.06806040609069]
["SV3",4.6085000000000003,{"$f":"IF(D196<>\"\",IF(OR(B196<>\"\",INDIRECT(\"D197\")=0),IF(B195<>\"\",F195+B195,VLOOKUP(INDEX($B$7:B195,MATCH(9.99999999999999E+307,$B$7:B195)),$B$7:F195,5,FALSE)+INDEX($B$7:B195,MATCH(9.99999999999999E+307,$B$7:B195))),(VLOOKUP(INDEX($B$7:B195,MATCH(9.99999999999999E+307,$B$7:B195)),$B$7:F195,5,FALSE))+(INDEX($B$7:B195,MATCH(9.99999999999999E+307,$B$7:B195)))),\"\")","v":630.41580000000022},7.0723000000000003,{"$f":"IF(D196<>\"\",IF(OR(B196<>\"\",INDIRECT(\"D197\")=0),D196,0),\"\")","v":7.0723000000000003},623.34350000000018,null,{"$f":"IF(D196<>\"\",IF(AND(B196<>\"\",B195<>\"\"),$I$4+H195,VLOOKUP(INDEX($B$7:B195,MATCH(9.99999999999999E+307,$B$7:B195)),$B$7:H195,7,FALSE)+$I$4),\"\")","v":-5.4685279196995049E-3},623.3380314720805]
["TP16",4.0202,{"$f":"IF(D197<>\"\",IF(OR(B197<>\"\",INDIRECT(\"D198\")=0),IF(B196<>\"\",F196+B196,VLOOKUP(INDEX($B$7:B196,MATCH(9.99999999999999E+307,$B$7:B196)),$B$7:F196,5,FALSE)+INDEX($B$7:B196,MATCH(9.99999999999999E+307,$B$7:B196))),(VLOOKUP(INDEX($B$7:B196,MATCH(9.99999999999999E+307,$B$7:B196)),$B$7:F196,5,FALSE))+(INDEX($B$7:B196,MATCH(9.99999999999999E+307,$B$7:B196)))),\"\")","v":627.95200000000023},5.4231999999999996,{"$f":"IF(D197<>\"\",IF(OR(B197<>\"\",INDIRECT(\"D198\")=0),D197,0),\"\")","v":5.4231999999999996},622.52880000000027,null,{"$f":"IF(D197<>\"\",IF(AND(B197<>\"\",B196<>\"\"),$I$4+H196,VLOOKUP(INDEX($B$7:B196,MATCH(9.99999999999999E+307,$B$7:B196)),$B$7:H196,7,FALSE)+$I$4),\"\")","v":-5.4974619298566452E-3},622.52330253807042]
["TP17",6.0155000000000003,{"$f":"IF(D198<>\"\",IF(OR(B198<>\"\",INDIRECT(\"D199\")=0),IF(B197<>\"\",F197+B197,VLOOKUP(INDEX($B$7:B197,MATCH(9.99999999999999E+307,$B$7:B197)),$B$7:F197,5,FALSE)+INDEX($B$7:B197,MATCH(9.99999999999999E+307,$B$7:B197))),(VLOOKUP(INDEX($B$7:B197,MATCH(9.99999999999999E+307,$B$7:B197)),$B$7:F197,5,FALSE))+(INDEX($B$7:B197,MATCH(9.99999999999999E+307,$B$7:B197)))),\"\")","v":626.54900000000032},6.117,{"$f":"IF(D198<>\"\",IF(OR(B198<>\"\",INDIRECT(\"D199\")=0),D198,0),\"\")","v":6.117},620.43200000000036,null,{"$f":"IF(D198<>\"\",IF(AND(B198<>\"\",B197<>\"\"),$I$4+H197,VLOOKUP(INDEX($B$7:B197,MATCH(9.99999999999999E+307,$B$7:B197)),$B$7:H197,7,FALSE)+$I$4),\"\")","v":-5.5263959400137855E-3},620.42647360406033]
["TP18",6.0720999999999998,{"$f":"IF(D199<>\"\",IF(OR(B199<>\"\",INDIRECT(\"D200\")=0),IF(B198<>\"\",F198+B198,VLOOKUP(INDEX($B$7:B198,MATCH(9.99999999999999E+307,$B$7:B198)),$B$7:F198,5,FALSE)+INDEX($B$7:B198,MATCH(9.99999999999999E+307,$B$7:B198))),(VLOOKUP(INDEX($B$7:B198,MATCH(9.99999999999999E+307,$B$7:B198)),$B$7:F198,5,FALSE))+(INDEX($B$7:B198,MATCH(9.99999999999999E+307,$B$7:B198)))),\"\")","v":626.44750000000033},4.2986000000000004,{"$f":"IF(D199<>\"\",IF(OR(B199<>\"\",INDIRECT(\"D200\")=0),D199,0),\"\")","v":4.2986000000000004},622.14890000000037,null,{"$f":"IF(D199<>\"\",IF(AND(B199<>\"\",B198<>\"\"),$I$4+H198,VLOOKUP(INDEX($B$7:B198,MATCH(9.99999999999999E+307,$B$7:B198)),$B$7:H198,7,FALSE)+$I$4),\"\")","v":-5.5553299501709258E-3},622.14334467005017]
["TP19",6.2971000000000004,{"$f":"IF(D200<>\"\",IF(OR(B200<>\"\",INDIRECT(\"D201\")=0),IF(B199<>\"\",F199+B199,VLOOKUP(INDEX($B$7:B199,MATCH(9.99999999999999E+307,$B$7:B199)),$B$7:F199,5,FALSE)+INDEX($B$7:B199,MATCH(9.99999999999999E+307,$B$7:B199))),(VLOOKUP(INDEX($B$7:B199,MATCH(9.99999999999999E+307,$B$7:B199)),$B$7:F199,5,FALSE))+(INDEX($B$7:B199,MATCH(9.99999999999999E+307,$B$7:B199)))),\"\")","v":628.22100000000034},4.4066999999999998,{"$f":"IF(D200<>\"\",IF(OR(B200<>\"\",INDIRECT(\"D201\")=0),D200,0),\"\")","v":4.4066999999999998},623.81430000000034,null,{"$f":"IF(D200<>\"\",IF(AND(B200<>\"\",B199<>\"\"),$I$4+H199,VLOOKUP(INDEX($B$7:B199,MATCH(9.99999999999999E+307,$B$7:B199)),$B$7:H199,7,FALSE)+$I$4),\"\")","v":-5.5842639603280661E-3},623.80871573603997]
["TP20",4.4539,{"$f":"IF(D201<>\"\",IF(OR(B201<>\"\",INDIRECT(\"D201\")=0),IF(B200<>\"\",F200+B200,VLOOKUP(INDEX($B$7:B200,MATCH(9.99999999999999E+307,$B$7:B200)),$B$7:F200,5,FALSE)+INDEX($B$7:B200,MATCH(9.99999999999999E+307,$B$7:B200))),(VLOOKUP(INDEX($B$7:B200,MATCH(9.99999999999999E+307,$B$7:B200)),$B$7:F200,5,FALSE))+(INDEX($B$7:B200,MATCH(9.99999999999999E+307,$B$7:B200)))),\"\")","v":630.11140000000034},3.6116999999999999,{"$f":"IF(D201<>\"\",IF(OR(B201<>\"\",INDIRECT(\"D201\")=0),D201,0),\"\")","v":3.6116999999999999},626.4997000000003,null,{"$f":"IF(D201<>\"\",IF(AND(B201<>\"\",B200<>\"\"),$I$4+H200,VLOOKUP(INDEX($B$7:B200,MATCH(9.99999999999999E+307,$B$7:B200)),$B$7:H200,7,FALSE)+$I$4),\"\")","v":-5.6131979704852064E-3},{"$f":"IF(D201<>\"\",(F201+H201),\"\")","v":626.49408680202987}]
["SV2",4.3324999999999996,{"$f":"IF(D202<>\"\",IF(OR(B202<>\"\",INDIRECT(\"D201\")=0),IF(B201<>\"\",F201+B201,VLOOKUP(INDEX($B$7:B201,MATCH(9.99999999999999E+307,$B$7:B201)),$B$7:F201,5,FALSE)+INDEX($B$7:B201,MATCH(9.99999999999999E+307,$B$7:B201))),(VLOOKUP(INDEX($B$7:B201,MATCH(9.99999999999999E+307,$B$7:B201)),$B$7:F201,5,FALSE))+(INDEX($B$7:B201,MATCH(9.99999999999999E+307,$B$7:B201)))),\"\")","v":630.95360000000028},3.3094999999999999,3.3094999999999999,{"$f":"IF(D202<>\"\",C202-D202,\"\")","v":627.64410000000032},null,{"$f":"IF(D202<>\"\",IF(AND(B202<>\"\",B201<>\"\"),$I$4+H201,VLOOKUP(INDEX($B$7:B201,MATCH(9.99999999999999E+307,$B$7:B201)),$B$7:H201,7,FALSE)+$I$4),\"\")","v":-5.6421319806423467E-3},627.63845786801971]
["SV1",0,{"$f":"IF(D203<>\"\",IF(OR(B203<>\"\",INDIRECT(\"D201\")=0),IF(B202<>\"\",F202+B202,VLOOKUP(INDEX($B$7:B202,MATCH(9.99999999999999E+307,$B$7:B202)),$B$7:F202,5,FALSE)+INDEX($B$7:B202,MATCH(9.99999999999999E+307,$B$7:B202))),(VLOOKUP(INDEX($B$7:B202,MATCH(9.99999999999999E+307,$B$7:B202)),$B$7:F202,5,FALSE))+(INDEX($B$7:B202,MATCH(9.99999999999999E+307,$B$7:B202)))),\"\")","v":631.9766000000003},6.7828999999999997,6.7828999999999997,625.19370000000026,null,{"$f":"IF(D203<>\"\",IF(AND(B203<>\"\",B202<>\"\"),$I$4+H202,VLOOKUP(INDEX($B$7:B202,MATCH(9.99999999999999E+307,$B$7:B202)),$B$7:H202,7,FALSE)+$I$4),\"\")","v":-5.671065990799487E-3},625.18802893400948]
[null,null,{"$f":"IF(D204<>\"\",IF(OR(B204<>\"\",INDIRECT(\"D201\")=0),IF(B203<>\"\",F203+B203,VLOOKUP(INDEX($B$7:B203,MATCH(9.99999999999999E+307,$B$7:B203)),$B$7:F203,5,FALSE)+INDEX($B$7:B203,MATCH(9.99999999999999E+307,$B$7:B203))),(VLOOKUP(INDEX($B$7:B203,MATCH(9.99999999999999E+307,$B$7:B203)),$B$7:F203,5,FALSE))+(INDEX($B$7:B203,MATCH(9.99999999999999E+307,$B$7:B203)))),\"\")","v":""},null,"",""]

{"sheet":"TIN","index":12,"n_rows":107,"n_cols":7,"rows_kept":107,"cut":false,"hidden":false,"merged":[[0,0,0,6],[1,0,1,6],[2,0,2,6],[105,0,106,3]]}
["Vertical TIN Accuracy Test"]
["Example Survey Check Shot Data Compared to TIN for Accuracy Class A"]
["(Units in U.S. Survey Feet)"]
["Point ID","Easting","Northing","Check Z","TIN Z","Dz","Dz^2"]
["LC30",2320871.37,628034.99699999997,1194.5250000000001,1194.53,{"$f":"E5-D5","v":4.9999999998817657E-3},{"$f":"F5^2","v":2.4999999998817658E-5}]
["LC29",2320865.568,628033.83200000005,1194.5540000000001,1194.56,{"$f":"E6-D6","v":5.9999999998581188E-3},{"$f":"F6^2","v":3.5999999998297424E-5}]
["LC28",2320859.7519999999,628032.68099999998,1194.6489999999999,1194.6600000000001,1.1000000000194632E-2,1.2100000000428191E-4]
["LC27",2320853.3820000002,628031.50800000003,1194.665,1194.69,{"$f":"E8-D8","v":2.5000000000090949E-2},{"$f":"F8^2","v":6.2500000000454748E-4}]
["LC26",2320846.92,628030.26399999997,1194.777,1194.8,2.299999999991087E-2,5.2899999999590005E-4]
["LC25",2320839.6,628028.777,1194.8610000000001,1194.8699999999999,8.9999999997871782E-3,8.0999999996169206E-5]
["LC24",2320831.2510000002,628027.29700000002,1194.925,1194.93,5.0000000001091394E-3,2.5000000001091393E-5]
["LC23",2320824.1579999998,628025.85699999996,1195.0709999999999,1195.08,9.0000000000145519E-3,8.1000000000261933E-5]
["LC22",2320815.8909999998,628024.22400000005,1195.133,1195.1400000000001,7.0000000000618456E-3,4.9000000000865842E-5]
["LC21",2320808.3769999999,628022.69999999995,1195.25,1195.28,2.9999999999972715E-2,8.9999999999836294E-4]
["LC20",2320799.6359999999,628021.06799999997,1195.3699999999999,1195.3800000000001,1.0000000000218279E-2,1.0000000000436557E-4]
["LC19",2320791.6540000001,628019.50100000005,1195.4880000000001,1195.49,1.9999999999527063E-3,3.9999999998108252E-6]
["LC18",2320783.406,628017.82999999996,1195.6389999999999,1195.6400000000001,1.0000000002037268E-3,1.0000000004074537E-6]
["LC17",2320775.5690000001,628016.32999999996,1195.7739999999999,1195.78,6.0000000000854925E-3,3.6000000001025907E-5]
["LC16",2320765.6269999999,628014.37899999996,1195.934,1195.96,2.6000000000067303E-2,6.7600000000349976E-4]
["LC15",2320756.6320000002,628012.522,1196.1189999999999,1196.1300000000001,1.1000000000194632E-2,1.2100000000428191E-4]
["LC14",2320746.0970000001,628010.48699999996,1196.3610000000001,1196.3599999999999,-1.0000000002037268E-3,1.0000000004074537E-6]
["LC13",2320736.0329999998,628008.51899999997,1196.6320000000001,1196.6099999999999,-2.200000000016189E-2,4.8400000000712316E-4]
["LC12",2320725.2230000002,628006.55200000003,1196.8530000000001,1196.83,-2.3000000000138243E-2,5.2900000000635924E-4]
["LC11",2320714.4419999998,628004.41700000002,1197.028,1197.05,2.1999999999934516E-2,4.8399999999711873E-4]
["LC10",2320703.682,628002.35199999996,1197.2370000000001,1197.23,-7.0000000000618456E-3,4.9000000000865842E-5]
["LC9",2320693.3089999999,628000.28500000003,1197.3989999999999,1197.4000000000001,1.0000000002037268E-3,1.0000000004074537E-6]
["LC8",2320682.5959999999,627998.18299999996,1197.548,1197.54,-8.0000000000381988E-3,6.4000000000611175E-5]
["LC7",2320671.344,627995.98100000003,1197.731,1197.72,-1.0999999999967258E-2,1.2099999999927968E-4]
[null,null,null,null,null,0,0]
[null,null,null,null,null,0,0]
[null,null,null,null,null,0,0]
[null,null,null,null,null,0,0]
[null,null,null,null,null,0,0]
[null,null,null,null,null,0,0]
[null,null,null,null,null,0,0]
[null,null,null,null,null,0,0]
[null,null,null,null,null,0,0]
[null,null,null,null,null,0,0]
[null,null,null,null,null,0,0]
[null,null,null,null,null,0,0]
[null,null,null,null,null,0,0]
[null,null,null,null,null,0,0]
[null,null,null,null,null,0,0]
[null,null,null,null,null,0,0]
[null,null,null,null,null,0,0]
[null,null,null,null,null,0,0]
[null,null,null,null,null,0,0]
[null,null,null,null,null,0,0]
[null,null,null,null,null,0,0]
[null,null,null,null,null,0,0]
[null,null,null,null,null,0,0]
[null,null,null,null,null,0,0]
[null,null,null,null,null,0,0]
[null,null,null,null,null,0,0]
[null,null,null,null,null,0,0]
[null,null,null,null,null,0,0]
[null,null,null,null,null,0,0]
[null,null,null,null,null,0,0]
[null,null,null,null,null,0,0]
[null,null,null,null,null,0,0]
[null,null,null,null,null,0,0]
[null,null,null,null,null,0,0]
[null,null,null,null,null,0,0]
[null,null,null,null,null,0,0]
[null,null,null,null,null,0,0]
[null,null,null,null,null,0,0]
[null,null,null,null,null,0,0]
[null,null,null,null,null,0,0]
[null,null,null,null,null,0,0]
[null,null,null,null,null,0,0]
[null,null,null,null,null,0,0]
[null,null,null,null,null,{"$f":"E72-D72","v":0},{"$f":"F72^2","v":0}]
[null,null,null,null,null,0,0]
[null,null,null,null,null,0,0]
[null,null,null,null,null,0,0]
[null,null,null,null,null,0,0]
[null,null,null,null,null,0,0]
[null,null,null,null,null,0,0]
[null,null,null,null,null,0,0]
[null,null,null,null,null,0,0]
[null,null,null,null,null,0,0]
[null,null,null,null,null,0,0]
[null,null,null,null,null,0,0]
[null,null,null,null,null,0,0]
[null,null,null,null,null,0,0]
[null,null,null,null,null,0,0]
[null,null,null,null,null,0,0]
[null,null,null,null,null,0,0]
[null,null,null,null,null,0,0]
[null,null,null,null,null,0,0]
[null,null,null,null,null,0,0]
[null,null,null,null,null,0,0]
[null,null,null,null,null,0,0]
[null,null,null,null,null,0,0]
[null,null,null,null,null,0,0]
[null,null,null,null,null,0,0]
[null,null,null,null,null,0,0]
[null,null,null,null,null,0,0]
[null,null,null,null,null,{"$f":"E99-D99","v":0},{"$f":"F99^2","v":0}]
[null,null,null,null,null,0,0]
[null,null,null,null,null,0,0]
[null,null,null,null,null,0,0]
[null,null,null,null,null,0,0]
[null,null,null,null,null,0,0]
[null,null,null,null,"Sum Dz=",{"$f":"SUM($F$5:$F104)","v":0.13700000000017099}]
["Spreadsheet user is responsible to verify all calculations. This spreadsheet is not guaranteed to provide accurate results.",null,null,null,"Sum Dz^2=",null,{"$f":"SUM($G$5:$G104)","v":5.1430000000241604E-3}]
[null,null,null,null,"N=",{"$f":"COUNT($D$5:$D104)","v":24}]

{"sheet":"DATABASE","index":13,"n_rows":1,"n_cols":18,"rows_kept":1,"cut":false,"hidden":false,"merged":[]}
["Name","Point ID","Northing","Easting","Elevation","Feature","Condition","Latitude","Longitude","Ellips Ht","Datum_Adj","Geoid","Method","Date","County","Route","District","PID"]