{"text_format":"1","workbook":"xlsx","n_sheets":19,"sheets":["sht mgr","EDA","GT","GY","MN","MD","TYP LEGEND","GG001","GG002","Pavement","Plan","Traffic Control","Earthwork","end area","XS (1)","XS","0811 Bridge","2062 Bridge","HW RT"],"not_rendered":{"charts":0,"images":0,"macros":1,"external_links":5,"defined_names":138,"comments":0,"pivot_tables":0},"unopened":[],"bounds":{"document_bytes":16777216,"sheet_cells":100000,"rows_first":2000,"rows_last":500,"rows_between":2000,"halvings":0,"cell_chars":16384,"cell_head_chars":4096},"cells_cut":0,"cells_raw":0,"read":"whole","date_system":"1900"}

{"sheet":"sht mgr","index":0,"n_rows":63,"n_cols":30,"rows_kept":63,"cut":false,"hidden":false,"merged":[]}
["File Name","Model Name","Title Property","Comments Property","PID","Sheet Title","Sub-Title","Sub-Title 2","Sheet Number","Sheet Total","Subset Number","Subset Total","Designer","Checker","Reviewer","Review Date","SFN1","SFN2","Scale2","Scale3","Scale4","CRS","DesignAgencyCellName","XBaseLength","YBaseLength","AgencyBoxBaseLowerXDist","AgencyBoxBaseLowerYDist","AgencyBoxBaseWidth","AgencyBoxBaseHeight","PlacedAgencyCells"]
["01 Active Projects\\District 06\\Morrow\\96213\\400-Engineering\\Roadway\\Sheets\\96213_GT001.dgn","96213_GT001","Roadway Title Sheet",null,"96213","PID #96213 MRW-314-(8.11) (20.62)","---NA---","---NA---","P.1",{"$f":"$I$55","v":"P.54"},"---NA---","---NA---","AMH","---NA---","KLM","2023-09-12","---NA---","---NA---","---NA---","---NA---","---NA---","MRW-314-(8.11) (20.62)","ODOT_ZEPHYR","34","22","32","2.5","1.5","2","Placed Agency Cells: ODOT_ZEPHYR"]
["01 Active Projects\\District 06\\Morrow\\96213\\400-Engineering\\Roadway\\Sheets\\96213_GY001.dgn","96213_GY001","Roadway Typical Sections Sheet",null,"96213","TYPICAL SECTIONS","---NA---","---NA---","P.2","P.54","---NA---","---NA---","AMH","---NA---","LW","2023-08-23","---NA---","---NA---","---NA---","---NA---","---NA---","MRW-314-(8.11) (20.62)","ODOT_ZEPHYR","34","22","32","2.5","1.5","2","Placed Agency Cells: ODOT_ZEPHYR"]
["01 Active Projects\\District 06\\Morrow\\96213\\400-Engineering\\Roadway\\Sheets\\96213_GN001.dgn","96213_GN001","Roadway General Notes Sheet",null,"96213","GENERAL NOTES","---NA---","---NA---","P.3","P.54","---NA---","---NA---","AMH","---NA---","KLM","2023-09-12","---NA---","---NA---","---NA---","---NA---","---NA---","MRW-314-(8.11) (20.62)","ODOT_ZEPHYR","34","22","32","2.5","1.5","2","Placed Agency Cells: ODOT_ZEPHYR"]
["01 Active Projects\\District 06\\Morrow\\96213\\400-Engineering\\MOT\\Sheets\\96213_MN001.dgn","96213_MN001","MOT Notes Sheet",null,"96213","MAINTENANCE OF TRAFFIC NOTES","---NA---","---NA---","P.4","P.54","---NA---","---NA---","AMH","---NA---","VP","2023-09-14","---NA---","---NA---","---NA---","---NA---","---NA---","MRW-314-(8.11) (20.62)","ODOT_ZEPHYR","34","22","32","2.5","1.5","2","Placed Agency Cells: ODOT_ZEPHYR"]
["01 Active Projects\\District 06\\Morrow\\96213\\400-Engineering\\MOT\\Sheets\\96213_MN001.dgn","96213_MN002","MOT Notes Sheet",null,"96213","MAINTENANCE OF TRAFFIC NOTES","---NA---","---NA---","P.5","P.54","---NA---","---NA---","AMH","---NA---","VP","2023-09-14","---NA---","---NA---","---NA---","---NA---","---NA---","MRW-314-(8.11) (20.62)","ODOT_ZEPHYR","34","22","32","2.5","1.5","2","Placed Agency Cells: ODOT_ZEPHYR"]
["01 Active Projects\\District 06\\Morrow\\96213\\400-Engineering\\MOT\\Sheets\\96213_MN001.dgn","96213_MN003","MOT Notes Sheet",null,"96213","MAINTENANCE OF TRAFFIC NOTES","---NA---","---NA---","P.6","P.54","---NA---","---NA---","AMH","---NA---","VP","2023-09-14","---NA---","---NA---","---NA---","---NA---","---NA---","MRW-314-(8.11) (20.62)","ODOT_ZEPHYR","34","22","32","2.5","1.5","2","Placed Agency Cells: ODOT_ZEPHYR"]
["01 Active Projects\\District 06\\Morrow\\96213\\400-Engineering\\MOT\\Sheets\\96213_MD001.dgn","96213_MD001","MOT Detour Plan Sheet",null,"96213","MAINTENANCE OF TRAFFIC PLAN","DETOUR SIGNAGE ","---NA---","P.7","P.54","---NA---","---NA---","AMH","---NA---","VP","2023-09-14","---NA---","---NA---","---NA---","---NA---","---NA---","MRW-314-(8.11) (20.62)","ODOT_ZEPHYR","34","22","32","2.5","1.5","2","Placed Agency Cells: ODOT_ZEPHYR"]
["01 Active Projects\\District 06\\Morrow\\96213\\400-Engineering\\MOT\\Sheets\\96213_MD001.dgn","96213_MD002","MOT Detour Plan Sheet",null,"96213","MAINTENANCE OF TRAFFIC PLAN","DETOUR - LOCATION 1","---NA---","P.8","P.54","---NA---","---NA---","AMH","---NA---","VP","2023-09-14","---NA---","---NA---","1250","2500",5000,"MRW-314-(8.11) (20.62)","ODOT_ZEPHYR","34","22","32","2.5","1.5","2","Placed Agency Cells: ODOT_ZEPHYR"]
["01 Active Projects\\District 06\\Morrow\\96213\\400-Engineering\\MOT\\Sheets\\96213_MD001.dgn","96213_MD003","MOT Detour Plan Sheet",null,"96213","MAINTENANCE OF TRAFFIC PLAN","DETOUR PLAN - LOCATION 2","---NA---","P.9","P.54","---NA---","---NA---","AMH","---NA---","VP","2023-09-14","---NA---","---NA---","1250","2500",5000,"MRW-314-(8.11) (20.62)","ODOT_ZEPHYR","34","22","32","2.5","1.5","2","Placed Agency Cells: ODOT_ZEPHYR"]
{"$rows_left_out":54}
{"sheet":"EDA","index":1,"n_rows":6,"n_cols":4,"rows_kept":6,"cut":false,"hidden":false,"merged":[]}
[]
[]
[]
[]
[]
[null,null,"EDA",{"$f":"Earthwork!G47/4840","v":0.34958677685950412}]

{"sheet":"GT","index":2,"n_rows":33,"n_cols":24,"rows_kept":33,"cut":false,"hidden":false,"merged":[[0,3,0,5],[24,23,24,24],[25,23,25,24],[26,23,26,24],[27,23,27,24],[22,23,22,24],[23,23,23,24],[14,13,15,20],[14,21,14,22],[15,21,15,22],[21,23,21,24],[14,23,14,24],[15,23,15,24],[20,23,20,24],[16,23,19,24],[7,0,7,1],[8,0,8,1],[9,0,9,1],[10,0,10,1],[7,2,7,3],[8,2,8,3],[9,2,9,3],[10,2,10,3],[2,0,2,1],[3,0,3,1],[4,0,4,1],[5,0,5,1],[6,0,6,1]]}
[]
[null,null,"MRW-314-8.11","MRW-314-20.62"]
["CURRENT ADT (2024)____________________________",null,2600,2900]
["DESIGN YEAR ADT (2044)_________________________",null,3200,3000]
["DESIGN HOURLY VOLUME (2044)__________________",null,400,400]
["DIRECTIONAL DISTRIBUTION_____________________",null,0.51,0.56000000000000005]
["TRUCKS (24 HOUR B&C)_________________________",null,0.2,0.11]
["DESIGN SPEED_________________________________",null,"55 MPH"]
["LEGAL SPEED__________________________________",null,"55 MPH"]
["DESIGN FUNCTIONAL CLASSIFICATION:",null,"05 MAJOR COLLECTOR (RURAL)"]
{"$rows_left_out":24}
{"sheet":"GY","index":3,"n_rows":14,"n_cols":7,"rows_kept":14,"cut":false,"hidden":false,"merged":[[7,0,7,6],[1,0,1,6],[4,0,4,1],[2,0,2,1],[11,0,11,1],[8,0,8,1]]}
[]
["TYPICAL SECTION #1 - FULL-DEPTH PAVEMENT REPLACEMENT"]
["LOCATION 1"]
["STA.",{"$f":"D10","v":270},"TO STA.",{"$f":"B11","v":341},"=",{"$f":"ROUND(D4-B4,0)","v":71},"FT"]
["LOCATION 2"]
["STA.",{"$f":"D13","v":1190},"TO STA.",{"$f":"B14","v":1250},"=",{"$f":"ROUND(D6-B6,0)","v":60},"FT"]
[]
["TYPICAL SECTION #2 - 1.50\" RESURFACING"]
["LOCATION 1"]
["STA.",245,"TO STA.",270,"=",{"$f":"ROUND(D10-B10,0)","v":25},"FT"]
{"$rows_left_out":5}
{"sheet":"MN","index":4,"n_rows":22,"n_cols":14,"rows_kept":22,"cut":false,"hidden":false,"merged":[[9,3,11,3],[12,3,12,6],[13,3,14,3],[15,3,15,6],[6,3,6,6],[7,3,8,3],[7,4,8,4],[18,12,18,13],[7,5,8,5],[7,6,8,6],[18,11,19,11],[18,10,19,10],[18,9,19,9]]}
[]
[]
[]
[]
[]
[]
[null,null,null,"NOTIFICATION TIME FRAME TABLE"]
[null,null,null,"ITEM","DURATION OF CLOSURE","NOTIFICATION DUE TO DISTRICT 6 COMMUNICATIONS OFFICE","SIGN DISPLAYED TO PUBLIC"]
[]
[null,null,null,"RAMP & ROAD CLOSURES",">= 2 WEEKS","21 CALENDAR DAYS PRIOR TO CLOSURE","14 CALENDAR DAYS PRIOR TO CLOSURE"]
{"$rows_left_out":13}
{"sheet":"MD","index":5,"n_rows":12,"n_cols":22,"rows_kept":12,"cut":false,"hidden":false,"merged":[[9,17,9,21],[9,9,9,14]]}
[]
[]
[]
[]
[]
[]
[]
[]
[null,null,null,null,null,null,null,null,"R11-3B-60"]
[null,null,null,null,null,null,null,null,null,"LOCATION 1",null,null,null,null,null,null,null,"LOCATION 2"]
{"$rows_left_out":3}
{"sheet":"TYP LEGEND","index":6,"n_rows":14,"n_cols":2,"rows_kept":14,"cut":false,"hidden":false,"merged":[]}
["LEGEND"]
["A","APPROX. 13\" EXISTING ASPHALT - SEE GEOTECHNICAL DATA"]
[1,"ITEM 202 - PAVEMENT REMOVED"]
[2,"ITEM 203 - EXCAVATION"]
[3,"ITEM 204 - SUBGRADE COMPACTION"]
[4,"ITEM 254 - PAVEMENT PLANING, ASPHALT CONCRETE, 1.50\""]
[5,"ITEM 301 - 10.00\" ASPHALT CONCRETE BASE, PG64-22, (449) (TWO 5.00\" LIFTS)"]
[6,"ITEM 304 - 6.00\" AGGREGATE BASE*"]
["6A","ITEM 304 - 13.00\" AGGREGATE BASE"]
[7,"ITEM 407 - NON-TRACKING TACK COAT (RATE PER CMS TABLE 407.06-1)"]
{"$rows_left_out":5}
{"sheet":"GG001","index":7,"n_rows":71,"n_cols":25,"rows_kept":71,"cut":false,"hidden":false,"merged":[[0,0,1,11],[3,0,4,11],[3,12,7,12],[3,13,4,13],[0,12,2,12],[7,22,7,24],[3,14,4,14],[3,15,4,15],[3,16,4,16],[3,17,4,17]]}
[null,null,null,null,null,null,null,null,null,null,null,null,"PARTICIPATION"]
[]
[null,null,null,null,null,null,null,null,null,null,null,null,null,null,null,null,null,null,"SEE"]
["SHEET NUMBER",null,null,null,null,null,null,null,null,null,null,null,"01/STR/10","ITEM","ITEM","GRAND","UNIT","DESCRIPTION","SHEET"]
[null,null,null,null,null,null,null,null,null,null,null,null,null,null,null,null,null,null,"NO."]
[null,null,null,null,null,null,null,null,null,null,null,null,null,null,"EXT","TOTAL"]
[]
[{"$f":"'sht mgr'!I4","v":"P.3"},{"$f":"'sht mgr'!I5&\"-\"&'sht mgr'!I7","v":"P.4-P.6"},{"$f":"'sht mgr'!I13","v":"P.12"},{"$f":"'sht mgr'!I14","v":"P.13"},{"$f":"'sht mgr'!I15","v":"P.14"},{"$f":"'sht mgr'!I31","v":"P.30"},{"$f":"'sht mgr'!I39","v":"P.38"},null,null,null,null,null,null,null,null,null,null,null,null,null,null,null,"CHECKS"]
[null,null,null,null,null,null,null,null,null,null,null,null,null,null,null,null,null,"ROADWAY",null,null,null,null,"QTY","UNIT","DESC"]
[null,null,null,null,null,"LS","LS",null,null,null,null,null,"LS",{"$f":"LEFT('0811 Bridge'!A3,3)","v":"201"},{"$f":"RIGHT('0811 Bridge'!A3,5)","v":"11000"},"LS",null,{"$f":"'0811 Bridge'!D3","v":"CLEARING AND GRUBBING"},null,null,{"$f":"N10&\"E\"&O10","v":"201E11000"},null,{"$f":"IF(P10=[4]SimpleForm!AC14,1,\"BAD\")","v":1},{"$f":"IF(Q10=[4]SimpleForm!AD14,1,\"BAD\")","v":1},{"$f":"IF(R10=[4]SimpleForm!AE14,1,\"BAD\")","v":1}]
{"$rows_left_out":62}
{"sheet":"GG002","index":8,"n_rows":52,"n_cols":25,"rows_kept":52,"cut":false,"hidden":false,"merged":[[7,22,7,24],[3,15,4,15],[3,16,4,16],[3,17,4,17],[0,0,1,11],[0,12,2,12],[3,0,4,11],[3,12,7,12],[3,13,4,13],[3,14,4,14]]}
[null,null,null,null,null,null,null,null,null,null,null,null,"PARTICIPATION"]
[]
[null,null,null,null,null,null,null,null,null,null,null,null,null,null,null,null,null,null,"SEE"]
["SHEET NUMBER",null,null,null,null,null,null,null,null,null,null,null,"01/STR/10","ITEM","ITEM","GRAND","UNIT","DESCRIPTION","SHEET"]
[null,null,null,null,null,null,null,null,null,null,null,null,null,null,null,null,null,null,"NO."]
[null,null,null,null,null,null,null,null,null,null,null,null,null,null,"EXT","TOTAL"]
[]
[{"$f":"'sht mgr'!I4","v":"P.3"},{"$f":"'sht mgr'!I5&\"-\"&'sht mgr'!I7","v":"P.4-P.6"},{"$f":"'sht mgr'!I13","v":"P.12"},{"$f":"'sht mgr'!I14","v":"P.13"},{"$f":"'sht mgr'!I15","v":"P.14"},{"$f":"'sht mgr'!I31","v":"P.30"},{"$f":"'sht mgr'!I39","v":"P.38"},null,null,null,null,null,null,null,null,null,null,null,null,null,null,null,"CHECKS"]
[null,null,null,null,null,null,null,null,null,null,null,null,null,null,null,null,null,"STRUCTURE 20 FOOT SPAN AND UNDER (MRW-314-0811, SFN: 5903034)",null,null,null,{"$f":"R9","v":"STRUCTURE 20 FOOT SPAN AND UNDER (MRW-314-0811, SFN: 5903034)"},"QTY","UNIT","DESC"]
[null,null,null,null,null,{"$f":"'0811 Bridge'!B4","v":"LS"},null,null,null,null,null,null,{"$f":"F10","v":"LS"},{"$f":"LEFT('0811 Bridge'!A4,3)","v":"202"},{"$f":"RIGHT('0811 Bridge'!A4,5)","v":"11000"},{"$f":"M10","v":"LS"},null,{"$f":"'0811 Bridge'!D4","v":"STRUCTURE REMOVED"},null,null,{"$f":"N10&\"E\"&O10","v":"202E11000"},null,{"$f":"IF(P10=[4]SimpleForm!AC78,1,\"BAD\")","v":1},{"$f":"IF(Q10=[4]SimpleForm!AD78,1,\"BAD\")","v":1},{"$f":"IF(R10=[4]SimpleForm!AE78,1,\"BAD\")","v":1}]
{"$rows_left_out":43}
{"sheet":"Pavement","index":9,"n_rows":24,"n_cols":19,"rows_kept":24,"cut":false,"hidden":false,"merged":[[23,14,23,15],[0,9,0,18],[2,14,4,15],[5,15,8,15],[5,14,8,14],[0,0,0,2],[1,0,9,0],[23,0,23,8],[2,18,8,18],[1,1,9,1],[1,2,9,2],[2,13,8,13],[0,3,0,8],[2,7,8,7],[21,3,21,7],[1,3,9,3],[2,10,8,10],[1,4,8,4],[15,3,15,7],[2,17,8,17],[1,5,1,7],[1,8,8,8],[2,9,8,9],[2,11,8,11],[2,16,8,16],[2,5,8,5],[2,6,8,6],[2,12,8,12],[1,14,1,15]]}
["LOCATION",null,null,"DESIGN",null,null,null,null,null,"QUANTITIES"]
["LOCATION","BEGIN STA","END STA","SECTION","LENGTH","AVG. WIDTH",null,null,"TOTAL \nPAVEMENT AREA","202E23000","203E10000","204E10000","254E01000","301E56000","304E20000",null,"407E20000","441E70000","605E31100"]
[null,null,null,null,null,"LEFT SHOULDER","LANES","RIGHT SHOULDER",null,"PAVEMENT REMOVED","EXCAVATION","SUBGRADE COMPACTION","PAVEMENT PLANING, ASPHALT CONCRETE, 1.50\"","ASPHALT CONCRETE BASE, PG64-22, (449)","AGGREGATE BASE",null,"NON-TRACKING TACK COAT","ASPHALT CONCRETE SURFACE COURSE, TYPE 1, (449), PG64-22","AGGREGATE DRAINS"]
[]
[]
[null,null,null,null,null,null,null,null,null,null,null,null,null,null,"PAVEMENT BASE (8\" OVER STRUC., 6\" OTHERWISE)","AGG. SHLDR (2.76 SF/LF EACH SIDE)"]
[]
[]
[]
[null,null,null,null,"FT","FT","FT","FT","SY","SY","CY","SY","SY","CY","CY","CY","GAL","CY","FT"]
{"$rows_left_out":15}
{"sheet":"Plan","index":10,"n_rows":28,"n_cols":27,"rows_kept":28,"cut":false,"hidden":false,"merged":[[2,18,12,18],[27,1,27,6],[1,2,13,2],[2,12,12,12],[2,14,12,14],[2,13,12,13],[2,8,12,8],[2,9,12,9],[0,1,0,6],[0,7,0,23],[1,1,13,1],[1,3,13,3],[1,4,13,4],[1,5,13,5],[1,6,13,6],[2,7,12,7],[2,10,12,10],[2,11,12,11],[2,15,12,15],[2,21,12,21],[2,22,12,22],[2,16,12,16],[2,20,12,20],[2,19,12,19]]}
[null,"LOCATION",null,null,null,null,null,"QUANTITIES"]
[null,"SHEET","LOCATION","REF","BEGIN STA.","END STA.","SIDE",null,"202E35200","202E75000","202E38001","202E42001","606E15050","606E15150","606E15300","606E26151","606E26550",null,"601E32200","611E04900","611E16600","617E10100","626E00110"]
[null,null,null,null,null,null,null,null,"PIPE REMOVED, OVER 24\"","FENCE REMOVED","GUARDRAIL REMOVED, AS PER PLAN","ANCHOR ASSEMBLY REMOVED, TYPE A, AS PER PLAN","GUARDRAIL, TYPE MGS","GUARDRAIL, TYPE MGS HALF POST SPACING","GUARDRAIL, TYPE MGS QUARTER POST SPACING WITH LONG POSTS","ANCHOR ASSEMBLY, MGS TYPE E, AS PER PLAN (MASH2016)","ANCHOR ASSEMBLY, MGS TYPE T",null,"ROCK CHANNEL PROTECTION, TYPE C WITH FILTER","12\" CONDUIT, TYPE D","36\" CONDUIT, TYPE C","COMPACTED AGGREGATE \n(3\" LIFT x 1' WIDE FOR BERM REPLACEMENT)","BARRIER REFLECTOR, TYPE 2, BI-DIRECTIONAL"]
[]
[]
[]
[]
[]
[]
[]
{"$rows_left_out":19}
{"sheet":"Traffic Control","index":11,"n_rows":15,"n_cols":11,"rows_kept":15,"cut":false,"hidden":false,"merged":[[1,9,8,9],[1,10,9,10],[14,0,14,4],[0,0,0,4],[0,7,0,9],[1,0,9,0],[1,1,9,1],[1,2,9,2],[1,3,8,3],[1,4,8,4],[0,5,0,6],[2,7,7,7],[2,8,8,8],[2,6,8,6],[2,5,8,5]]}
["LOCATION",null,null,null,null,"ITEM 621 - RPM",null,"ITEM 642 - TRAFFIC PAINT",null,null,"REMARKS"]
["LOCATION","BEGINS STA.","END STA.","LENGTH","LENGTH","621E00100","621E54000","642E00104","642E00300"]
[null,null,null,null,null,"RPM","RAISED PAVEMENT MARKER REMOVED","EDGE LINE, 6\", TYPE 1","CENTER LINE, TYPE 1"]
[]
[]
[]
[]
[]
[null,null,null,null,null,null,null,"WHITE"]
[null,null,null,"MI","FT","EACH","EACH","MILE","MILE"]
{"$rows_left_out":6}
{"sheet":"Earthwork","index":12,"n_rows":47,"n_cols":20,"rows_kept":47,"cut":false,"hidden":false,"merged":[[46,0,46,3],[1,7,3,7],[0,0,4,0],[0,1,4,1],[1,4,3,4],[1,5,3,5],[1,6,3,6]]}
["SHEET NUMBER","LOCATION",null,null,203,203,659]
[null,null,null,null,"EXCAVATION","EMBANKMENT","SEEDING AND MULCHING, CLASS 3B"]
[null,null,"STATIONS","STATIONS"]
[]
[null,null,null,null,"CY","CY","SY"]
[null,null,null,null,null,null,null,null,null,"ITEM 659 - TOPSOIL:",null,null,null,null,null,"ITEM 659 - REPAIR SEEDING AND MULCHING:"]
[{"$f":"'sht mgr'!I18","v":"P.17"},1,{"$f":"'end area'!B19","v":100},{"$f":"'end area'!B20","v":125},null,{"$f":"'end area'!E20","v":1},{"$f":"'end area'!I20","v":14},null,null,"THE APPLICATION RATE FOR THIS ITEM IS",null,null,null,null,null,"THE APPLICATION RATE FOR THIS ITEM IS"]
[{"$f":"A7","v":"P.17"},1,{"$f":"D7","v":125},{"$f":"'end area'!B21","v":150},{"$f":"'end area'!G21","v":8},{"$f":"'end area'!E21","v":1},{"$f":"'end area'!I21","v":50},null,null,"111 CU YDS PER 1000 SQ YDS OF SEEDING",null,null,null,null,null,"5% OF THE SEEDING AREA."]
[{"$f":"A8&\"-\"&A10","v":"P.17-P.18"},1,{"$f":"D8","v":150},{"$f":"'end area'!B22","v":175},{"$f":"'end area'!G22","v":15},{"$f":"'end area'!E22","v":2},{"$f":"'end area'!I22","v":75}]
[{"$f":"'sht mgr'!I19","v":"P.18"},1,175,{"$f":"'end area'!B23","v":200},{"$f":"'end area'!G23","v":20},{"$f":"'end area'!E23","v":3},{"$f":"'end area'!I23","v":98},null,null,{"$f":"CONCATENATE(G47,\" SQ YD / 1000 =\")","v":"1692 SQ YD / 1000 ="},{"$f":"ROUND((G47/1000),1)","v":1.7},null,null,null,null,{"$f":"G47","v":1692},"SQ YD OF SEEDING AND"]
{"$rows_left_out":38}
{"sheet":"end area","index":13,"n_rows":34,"n_cols":9,"rows_kept":34,"cut":false,"hidden":false,"merged":[]}
[null,"station","length","area","embank","area","excavate","seeding length","area"]
["loc 2",1025,null,null,null,null,null,6]
[null,1050,{"$f":"B3-B2","v":25},0.4,{"$f":"ROUNDUP((D3+D2)/2*C3/27,0)","v":1},null,{"$f":"ROUNDUP((F3+F2)/2*C3/27,0)","v":0},6.3,{"$f":"ROUNDUP(((H3+H2)/2)*C3/9,0)","v":18}]
[null,1075,{"$f":"B4-B3","v":25},1.1000000000000001,{"$f":"ROUNDUP((D4+D3)/2*C4/27,0)","v":1},null,{"$f":"ROUNDUP((F4+F3)/2*C4/27,0)","v":0},8.3000000000000007,{"$f":"ROUNDUP(((H4+H3)/2)*C4/9,0)","v":21}]
[null,1100,{"$f":"B5-B4","v":25},1,1,null,0,6.5,21]
[null,1125,25,1,1,null,0,7,19]
[null,1150,25,11.5,6,null,0,14.2,30]
[null,1175,25,8.8000000000000007,10,null,0,20.2,48]
[null,1200,25,4,6,0.5,1,15.7,50]
[null,1225,25,2.4,3,null,1,9.6,36]
{"$rows_left_out":25}
{"sheet":"XS (1)","index":14,"n_rows":79,"n_cols":4,"rows_kept":79,"cut":false,"hidden":false,"merged":[]}
[{"$f":"'end area'!B19","v":100}]
["CUT AREA (SF):",{"$f":"VLOOKUP($A$1,'end area'!$B$19:$I$34,5)","v":0},"CUT VOLUME (CY):",{"$f":"VLOOKUP($A$1,'end area'!$B$19:$I$34,6)","v":0}]
["FILL AREA (SF):",{"$f":"VLOOKUP($A$1,'end area'!$B$19:$I$34,3)","v":0},"FILL VOLUME (CY):",{"$f":"VLOOKUP($A$1,'end area'!$B$19:$I$34,4)","v":0}]
["SEED WIDTH (FT):",{"$f":"VLOOKUP($A$1,'end area'!$B$19:$I$34,7)","v":0},"SEED AREA (SY):",{"$f":"VLOOKUP($A$1,'end area'!$B$19:$I$34,8)","v":0}]
[]
[{"$f":"A1+25","v":125}]
["CUT AREA (SF):",{"$f":"VLOOKUP(A6,'end area'!$B$19:$I$34,5)","v":0.34},"CUT VOLUME (CY):",{"$f":"VLOOKUP(A6,'end area'!$B$19:$I$34,6)","v":1}]
["FILL AREA (SF):",{"$f":"VLOOKUP(A6,'end area'!$B$19:$I$34,3)","v":0.98},"FILL VOLUME (CY):",{"$f":"VLOOKUP(A6,'end area'!$B$19:$I$34,4)","v":1}]
["SEED WIDTH (FT):",{"$f":"VLOOKUP(A6,'end area'!$B$19:$I$34,7)","v":9.5},"SEED AREA (SY):",{"$f":"VLOOKUP(A6,'end area'!$B$19:$I$34,8)","v":14}]
[]
{"$rows_left_out":70}
{"sheet":"XS","index":15,"n_rows":69,"n_cols":4,"rows_kept":69,"cut":false,"hidden":false,"merged":[]}
[{"$f":"'end area'!B3","v":1050}]
["CUT AREA (SF):",null,"CUT VOLUME (CY):"]
["FILL AREA (SF):",{"$f":"VLOOKUP(XS!A1,'end area'!$B$2:$I$17,3)","v":0.4},"FILL VOLUME (CY):",{"$f":"VLOOKUP(XS!A1,'end area'!$B$2:$I$17,4)","v":1}]
["SEED WIDTH (FT):",{"$f":"VLOOKUP(XS!A1,'end area'!$B$2:$I$17,7)","v":6.3},"SEED AREA (SY):",{"$f":"VLOOKUP(XS!A1,'end area'!$B$2:$I$17,8)","v":18}]
[]
[{"$f":"A1+25","v":1075}]
["CUT AREA (SF):",null,"CUT VOLUME (CY):"]
["FILL AREA (SF):",{"$f":"VLOOKUP(XS!A6,'end area'!$B$2:$I$17,3)","v":1.1000000000000001},"FILL VOLUME (CY):",{"$f":"VLOOKUP(XS!A6,'end area'!$B$2:$I$17,4)","v":1}]
["SEED WIDTH (FT):",{"$f":"VLOOKUP(XS!A6,'end area'!$B$2:$I$17,7)","v":8.3000000000000007},"SEED AREA (SY):",{"$f":"VLOOKUP(XS!A6,'end area'!$B$2:$I$17,8)","v":21}]
[]
{"$rows_left_out":60}
{"sheet":"0811 Bridge","index":16,"n_rows":22,"n_cols":4,"rows_kept":22,"cut":false,"hidden":false,"merged":[[0,0,0,3],[21,0,21,3]]}
["ESTIMATED QUANTITIES"]
["ITEM","QUANTITY","UNIT","DESCRIPTION"]
["201E11000","LS",null,"CLEARING AND GRUBBING"]
["202E11000","LS",null,"STRUCTURE REMOVED"]
["503E11100","LS",null,"COFFERDAMS AND EXCAVATION BRACING"]
["503E21300","LS",null,"UNCLASSIFIED EXCAVATION"]
["509E10000",4235,"LB","EPOXY COATED STEEL REINFORCEMENT"]
[]
["511E46510",55,"CY","CLASS QC1 CONCRETE, FOOTING"]
["511E46610",1,"CY","CLASS QC1 CONCRETE, HEADWALL"]
{"$rows_left_out":13}
{"sheet":"2062 Bridge","index":17,"n_rows":24,"n_cols":4,"rows_kept":24,"cut":false,"hidden":false,"merged":[[0,0,0,3],[23,0,23,3]]}
["ESTIMATED QUANTITIES"]
["ITEM","QUANTITY","UNIT","DESCRIPTION"]
["201E11000","LS",null,"CLEARING AND GRUBBING"]
["202E11000","LS",null,"STRUCTURE REMOVED"]
["503E11100","LS",null,"COFFERDAMS AND EXCAVATION BRACING"]
["503E21300","LS",null,"UNCLASSIFIED EXCAVATION"]
["503E21101",{"$f":"ROUNDUP((8-1.5+1)*2*53.9/27,0)*2","v":60},"CY","UNCLASSIFIED EXCAVATION, AS PER PLAN"]
[]
["509E10000",{"$f":"ROUND('[5]FINAL FORMAT'!$E$63,0)","v":5176},"LB","EPOXY COATED STEEL REINFORCEMENT"]
["511E46510",{"$f":"ROUND((54.17*2*1.5*2+54.17*8*2*2+16*4*1*2+16*0.5*2)/27,0)","v":82},"CY","CLASS QC1 CONCRETE, FOOTING"]
{"$rows_left_out":15}
{"sheet":"HW RT","index":18,"n_rows":14,"n_cols":5,"rows_kept":14,"cut":false,"hidden":false,"merged":[]}
[]
[]
["invert","top of wall grading (3:1 from invert)",null,"northern RT wall","length"]
[1238.4000000000001,{"$f":"A4+E4*0.33333","v":1244.0666100000001},null,{"$f":"1248.89-0.016*12-0.04*3-7*0.08-12.351*0.3333","v":1243.9014117000002},17]
[]
["invert","top of wall grading (3:1 from invert)",null,"southern RT wall"]
[1238.4000000000001,{"$f":"A7+E7*0.33333","v":1243.39995},null,{"$f":"1249.45-0.016*12-0.04*3-7*0.08-16.837*0.3333","v":1242.9662279000001},15]
[]
[]
["invert","top of wall grading (3:1 from invert)",null,"northern LT wall","length"]
{"$rows_left_out":4}