{"text_format":"1","workbook":"xlsx","n_sheets":6,"sheets":["Notes-COPY ALL","Instructions","Catagory Codes","SUBSummary","Combine","Sub01"],"not_rendered":{"charts":0,"images":19,"macros":1,"external_links":1,"defined_names":1,"comments":0,"pivot_tables":2},"unopened":[],"bounds":{"document_bytes":16777216,"sheet_cells":100000,"rows_first":2000,"rows_last":500,"rows_between":2000,"halvings":0,"cell_chars":16384,"cell_head_chars":4096},"cells_cut":0,"cells_raw":0,"read":"whole","date_system":"1900"}

{"sheet":"Notes-COPY ALL","index":0,"n_rows":1,"n_cols":1,"rows_kept":1,"cut":false,"hidden":false,"merged":[[0,0,0,9]]}
["WORKBOOK NOTES"]

{"sheet":"Instructions","index":1,"n_rows":129,"n_cols":12,"rows_kept":129,"cut":false,"hidden":false,"merged":[[66,1,67,10],[68,2,70,10],[71,2,73,10],[49,2,50,10],[52,2,52,10],[109,0,109,10],[82,1,82,10],[97,2,98,10],[99,2,100,10],[108,1,108,10],[94,1,96,10],[104,2,107,10],[101,1,103,10],[83,2,84,10],[88,2,91,10],[93,0,93,10],[85,1,87,10],[77,2,79,10],[55,1,55,10],[0,0,0,10],[2,0,2,10],[11,0,11,10],[25,0,25,10],[10,1,10,10],[19,2,23,10],[3,1,3,10],[1,0,1,10],[12,1,12,10],[13,1,13,10],[74,2,76,10],[30,1,30,10],[31,1,31,10],[35,2,38,10],[42,2,44,10],[29,1,29,10],[65,0,65,10],[60,2,63,10],[51,1,51,10],[53,2,54,10],[32,1,34,10],[128,1,128,10],[9,1,9,10],[4,2,8,10],[14,2,15,10],[16,2,16,10],[17,1,18,10],[28,2,28,10],[26,1,27,10],[39,2,41,10],[45,2,47,10],[24,1,24,10],[56,1,59,10],[64,1,64,10],[92,1,92,10],[48,1,48,10],[80,1,81,10],[110,1,112,10],[113,1,113,10],[115,2,116,10],[114,2,114,10],[125,1,127,10],[117,1,117,10],[118,1,119,10],[124,1,124,10],[120,2,123,10]]}
[null,null,null,null,null,null,null,null,null,null,null,{"$f":"CELL(\"filename\",L3)","v":"c:\\users\\dbryant\\appdata\\local\\bentley\\projectwise\\workingdir\\ohiodot-pw.bentley.com_ohiodot-pw-02\\dee.bryant@dot.ohio.gov\\d0567604\\[OFFICE Calcs_9 21 2023.xlsm]Instructions"}]
[{"$f":"CONCATENATE(\"HOW TO USE THIS WORKBOOK (\", L6, \")\")","v":"HOW TO USE THIS WORKBOOK (OFFICE Calcs_9 21 2023.xlsm)"},null,null,null,null,null,null,null,null,null,null,{"$f":"FIND(\"[\",L1)","v":133}]
["Opening the workbook",null,null,null,null,null,null,null,null,null,null,{"$f":"FIND(\"]\",L1)","v":161}]
[1,"Select \"Enable Macros\" when you open this workbook (if security is set to Medium)",null,null,null,null,null,null,null,null,null,{"$f":"LEN(L1)","v":173}]
[null,"a.","If you are not asked about enabling macros when you open the workbook, you either have your security set on the highest or lowest setting.  Set your security to \"Medium\" by the following steps:\nTools  >>  Macro  >>  Security….  For this workbook to function, you must have Medium (recommended), or Low selected.  If it was previously set on high, you must close this workbook and re-open it to ensure that the macros are enabled.",null,null,null,null,null,null,null,null,{"$f":"LEFT(CELL(\"filename\",L3),L3-1)","v":"c:\\users\\dbryant\\appdata\\local\\bentley\\projectwise\\workingdir\\ohiodot-pw.bentley.com_ohiodot-pw-02\\dee.bryant@dot.ohio.gov\\d0567604\\[OFFICE Calcs_9 21 2023.xlsm"}]
[null,null,null,null,null,null,null,null,null,null,null,{"$f":"RIGHT(L5,L3-L2-1)","v":"OFFICE Calcs_9 21 2023.xlsm"}]
[]
[]
[]
[2,"Select \"Update\" when it asks about external links"]
{"$rows_left_out":120}
{"sheet":"Catagory Codes","index":2,"n_rows":39,"n_cols":3,"rows_kept":39,"cut":false,"hidden":false,"merged":[[0,0,0,2]]}
["CODES FOR USE WITH EXCEL QUANTITIES\n(Used to sort items on General Summary Sheets)"]
[]
["AA","ROADWAY",{"$f":"A3","v":"AA"}]
["BB","EROSION CONTROL","BB"]
["CC","DRAINAGE","CC"]
["DD","PAVEMENT","DD"]
["EE","WATER WORK","EE"]
["FF","SANITARY SEWER","FF"]
["GG","LIGHTING","GG"]
["HH","TRAFFIC SURVEILLANCE","HH"]
{"$rows_left_out":30}
{"sheet":"SUBSummary","index":3,"n_rows":75,"n_cols":30,"rows_kept":75,"cut":false,"hidden":false,"merged":[[0,24,1,24],[0,25,1,25],[0,0,0,19],[0,20,1,20],[0,21,1,21],[0,22,1,22],[0,23,1,23]]}
["SHEET NUMBER",null,null,null,null,null,null,null,null,null,null,null,null,null,null,null,null,null,null,null,"ITEM","ITEM\nEXT.","TOTAL","UNIT","DESCRIPTION","SEE SHEET NO."]
[{"$f":"IF(Combine!AQ5<>\"\",Combine!AQ5,\"\")","v":"####"},{"$f":"IF(Combine!AR5<>\"\",Combine!AR5,\"\")","v":""},{"$f":"IF(Combine!AS5<>\"\",Combine!AS5,\"\")","v":""},{"$f":"IF(Combine!AT5<>\"\",Combine!AT5,\"\")","v":""},{"$f":"IF(Combine!AU5<>\"\",Combine!AU5,\"\")","v":""},{"$f":"IF(Combine!AV5<>\"\",Combine!AV5,\"\")","v":""},{"$f":"IF(Combine!AW5<>\"\",Combine!AW5,\"\")","v":""},{"$f":"IF(Combine!AX5<>\"\",Combine!AX5,\"\")","v":""},{"$f":"IF(Combine!AY5<>\"\",Combine!AY5,\"\")","v":""},{"$f":"IF(Combine!AZ5<>\"\",Combine!AZ5,\"\")","v":""},{"$f":"IF(Combine!BA5<>\"\",Combine!BA5,\"\")","v":""},{"$f":"IF(Combine!BB5<>\"\",Combine!BB5,\"\")","v":""},{"$f":"IF(Combine!BC5<>\"\",Combine!BC5,\"\")","v":""},{"$f":"IF(Combine!BD5<>\"\",Combine!BD5,\"\")","v":""},{"$f":"IF(Combine!BE5<>\"\",Combine!BE5,\"\")","v":""},{"$f":"IF(Combine!BF5<>\"\",Combine!BF5,\"\")","v":""},{"$f":"IF(Combine!BG5<>\"\",Combine!BG5,\"\")","v":""},{"$f":"IF(Combine!BH5<>\"\",Combine!BH5,\"\")","v":""},{"$f":"IF(Combine!BI5<>\"\",Combine!BI5,\"\")","v":""},{"$f":"IF(Combine!BJ5<>\"\",Combine!BJ5,\"\")","v":""},null,null,null,null,null,null,"line","remain","offset","UNIT"]
[25735,"","","","","","","","","","","","","","","","","","","","204","10000",25735,"SY","SUBGRADE COMPACTION ",null,1,{"$f":"INT(AA3/6)","v":0},{"$f":"IF(  (AA3 - 6*AB3) = 0, 0, AA3 - AB3 )","v":1},{"$f":"IF( $AC3 = 0, \"\", IF( OFFSET( Combine!$AP$9,$AC3 - 1,0,1,1)<>0, VLOOKUP( OFFSET( Combine!$AP$9,$AC3 - 1,0,1,1),[1]Items!$A$2:$E$10001,3,0),\"\"))","v":"SY"}]
[1578,"","","","","","","","","","","","","","","","","","","","254","01000",1578,"SY","PAVEMENT PLANING, ASPHALT CONCRETE (1 1/4\") ",null,{"$f":"AA3+1","v":2},0,2,{"$f":"IF( $AC4 = 0, \"\", IF( OFFSET( Combine!$AP$9,$AC4 - 1,0,1,1)<>0, VLOOKUP( OFFSET( Combine!$AP$9,$AC4 - 1,0,1,1),[1]Items!$A$2:$E$10001,3,0),\"\"))","v":"SY"}]
[3607,"","","","","","","","","","","","","","","","","","","","301","56000",3607,"CY","ASPHALT CONCRETE BASE, PG64-22, (449) ",null,3,0,3,{"$f":"IF( $AC5 = 0, \"\", IF( OFFSET( Combine!$AP$9,$AC5 - 1,0,1,1)<>0, VLOOKUP( OFFSET( Combine!$AP$9,$AC5 - 1,0,1,1),[1]Items!$A$2:$E$10001,3,0),\"\"))","v":"CY"}]
[4654,"","","","","","","","","","","","","","","","","","","","304","20000",4654,"CY","AGGREGATE BASE ",null,4,0,4,{"$f":"IF( $AC6 = 0, \"\", IF( OFFSET( Combine!$AP$9,$AC6 - 1,0,1,1)<>0, VLOOKUP( OFFSET( Combine!$AP$9,$AC6 - 1,0,1,1),[1]Items!$A$2:$E$10001,3,0),\"\"))","v":"CY"}]
[3706,"","","","","","","","","","","","","","","","","","","","407","20000",3706,"GAL","NON-TRACKING TACK COAT ",null,5,0,5,{"$f":"IF( $AC7 = 0, \"\", IF( OFFSET( Combine!$AP$9,$AC7 - 1,0,1,1)<>0, VLOOKUP( OFFSET( Combine!$AP$9,$AC7 - 1,0,1,1),[1]Items!$A$2:$E$10001,3,0),\"\"))","v":"GAL"}]
["","","","","","","","","","","","","","","","","","","","","","","","","",null,6,1,0,{"$f":"IF( $AC8 = 0, \"\", IF( OFFSET( Combine!$AP$9,$AC8 - 1,0,1,1)<>0, VLOOKUP( OFFSET( Combine!$AP$9,$AC8 - 1,0,1,1),[1]Items!$A$2:$E$10001,3,0),\"\"))","v":""}]
[12,"","","","","","","","","","","","","","","","","","","","408","10001",12,"GAL","PRIME COAT, AS PER PLAN ",null,7,1,6,{"$f":"IF( $AC9 = 0, \"\", IF( OFFSET( Combine!$AP$9,$AC9 - 1,0,1,1)<>0, VLOOKUP( OFFSET( Combine!$AP$9,$AC9 - 1,0,1,1),[1]Items!$A$2:$E$10001,3,0),\"\"))","v":"GAL"}]
[808,"","","","","","","","","","","","","","","","","","","","441","50101",808,"CY","ASPHALT CONCRETE SURFACE COURSE, TYPE 1, (448), PG70-22M, AS PER PLAN  ",null,8,1,7,{"$f":"IF( $AC10 = 0, \"\", IF( OFFSET( Combine!$AP$9,$AC10 - 1,0,1,1)<>0, VLOOKUP( OFFSET( Combine!$AP$9,$AC10 - 1,0,1,1),[1]Items!$A$2:$E$10001,3,0),\"\"))","v":"CY"}]
{"$rows_left_out":66}
{"sheet":"Combine","index":4,"n_rows":842,"n_cols":62,"rows_kept":842,"cut":false,"hidden":false,"merged":[[0,41,1,61],[86,10,127,10],[128,10,169,10],[170,10,211,10],[3,18,3,19],[4,18,4,19],[0,18,1,39],[380,10,421,10],[0,0,0,4],[0,6,0,10],[44,10,85,10],[2,10,43,10],[212,10,253,10],[254,10,295,10],[296,10,337,10],[338,10,379,10],[800,10,841,10],[632,10,673,10],[674,10,715,10],[716,10,757,10],[758,10,799,10],[590,10,631,10],[422,10,463,10],[464,10,505,10],[506,10,547,10],[548,10,589,10]]}
["Cell References - HIDE",null,null,null,null,null,"Values",null,null,null,null,null,null,null,null,null,null,null,"                       ONLY MODIFY THE YELLOW CELLS (PAGE NUMBERS)",null,null,null,null,null,null,null,null,null,null,null,null,null,null,null,null,null,null,null,null,null,null,"TABLE TO MAKE SUB-SUMMARY"]
["Lookup Value","Quantity","Code","Line","Sheet",null,"Lookup Value","Quantity","Code","Sheet","Sheet"]
[{"$f":"ADDRESS($D3,1,4,1,$E3)","v":"'Sub01'!A108"},{"$f":"ADDRESS($D3,2,4,1,$E3)","v":"'Sub01'!B108"},{"$f":"ADDRESS($D3,3,4,1,$E3)","v":"'Sub01'!C108"},108,{"$f":"K3","v":"Sub01"},null,{"$f":"IF(INDIRECT(A3,1)<>\"\",INDIRECT(A3,1),\"\")","v":""},{"$f":"IF(INDIRECT(B3,1)<>\"\",IF(INDIRECT(B3,1)=\"LUMP\", \"LUMP\", INDIRECT(B3,1)),\"\")","v":""},{"$f":"IF(INDIRECT(C3,1)<>\"\",INDIRECT(C3,1),\"\")","v":""},{"$f":"K3","v":"Sub01"},"Sub01"]
[{"$f":"ADDRESS(D4,1,4,1,E4)","v":"'Sub01'!A109"},{"$f":"ADDRESS($D4,2,4,1,$E4)","v":"'Sub01'!B109"},{"$f":"ADDRESS($D4,3,4,1,$E4)","v":"'Sub01'!C109"},{"$f":"D3+1","v":109},{"$f":"K3","v":"Sub01"},null,{"$f":"IF(INDIRECT(A4,1)<>\"\",INDIRECT(A4,1),\"\")","v":""},{"$f":"IF(INDIRECT(B4,1)<>\"\",IF(INDIRECT(B4,1)=\"LUMP\", \"LUMP\", INDIRECT(B4,1)),\"\")","v":""},{"$f":"IF(INDIRECT(C4,1)<>\"\",INDIRECT(C4,1),\"\")","v":""},{"$f":"K3","v":"Sub01"},null,null,null,null,null,null,null,null,"Sub Sheet",null,{"$f":"IF(SUM(U8:U106)<>0,U7,\"\")","v":"Sub01"},{"$f":"IF(SUM(V8:V106)<>0,V7,\"\")","v":""},"","","","","","","","","","","","","","","","","",""]
["'Sub01'!A110","'Sub01'!B110","'Sub01'!C110",{"$f":"D4+1","v":110},{"$f":"K3","v":"Sub01"},null,"","","",{"$f":"K3","v":"Sub01"},null,null,null,null,null,null,null,null,"Page No.",null,{"$f":"IF(SUM(U8:U106)<>0,\"####\",\"\")","v":"####"},{"$f":"IF(SUM(V8:V106)<>0,\"####\",\"\")","v":""},{"$f":"IF(SUM(W8:W106)<>0,\"####\",\"\")","v":""},{"$f":"IF(SUM(X8:X106)<>0,\"####\",\"\")","v":""},{"$f":"IF(SUM(Y8:Y106)<>0,\"####\",\"\")","v":""},"","","","","","","","","","","","","","","",null,null,{"$f":"IF(U5<>\"\",U5,\"\")","v":"####"},"","","","","","","","","","",{"$f":"IF(AF5<>\"\",AF5,\"\")","v":""},"","","","","","","",""]
["'Sub01'!A111","'Sub01'!B111","'Sub01'!C111",111,{"$f":"K3","v":"Sub01"},null,"204E10000",25735,"AA",{"$f":"K3","v":"Sub01"},null,null,null,null,null,null,null,null,"Sum of Quantity",null,"Sheet",null,null,null,null,null,null,null,null,null,null,null,null,null,null,null,null,null,null,null,null,"Sum of Quantity","Sheet"]
["'Sub01'!A112","'Sub01'!B112","'Sub01'!C112",112,{"$f":"K3","v":"Sub01"},null,"254E010001",1578,"DD",{"$f":"K3","v":"Sub01"},null,null,"MASTER CODE","Item No.","Item Ext.","Item Code","Total for Code","Count Blanks","Lookup Value","Code","Sub01","Sub02","Sub03","Sub04","Sub05","Sub06","Sub07","Sub08","Sub09","Sub10","Sub11","Sub12","Sub13","Sub14","Sub15","Sub16","Sub17","Sub18","Sub19","Sub20",null,"Lookup Value","Sub01","Sub02","Sub03","Sub04","Sub05","Sub06","Sub07","Sub08","Sub09","Sub10","Sub11","Sub12","Sub13","Sub14","Sub15","Sub16","Sub17","Sub18","Sub19","Sub20"]
["'Sub01'!A113","'Sub01'!B113","'Sub01'!C113",113,{"$f":"K3","v":"Sub01"},null,"","","",{"$f":"K3","v":"Sub01"},null,null,null,{"$f":"IF(S8<>\"\",LEFT(S8,3),\"\")","v":""},{"$f":"IF(T8<>\"\", IF(LEN(OFFSET(S8,-R8,0,1,1))=9, RIGHT(OFFSET(S8,-R8,0,1,1),5), RIGHT(OFFSET(S8,-R8,0,1,1),6)),\"\")","v":""},null,null,null,"",null,0,0,0,0,0,0,0,0,0,0,0,0,0,0,0,0,0,0,0,0,null,null,0,0,0,0,0,0,0,0,0,0,0,0,0,0,0,0,0,0,0,0]
["'Sub01'!A114","'Sub01'!B114","'Sub01'!C114",114,{"$f":"K3","v":"Sub01"},null,"301E56000",3607,"DD",{"$f":"K3","v":"Sub01"},null,null,{"$f":"CONCATENATE(P9,N9,O9)","v":"AA20410000"},{"$f":"IF(T9<>\"\",LEFT(OFFSET(S9,-R9,0,1,1),3),\"\")","v":"204"},{"$f":"IF(T9<>\"\", IF(LEN(OFFSET(S9,-R9,0,1,1))=9, RIGHT(OFFSET(S9,-R9,0,1,1),5), RIGHT(OFFSET(S9,-R9,0,1,1),6)),\"\")","v":"10000"},{"$f":"IF(T9<>\"\", T9,\"\")","v":"AA"},{"$f":"IF(SUM(U9:AN9)<>0,SUM(U9:AN9),\"\")","v":25735},{"$f":"IF(T9<>\"\",IF(S9<>\"\",0,1+R8),\"\")","v":0},"204E10000","AA",25735,null,null,null,null,null,null,null,null,null,null,null,null,null,null,null,null,null,null,null,null,"204E10000",25735]
["'Sub01'!A115","'Sub01'!B115","'Sub01'!C115",115,{"$f":"K3","v":"Sub01"},null,"304E20000",4654,"DD",{"$f":"K3","v":"Sub01"},null,null,{"$f":"CONCATENATE(P10,N10,O10)","v":"DD254010001"},{"$f":"IF(T10<>\"\",LEFT(OFFSET(S10,-R10,0,1,1),3),\"\")","v":"254"},"010001",{"$f":"IF(T10<>\"\", T10,\"\")","v":"DD"},{"$f":"IF(SUM(U10:AN10)<>0,SUM(U10:AN10),\"\")","v":1578},{"$f":"IF(T10<>\"\",IF(S10<>\"\",0,1+R9),\"\")","v":0},"254E010001","DD",1578,null,null,null,null,null,null,null,null,null,null,null,null,null,null,null,null,null,null,null,null,"254E010001",1578]
{"$rows_left_out":833}
{"sheet":"Sub01","index":5,"n_rows":156,"n_cols":42,"rows_kept":156,"cut":false,"hidden":false,"merged":[[79,0,79,11],[6,41,7,41],[6,34,7,34],[6,40,7,40],[6,35,7,35],[6,32,7,32],[6,33,7,33],[6,36,7,36],[6,37,7,37],[6,38,7,38],[6,28,7,28],[6,31,7,31],[6,30,7,30],[6,39,7,39],[6,29,7,29]]}
[]
[]
[]
[]
["ROUTE","SHEET\nNO.","STATION",null,null,null,"WIDTH",null,"SIDE","LENGTH","AVERAGE WIDTH","SURFACE \nAREA\n(CA = CADD GENERATED AREA)","","","","204","254","","301","304","","407","407","441","441","","617","408","","","","","","","","","","","","","",""]
[null,null,null,null,null,null,null,null,null,null,null,null,null,"","",null,null,"",6,6,null,"Rate - 0.085","Rate - 0.055",1.25,1.75,"","T=2.00\"","Rate - 0.04","","","","","","","","","","","","","",""]
[null,null,null,null,null,null,null,null,null,null,null,null,"","","","SUBGRADE COMPACTION ","PAVEMENT PLANING, ASPHALT CONCRETE (1 1/4\") ","","ASPHALT CONCRETE BASE, PG64-22, (449) ","AGGREGATE BASE ","","NON-TRACKING TACK COAT ","NON-TRACKING TACK COAT ","ASPHALT CONCRETE SURFACE COURSE, TYPE 1, (448), PG70-22M, AS PER PLAN  ","ASPHALT CONCRETE INTERMEDIATE COURSE, TYPE 2, (448) ","","COMPACTED AGGREGATE, AS PER PLAN ","PRIME COAT, AS PER PLAN ","","","","","","","","","","","","","",""]
[]
[null,null,"FROM",null,"TO",null,"FROM","FT",null,"FT","FT","SF","","","","SY","SY","","CY","CY","","GAL","GAL","CY","CY","","CY","GAL","","","","","","","","","","","","","",""]
["SR-170",null,null,21097,null,21584.42,null,null,"LT/RT",487.5,null,13497.800000000001,null,null,null,null,1499.8000000000002,null,null,null,null,127.5,null,52.1,null,null,12.100000000000001,9]
{"$rows_left_out":146}