{"text_format":"1","workbook":"xlsx","n_sheets":6,"sheets":["Notes-COPY ALL","Instructions","Catagory Codes","SUBSummary","Combine","Sub01"],"not_rendered":{"charts":0,"images":19,"macros":1,"external_links":1,"defined_names":1,"comments":0,"pivot_tables":2},"unopened":[],"bounds":{"document_bytes":16777216,"sheet_cells":100000,"rows_first":2000,"rows_last":500,"rows_between":2000,"halvings":0,"cell_chars":16384,"cell_head_chars":4096},"cells_cut":0,"cells_raw":0,"read":"whole","date_system":"1900"}

{"sheet":"Notes-COPY ALL","index":0,"n_rows":1,"n_cols":1,"rows_kept":1,"cut":false,"hidden":false,"merged":[[0,0,0,9]]}
["WORKBOOK NOTES"]

{"sheet":"Instructions","index":1,"n_rows":129,"n_cols":12,"rows_kept":129,"cut":false,"hidden":false,"merged":[[66,1,67,10],[68,2,70,10],[71,2,73,10],[49,2,50,10],[52,2,52,10],[109,0,109,10],[82,1,82,10],[97,2,98,10],[99,2,100,10],[108,1,108,10],[94,1,96,10],[104,2,107,10],[101,1,103,10],[83,2,84,10],[88,2,91,10],[93,0,93,10],[85,1,87,10],[77,2,79,10],[55,1,55,10],[0,0,0,10],[2,0,2,10],[11,0,11,10],[25,0,25,10],[10,1,10,10],[19,2,23,10],[3,1,3,10],[1,0,1,10],[12,1,12,10],[13,1,13,10],[74,2,76,10],[30,1,30,10],[31,1,31,10],[35,2,38,10],[42,2,44,10],[29,1,29,10],[65,0,65,10],[60,2,63,10],[51,1,51,10],[53,2,54,10],[32,1,34,10],[128,1,128,10],[9,1,9,10],[4,2,8,10],[14,2,15,10],[16,2,16,10],[17,1,18,10],[28,2,28,10],[26,1,27,10],[39,2,41,10],[45,2,47,10],[24,1,24,10],[56,1,59,10],[64,1,64,10],[92,1,92,10],[48,1,48,10],[80,1,81,10],[110,1,112,10],[113,1,113,10],[115,2,116,10],[114,2,114,10],[125,1,127,10],[117,1,117,10],[118,1,119,10],[124,1,124,10],[120,2,123,10]]}
[null,null,null,null,null,null,null,null,null,null,null,{"$f":"CELL(\"filename\",L3)","v":"c:\\users\\dbryant\\appdata\\local\\bentley\\projectwise\\workingdir\\ohiodot-pw.bentley.com_ohiodot-pw-02\\dee.bryant@dot.ohio.gov\\d0567604\\[OFFICE Calcs_9 21 2023.xlsm]Instructions"}]
[{"$f":"CONCATENATE(\"HOW TO USE THIS WORKBOOK (\", L6, \")\")","v":"HOW TO USE THIS WORKBOOK (OFFICE Calcs_9 21 2023.xlsm)"},null,null,null,null,null,null,null,null,null,null,{"$f":"FIND(\"[\",L1)","v":133}]
["Opening the workbook",null,null,null,null,null,null,null,null,null,null,{"$f":"FIND(\"]\",L1)","v":161}]
[1,"Select \"Enable Macros\" when you open this workbook (if security is set to Medium)",null,null,null,null,null,null,null,null,null,{"$f":"LEN(L1)","v":173}]
[null,"a.","If you are not asked about enabling macros when you open the workbook, you either have your security set on the highest or lowest setting.  Set your security to \"Medium\" by the following steps:\nTools  >>  Macro  >>  Security….  For this workbook to function, you must have Medium (recommended), or Low selected.  If it was previously set on high, you must close this workbook and re-open it to ensure that the macros are enabled.",null,null,null,null,null,null,null,null,{"$f":"LEFT(CELL(\"filename\",L3),L3-1)","v":"c:\\users\\dbryant\\appdata\\local\\bentley\\projectwise\\workingdir\\ohiodot-pw.bentley.com_ohiodot-pw-02\\dee.bryant@dot.ohio.gov\\d0567604\\[OFFICE Calcs_9 21 2023.xlsm"}]
[null,null,null,null,null,null,null,null,null,null,null,{"$f":"RIGHT(L5,L3-L2-1)","v":"OFFICE Calcs_9 21 2023.xlsm"}]
[]
[]
[]
[2,"Select \"Update\" when it asks about external links"]
["X","                                        Link to top"]
["Getting Started"]
[1,"Read the instructions in their entirety"]
[2,"Read the notes in their entirety"]
[null,"a.","If you do anything out of the ordinary in this workbook please note it in on the notes sheet to ensure that anyone who opens this workbook can decipher the methodology used."]
[]
[null,"b.","Create notes sorted by sheet names for quick retrieval of pertinent notes"]
[3,"BEWARE: Changing protected formulas and adding/deleting rows & columns could potentially disable the entire workbook, and therefore the entire system."]
[]
[null,"b.","Every effort has been made to make sure that all necessary privaliges to work with this workbook are already allowed.  If there is some reason to change something not allowed because of the sheet protection, you may unprotect the sheet.  You can do this by selecting \"Tools >> Protection >> Unprotect sheet\"  (there is no password.)  IF you do need to do this, make sure that the sheet is protected again before you exit the sheet (not the workbook)"]
[]
[]
[]
[]
["X","                                        Link to top"]
["Data Entry"]
[1,"All calculations and data entry is to be done solely on the \"Calc##\" sheets.  The \"Sub## sheets are a formatted copy of the \"Calc##\" sheets and are to be used for importing into Microstation"]
[]
[null,"a.","The \"Sub##\" sheets are locked because no data is to be entered / deleted.  Formating can still be done."]
[2,"To begin entering data, select a \"Calc##\" sheet"]
[3,"Enter the Item Number of the item(s)"]
[4,"Enter the Item Extension of the item(s) - This information is seen on the General Summary and Estimate"]
[5,"Enter the Category Code of the item(s).  This information is used to separate the items into their respective categories on both the General Summary and the Cost Estimate.  The actual code is never seen on a printed document, but it is absolutely essential for this system to work."]
[]
[]
[null,"a.","The \"Category Codes\" sheet has a listing of all of the necessary codes.  These are a copy of the \"official\" category codes used in compiling the General Summary.  When the General Summary is compiled, the \"Category Codes\" sheet from the \"GENERAL SUMMARY.xls\" workbook is referenced for placing titles on the General Summary sheet."]
[]
[]
[]
[null,"b.","The Category Codes are listed in the order ODOT wants to see them on the General Summary.  If ODOT were to change the categories that they want to see on the General Summary, the descriptions on the \"Category Codes\" sheet of the \"GENERAL SUMMARY.xls\" workbook would have to change to reflect these changes."]
[]
[]
[null,"c.","The \"MISCELLANEOUS\" Code (RR & RS) is used to denote Incidentals.  These are items placed at the end of both the General Summary and Estimate.  In the General Summary these items do not get a category title, but on the Estimate they get placed under the \"Incidentals\" section."]
[]
[]
[null,"d.","The second set of codes is to denote an \"Item Special\" under the given ODOT category.  Essentially, the first letter of the code denotes the category, and the second letter denotes whether or not it is an item special (although if it is not an item special, the two identical letters are still needed.)"]
[]
[]
[6,"Enter the specific details for each item (Ref, Sheet, Station, Side, ect. )"]
[null,"a.","These columns will be referred to as the INFO columns in the future….They include all columns that contain data that is not carried to the general summary"]
[]
[7,"Enter the quantities of each item."]
[null,"a.","Actual calculations can be performed in each quantity cell"]
[null,"a."," You do not need to worry about rounding, since that is automated by the \"Sub##\" sheets associated with each \"Calc ##\" sheet.  Setting the rounding amounts is further explained in the \"Formating Data\" section"]
[]
[8,"Repeat the above steps on as many \"Calc##\" sheets as it takes to facilitate the all pertinent quantities"]
[9,"To make this new information available to the Generals Summary, the \"COMPILE\" button must be pressed (upper left hand corner of the \"Calc ##\" sheets.  THIS MUST BE DONE BEFORE YOU EXIT THE WORKBOOK."]
[]
[]
[]
[null,"a.","The compile button refreshes hidden pivot tables that consolidates all of the \"Sub##\" sheets into tables used to transfer data onto the \"SUBSummary\" sheet and the \"General Summary.xls\" workbook  The button also brings you to the \"Sub##\" sheet associated with the \"Calc##\" sheet on which the button was pushed.  After updating the pivot tables, the workbook is automatically saved."]
[]
[]
[]
["X","                                        Link to top"]
["Formating Data"]
[1,"After the calculations are made, the data must be rounded consistently.  There are 4 rows at the bottom of each \"Calc##\" sheet that are used for this reason.  It is also possible to add text to the ODOT description in this section."]
[]
[null,"a.","\"Prepended Description\" will add text to the beginning of the ODOT description.\nNOTE: The modification is only good for this sheet, it is required that only the ODOT description be present on the General Summary.  This option is to be used sparingly."]
[]
[]
[null,"b.","\"Appended Description\" will add text to the end of the ODOT description.\nNOTE: The modification is only good for this sheet, it is required that only the ODOT description be present on the General Summary.  This option is to be used sparingly."]
[]
[]
[null,"c.","\"SubTotal Precision\" will round all of the calculated values UP to the nearest multiple of this number.  This will ensure that all of the calculations in the \"Calc##\" sheets are carried to the \"Sub##\" sheets with the same degree of precision, regardless of how precise they are on the \"Calc##\" sheets."]
[]
[]
[null,"d.","\"Summary Precision\" will round the TOTALS lines UP to the nearest multiple of this number.  ODOT items are to be rounded to a specific degree of precision on the General Summary.  It is this \"Summary Precision\" that does this rounding automatically for us."]
[]
[]
[2,"Any of the \"Title\" cells across the top of the \"Sub##\" sheets (with the exception of the Item No., Description, and Units) can be changed on the \"Calc##\" sheets, and the change will be reflected on the \"Sub##\" sheets."]
[]
[3,"Cells in the INFO columns may be merged to provide for section titles."]
[null,"a.","When \"Sub##\" INFO cells are merged, the data that will be brought to the merged area corresponds to the same cell on the \"Calc##\" sheets as the upper-left most cell of the merged cells."]
[]
[4,"Rows and columns may be hidden (hidden rows/columns will not show up when referenced using Axiom), but UNDER NO CIRCUMSTANCES may rows and columns be deleted or inserted.  There are many \"static\" and \"indirect\" cell references that will be lost, and therefore the system will be broken  :-("]
[]
[]
[null,"a.","One of the \"TOTAL\" lines at the bottom of the \"Sub##\" sheets needs to be hidden before importing the sheet into Microstation.  The \"TOTALS CARRIED TO GENERAL SUMMARY\" line is a total quantity from the entire workbook, and is to be shown if only one \"Sub##\" sheet is used.  The \"TOTALS CARRIED TO SUBSUMMARY\" line is to be shown when a SUBSummary sheet is used."]
[]
[]
[]
["X","                                        Link to top"]
["Using the SUBSummary"]
[1,"Since the General Summary has a limited number of possible columns for referenced SubSummaries, the \"Sub##\" sheets (calculation sheets) from this notebook need to be consolidated to a single SubSummary (if more than one \"Sub##\" sheet is used).  This sheet is created automatically, and can be seen on the \"SUBSummary\" sheet."]
[]
[]
[null,"a.","Like the \"Sub##\" sheets, the \"SUBSummary\" sheet allows for formatting (no merging of cells) and hiding of rows/columns."]
[]
[null,"b.","REMINDER: Will the \"SUBSummary\" sheet and last \"Sub##\" sheet fit on the same page of a Microstation drawing if you hide the unneccesary rows on both?"]
[]
[2,"If the \"SUBSummary\" is to be used, each column must reference a calculation sheet.  This is done on the \"Combine\" sheet.  The sheets that need a page referenced will be displayed on the top blackened rows, and the cell that needs the page number placed in it will turn yellow and display \"####\""]
[]
[]
[null,"a.","The \"####\" is displayed through a formula.  The formula can be deleted and the page number entered in the same cell.\nNOTE: DO NOTE CHANGE ANY OTHER THINGS ON THIS PAGE, AS THIS IS THE PAGE THAT MAKES THE ENTIRE SYSTEM WORK!"]
[]
[]
[]
["X","                                       Link to top"]
["Importing into Microstation"]
[1,"NOTE: HAVE THE SHEET READY TO GO IF USING THE SHARED RESOURCE PC.  The shared resource PC is too slow to do all of the calculations and external links.  When it asks, say \"Disable Macros\", and \"Don't Update\".  If the button was pushed last time you left the workbook, the workbook should be up to date when you re-open it."]
[]
[]
[2,"Load Axiom into Microstation (office.mdl)"]
[null,"a.","Select…Utilies >> MDL Applications from the Microstation menue"]
[null,"b.","Select \"Browse\"  and load \"S:\\BENTLEY\\Axiom\\office\\office.ma\" - NOTE: this can only be loaded on the computer that has Axiom installed on it (Typicaly the Shared Resource PC.)"]
[]
[2,"Load the \"S:\\BENTLEY\\Axiom\\office\\QUANTITIES.ini\" file to use for importing these spreadsheets."]
[3,"Select the area of the sheet (in Excel) you wish to import to Microstation.  Now envoke the copy command (in Excel) by either   Edit >> Copy, or by holding the \"Ctrl\" key and pressing the \"C\" button"]
[]
[null,"a.","NOTE/TIP: Include some extra \"blank\" area such that if more data is added to the Excel sheet it will automatically be placed on the sheet with an \"Update\", as opposed to having to completely re-insert the Excel Sheet.  Rows/Columns that are hidden when the sheet is imported into Microstation will remain hidden in Microstation even if they are unhidden in Excel."]
[]
[]
[]
[4,"Paste the data into Microstation using the paste button on the Axiom toolbar."]
[5,"Once all of the sheets are referenced into Microstation, they will remain the same size upon updates.  The updates need to be done manually on the shared resources PC …by loading Axiom each time and selecting each item to be updated."]
[]
[]
["X","                                        Link to top"]

{"sheet":"Catagory Codes","index":2,"n_rows":39,"n_cols":3,"rows_kept":39,"cut":false,"hidden":false,"merged":[[0,0,0,2]]}
["CODES FOR USE WITH EXCEL QUANTITIES\n(Used to sort items on General Summary Sheets)"]
[]
["AA","ROADWAY",{"$f":"A3","v":"AA"}]
["BB","EROSION CONTROL","BB"]
["CC","DRAINAGE","CC"]
["DD","PAVEMENT","DD"]
["EE","WATER WORK","EE"]
["FF","SANITARY SEWER","FF"]
["GG","LIGHTING","GG"]
["HH","TRAFFIC SURVEILLANCE","HH"]
["II","TRAFFIC CONTROL","II"]
["JJ","TRAFFIC SIGNALS","JJ"]
["KK","LANDSCAPING","KK"]
["LL","RETAINING WALLS","LL"]
["MM","BUILDING DEMOLITION","MM"]
["NN","NOISE BARRIERS","NN"]
["OO","STRUCTURES (20' AND UNDER)","OO"]
["PP","STRUCTURES (OVER 20')","PP"]
["QQ","MAINTENANCE OF TRAFFIC","QQ"]
["RR","MISCELLANEOUS","RR"]
[]
[{"$f":"CONCATENATE(LEFT(A3,1),\"S\")","v":"AS"},{"$f":"CONCATENATE(B3,\" - SPECIAL\")","v":"ROADWAY - SPECIAL"},{"$f":"A22","v":"AS"}]
["BS","EROSION CONTROL - SPECIAL","BS"]
["CS","DRAINAGE - SPECIAL","CS"]
["DS","PAVEMENT - SPECIAL","DS"]
["ES","WATER WORK - SPECIAL","ES"]
["FS","SANITARY SEWER - SPECIAL","FS"]
["GS","LIGHTING - SPECIAL","GS"]
["HS","TRAFFIC SURVEILLANCE - SPECIAL","HS"]
["IS","TRAFFIC CONTROL - SPECIAL","IS"]
["JS","TRAFFIC SIGNALS - SPECIAL","JS"]
["KS","LANDSCAPING - SPECIAL","KS"]
["LS","RETAINING WALLS - SPECIAL","LS"]
["MS","BUILDING DEMOLITION - SPECIAL","MS"]
["NS","NOISE BARRIERS - SPECIAL","NS"]
["OS","STRUCTURES (20' AND UNDER) - SPECIAL","OS"]
["PS","STRUCTURES (OVER 20') - SPECIAL","PS"]
["QS","MAINTENANCE OF TRAFFIC - SPECIAL","QS"]
["RS","MISCELLANEOUS - SPECIAL","RS"]

{"sheet":"SUBSummary","index":3,"n_rows":75,"n_cols":30,"rows_kept":75,"cut":false,"hidden":false,"merged":[[0,24,1,24],[0,25,1,25],[0,0,0,19],[0,20,1,20],[0,21,1,21],[0,22,1,22],[0,23,1,23]]}
["SHEET NUMBER",null,null,null,null,null,null,null,null,null,null,null,null,null,null,null,null,null,null,null,"ITEM","ITEM\nEXT.","TOTAL","UNIT","DESCRIPTION","SEE SHEET NO."]
[{"$f":"IF(Combine!AQ5<>\"\",Combine!AQ5,\"\")","v":"####"},{"$f":"IF(Combine!AR5<>\"\",Combine!AR5,\"\")","v":""},{"$f":"IF(Combine!AS5<>\"\",Combine!AS5,\"\")","v":""},{"$f":"IF(Combine!AT5<>\"\",Combine!AT5,\"\")","v":""},{"$f":"IF(Combine!AU5<>\"\",Combine!AU5,\"\")","v":""},{"$f":"IF(Combine!AV5<>\"\",Combine!AV5,\"\")","v":""},{"$f":"IF(Combine!AW5<>\"\",Combine!AW5,\"\")","v":""},{"$f":"IF(Combine!AX5<>\"\",Combine!AX5,\"\")","v":""},{"$f":"IF(Combine!AY5<>\"\",Combine!AY5,\"\")","v":""},{"$f":"IF(Combine!AZ5<>\"\",Combine!AZ5,\"\")","v":""},{"$f":"IF(Combine!BA5<>\"\",Combine!BA5,\"\")","v":""},{"$f":"IF(Combine!BB5<>\"\",Combine!BB5,\"\")","v":""},{"$f":"IF(Combine!BC5<>\"\",Combine!BC5,\"\")","v":""},{"$f":"IF(Combine!BD5<>\"\",Combine!BD5,\"\")","v":""},{"$f":"IF(Combine!BE5<>\"\",Combine!BE5,\"\")","v":""},{"$f":"IF(Combine!BF5<>\"\",Combine!BF5,\"\")","v":""},{"$f":"IF(Combine!BG5<>\"\",Combine!BG5,\"\")","v":""},{"$f":"IF(Combine!BH5<>\"\",Combine!BH5,\"\")","v":""},{"$f":"IF(Combine!BI5<>\"\",Combine!BI5,\"\")","v":""},{"$f":"IF(Combine!BJ5<>\"\",Combine!BJ5,\"\")","v":""},null,null,null,null,null,null,"line","remain","offset","UNIT"]
[25735,"","","","","","","","","","","","","","","","","","","","204","10000",25735,"SY","SUBGRADE COMPACTION ",null,1,{"$f":"INT(AA3/6)","v":0},{"$f":"IF(  (AA3 - 6*AB3) = 0, 0, AA3 - AB3 )","v":1},{"$f":"IF( $AC3 = 0, \"\", IF( OFFSET( Combine!$AP$9,$AC3 - 1,0,1,1)<>0, VLOOKUP( OFFSET( Combine!$AP$9,$AC3 - 1,0,1,1),[1]Items!$A$2:$E$10001,3,0),\"\"))","v":"SY"}]
[1578,"","","","","","","","","","","","","","","","","","","","254","01000",1578,"SY","PAVEMENT PLANING, ASPHALT CONCRETE (1 1/4\") ",null,{"$f":"AA3+1","v":2},0,2,{"$f":"IF( $AC4 = 0, \"\", IF( OFFSET( Combine!$AP$9,$AC4 - 1,0,1,1)<>0, VLOOKUP( OFFSET( Combine!$AP$9,$AC4 - 1,0,1,1),[1]Items!$A$2:$E$10001,3,0),\"\"))","v":"SY"}]
[3607,"","","","","","","","","","","","","","","","","","","","301","56000",3607,"CY","ASPHALT CONCRETE BASE, PG64-22, (449) ",null,3,0,3,{"$f":"IF( $AC5 = 0, \"\", IF( OFFSET( Combine!$AP$9,$AC5 - 1,0,1,1)<>0, VLOOKUP( OFFSET( Combine!$AP$9,$AC5 - 1,0,1,1),[1]Items!$A$2:$E$10001,3,0),\"\"))","v":"CY"}]
[4654,"","","","","","","","","","","","","","","","","","","","304","20000",4654,"CY","AGGREGATE BASE ",null,4,0,4,{"$f":"IF( $AC6 = 0, \"\", IF( OFFSET( Combine!$AP$9,$AC6 - 1,0,1,1)<>0, VLOOKUP( OFFSET( Combine!$AP$9,$AC6 - 1,0,1,1),[1]Items!$A$2:$E$10001,3,0),\"\"))","v":"CY"}]
[3706,"","","","","","","","","","","","","","","","","","","","407","20000",3706,"GAL","NON-TRACKING TACK COAT ",null,5,0,5,{"$f":"IF( $AC7 = 0, \"\", IF( OFFSET( Combine!$AP$9,$AC7 - 1,0,1,1)<>0, VLOOKUP( OFFSET( Combine!$AP$9,$AC7 - 1,0,1,1),[1]Items!$A$2:$E$10001,3,0),\"\"))","v":"GAL"}]
["","","","","","","","","","","","","","","","","","","","","","","","","",null,6,1,0,{"$f":"IF( $AC8 = 0, \"\", IF( OFFSET( Combine!$AP$9,$AC8 - 1,0,1,1)<>0, VLOOKUP( OFFSET( Combine!$AP$9,$AC8 - 1,0,1,1),[1]Items!$A$2:$E$10001,3,0),\"\"))","v":""}]
[12,"","","","","","","","","","","","","","","","","","","","408","10001",12,"GAL","PRIME COAT, AS PER PLAN ",null,7,1,6,{"$f":"IF( $AC9 = 0, \"\", IF( OFFSET( Combine!$AP$9,$AC9 - 1,0,1,1)<>0, VLOOKUP( OFFSET( Combine!$AP$9,$AC9 - 1,0,1,1),[1]Items!$A$2:$E$10001,3,0),\"\"))","v":"GAL"}]
[808,"","","","","","","","","","","","","","","","","","","","441","50101",808,"CY","ASPHALT CONCRETE SURFACE COURSE, TYPE 1, (448), PG70-22M, AS PER PLAN  ",null,8,1,7,{"$f":"IF( $AC10 = 0, \"\", IF( OFFSET( Combine!$AP$9,$AC10 - 1,0,1,1)<>0, VLOOKUP( OFFSET( Combine!$AP$9,$AC10 - 1,0,1,1),[1]Items!$A$2:$E$10001,3,0),\"\"))","v":"CY"}]
[1053,"","","","","","","","","","","","","","","","","","","","441","50300",1053,"CY","ASPHALT CONCRETE INTERMEDIATE COURSE, TYPE 2, (448) ",null,9,1,8,{"$f":"IF( $AC11 = 0, \"\", IF( OFFSET( Combine!$AP$9,$AC11 - 1,0,1,1)<>0, VLOOKUP( OFFSET( Combine!$AP$9,$AC11 - 1,0,1,1),[1]Items!$A$2:$E$10001,3,0),\"\"))","v":"CY"}]
[16,"","","","","","","","","","","","","","","","","","","","617","10101",16,"CY","COMPACTED AGGREGATE, AS PER PLAN ",null,10,1,9,{"$f":"IF( $AC12 = 0, \"\", IF( OFFSET( Combine!$AP$9,$AC12 - 1,0,1,1)<>0, VLOOKUP( OFFSET( Combine!$AP$9,$AC12 - 1,0,1,1),[1]Items!$A$2:$E$10001,3,0),\"\"))","v":"CY"}]
[{"$f":"IF( $AC13 = 0, \"\", IF( OFFSET( Combine!AQ$9,$AC13 - 1,0,1,1)<>0, IF(OR($AD13=\"LUMP\", $AD13=\"LS\"), \"LUMP\", OFFSET( Combine!AQ$9,$AC13 - 1,0,1,1)),\"\"))","v":""},{"$f":"IF( $AC13 = 0, \"\", IF( OFFSET( Combine!AR$9,$AC13 - 1,0,1,1)<>0, IF(OR($AD13=\"LUMP\", $AD13=\"LS\"), \"LUMP\", OFFSET( Combine!AR$9,$AC13 - 1,0,1,1)),\"\"))","v":""},{"$f":"IF( $AC13 = 0, \"\", IF( OFFSET( Combine!AS$9,$AC13 - 1,0,1,1)<>0, IF(OR($AD13=\"LUMP\", $AD13=\"LS\"), \"LUMP\", OFFSET( Combine!AS$9,$AC13 - 1,0,1,1)),\"\"))","v":""},{"$f":"IF( $AC13 = 0, \"\", IF( OFFSET( Combine!AT$9,$AC13 - 1,0,1,1)<>0, IF(OR($AD13=\"LUMP\", $AD13=\"LS\"), \"LUMP\", OFFSET( Combine!AT$9,$AC13 - 1,0,1,1)),\"\"))","v":""},{"$f":"IF( $AC13 = 0, \"\", IF( OFFSET( Combine!AU$9,$AC13 - 1,0,1,1)<>0, IF(OR($AD13=\"LUMP\", $AD13=\"LS\"), \"LUMP\", OFFSET( Combine!AU$9,$AC13 - 1,0,1,1)),\"\"))","v":""},{"$f":"IF( $AC13 = 0, \"\", IF( OFFSET( Combine!AV$9,$AC13 - 1,0,1,1)<>0, IF(OR($AD13=\"LUMP\", $AD13=\"LS\"), \"LUMP\", OFFSET( Combine!AV$9,$AC13 - 1,0,1,1)),\"\"))","v":""},{"$f":"IF( $AC13 = 0, \"\", IF( OFFSET( Combine!AW$9,$AC13 - 1,0,1,1)<>0, IF(OR($AD13=\"LUMP\", $AD13=\"LS\"), \"LUMP\", OFFSET( Combine!AW$9,$AC13 - 1,0,1,1)),\"\"))","v":""},{"$f":"IF( $AC13 = 0, \"\", IF( OFFSET( Combine!AX$9,$AC13 - 1,0,1,1)<>0, IF(OR($AD13=\"LUMP\", $AD13=\"LS\"), \"LUMP\", OFFSET( Combine!AX$9,$AC13 - 1,0,1,1)),\"\"))","v":""},{"$f":"IF( $AC13 = 0, \"\", IF( OFFSET( Combine!AY$9,$AC13 - 1,0,1,1)<>0, IF(OR($AD13=\"LUMP\", $AD13=\"LS\"), \"LUMP\", OFFSET( Combine!AY$9,$AC13 - 1,0,1,1)),\"\"))","v":""},{"$f":"IF( $AC13 = 0, \"\", IF( OFFSET( Combine!AZ$9,$AC13 - 1,0,1,1)<>0, IF(OR($AD13=\"LUMP\", $AD13=\"LS\"), \"LUMP\", OFFSET( Combine!AZ$9,$AC13 - 1,0,1,1)),\"\"))","v":""},{"$f":"IF( $AC13 = 0, \"\", IF( OFFSET( Combine!BA$9,$AC13 - 1,0,1,1)<>0, IF(OR($AD13=\"LUMP\", $AD13=\"LS\"), \"LUMP\", OFFSET( Combine!BA$9,$AC13 - 1,0,1,1)),\"\"))","v":""},{"$f":"IF( $AC13 = 0, \"\", IF( OFFSET( Combine!BB$9,$AC13 - 1,0,1,1)<>0, IF(OR($AD13=\"LUMP\", $AD13=\"LS\"), \"LUMP\", OFFSET( Combine!BB$9,$AC13 - 1,0,1,1)),\"\"))","v":""},{"$f":"IF( $AC13 = 0, \"\", IF( OFFSET( Combine!BC$9,$AC13 - 1,0,1,1)<>0, IF(OR($AD13=\"LUMP\", $AD13=\"LS\"), \"LUMP\", OFFSET( Combine!BC$9,$AC13 - 1,0,1,1)),\"\"))","v":""},{"$f":"IF( $AC13 = 0, \"\", IF( OFFSET( Combine!BD$9,$AC13 - 1,0,1,1)<>0, IF(OR($AD13=\"LUMP\", $AD13=\"LS\"), \"LUMP\", OFFSET( Combine!BD$9,$AC13 - 1,0,1,1)),\"\"))","v":""},{"$f":"IF( $AC13 = 0, \"\", IF( OFFSET( Combine!BE$9,$AC13 - 1,0,1,1)<>0, IF(OR($AD13=\"LUMP\", $AD13=\"LS\"), \"LUMP\", OFFSET( Combine!BE$9,$AC13 - 1,0,1,1)),\"\"))","v":""},{"$f":"IF( $AC13 = 0, \"\", IF( OFFSET( Combine!BF$9,$AC13 - 1,0,1,1)<>0, IF(OR($AD13=\"LUMP\", $AD13=\"LS\"), \"LUMP\", OFFSET( Combine!BF$9,$AC13 - 1,0,1,1)),\"\"))","v":""},{"$f":"IF( $AC13 = 0, \"\", IF( OFFSET( Combine!BG$9,$AC13 - 1,0,1,1)<>0, IF(OR($AD13=\"LUMP\", $AD13=\"LS\"), \"LUMP\", OFFSET( Combine!BG$9,$AC13 - 1,0,1,1)),\"\"))","v":""},{"$f":"IF( $AC13 = 0, \"\", IF( OFFSET( Combine!BH$9,$AC13 - 1,0,1,1)<>0, IF(OR($AD13=\"LUMP\", $AD13=\"LS\"), \"LUMP\", OFFSET( Combine!BH$9,$AC13 - 1,0,1,1)),\"\"))","v":""},{"$f":"IF( $AC13 = 0, \"\", IF( OFFSET( Combine!BI$9,$AC13 - 1,0,1,1)<>0, IF(OR($AD13=\"LUMP\", $AD13=\"LS\"), \"LUMP\", OFFSET( Combine!BI$9,$AC13 - 1,0,1,1)),\"\"))","v":""},{"$f":"IF( $AC13 = 0, \"\", IF( OFFSET( Combine!BJ$9,$AC13 - 1,0,1,1)<>0, IF(OR($AD13=\"LUMP\", $AD13=\"LS\"), \"LUMP\", OFFSET( Combine!BJ$9,$AC13 - 1,0,1,1)),\"\"))","v":""},{"$f":"IF( $AC13 = 0, \"\", IF( OFFSET( Combine!AP$9,$AC13 - 1,0,1,1)<>0, LEFT(OFFSET( Combine!AP$9,$AC13 - 1,0,1,1),3),\"\"))","v":""},{"$f":"IF( $AC13 = 0, \"\", IF( OFFSET( Combine!AP$9,$AC13 - 1,0,1,1)<>0, IF(LEN(OFFSET( Combine!AP$9,$AC13 - 1,0,1,1))=9,   RIGHT(OFFSET( Combine!AP$9,$AC13 - 1,0,1,1),5),    LEFT(RIGHT(OFFSET( Combine!AP$9,$AC13 - 1,0,1,1),6), 5)      ),\"\"))","v":""},{"$f":"IF(SUM(A13:T13)<>0,SUM(A13:T13),IF(OR(AD13=\"LUMP\", AD13=\"LS\"), \"LUMP\", \"\"))","v":""},{"$f":"IF( $AC13 = 0, \"\", IF( OFFSET( Combine!$AP$9,$AC13 - 1,0,1,1)<>0,IF(OR(AD13=\"LUMP\", AD13=\"LS\"), \"\", AD13),\"\"))","v":""},{"$f":"IF( $AC13 = 0, \"\", IF( OFFSET( Combine!$AP$9,$AC13 - 1,0,1,1)<>0, VLOOKUP( OFFSET( Combine!$AP$9,$AC13 - 1,0,1,1),[1]Items!$A$2:$E$10001,4,0),\"\"))","v":""},null,11,1,10,{"$f":"IF( $AC13 = 0, \"\", IF( OFFSET( Combine!$AP$9,$AC13 - 1,0,1,1)<>0, VLOOKUP( OFFSET( Combine!$AP$9,$AC13 - 1,0,1,1),[1]Items!$A$2:$E$10001,3,0),\"\"))","v":""}]
[{"$f":"IF( $AC14 = 0, \"\", IF( OFFSET( Combine!AQ$9,$AC14 - 1,0,1,1)<>0, IF(OR($AD14=\"LUMP\", $AD14=\"LS\"), \"LUMP\", OFFSET( Combine!AQ$9,$AC14 - 1,0,1,1)),\"\"))","v":""},{"$f":"IF( $AC14 = 0, \"\", IF( OFFSET( Combine!AR$9,$AC14 - 1,0,1,1)<>0, IF(OR($AD14=\"LUMP\", $AD14=\"LS\"), \"LUMP\", OFFSET( Combine!AR$9,$AC14 - 1,0,1,1)),\"\"))","v":""},{"$f":"IF( $AC14 = 0, \"\", IF( OFFSET( Combine!AS$9,$AC14 - 1,0,1,1)<>0, IF(OR($AD14=\"LUMP\", $AD14=\"LS\"), \"LUMP\", OFFSET( Combine!AS$9,$AC14 - 1,0,1,1)),\"\"))","v":""},{"$f":"IF( $AC14 = 0, \"\", IF( OFFSET( Combine!AT$9,$AC14 - 1,0,1,1)<>0, IF(OR($AD14=\"LUMP\", $AD14=\"LS\"), \"LUMP\", OFFSET( Combine!AT$9,$AC14 - 1,0,1,1)),\"\"))","v":""},{"$f":"IF( $AC14 = 0, \"\", IF( OFFSET( Combine!AU$9,$AC14 - 1,0,1,1)<>0, IF(OR($AD14=\"LUMP\", $AD14=\"LS\"), \"LUMP\", OFFSET( Combine!AU$9,$AC14 - 1,0,1,1)),\"\"))","v":""},{"$f":"IF( $AC14 = 0, \"\", IF( OFFSET( Combine!AV$9,$AC14 - 1,0,1,1)<>0, IF(OR($AD14=\"LUMP\", $AD14=\"LS\"), \"LUMP\", OFFSET( Combine!AV$9,$AC14 - 1,0,1,1)),\"\"))","v":""},{"$f":"IF( $AC14 = 0, \"\", IF( OFFSET( Combine!AW$9,$AC14 - 1,0,1,1)<>0, IF(OR($AD14=\"LUMP\", $AD14=\"LS\"), \"LUMP\", OFFSET( Combine!AW$9,$AC14 - 1,0,1,1)),\"\"))","v":""},{"$f":"IF( $AC14 = 0, \"\", IF( OFFSET( Combine!AX$9,$AC14 - 1,0,1,1)<>0, IF(OR($AD14=\"LUMP\", $AD14=\"LS\"), \"LUMP\", OFFSET( Combine!AX$9,$AC14 - 1,0,1,1)),\"\"))","v":""},{"$f":"IF( $AC14 = 0, \"\", IF( OFFSET( Combine!AY$9,$AC14 - 1,0,1,1)<>0, IF(OR($AD14=\"LUMP\", $AD14=\"LS\"), \"LUMP\", OFFSET( Combine!AY$9,$AC14 - 1,0,1,1)),\"\"))","v":""},{"$f":"IF( $AC14 = 0, \"\", IF( OFFSET( Combine!AZ$9,$AC14 - 1,0,1,1)<>0, IF(OR($AD14=\"LUMP\", $AD14=\"LS\"), \"LUMP\", OFFSET( Combine!AZ$9,$AC14 - 1,0,1,1)),\"\"))","v":""},{"$f":"IF( $AC14 = 0, \"\", IF( OFFSET( Combine!BA$9,$AC14 - 1,0,1,1)<>0, IF(OR($AD14=\"LUMP\", $AD14=\"LS\"), \"LUMP\", OFFSET( Combine!BA$9,$AC14 - 1,0,1,1)),\"\"))","v":""},{"$f":"IF( $AC14 = 0, \"\", IF( OFFSET( Combine!BB$9,$AC14 - 1,0,1,1)<>0, IF(OR($AD14=\"LUMP\", $AD14=\"LS\"), \"LUMP\", OFFSET( Combine!BB$9,$AC14 - 1,0,1,1)),\"\"))","v":""},{"$f":"IF( $AC14 = 0, \"\", IF( OFFSET( Combine!BC$9,$AC14 - 1,0,1,1)<>0, IF(OR($AD14=\"LUMP\", $AD14=\"LS\"), \"LUMP\", OFFSET( Combine!BC$9,$AC14 - 1,0,1,1)),\"\"))","v":""},{"$f":"IF( $AC14 = 0, \"\", IF( OFFSET( Combine!BD$9,$AC14 - 1,0,1,1)<>0, IF(OR($AD14=\"LUMP\", $AD14=\"LS\"), \"LUMP\", OFFSET( Combine!BD$9,$AC14 - 1,0,1,1)),\"\"))","v":""},{"$f":"IF( $AC14 = 0, \"\", IF( OFFSET( Combine!BE$9,$AC14 - 1,0,1,1)<>0, IF(OR($AD14=\"LUMP\", $AD14=\"LS\"), \"LUMP\", OFFSET( Combine!BE$9,$AC14 - 1,0,1,1)),\"\"))","v":""},{"$f":"IF( $AC14 = 0, \"\", IF( OFFSET( Combine!BF$9,$AC14 - 1,0,1,1)<>0, IF(OR($AD14=\"LUMP\", $AD14=\"LS\"), \"LUMP\", OFFSET( Combine!BF$9,$AC14 - 1,0,1,1)),\"\"))","v":""},{"$f":"IF( $AC14 = 0, \"\", IF( OFFSET( Combine!BG$9,$AC14 - 1,0,1,1)<>0, IF(OR($AD14=\"LUMP\", $AD14=\"LS\"), \"LUMP\", OFFSET( Combine!BG$9,$AC14 - 1,0,1,1)),\"\"))","v":""},{"$f":"IF( $AC14 = 0, \"\", IF( OFFSET( Combine!BH$9,$AC14 - 1,0,1,1)<>0, IF(OR($AD14=\"LUMP\", $AD14=\"LS\"), \"LUMP\", OFFSET( Combine!BH$9,$AC14 - 1,0,1,1)),\"\"))","v":""},{"$f":"IF( $AC14 = 0, \"\", IF( OFFSET( Combine!BI$9,$AC14 - 1,0,1,1)<>0, IF(OR($AD14=\"LUMP\", $AD14=\"LS\"), \"LUMP\", OFFSET( Combine!BI$9,$AC14 - 1,0,1,1)),\"\"))","v":""},{"$f":"IF( $AC14 = 0, \"\", IF( OFFSET( Combine!BJ$9,$AC14 - 1,0,1,1)<>0, IF(OR($AD14=\"LUMP\", $AD14=\"LS\"), \"LUMP\", OFFSET( Combine!BJ$9,$AC14 - 1,0,1,1)),\"\"))","v":""},{"$f":"IF( $AC14 = 0, \"\", IF( OFFSET( Combine!AP$9,$AC14 - 1,0,1,1)<>0, LEFT(OFFSET( Combine!AP$9,$AC14 - 1,0,1,1),3),\"\"))","v":""},{"$f":"IF( $AC14 = 0, \"\", IF( OFFSET( Combine!AP$9,$AC14 - 1,0,1,1)<>0, IF(LEN(OFFSET( Combine!AP$9,$AC14 - 1,0,1,1))=9,   RIGHT(OFFSET( Combine!AP$9,$AC14 - 1,0,1,1),5),    LEFT(RIGHT(OFFSET( Combine!AP$9,$AC14 - 1,0,1,1),6), 5)      ),\"\"))","v":""},"",{"$f":"IF( $AC14 = 0, \"\", IF( OFFSET( Combine!$AP$9,$AC14 - 1,0,1,1)<>0,IF(OR(AD14=\"LUMP\", AD14=\"LS\"), \"\", AD14),\"\"))","v":""},{"$f":"IF( $AC14 = 0, \"\", IF( OFFSET( Combine!$AP$9,$AC14 - 1,0,1,1)<>0, VLOOKUP( OFFSET( Combine!$AP$9,$AC14 - 1,0,1,1),[1]Items!$A$2:$E$10001,4,0),\"\"))","v":""},null,12,2,0,{"$f":"IF( $AC14 = 0, \"\", IF( OFFSET( Combine!$AP$9,$AC14 - 1,0,1,1)<>0, VLOOKUP( OFFSET( Combine!$AP$9,$AC14 - 1,0,1,1),[1]Items!$A$2:$E$10001,3,0),\"\"))","v":""}]
[{"$f":"IF( $AC15 = 0, \"\", IF( OFFSET( Combine!AQ$9,$AC15 - 1,0,1,1)<>0, IF(OR($AD15=\"LUMP\", $AD15=\"LS\"), \"LUMP\", OFFSET( Combine!AQ$9,$AC15 - 1,0,1,1)),\"\"))","v":""},{"$f":"IF( $AC15 = 0, \"\", IF( OFFSET( Combine!AR$9,$AC15 - 1,0,1,1)<>0, IF(OR($AD15=\"LUMP\", $AD15=\"LS\"), \"LUMP\", OFFSET( Combine!AR$9,$AC15 - 1,0,1,1)),\"\"))","v":""},{"$f":"IF( $AC15 = 0, \"\", IF( OFFSET( Combine!AS$9,$AC15 - 1,0,1,1)<>0, IF(OR($AD15=\"LUMP\", $AD15=\"LS\"), \"LUMP\", OFFSET( Combine!AS$9,$AC15 - 1,0,1,1)),\"\"))","v":""},{"$f":"IF( $AC15 = 0, \"\", IF( OFFSET( Combine!AT$9,$AC15 - 1,0,1,1)<>0, IF(OR($AD15=\"LUMP\", $AD15=\"LS\"), \"LUMP\", OFFSET( Combine!AT$9,$AC15 - 1,0,1,1)),\"\"))","v":""},{"$f":"IF( $AC15 = 0, \"\", IF( OFFSET( Combine!AU$9,$AC15 - 1,0,1,1)<>0, IF(OR($AD15=\"LUMP\", $AD15=\"LS\"), \"LUMP\", OFFSET( Combine!AU$9,$AC15 - 1,0,1,1)),\"\"))","v":""},{"$f":"IF( $AC15 = 0, \"\", IF( OFFSET( Combine!AV$9,$AC15 - 1,0,1,1)<>0, IF(OR($AD15=\"LUMP\", $AD15=\"LS\"), \"LUMP\", OFFSET( Combine!AV$9,$AC15 - 1,0,1,1)),\"\"))","v":""},{"$f":"IF( $AC15 = 0, \"\", IF( OFFSET( Combine!AW$9,$AC15 - 1,0,1,1)<>0, IF(OR($AD15=\"LUMP\", $AD15=\"LS\"), \"LUMP\", OFFSET( Combine!AW$9,$AC15 - 1,0,1,1)),\"\"))","v":""},{"$f":"IF( $AC15 = 0, \"\", IF( OFFSET( Combine!AX$9,$AC15 - 1,0,1,1)<>0, IF(OR($AD15=\"LUMP\", $AD15=\"LS\"), \"LUMP\", OFFSET( Combine!AX$9,$AC15 - 1,0,1,1)),\"\"))","v":""},{"$f":"IF( $AC15 = 0, \"\", IF( OFFSET( Combine!AY$9,$AC15 - 1,0,1,1)<>0, IF(OR($AD15=\"LUMP\", $AD15=\"LS\"), \"LUMP\", OFFSET( Combine!AY$9,$AC15 - 1,0,1,1)),\"\"))","v":""},{"$f":"IF( $AC15 = 0, \"\", IF( OFFSET( Combine!AZ$9,$AC15 - 1,0,1,1)<>0, IF(OR($AD15=\"LUMP\", $AD15=\"LS\"), \"LUMP\", OFFSET( Combine!AZ$9,$AC15 - 1,0,1,1)),\"\"))","v":""},{"$f":"IF( $AC15 = 0, \"\", IF( OFFSET( Combine!BA$9,$AC15 - 1,0,1,1)<>0, IF(OR($AD15=\"LUMP\", $AD15=\"LS\"), \"LUMP\", OFFSET( Combine!BA$9,$AC15 - 1,0,1,1)),\"\"))","v":""},{"$f":"IF( $AC15 = 0, \"\", IF( OFFSET( Combine!BB$9,$AC15 - 1,0,1,1)<>0, IF(OR($AD15=\"LUMP\", $AD15=\"LS\"), \"LUMP\", OFFSET( Combine!BB$9,$AC15 - 1,0,1,1)),\"\"))","v":""},{"$f":"IF( $AC15 = 0, \"\", IF( OFFSET( Combine!BC$9,$AC15 - 1,0,1,1)<>0, IF(OR($AD15=\"LUMP\", $AD15=\"LS\"), \"LUMP\", OFFSET( Combine!BC$9,$AC15 - 1,0,1,1)),\"\"))","v":""},{"$f":"IF( $AC15 = 0, \"\", IF( OFFSET( Combine!BD$9,$AC15 - 1,0,1,1)<>0, IF(OR($AD15=\"LUMP\", $AD15=\"LS\"), \"LUMP\", OFFSET( Combine!BD$9,$AC15 - 1,0,1,1)),\"\"))","v":""},{"$f":"IF( $AC15 = 0, \"\", IF( OFFSET( Combine!BE$9,$AC15 - 1,0,1,1)<>0, IF(OR($AD15=\"LUMP\", $AD15=\"LS\"), \"LUMP\", OFFSET( Combine!BE$9,$AC15 - 1,0,1,1)),\"\"))","v":""},{"$f":"IF( $AC15 = 0, \"\", IF( OFFSET( Combine!BF$9,$AC15 - 1,0,1,1)<>0, IF(OR($AD15=\"LUMP\", $AD15=\"LS\"), \"LUMP\", OFFSET( Combine!BF$9,$AC15 - 1,0,1,1)),\"\"))","v":""},{"$f":"IF( $AC15 = 0, \"\", IF( OFFSET( Combine!BG$9,$AC15 - 1,0,1,1)<>0, IF(OR($AD15=\"LUMP\", $AD15=\"LS\"), \"LUMP\", OFFSET( Combine!BG$9,$AC15 - 1,0,1,1)),\"\"))","v":""},{"$f":"IF( $AC15 = 0, \"\", IF( OFFSET( Combine!BH$9,$AC15 - 1,0,1,1)<>0, IF(OR($AD15=\"LUMP\", $AD15=\"LS\"), \"LUMP\", OFFSET( Combine!BH$9,$AC15 - 1,0,1,1)),\"\"))","v":""},{"$f":"IF( $AC15 = 0, \"\", IF( OFFSET( Combine!BI$9,$AC15 - 1,0,1,1)<>0, IF(OR($AD15=\"LUMP\", $AD15=\"LS\"), \"LUMP\", OFFSET( Combine!BI$9,$AC15 - 1,0,1,1)),\"\"))","v":""},{"$f":"IF( $AC15 = 0, \"\", IF( OFFSET( Combine!BJ$9,$AC15 - 1,0,1,1)<>0, IF(OR($AD15=\"LUMP\", $AD15=\"LS\"), \"LUMP\", OFFSET( Combine!BJ$9,$AC15 - 1,0,1,1)),\"\"))","v":""},{"$f":"IF( $AC15 = 0, \"\", IF( OFFSET( Combine!AP$9,$AC15 - 1,0,1,1)<>0, LEFT(OFFSET( Combine!AP$9,$AC15 - 1,0,1,1),3),\"\"))","v":""},{"$f":"IF( $AC15 = 0, \"\", IF( OFFSET( Combine!AP$9,$AC15 - 1,0,1,1)<>0, IF(LEN(OFFSET( Combine!AP$9,$AC15 - 1,0,1,1))=9,   RIGHT(OFFSET( Combine!AP$9,$AC15 - 1,0,1,1),5),    LEFT(RIGHT(OFFSET( Combine!AP$9,$AC15 - 1,0,1,1),6), 5)      ),\"\"))","v":""},"",{"$f":"IF( $AC15 = 0, \"\", IF( OFFSET( Combine!$AP$9,$AC15 - 1,0,1,1)<>0,IF(OR(AD15=\"LUMP\", AD15=\"LS\"), \"\", AD15),\"\"))","v":""},{"$f":"IF( $AC15 = 0, \"\", IF( OFFSET( Combine!$AP$9,$AC15 - 1,0,1,1)<>0, VLOOKUP( OFFSET( Combine!$AP$9,$AC15 - 1,0,1,1),[1]Items!$A$2:$E$10001,4,0),\"\"))","v":""},null,13,2,11,{"$f":"IF( $AC15 = 0, \"\", IF( OFFSET( Combine!$AP$9,$AC15 - 1,0,1,1)<>0, VLOOKUP( OFFSET( Combine!$AP$9,$AC15 - 1,0,1,1),[1]Items!$A$2:$E$10001,3,0),\"\"))","v":""}]
[{"$f":"IF( $AC16 = 0, \"\", IF( OFFSET( Combine!AQ$9,$AC16 - 1,0,1,1)<>0, IF(OR($AD16=\"LUMP\", $AD16=\"LS\"), \"LUMP\", OFFSET( Combine!AQ$9,$AC16 - 1,0,1,1)),\"\"))","v":""},{"$f":"IF( $AC16 = 0, \"\", IF( OFFSET( Combine!AR$9,$AC16 - 1,0,1,1)<>0, IF(OR($AD16=\"LUMP\", $AD16=\"LS\"), \"LUMP\", OFFSET( Combine!AR$9,$AC16 - 1,0,1,1)),\"\"))","v":""},{"$f":"IF( $AC16 = 0, \"\", IF( OFFSET( Combine!AS$9,$AC16 - 1,0,1,1)<>0, IF(OR($AD16=\"LUMP\", $AD16=\"LS\"), \"LUMP\", OFFSET( Combine!AS$9,$AC16 - 1,0,1,1)),\"\"))","v":""},{"$f":"IF( $AC16 = 0, \"\", IF( OFFSET( Combine!AT$9,$AC16 - 1,0,1,1)<>0, IF(OR($AD16=\"LUMP\", $AD16=\"LS\"), \"LUMP\", OFFSET( Combine!AT$9,$AC16 - 1,0,1,1)),\"\"))","v":""},{"$f":"IF( $AC16 = 0, \"\", IF( OFFSET( Combine!AU$9,$AC16 - 1,0,1,1)<>0, IF(OR($AD16=\"LUMP\", $AD16=\"LS\"), \"LUMP\", OFFSET( Combine!AU$9,$AC16 - 1,0,1,1)),\"\"))","v":""},{"$f":"IF( $AC16 = 0, \"\", IF( OFFSET( Combine!AV$9,$AC16 - 1,0,1,1)<>0, IF(OR($AD16=\"LUMP\", $AD16=\"LS\"), \"LUMP\", OFFSET( Combine!AV$9,$AC16 - 1,0,1,1)),\"\"))","v":""},{"$f":"IF( $AC16 = 0, \"\", IF( OFFSET( Combine!AW$9,$AC16 - 1,0,1,1)<>0, IF(OR($AD16=\"LUMP\", $AD16=\"LS\"), \"LUMP\", OFFSET( Combine!AW$9,$AC16 - 1,0,1,1)),\"\"))","v":""},{"$f":"IF( $AC16 = 0, \"\", IF( OFFSET( Combine!AX$9,$AC16 - 1,0,1,1)<>0, IF(OR($AD16=\"LUMP\", $AD16=\"LS\"), \"LUMP\", OFFSET( Combine!AX$9,$AC16 - 1,0,1,1)),\"\"))","v":""},{"$f":"IF( $AC16 = 0, \"\", IF( OFFSET( Combine!AY$9,$AC16 - 1,0,1,1)<>0, IF(OR($AD16=\"LUMP\", $AD16=\"LS\"), \"LUMP\", OFFSET( Combine!AY$9,$AC16 - 1,0,1,1)),\"\"))","v":""},{"$f":"IF( $AC16 = 0, \"\", IF( OFFSET( Combine!AZ$9,$AC16 - 1,0,1,1)<>0, IF(OR($AD16=\"LUMP\", $AD16=\"LS\"), \"LUMP\", OFFSET( Combine!AZ$9,$AC16 - 1,0,1,1)),\"\"))","v":""},{"$f":"IF( $AC16 = 0, \"\", IF( OFFSET( Combine!BA$9,$AC16 - 1,0,1,1)<>0, IF(OR($AD16=\"LUMP\", $AD16=\"LS\"), \"LUMP\", OFFSET( Combine!BA$9,$AC16 - 1,0,1,1)),\"\"))","v":""},{"$f":"IF( $AC16 = 0, \"\", IF( OFFSET( Combine!BB$9,$AC16 - 1,0,1,1)<>0, IF(OR($AD16=\"LUMP\", $AD16=\"LS\"), \"LUMP\", OFFSET( Combine!BB$9,$AC16 - 1,0,1,1)),\"\"))","v":""},{"$f":"IF( $AC16 = 0, \"\", IF( OFFSET( Combine!BC$9,$AC16 - 1,0,1,1)<>0, IF(OR($AD16=\"LUMP\", $AD16=\"LS\"), \"LUMP\", OFFSET( Combine!BC$9,$AC16 - 1,0,1,1)),\"\"))","v":""},{"$f":"IF( $AC16 = 0, \"\", IF( OFFSET( Combine!BD$9,$AC16 - 1,0,1,1)<>0, IF(OR($AD16=\"LUMP\", $AD16=\"LS\"), \"LUMP\", OFFSET( Combine!BD$9,$AC16 - 1,0,1,1)),\"\"))","v":""},{"$f":"IF( $AC16 = 0, \"\", IF( OFFSET( Combine!BE$9,$AC16 - 1,0,1,1)<>0, IF(OR($AD16=\"LUMP\", $AD16=\"LS\"), \"LUMP\", OFFSET( Combine!BE$9,$AC16 - 1,0,1,1)),\"\"))","v":""},{"$f":"IF( $AC16 = 0, \"\", IF( OFFSET( Combine!BF$9,$AC16 - 1,0,1,1)<>0, IF(OR($AD16=\"LUMP\", $AD16=\"LS\"), \"LUMP\", OFFSET( Combine!BF$9,$AC16 - 1,0,1,1)),\"\"))","v":""},{"$f":"IF( $AC16 = 0, \"\", IF( OFFSET( Combine!BG$9,$AC16 - 1,0,1,1)<>0, IF(OR($AD16=\"LUMP\", $AD16=\"LS\"), \"LUMP\", OFFSET( Combine!BG$9,$AC16 - 1,0,1,1)),\"\"))","v":""},{"$f":"IF( $AC16 = 0, \"\", IF( OFFSET( Combine!BH$9,$AC16 - 1,0,1,1)<>0, IF(OR($AD16=\"LUMP\", $AD16=\"LS\"), \"LUMP\", OFFSET( Combine!BH$9,$AC16 - 1,0,1,1)),\"\"))","v":""},{"$f":"IF( $AC16 = 0, \"\", IF( OFFSET( Combine!BI$9,$AC16 - 1,0,1,1)<>0, IF(OR($AD16=\"LUMP\", $AD16=\"LS\"), \"LUMP\", OFFSET( Combine!BI$9,$AC16 - 1,0,1,1)),\"\"))","v":""},{"$f":"IF( $AC16 = 0, \"\", IF( OFFSET( Combine!BJ$9,$AC16 - 1,0,1,1)<>0, IF(OR($AD16=\"LUMP\", $AD16=\"LS\"), \"LUMP\", OFFSET( Combine!BJ$9,$AC16 - 1,0,1,1)),\"\"))","v":""},{"$f":"IF( $AC16 = 0, \"\", IF( OFFSET( Combine!AP$9,$AC16 - 1,0,1,1)<>0, LEFT(OFFSET( Combine!AP$9,$AC16 - 1,0,1,1),3),\"\"))","v":""},{"$f":"IF( $AC16 = 0, \"\", IF( OFFSET( Combine!AP$9,$AC16 - 1,0,1,1)<>0, IF(LEN(OFFSET( Combine!AP$9,$AC16 - 1,0,1,1))=9,   RIGHT(OFFSET( Combine!AP$9,$AC16 - 1,0,1,1),5),    LEFT(RIGHT(OFFSET( Combine!AP$9,$AC16 - 1,0,1,1),6), 5)      ),\"\"))","v":""},"",{"$f":"IF( $AC16 = 0, \"\", IF( OFFSET( Combine!$AP$9,$AC16 - 1,0,1,1)<>0,IF(OR(AD16=\"LUMP\", AD16=\"LS\"), \"\", AD16),\"\"))","v":""},{"$f":"IF( $AC16 = 0, \"\", IF( OFFSET( Combine!$AP$9,$AC16 - 1,0,1,1)<>0, VLOOKUP( OFFSET( Combine!$AP$9,$AC16 - 1,0,1,1),[1]Items!$A$2:$E$10001,4,0),\"\"))","v":""},null,14,2,12,{"$f":"IF( $AC16 = 0, \"\", IF( OFFSET( Combine!$AP$9,$AC16 - 1,0,1,1)<>0, VLOOKUP( OFFSET( Combine!$AP$9,$AC16 - 1,0,1,1),[1]Items!$A$2:$E$10001,3,0),\"\"))","v":""}]
[{"$f":"IF( $AC17 = 0, \"\", IF( OFFSET( Combine!AQ$9,$AC17 - 1,0,1,1)<>0, IF(OR($AD17=\"LUMP\", $AD17=\"LS\"), \"LUMP\", OFFSET( Combine!AQ$9,$AC17 - 1,0,1,1)),\"\"))","v":""},{"$f":"IF( $AC17 = 0, \"\", IF( OFFSET( Combine!AR$9,$AC17 - 1,0,1,1)<>0, IF(OR($AD17=\"LUMP\", $AD17=\"LS\"), \"LUMP\", OFFSET( Combine!AR$9,$AC17 - 1,0,1,1)),\"\"))","v":""},{"$f":"IF( $AC17 = 0, \"\", IF( OFFSET( Combine!AS$9,$AC17 - 1,0,1,1)<>0, IF(OR($AD17=\"LUMP\", $AD17=\"LS\"), \"LUMP\", OFFSET( Combine!AS$9,$AC17 - 1,0,1,1)),\"\"))","v":""},{"$f":"IF( $AC17 = 0, \"\", IF( OFFSET( Combine!AT$9,$AC17 - 1,0,1,1)<>0, IF(OR($AD17=\"LUMP\", $AD17=\"LS\"), \"LUMP\", OFFSET( Combine!AT$9,$AC17 - 1,0,1,1)),\"\"))","v":""},{"$f":"IF( $AC17 = 0, \"\", IF( OFFSET( Combine!AU$9,$AC17 - 1,0,1,1)<>0, IF(OR($AD17=\"LUMP\", $AD17=\"LS\"), \"LUMP\", OFFSET( Combine!AU$9,$AC17 - 1,0,1,1)),\"\"))","v":""},{"$f":"IF( $AC17 = 0, \"\", IF( OFFSET( Combine!AV$9,$AC17 - 1,0,1,1)<>0, IF(OR($AD17=\"LUMP\", $AD17=\"LS\"), \"LUMP\", OFFSET( Combine!AV$9,$AC17 - 1,0,1,1)),\"\"))","v":""},{"$f":"IF( $AC17 = 0, \"\", IF( OFFSET( Combine!AW$9,$AC17 - 1,0,1,1)<>0, IF(OR($AD17=\"LUMP\", $AD17=\"LS\"), \"LUMP\", OFFSET( Combine!AW$9,$AC17 - 1,0,1,1)),\"\"))","v":""},{"$f":"IF( $AC17 = 0, \"\", IF( OFFSET( Combine!AX$9,$AC17 - 1,0,1,1)<>0, IF(OR($AD17=\"LUMP\", $AD17=\"LS\"), \"LUMP\", OFFSET( Combine!AX$9,$AC17 - 1,0,1,1)),\"\"))","v":""},{"$f":"IF( $AC17 = 0, \"\", IF( OFFSET( Combine!AY$9,$AC17 - 1,0,1,1)<>0, IF(OR($AD17=\"LUMP\", $AD17=\"LS\"), \"LUMP\", OFFSET( Combine!AY$9,$AC17 - 1,0,1,1)),\"\"))","v":""},{"$f":"IF( $AC17 = 0, \"\", IF( OFFSET( Combine!AZ$9,$AC17 - 1,0,1,1)<>0, IF(OR($AD17=\"LUMP\", $AD17=\"LS\"), \"LUMP\", OFFSET( Combine!AZ$9,$AC17 - 1,0,1,1)),\"\"))","v":""},{"$f":"IF( $AC17 = 0, \"\", IF( OFFSET( Combine!BA$9,$AC17 - 1,0,1,1)<>0, IF(OR($AD17=\"LUMP\", $AD17=\"LS\"), \"LUMP\", OFFSET( Combine!BA$9,$AC17 - 1,0,1,1)),\"\"))","v":""},{"$f":"IF( $AC17 = 0, \"\", IF( OFFSET( Combine!BB$9,$AC17 - 1,0,1,1)<>0, IF(OR($AD17=\"LUMP\", $AD17=\"LS\"), \"LUMP\", OFFSET( Combine!BB$9,$AC17 - 1,0,1,1)),\"\"))","v":""},{"$f":"IF( $AC17 = 0, \"\", IF( OFFSET( Combine!BC$9,$AC17 - 1,0,1,1)<>0, IF(OR($AD17=\"LUMP\", $AD17=\"LS\"), \"LUMP\", OFFSET( Combine!BC$9,$AC17 - 1,0,1,1)),\"\"))","v":""},{"$f":"IF( $AC17 = 0, \"\", IF( OFFSET( Combine!BD$9,$AC17 - 1,0,1,1)<>0, IF(OR($AD17=\"LUMP\", $AD17=\"LS\"), \"LUMP\", OFFSET( Combine!BD$9,$AC17 - 1,0,1,1)),\"\"))","v":""},{"$f":"IF( $AC17 = 0, \"\", IF( OFFSET( Combine!BE$9,$AC17 - 1,0,1,1)<>0, IF(OR($AD17=\"LUMP\", $AD17=\"LS\"), \"LUMP\", OFFSET( Combine!BE$9,$AC17 - 1,0,1,1)),\"\"))","v":""},{"$f":"IF( $AC17 = 0, \"\", IF( OFFSET( Combine!BF$9,$AC17 - 1,0,1,1)<>0, IF(OR($AD17=\"LUMP\", $AD17=\"LS\"), \"LUMP\", OFFSET( Combine!BF$9,$AC17 - 1,0,1,1)),\"\"))","v":""},{"$f":"IF( $AC17 = 0, \"\", IF( OFFSET( Combine!BG$9,$AC17 - 1,0,1,1)<>0, IF(OR($AD17=\"LUMP\", $AD17=\"LS\"), \"LUMP\", OFFSET( Combine!BG$9,$AC17 - 1,0,1,1)),\"\"))","v":""},{"$f":"IF( $AC17 = 0, \"\", IF( OFFSET( Combine!BH$9,$AC17 - 1,0,1,1)<>0, IF(OR($AD17=\"LUMP\", $AD17=\"LS\"), \"LUMP\", OFFSET( Combine!BH$9,$AC17 - 1,0,1,1)),\"\"))","v":""},{"$f":"IF( $AC17 = 0, \"\", IF( OFFSET( Combine!BI$9,$AC17 - 1,0,1,1)<>0, IF(OR($AD17=\"LUMP\", $AD17=\"LS\"), \"LUMP\", OFFSET( Combine!BI$9,$AC17 - 1,0,1,1)),\"\"))","v":""},{"$f":"IF( $AC17 = 0, \"\", IF( OFFSET( Combine!BJ$9,$AC17 - 1,0,1,1)<>0, IF(OR($AD17=\"LUMP\", $AD17=\"LS\"), \"LUMP\", OFFSET( Combine!BJ$9,$AC17 - 1,0,1,1)),\"\"))","v":""},{"$f":"IF( $AC17 = 0, \"\", IF( OFFSET( Combine!AP$9,$AC17 - 1,0,1,1)<>0, LEFT(OFFSET( Combine!AP$9,$AC17 - 1,0,1,1),3),\"\"))","v":""},{"$f":"IF( $AC17 = 0, \"\", IF( OFFSET( Combine!AP$9,$AC17 - 1,0,1,1)<>0, IF(LEN(OFFSET( Combine!AP$9,$AC17 - 1,0,1,1))=9,   RIGHT(OFFSET( Combine!AP$9,$AC17 - 1,0,1,1),5),    LEFT(RIGHT(OFFSET( Combine!AP$9,$AC17 - 1,0,1,1),6), 5)      ),\"\"))","v":""},"",{"$f":"IF( $AC17 = 0, \"\", IF( OFFSET( Combine!$AP$9,$AC17 - 1,0,1,1)<>0,IF(OR(AD17=\"LUMP\", AD17=\"LS\"), \"\", AD17),\"\"))","v":""},{"$f":"IF( $AC17 = 0, \"\", IF( OFFSET( Combine!$AP$9,$AC17 - 1,0,1,1)<>0, VLOOKUP( OFFSET( Combine!$AP$9,$AC17 - 1,0,1,1),[1]Items!$A$2:$E$10001,4,0),\"\"))","v":""},null,15,2,13,{"$f":"IF( $AC17 = 0, \"\", IF( OFFSET( Combine!$AP$9,$AC17 - 1,0,1,1)<>0, VLOOKUP( OFFSET( Combine!$AP$9,$AC17 - 1,0,1,1),[1]Items!$A$2:$E$10001,3,0),\"\"))","v":""}]
[{"$f":"IF( $AC18 = 0, \"\", IF( OFFSET( Combine!AQ$9,$AC18 - 1,0,1,1)<>0, IF(OR($AD18=\"LUMP\", $AD18=\"LS\"), \"LUMP\", OFFSET( Combine!AQ$9,$AC18 - 1,0,1,1)),\"\"))","v":""},{"$f":"IF( $AC18 = 0, \"\", IF( OFFSET( Combine!AR$9,$AC18 - 1,0,1,1)<>0, IF(OR($AD18=\"LUMP\", $AD18=\"LS\"), \"LUMP\", OFFSET( Combine!AR$9,$AC18 - 1,0,1,1)),\"\"))","v":""},{"$f":"IF( $AC18 = 0, \"\", IF( OFFSET( Combine!AS$9,$AC18 - 1,0,1,1)<>0, IF(OR($AD18=\"LUMP\", $AD18=\"LS\"), \"LUMP\", OFFSET( Combine!AS$9,$AC18 - 1,0,1,1)),\"\"))","v":""},{"$f":"IF( $AC18 = 0, \"\", IF( OFFSET( Combine!AT$9,$AC18 - 1,0,1,1)<>0, IF(OR($AD18=\"LUMP\", $AD18=\"LS\"), \"LUMP\", OFFSET( Combine!AT$9,$AC18 - 1,0,1,1)),\"\"))","v":""},{"$f":"IF( $AC18 = 0, \"\", IF( OFFSET( Combine!AU$9,$AC18 - 1,0,1,1)<>0, IF(OR($AD18=\"LUMP\", $AD18=\"LS\"), \"LUMP\", OFFSET( Combine!AU$9,$AC18 - 1,0,1,1)),\"\"))","v":""},{"$f":"IF( $AC18 = 0, \"\", IF( OFFSET( Combine!AV$9,$AC18 - 1,0,1,1)<>0, IF(OR($AD18=\"LUMP\", $AD18=\"LS\"), \"LUMP\", OFFSET( Combine!AV$9,$AC18 - 1,0,1,1)),\"\"))","v":""},{"$f":"IF( $AC18 = 0, \"\", IF( OFFSET( Combine!AW$9,$AC18 - 1,0,1,1)<>0, IF(OR($AD18=\"LUMP\", $AD18=\"LS\"), \"LUMP\", OFFSET( Combine!AW$9,$AC18 - 1,0,1,1)),\"\"))","v":""},{"$f":"IF( $AC18 = 0, \"\", IF( OFFSET( Combine!AX$9,$AC18 - 1,0,1,1)<>0, IF(OR($AD18=\"LUMP\", $AD18=\"LS\"), \"LUMP\", OFFSET( Combine!AX$9,$AC18 - 1,0,1,1)),\"\"))","v":""},{"$f":"IF( $AC18 = 0, \"\", IF( OFFSET( Combine!AY$9,$AC18 - 1,0,1,1)<>0, IF(OR($AD18=\"LUMP\", $AD18=\"LS\"), \"LUMP\", OFFSET( Combine!AY$9,$AC18 - 1,0,1,1)),\"\"))","v":""},{"$f":"IF( $AC18 = 0, \"\", IF( OFFSET( Combine!AZ$9,$AC18 - 1,0,1,1)<>0, IF(OR($AD18=\"LUMP\", $AD18=\"LS\"), \"LUMP\", OFFSET( Combine!AZ$9,$AC18 - 1,0,1,1)),\"\"))","v":""},{"$f":"IF( $AC18 = 0, \"\", IF( OFFSET( Combine!BA$9,$AC18 - 1,0,1,1)<>0, IF(OR($AD18=\"LUMP\", $AD18=\"LS\"), \"LUMP\", OFFSET( Combine!BA$9,$AC18 - 1,0,1,1)),\"\"))","v":""},{"$f":"IF( $AC18 = 0, \"\", IF( OFFSET( Combine!BB$9,$AC18 - 1,0,1,1)<>0, IF(OR($AD18=\"LUMP\", $AD18=\"LS\"), \"LUMP\", OFFSET( Combine!BB$9,$AC18 - 1,0,1,1)),\"\"))","v":""},{"$f":"IF( $AC18 = 0, \"\", IF( OFFSET( Combine!BC$9,$AC18 - 1,0,1,1)<>0, IF(OR($AD18=\"LUMP\", $AD18=\"LS\"), \"LUMP\", OFFSET( Combine!BC$9,$AC18 - 1,0,1,1)),\"\"))","v":""},{"$f":"IF( $AC18 = 0, \"\", IF( OFFSET( Combine!BD$9,$AC18 - 1,0,1,1)<>0, IF(OR($AD18=\"LUMP\", $AD18=\"LS\"), \"LUMP\", OFFSET( Combine!BD$9,$AC18 - 1,0,1,1)),\"\"))","v":""},{"$f":"IF( $AC18 = 0, \"\", IF( OFFSET( Combine!BE$9,$AC18 - 1,0,1,1)<>0, IF(OR($AD18=\"LUMP\", $AD18=\"LS\"), \"LUMP\", OFFSET( Combine!BE$9,$AC18 - 1,0,1,1)),\"\"))","v":""},{"$f":"IF( $AC18 = 0, \"\", IF( OFFSET( Combine!BF$9,$AC18 - 1,0,1,1)<>0, IF(OR($AD18=\"LUMP\", $AD18=\"LS\"), \"LUMP\", OFFSET( Combine!BF$9,$AC18 - 1,0,1,1)),\"\"))","v":""},{"$f":"IF( $AC18 = 0, \"\", IF( OFFSET( Combine!BG$9,$AC18 - 1,0,1,1)<>0, IF(OR($AD18=\"LUMP\", $AD18=\"LS\"), \"LUMP\", OFFSET( Combine!BG$9,$AC18 - 1,0,1,1)),\"\"))","v":""},{"$f":"IF( $AC18 = 0, \"\", IF( OFFSET( Combine!BH$9,$AC18 - 1,0,1,1)<>0, IF(OR($AD18=\"LUMP\", $AD18=\"LS\"), \"LUMP\", OFFSET( Combine!BH$9,$AC18 - 1,0,1,1)),\"\"))","v":""},{"$f":"IF( $AC18 = 0, \"\", IF( OFFSET( Combine!BI$9,$AC18 - 1,0,1,1)<>0, IF(OR($AD18=\"LUMP\", $AD18=\"LS\"), \"LUMP\", OFFSET( Combine!BI$9,$AC18 - 1,0,1,1)),\"\"))","v":""},{"$f":"IF( $AC18 = 0, \"\", IF( OFFSET( Combine!BJ$9,$AC18 - 1,0,1,1)<>0, IF(OR($AD18=\"LUMP\", $AD18=\"LS\"), \"LUMP\", OFFSET( Combine!BJ$9,$AC18 - 1,0,1,1)),\"\"))","v":""},{"$f":"IF( $AC18 = 0, \"\", IF( OFFSET( Combine!AP$9,$AC18 - 1,0,1,1)<>0, LEFT(OFFSET( Combine!AP$9,$AC18 - 1,0,1,1),3),\"\"))","v":""},{"$f":"IF( $AC18 = 0, \"\", IF( OFFSET( Combine!AP$9,$AC18 - 1,0,1,1)<>0, IF(LEN(OFFSET( Combine!AP$9,$AC18 - 1,0,1,1))=9,   RIGHT(OFFSET( Combine!AP$9,$AC18 - 1,0,1,1),5),    LEFT(RIGHT(OFFSET( Combine!AP$9,$AC18 - 1,0,1,1),6), 5)      ),\"\"))","v":""},"",{"$f":"IF( $AC18 = 0, \"\", IF( OFFSET( Combine!$AP$9,$AC18 - 1,0,1,1)<>0,IF(OR(AD18=\"LUMP\", AD18=\"LS\"), \"\", AD18),\"\"))","v":""},{"$f":"IF( $AC18 = 0, \"\", IF( OFFSET( Combine!$AP$9,$AC18 - 1,0,1,1)<>0, VLOOKUP( OFFSET( Combine!$AP$9,$AC18 - 1,0,1,1),[1]Items!$A$2:$E$10001,4,0),\"\"))","v":""},null,16,2,14,{"$f":"IF( $AC18 = 0, \"\", IF( OFFSET( Combine!$AP$9,$AC18 - 1,0,1,1)<>0, VLOOKUP( OFFSET( Combine!$AP$9,$AC18 - 1,0,1,1),[1]Items!$A$2:$E$10001,3,0),\"\"))","v":""}]
[{"$f":"IF( $AC19 = 0, \"\", IF( OFFSET( Combine!AQ$9,$AC19 - 1,0,1,1)<>0, IF(OR($AD19=\"LUMP\", $AD19=\"LS\"), \"LUMP\", OFFSET( Combine!AQ$9,$AC19 - 1,0,1,1)),\"\"))","v":""},{"$f":"IF( $AC19 = 0, \"\", IF( OFFSET( Combine!AR$9,$AC19 - 1,0,1,1)<>0, IF(OR($AD19=\"LUMP\", $AD19=\"LS\"), \"LUMP\", OFFSET( Combine!AR$9,$AC19 - 1,0,1,1)),\"\"))","v":""},{"$f":"IF( $AC19 = 0, \"\", IF( OFFSET( Combine!AS$9,$AC19 - 1,0,1,1)<>0, IF(OR($AD19=\"LUMP\", $AD19=\"LS\"), \"LUMP\", OFFSET( Combine!AS$9,$AC19 - 1,0,1,1)),\"\"))","v":""},{"$f":"IF( $AC19 = 0, \"\", IF( OFFSET( Combine!AT$9,$AC19 - 1,0,1,1)<>0, IF(OR($AD19=\"LUMP\", $AD19=\"LS\"), \"LUMP\", OFFSET( Combine!AT$9,$AC19 - 1,0,1,1)),\"\"))","v":""},{"$f":"IF( $AC19 = 0, \"\", IF( OFFSET( Combine!AU$9,$AC19 - 1,0,1,1)<>0, IF(OR($AD19=\"LUMP\", $AD19=\"LS\"), \"LUMP\", OFFSET( Combine!AU$9,$AC19 - 1,0,1,1)),\"\"))","v":""},{"$f":"IF( $AC19 = 0, \"\", IF( OFFSET( Combine!AV$9,$AC19 - 1,0,1,1)<>0, IF(OR($AD19=\"LUMP\", $AD19=\"LS\"), \"LUMP\", OFFSET( Combine!AV$9,$AC19 - 1,0,1,1)),\"\"))","v":""},{"$f":"IF( $AC19 = 0, \"\", IF( OFFSET( Combine!AW$9,$AC19 - 1,0,1,1)<>0, IF(OR($AD19=\"LUMP\", $AD19=\"LS\"), \"LUMP\", OFFSET( Combine!AW$9,$AC19 - 1,0,1,1)),\"\"))","v":""},{"$f":"IF( $AC19 = 0, \"\", IF( OFFSET( Combine!AX$9,$AC19 - 1,0,1,1)<>0, IF(OR($AD19=\"LUMP\", $AD19=\"LS\"), \"LUMP\", OFFSET( Combine!AX$9,$AC19 - 1,0,1,1)),\"\"))","v":""},{"$f":"IF( $AC19 = 0, \"\", IF( OFFSET( Combine!AY$9,$AC19 - 1,0,1,1)<>0, IF(OR($AD19=\"LUMP\", $AD19=\"LS\"), \"LUMP\", OFFSET( Combine!AY$9,$AC19 - 1,0,1,1)),\"\"))","v":""},{"$f":"IF( $AC19 = 0, \"\", IF( OFFSET( Combine!AZ$9,$AC19 - 1,0,1,1)<>0, IF(OR($AD19=\"LUMP\", $AD19=\"LS\"), \"LUMP\", OFFSET( Combine!AZ$9,$AC19 - 1,0,1,1)),\"\"))","v":""},{"$f":"IF( $AC19 = 0, \"\", IF( OFFSET( Combine!BA$9,$AC19 - 1,0,1,1)<>0, IF(OR($AD19=\"LUMP\", $AD19=\"LS\"), \"LUMP\", OFFSET( Combine!BA$9,$AC19 - 1,0,1,1)),\"\"))","v":""},{"$f":"IF( $AC19 = 0, \"\", IF( OFFSET( Combine!BB$9,$AC19 - 1,0,1,1)<>0, IF(OR($AD19=\"LUMP\", $AD19=\"LS\"), \"LUMP\", OFFSET( Combine!BB$9,$AC19 - 1,0,1,1)),\"\"))","v":""},{"$f":"IF( $AC19 = 0, \"\", IF( OFFSET( Combine!BC$9,$AC19 - 1,0,1,1)<>0, IF(OR($AD19=\"LUMP\", $AD19=\"LS\"), \"LUMP\", OFFSET( Combine!BC$9,$AC19 - 1,0,1,1)),\"\"))","v":""},{"$f":"IF( $AC19 = 0, \"\", IF( OFFSET( Combine!BD$9,$AC19 - 1,0,1,1)<>0, IF(OR($AD19=\"LUMP\", $AD19=\"LS\"), \"LUMP\", OFFSET( Combine!BD$9,$AC19 - 1,0,1,1)),\"\"))","v":""},{"$f":"IF( $AC19 = 0, \"\", IF( OFFSET( Combine!BE$9,$AC19 - 1,0,1,1)<>0, IF(OR($AD19=\"LUMP\", $AD19=\"LS\"), \"LUMP\", OFFSET( Combine!BE$9,$AC19 - 1,0,1,1)),\"\"))","v":""},{"$f":"IF( $AC19 = 0, \"\", IF( OFFSET( Combine!BF$9,$AC19 - 1,0,1,1)<>0, IF(OR($AD19=\"LUMP\", $AD19=\"LS\"), \"LUMP\", OFFSET( Combine!BF$9,$AC19 - 1,0,1,1)),\"\"))","v":""},{"$f":"IF( $AC19 = 0, \"\", IF( OFFSET( Combine!BG$9,$AC19 - 1,0,1,1)<>0, IF(OR($AD19=\"LUMP\", $AD19=\"LS\"), \"LUMP\", OFFSET( Combine!BG$9,$AC19 - 1,0,1,1)),\"\"))","v":""},{"$f":"IF( $AC19 = 0, \"\", IF( OFFSET( Combine!BH$9,$AC19 - 1,0,1,1)<>0, IF(OR($AD19=\"LUMP\", $AD19=\"LS\"), \"LUMP\", OFFSET( Combine!BH$9,$AC19 - 1,0,1,1)),\"\"))","v":""},{"$f":"IF( $AC19 = 0, \"\", IF( OFFSET( Combine!BI$9,$AC19 - 1,0,1,1)<>0, IF(OR($AD19=\"LUMP\", $AD19=\"LS\"), \"LUMP\", OFFSET( Combine!BI$9,$AC19 - 1,0,1,1)),\"\"))","v":""},{"$f":"IF( $AC19 = 0, \"\", IF( OFFSET( Combine!BJ$9,$AC19 - 1,0,1,1)<>0, IF(OR($AD19=\"LUMP\", $AD19=\"LS\"), \"LUMP\", OFFSET( Combine!BJ$9,$AC19 - 1,0,1,1)),\"\"))","v":""},{"$f":"IF( $AC19 = 0, \"\", IF( OFFSET( Combine!AP$9,$AC19 - 1,0,1,1)<>0, LEFT(OFFSET( Combine!AP$9,$AC19 - 1,0,1,1),3),\"\"))","v":""},{"$f":"IF( $AC19 = 0, \"\", IF( OFFSET( Combine!AP$9,$AC19 - 1,0,1,1)<>0, IF(LEN(OFFSET( Combine!AP$9,$AC19 - 1,0,1,1))=9,   RIGHT(OFFSET( Combine!AP$9,$AC19 - 1,0,1,1),5),    LEFT(RIGHT(OFFSET( Combine!AP$9,$AC19 - 1,0,1,1),6), 5)      ),\"\"))","v":""},"",{"$f":"IF( $AC19 = 0, \"\", IF( OFFSET( Combine!$AP$9,$AC19 - 1,0,1,1)<>0,IF(OR(AD19=\"LUMP\", AD19=\"LS\"), \"\", AD19),\"\"))","v":""},{"$f":"IF( $AC19 = 0, \"\", IF( OFFSET( Combine!$AP$9,$AC19 - 1,0,1,1)<>0, VLOOKUP( OFFSET( Combine!$AP$9,$AC19 - 1,0,1,1),[1]Items!$A$2:$E$10001,4,0),\"\"))","v":""},null,17,2,15,{"$f":"IF( $AC19 = 0, \"\", IF( OFFSET( Combine!$AP$9,$AC19 - 1,0,1,1)<>0, VLOOKUP( OFFSET( Combine!$AP$9,$AC19 - 1,0,1,1),[1]Items!$A$2:$E$10001,3,0),\"\"))","v":""}]
[{"$f":"IF( $AC20 = 0, \"\", IF( OFFSET( Combine!AQ$9,$AC20 - 1,0,1,1)<>0, IF(OR($AD20=\"LUMP\", $AD20=\"LS\"), \"LUMP\", OFFSET( Combine!AQ$9,$AC20 - 1,0,1,1)),\"\"))","v":""},{"$f":"IF( $AC20 = 0, \"\", IF( OFFSET( Combine!AR$9,$AC20 - 1,0,1,1)<>0, IF(OR($AD20=\"LUMP\", $AD20=\"LS\"), \"LUMP\", OFFSET( Combine!AR$9,$AC20 - 1,0,1,1)),\"\"))","v":""},{"$f":"IF( $AC20 = 0, \"\", IF( OFFSET( Combine!AS$9,$AC20 - 1,0,1,1)<>0, IF(OR($AD20=\"LUMP\", $AD20=\"LS\"), \"LUMP\", OFFSET( Combine!AS$9,$AC20 - 1,0,1,1)),\"\"))","v":""},{"$f":"IF( $AC20 = 0, \"\", IF( OFFSET( Combine!AT$9,$AC20 - 1,0,1,1)<>0, IF(OR($AD20=\"LUMP\", $AD20=\"LS\"), \"LUMP\", OFFSET( Combine!AT$9,$AC20 - 1,0,1,1)),\"\"))","v":""},{"$f":"IF( $AC20 = 0, \"\", IF( OFFSET( Combine!AU$9,$AC20 - 1,0,1,1)<>0, IF(OR($AD20=\"LUMP\", $AD20=\"LS\"), \"LUMP\", OFFSET( Combine!AU$9,$AC20 - 1,0,1,1)),\"\"))","v":""},{"$f":"IF( $AC20 = 0, \"\", IF( OFFSET( Combine!AV$9,$AC20 - 1,0,1,1)<>0, IF(OR($AD20=\"LUMP\", $AD20=\"LS\"), \"LUMP\", OFFSET( Combine!AV$9,$AC20 - 1,0,1,1)),\"\"))","v":""},{"$f":"IF( $AC20 = 0, \"\", IF( OFFSET( Combine!AW$9,$AC20 - 1,0,1,1)<>0, IF(OR($AD20=\"LUMP\", $AD20=\"LS\"), \"LUMP\", OFFSET( Combine!AW$9,$AC20 - 1,0,1,1)),\"\"))","v":""},{"$f":"IF( $AC20 = 0, \"\", IF( OFFSET( Combine!AX$9,$AC20 - 1,0,1,1)<>0, IF(OR($AD20=\"LUMP\", $AD20=\"LS\"), \"LUMP\", OFFSET( Combine!AX$9,$AC20 - 1,0,1,1)),\"\"))","v":""},{"$f":"IF( $AC20 = 0, \"\", IF( OFFSET( Combine!AY$9,$AC20 - 1,0,1,1)<>0, IF(OR($AD20=\"LUMP\", $AD20=\"LS\"), \"LUMP\", OFFSET( Combine!AY$9,$AC20 - 1,0,1,1)),\"\"))","v":""},{"$f":"IF( $AC20 = 0, \"\", IF( OFFSET( Combine!AZ$9,$AC20 - 1,0,1,1)<>0, IF(OR($AD20=\"LUMP\", $AD20=\"LS\"), \"LUMP\", OFFSET( Combine!AZ$9,$AC20 - 1,0,1,1)),\"\"))","v":""},{"$f":"IF( $AC20 = 0, \"\", IF( OFFSET( Combine!BA$9,$AC20 - 1,0,1,1)<>0, IF(OR($AD20=\"LUMP\", $AD20=\"LS\"), \"LUMP\", OFFSET( Combine!BA$9,$AC20 - 1,0,1,1)),\"\"))","v":""},{"$f":"IF( $AC20 = 0, \"\", IF( OFFSET( Combine!BB$9,$AC20 - 1,0,1,1)<>0, IF(OR($AD20=\"LUMP\", $AD20=\"LS\"), \"LUMP\", OFFSET( Combine!BB$9,$AC20 - 1,0,1,1)),\"\"))","v":""},{"$f":"IF( $AC20 = 0, \"\", IF( OFFSET( Combine!BC$9,$AC20 - 1,0,1,1)<>0, IF(OR($AD20=\"LUMP\", $AD20=\"LS\"), \"LUMP\", OFFSET( Combine!BC$9,$AC20 - 1,0,1,1)),\"\"))","v":""},{"$f":"IF( $AC20 = 0, \"\", IF( OFFSET( Combine!BD$9,$AC20 - 1,0,1,1)<>0, IF(OR($AD20=\"LUMP\", $AD20=\"LS\"), \"LUMP\", OFFSET( Combine!BD$9,$AC20 - 1,0,1,1)),\"\"))","v":""},{"$f":"IF( $AC20 = 0, \"\", IF( OFFSET( Combine!BE$9,$AC20 - 1,0,1,1)<>0, IF(OR($AD20=\"LUMP\", $AD20=\"LS\"), \"LUMP\", OFFSET( Combine!BE$9,$AC20 - 1,0,1,1)),\"\"))","v":""},{"$f":"IF( $AC20 = 0, \"\", IF( OFFSET( Combine!BF$9,$AC20 - 1,0,1,1)<>0, IF(OR($AD20=\"LUMP\", $AD20=\"LS\"), \"LUMP\", OFFSET( Combine!BF$9,$AC20 - 1,0,1,1)),\"\"))","v":""},{"$f":"IF( $AC20 = 0, \"\", IF( OFFSET( Combine!BG$9,$AC20 - 1,0,1,1)<>0, IF(OR($AD20=\"LUMP\", $AD20=\"LS\"), \"LUMP\", OFFSET( Combine!BG$9,$AC20 - 1,0,1,1)),\"\"))","v":""},{"$f":"IF( $AC20 = 0, \"\", IF( OFFSET( Combine!BH$9,$AC20 - 1,0,1,1)<>0, IF(OR($AD20=\"LUMP\", $AD20=\"LS\"), \"LUMP\", OFFSET( Combine!BH$9,$AC20 - 1,0,1,1)),\"\"))","v":""},{"$f":"IF( $AC20 = 0, \"\", IF( OFFSET( Combine!BI$9,$AC20 - 1,0,1,1)<>0, IF(OR($AD20=\"LUMP\", $AD20=\"LS\"), \"LUMP\", OFFSET( Combine!BI$9,$AC20 - 1,0,1,1)),\"\"))","v":""},{"$f":"IF( $AC20 = 0, \"\", IF( OFFSET( Combine!BJ$9,$AC20 - 1,0,1,1)<>0, IF(OR($AD20=\"LUMP\", $AD20=\"LS\"), \"LUMP\", OFFSET( Combine!BJ$9,$AC20 - 1,0,1,1)),\"\"))","v":""},{"$f":"IF( $AC20 = 0, \"\", IF( OFFSET( Combine!AP$9,$AC20 - 1,0,1,1)<>0, LEFT(OFFSET( Combine!AP$9,$AC20 - 1,0,1,1),3),\"\"))","v":""},{"$f":"IF( $AC20 = 0, \"\", IF( OFFSET( Combine!AP$9,$AC20 - 1,0,1,1)<>0, IF(LEN(OFFSET( Combine!AP$9,$AC20 - 1,0,1,1))=9,   RIGHT(OFFSET( Combine!AP$9,$AC20 - 1,0,1,1),5),    LEFT(RIGHT(OFFSET( Combine!AP$9,$AC20 - 1,0,1,1),6), 5)      ),\"\"))","v":""},"",{"$f":"IF( $AC20 = 0, \"\", IF( OFFSET( Combine!$AP$9,$AC20 - 1,0,1,1)<>0,IF(OR(AD20=\"LUMP\", AD20=\"LS\"), \"\", AD20),\"\"))","v":""},{"$f":"IF( $AC20 = 0, \"\", IF( OFFSET( Combine!$AP$9,$AC20 - 1,0,1,1)<>0, VLOOKUP( OFFSET( Combine!$AP$9,$AC20 - 1,0,1,1),[1]Items!$A$2:$E$10001,4,0),\"\"))","v":""},null,18,3,0,{"$f":"IF( $AC20 = 0, \"\", IF( OFFSET( Combine!$AP$9,$AC20 - 1,0,1,1)<>0, VLOOKUP( OFFSET( Combine!$AP$9,$AC20 - 1,0,1,1),[1]Items!$A$2:$E$10001,3,0),\"\"))","v":""}]
[{"$f":"IF( $AC21 = 0, \"\", IF( OFFSET( Combine!AQ$9,$AC21 - 1,0,1,1)<>0, IF(OR($AD21=\"LUMP\", $AD21=\"LS\"), \"LUMP\", OFFSET( Combine!AQ$9,$AC21 - 1,0,1,1)),\"\"))","v":""},{"$f":"IF( $AC21 = 0, \"\", IF( OFFSET( Combine!AR$9,$AC21 - 1,0,1,1)<>0, IF(OR($AD21=\"LUMP\", $AD21=\"LS\"), \"LUMP\", OFFSET( Combine!AR$9,$AC21 - 1,0,1,1)),\"\"))","v":""},{"$f":"IF( $AC21 = 0, \"\", IF( OFFSET( Combine!AS$9,$AC21 - 1,0,1,1)<>0, IF(OR($AD21=\"LUMP\", $AD21=\"LS\"), \"LUMP\", OFFSET( Combine!AS$9,$AC21 - 1,0,1,1)),\"\"))","v":""},{"$f":"IF( $AC21 = 0, \"\", IF( OFFSET( Combine!AT$9,$AC21 - 1,0,1,1)<>0, IF(OR($AD21=\"LUMP\", $AD21=\"LS\"), \"LUMP\", OFFSET( Combine!AT$9,$AC21 - 1,0,1,1)),\"\"))","v":""},{"$f":"IF( $AC21 = 0, \"\", IF( OFFSET( Combine!AU$9,$AC21 - 1,0,1,1)<>0, IF(OR($AD21=\"LUMP\", $AD21=\"LS\"), \"LUMP\", OFFSET( Combine!AU$9,$AC21 - 1,0,1,1)),\"\"))","v":""},{"$f":"IF( $AC21 = 0, \"\", IF( OFFSET( Combine!AV$9,$AC21 - 1,0,1,1)<>0, IF(OR($AD21=\"LUMP\", $AD21=\"LS\"), \"LUMP\", OFFSET( Combine!AV$9,$AC21 - 1,0,1,1)),\"\"))","v":""},{"$f":"IF( $AC21 = 0, \"\", IF( OFFSET( Combine!AW$9,$AC21 - 1,0,1,1)<>0, IF(OR($AD21=\"LUMP\", $AD21=\"LS\"), \"LUMP\", OFFSET( Combine!AW$9,$AC21 - 1,0,1,1)),\"\"))","v":""},{"$f":"IF( $AC21 = 0, \"\", IF( OFFSET( Combine!AX$9,$AC21 - 1,0,1,1)<>0, IF(OR($AD21=\"LUMP\", $AD21=\"LS\"), \"LUMP\", OFFSET( Combine!AX$9,$AC21 - 1,0,1,1)),\"\"))","v":""},{"$f":"IF( $AC21 = 0, \"\", IF( OFFSET( Combine!AY$9,$AC21 - 1,0,1,1)<>0, IF(OR($AD21=\"LUMP\", $AD21=\"LS\"), \"LUMP\", OFFSET( Combine!AY$9,$AC21 - 1,0,1,1)),\"\"))","v":""},{"$f":"IF( $AC21 = 0, \"\", IF( OFFSET( Combine!AZ$9,$AC21 - 1,0,1,1)<>0, IF(OR($AD21=\"LUMP\", $AD21=\"LS\"), \"LUMP\", OFFSET( Combine!AZ$9,$AC21 - 1,0,1,1)),\"\"))","v":""},{"$f":"IF( $AC21 = 0, \"\", IF( OFFSET( Combine!BA$9,$AC21 - 1,0,1,1)<>0, IF(OR($AD21=\"LUMP\", $AD21=\"LS\"), \"LUMP\", OFFSET( Combine!BA$9,$AC21 - 1,0,1,1)),\"\"))","v":""},{"$f":"IF( $AC21 = 0, \"\", IF( OFFSET( Combine!BB$9,$AC21 - 1,0,1,1)<>0, IF(OR($AD21=\"LUMP\", $AD21=\"LS\"), \"LUMP\", OFFSET( Combine!BB$9,$AC21 - 1,0,1,1)),\"\"))","v":""},{"$f":"IF( $AC21 = 0, \"\", IF( OFFSET( Combine!BC$9,$AC21 - 1,0,1,1)<>0, IF(OR($AD21=\"LUMP\", $AD21=\"LS\"), \"LUMP\", OFFSET( Combine!BC$9,$AC21 - 1,0,1,1)),\"\"))","v":""},{"$f":"IF( $AC21 = 0, \"\", IF( OFFSET( Combine!BD$9,$AC21 - 1,0,1,1)<>0, IF(OR($AD21=\"LUMP\", $AD21=\"LS\"), \"LUMP\", OFFSET( Combine!BD$9,$AC21 - 1,0,1,1)),\"\"))","v":""},{"$f":"IF( $AC21 = 0, \"\", IF( OFFSET( Combine!BE$9,$AC21 - 1,0,1,1)<>0, IF(OR($AD21=\"LUMP\", $AD21=\"LS\"), \"LUMP\", OFFSET( Combine!BE$9,$AC21 - 1,0,1,1)),\"\"))","v":""},{"$f":"IF( $AC21 = 0, \"\", IF( OFFSET( Combine!BF$9,$AC21 - 1,0,1,1)<>0, IF(OR($AD21=\"LUMP\", $AD21=\"LS\"), \"LUMP\", OFFSET( Combine!BF$9,$AC21 - 1,0,1,1)),\"\"))","v":""},{"$f":"IF( $AC21 = 0, \"\", IF( OFFSET( Combine!BG$9,$AC21 - 1,0,1,1)<>0, IF(OR($AD21=\"LUMP\", $AD21=\"LS\"), \"LUMP\", OFFSET( Combine!BG$9,$AC21 - 1,0,1,1)),\"\"))","v":""},{"$f":"IF( $AC21 = 0, \"\", IF( OFFSET( Combine!BH$9,$AC21 - 1,0,1,1)<>0, IF(OR($AD21=\"LUMP\", $AD21=\"LS\"), \"LUMP\", OFFSET( Combine!BH$9,$AC21 - 1,0,1,1)),\"\"))","v":""},{"$f":"IF( $AC21 = 0, \"\", IF( OFFSET( Combine!BI$9,$AC21 - 1,0,1,1)<>0, IF(OR($AD21=\"LUMP\", $AD21=\"LS\"), \"LUMP\", OFFSET( Combine!BI$9,$AC21 - 1,0,1,1)),\"\"))","v":""},{"$f":"IF( $AC21 = 0, \"\", IF( OFFSET( Combine!BJ$9,$AC21 - 1,0,1,1)<>0, IF(OR($AD21=\"LUMP\", $AD21=\"LS\"), \"LUMP\", OFFSET( Combine!BJ$9,$AC21 - 1,0,1,1)),\"\"))","v":""},{"$f":"IF( $AC21 = 0, \"\", IF( OFFSET( Combine!AP$9,$AC21 - 1,0,1,1)<>0, LEFT(OFFSET( Combine!AP$9,$AC21 - 1,0,1,1),3),\"\"))","v":""},{"$f":"IF( $AC21 = 0, \"\", IF( OFFSET( Combine!AP$9,$AC21 - 1,0,1,1)<>0, IF(LEN(OFFSET( Combine!AP$9,$AC21 - 1,0,1,1))=9,   RIGHT(OFFSET( Combine!AP$9,$AC21 - 1,0,1,1),5),    LEFT(RIGHT(OFFSET( Combine!AP$9,$AC21 - 1,0,1,1),6), 5)      ),\"\"))","v":""},"",{"$f":"IF( $AC21 = 0, \"\", IF( OFFSET( Combine!$AP$9,$AC21 - 1,0,1,1)<>0,IF(OR(AD21=\"LUMP\", AD21=\"LS\"), \"\", AD21),\"\"))","v":""},{"$f":"IF( $AC21 = 0, \"\", IF( OFFSET( Combine!$AP$9,$AC21 - 1,0,1,1)<>0, VLOOKUP( OFFSET( Combine!$AP$9,$AC21 - 1,0,1,1),[1]Items!$A$2:$E$10001,4,0),\"\"))","v":""},null,19,3,16,{"$f":"IF( $AC21 = 0, \"\", IF( OFFSET( Combine!$AP$9,$AC21 - 1,0,1,1)<>0, VLOOKUP( OFFSET( Combine!$AP$9,$AC21 - 1,0,1,1),[1]Items!$A$2:$E$10001,3,0),\"\"))","v":""}]
[{"$f":"IF( $AC22 = 0, \"\", IF( OFFSET( Combine!AQ$9,$AC22 - 1,0,1,1)<>0, IF(OR($AD22=\"LUMP\", $AD22=\"LS\"), \"LUMP\", OFFSET( Combine!AQ$9,$AC22 - 1,0,1,1)),\"\"))","v":""},{"$f":"IF( $AC22 = 0, \"\", IF( OFFSET( Combine!AR$9,$AC22 - 1,0,1,1)<>0, IF(OR($AD22=\"LUMP\", $AD22=\"LS\"), \"LUMP\", OFFSET( Combine!AR$9,$AC22 - 1,0,1,1)),\"\"))","v":""},{"$f":"IF( $AC22 = 0, \"\", IF( OFFSET( Combine!AS$9,$AC22 - 1,0,1,1)<>0, IF(OR($AD22=\"LUMP\", $AD22=\"LS\"), \"LUMP\", OFFSET( Combine!AS$9,$AC22 - 1,0,1,1)),\"\"))","v":""},{"$f":"IF( $AC22 = 0, \"\", IF( OFFSET( Combine!AT$9,$AC22 - 1,0,1,1)<>0, IF(OR($AD22=\"LUMP\", $AD22=\"LS\"), \"LUMP\", OFFSET( Combine!AT$9,$AC22 - 1,0,1,1)),\"\"))","v":""},{"$f":"IF( $AC22 = 0, \"\", IF( OFFSET( Combine!AU$9,$AC22 - 1,0,1,1)<>0, IF(OR($AD22=\"LUMP\", $AD22=\"LS\"), \"LUMP\", OFFSET( Combine!AU$9,$AC22 - 1,0,1,1)),\"\"))","v":""},{"$f":"IF( $AC22 = 0, \"\", IF( OFFSET( Combine!AV$9,$AC22 - 1,0,1,1)<>0, IF(OR($AD22=\"LUMP\", $AD22=\"LS\"), \"LUMP\", OFFSET( Combine!AV$9,$AC22 - 1,0,1,1)),\"\"))","v":""},{"$f":"IF( $AC22 = 0, \"\", IF( OFFSET( Combine!AW$9,$AC22 - 1,0,1,1)<>0, IF(OR($AD22=\"LUMP\", $AD22=\"LS\"), \"LUMP\", OFFSET( Combine!AW$9,$AC22 - 1,0,1,1)),\"\"))","v":""},{"$f":"IF( $AC22 = 0, \"\", IF( OFFSET( Combine!AX$9,$AC22 - 1,0,1,1)<>0, IF(OR($AD22=\"LUMP\", $AD22=\"LS\"), \"LUMP\", OFFSET( Combine!AX$9,$AC22 - 1,0,1,1)),\"\"))","v":""},{"$f":"IF( $AC22 = 0, \"\", IF( OFFSET( Combine!AY$9,$AC22 - 1,0,1,1)<>0, IF(OR($AD22=\"LUMP\", $AD22=\"LS\"), \"LUMP\", OFFSET( Combine!AY$9,$AC22 - 1,0,1,1)),\"\"))","v":""},{"$f":"IF( $AC22 = 0, \"\", IF( OFFSET( Combine!AZ$9,$AC22 - 1,0,1,1)<>0, IF(OR($AD22=\"LUMP\", $AD22=\"LS\"), \"LUMP\", OFFSET( Combine!AZ$9,$AC22 - 1,0,1,1)),\"\"))","v":""},{"$f":"IF( $AC22 = 0, \"\", IF( OFFSET( Combine!BA$9,$AC22 - 1,0,1,1)<>0, IF(OR($AD22=\"LUMP\", $AD22=\"LS\"), \"LUMP\", OFFSET( Combine!BA$9,$AC22 - 1,0,1,1)),\"\"))","v":""},{"$f":"IF( $AC22 = 0, \"\", IF( OFFSET( Combine!BB$9,$AC22 - 1,0,1,1)<>0, IF(OR($AD22=\"LUMP\", $AD22=\"LS\"), \"LUMP\", OFFSET( Combine!BB$9,$AC22 - 1,0,1,1)),\"\"))","v":""},{"$f":"IF( $AC22 = 0, \"\", IF( OFFSET( Combine!BC$9,$AC22 - 1,0,1,1)<>0, IF(OR($AD22=\"LUMP\", $AD22=\"LS\"), \"LUMP\", OFFSET( Combine!BC$9,$AC22 - 1,0,1,1)),\"\"))","v":""},{"$f":"IF( $AC22 = 0, \"\", IF( OFFSET( Combine!BD$9,$AC22 - 1,0,1,1)<>0, IF(OR($AD22=\"LUMP\", $AD22=\"LS\"), \"LUMP\", OFFSET( Combine!BD$9,$AC22 - 1,0,1,1)),\"\"))","v":""},{"$f":"IF( $AC22 = 0, \"\", IF( OFFSET( Combine!BE$9,$AC22 - 1,0,1,1)<>0, IF(OR($AD22=\"LUMP\", $AD22=\"LS\"), \"LUMP\", OFFSET( Combine!BE$9,$AC22 - 1,0,1,1)),\"\"))","v":""},{"$f":"IF( $AC22 = 0, \"\", IF( OFFSET( Combine!BF$9,$AC22 - 1,0,1,1)<>0, IF(OR($AD22=\"LUMP\", $AD22=\"LS\"), \"LUMP\", OFFSET( Combine!BF$9,$AC22 - 1,0,1,1)),\"\"))","v":""},{"$f":"IF( $AC22 = 0, \"\", IF( OFFSET( Combine!BG$9,$AC22 - 1,0,1,1)<>0, IF(OR($AD22=\"LUMP\", $AD22=\"LS\"), \"LUMP\", OFFSET( Combine!BG$9,$AC22 - 1,0,1,1)),\"\"))","v":""},{"$f":"IF( $AC22 = 0, \"\", IF( OFFSET( Combine!BH$9,$AC22 - 1,0,1,1)<>0, IF(OR($AD22=\"LUMP\", $AD22=\"LS\"), \"LUMP\", OFFSET( Combine!BH$9,$AC22 - 1,0,1,1)),\"\"))","v":""},{"$f":"IF( $AC22 = 0, \"\", IF( OFFSET( Combine!BI$9,$AC22 - 1,0,1,1)<>0, IF(OR($AD22=\"LUMP\", $AD22=\"LS\"), \"LUMP\", OFFSET( Combine!BI$9,$AC22 - 1,0,1,1)),\"\"))","v":""},{"$f":"IF( $AC22 = 0, \"\", IF( OFFSET( Combine!BJ$9,$AC22 - 1,0,1,1)<>0, IF(OR($AD22=\"LUMP\", $AD22=\"LS\"), \"LUMP\", OFFSET( Combine!BJ$9,$AC22 - 1,0,1,1)),\"\"))","v":""},{"$f":"IF( $AC22 = 0, \"\", IF( OFFSET( Combine!AP$9,$AC22 - 1,0,1,1)<>0, LEFT(OFFSET( Combine!AP$9,$AC22 - 1,0,1,1),3),\"\"))","v":""},{"$f":"IF( $AC22 = 0, \"\", IF( OFFSET( Combine!AP$9,$AC22 - 1,0,1,1)<>0, IF(LEN(OFFSET( Combine!AP$9,$AC22 - 1,0,1,1))=9,   RIGHT(OFFSET( Combine!AP$9,$AC22 - 1,0,1,1),5),    LEFT(RIGHT(OFFSET( Combine!AP$9,$AC22 - 1,0,1,1),6), 5)      ),\"\"))","v":""},"",{"$f":"IF( $AC22 = 0, \"\", IF( OFFSET( Combine!$AP$9,$AC22 - 1,0,1,1)<>0,IF(OR(AD22=\"LUMP\", AD22=\"LS\"), \"\", AD22),\"\"))","v":""},{"$f":"IF( $AC22 = 0, \"\", IF( OFFSET( Combine!$AP$9,$AC22 - 1,0,1,1)<>0, VLOOKUP( OFFSET( Combine!$AP$9,$AC22 - 1,0,1,1),[1]Items!$A$2:$E$10001,4,0),\"\"))","v":""},null,20,3,17,{"$f":"IF( $AC22 = 0, \"\", IF( OFFSET( Combine!$AP$9,$AC22 - 1,0,1,1)<>0, VLOOKUP( OFFSET( Combine!$AP$9,$AC22 - 1,0,1,1),[1]Items!$A$2:$E$10001,3,0),\"\"))","v":""}]
[{"$f":"IF( $AC23 = 0, \"\", IF( OFFSET( Combine!AQ$9,$AC23 - 1,0,1,1)<>0, IF(OR($AD23=\"LUMP\", $AD23=\"LS\"), \"LUMP\", OFFSET( Combine!AQ$9,$AC23 - 1,0,1,1)),\"\"))","v":""},{"$f":"IF( $AC23 = 0, \"\", IF( OFFSET( Combine!AR$9,$AC23 - 1,0,1,1)<>0, IF(OR($AD23=\"LUMP\", $AD23=\"LS\"), \"LUMP\", OFFSET( Combine!AR$9,$AC23 - 1,0,1,1)),\"\"))","v":""},{"$f":"IF( $AC23 = 0, \"\", IF( OFFSET( Combine!AS$9,$AC23 - 1,0,1,1)<>0, IF(OR($AD23=\"LUMP\", $AD23=\"LS\"), \"LUMP\", OFFSET( Combine!AS$9,$AC23 - 1,0,1,1)),\"\"))","v":""},{"$f":"IF( $AC23 = 0, \"\", IF( OFFSET( Combine!AT$9,$AC23 - 1,0,1,1)<>0, IF(OR($AD23=\"LUMP\", $AD23=\"LS\"), \"LUMP\", OFFSET( Combine!AT$9,$AC23 - 1,0,1,1)),\"\"))","v":""},{"$f":"IF( $AC23 = 0, \"\", IF( OFFSET( Combine!AU$9,$AC23 - 1,0,1,1)<>0, IF(OR($AD23=\"LUMP\", $AD23=\"LS\"), \"LUMP\", OFFSET( Combine!AU$9,$AC23 - 1,0,1,1)),\"\"))","v":""},{"$f":"IF( $AC23 = 0, \"\", IF( OFFSET( Combine!AV$9,$AC23 - 1,0,1,1)<>0, IF(OR($AD23=\"LUMP\", $AD23=\"LS\"), \"LUMP\", OFFSET( Combine!AV$9,$AC23 - 1,0,1,1)),\"\"))","v":""},{"$f":"IF( $AC23 = 0, \"\", IF( OFFSET( Combine!AW$9,$AC23 - 1,0,1,1)<>0, IF(OR($AD23=\"LUMP\", $AD23=\"LS\"), \"LUMP\", OFFSET( Combine!AW$9,$AC23 - 1,0,1,1)),\"\"))","v":""},{"$f":"IF( $AC23 = 0, \"\", IF( OFFSET( Combine!AX$9,$AC23 - 1,0,1,1)<>0, IF(OR($AD23=\"LUMP\", $AD23=\"LS\"), \"LUMP\", OFFSET( Combine!AX$9,$AC23 - 1,0,1,1)),\"\"))","v":""},{"$f":"IF( $AC23 = 0, \"\", IF( OFFSET( Combine!AY$9,$AC23 - 1,0,1,1)<>0, IF(OR($AD23=\"LUMP\", $AD23=\"LS\"), \"LUMP\", OFFSET( Combine!AY$9,$AC23 - 1,0,1,1)),\"\"))","v":""},{"$f":"IF( $AC23 = 0, \"\", IF( OFFSET( Combine!AZ$9,$AC23 - 1,0,1,1)<>0, IF(OR($AD23=\"LUMP\", $AD23=\"LS\"), \"LUMP\", OFFSET( Combine!AZ$9,$AC23 - 1,0,1,1)),\"\"))","v":""},{"$f":"IF( $AC23 = 0, \"\", IF( OFFSET( Combine!BA$9,$AC23 - 1,0,1,1)<>0, IF(OR($AD23=\"LUMP\", $AD23=\"LS\"), \"LUMP\", OFFSET( Combine!BA$9,$AC23 - 1,0,1,1)),\"\"))","v":""},{"$f":"IF( $AC23 = 0, \"\", IF( OFFSET( Combine!BB$9,$AC23 - 1,0,1,1)<>0, IF(OR($AD23=\"LUMP\", $AD23=\"LS\"), \"LUMP\", OFFSET( Combine!BB$9,$AC23 - 1,0,1,1)),\"\"))","v":""},{"$f":"IF( $AC23 = 0, \"\", IF( OFFSET( Combine!BC$9,$AC23 - 1,0,1,1)<>0, IF(OR($AD23=\"LUMP\", $AD23=\"LS\"), \"LUMP\", OFFSET( Combine!BC$9,$AC23 - 1,0,1,1)),\"\"))","v":""},{"$f":"IF( $AC23 = 0, \"\", IF( OFFSET( Combine!BD$9,$AC23 - 1,0,1,1)<>0, IF(OR($AD23=\"LUMP\", $AD23=\"LS\"), \"LUMP\", OFFSET( Combine!BD$9,$AC23 - 1,0,1,1)),\"\"))","v":""},{"$f":"IF( $AC23 = 0, \"\", IF( OFFSET( Combine!BE$9,$AC23 - 1,0,1,1)<>0, IF(OR($AD23=\"LUMP\", $AD23=\"LS\"), \"LUMP\", OFFSET( Combine!BE$9,$AC23 - 1,0,1,1)),\"\"))","v":""},{"$f":"IF( $AC23 = 0, \"\", IF( OFFSET( Combine!BF$9,$AC23 - 1,0,1,1)<>0, IF(OR($AD23=\"LUMP\", $AD23=\"LS\"), \"LUMP\", OFFSET( Combine!BF$9,$AC23 - 1,0,1,1)),\"\"))","v":""},{"$f":"IF( $AC23 = 0, \"\", IF( OFFSET( Combine!BG$9,$AC23 - 1,0,1,1)<>0, IF(OR($AD23=\"LUMP\", $AD23=\"LS\"), \"LUMP\", OFFSET( Combine!BG$9,$AC23 - 1,0,1,1)),\"\"))","v":""},{"$f":"IF( $AC23 = 0, \"\", IF( OFFSET( Combine!BH$9,$AC23 - 1,0,1,1)<>0, IF(OR($AD23=\"LUMP\", $AD23=\"LS\"), \"LUMP\", OFFSET( Combine!BH$9,$AC23 - 1,0,1,1)),\"\"))","v":""},{"$f":"IF( $AC23 = 0, \"\", IF( OFFSET( Combine!BI$9,$AC23 - 1,0,1,1)<>0, IF(OR($AD23=\"LUMP\", $AD23=\"LS\"), \"LUMP\", OFFSET( Combine!BI$9,$AC23 - 1,0,1,1)),\"\"))","v":""},{"$f":"IF( $AC23 = 0, \"\", IF( OFFSET( Combine!BJ$9,$AC23 - 1,0,1,1)<>0, IF(OR($AD23=\"LUMP\", $AD23=\"LS\"), \"LUMP\", OFFSET( Combine!BJ$9,$AC23 - 1,0,1,1)),\"\"))","v":""},{"$f":"IF( $AC23 = 0, \"\", IF( OFFSET( Combine!AP$9,$AC23 - 1,0,1,1)<>0, LEFT(OFFSET( Combine!AP$9,$AC23 - 1,0,1,1),3),\"\"))","v":""},{"$f":"IF( $AC23 = 0, \"\", IF( OFFSET( Combine!AP$9,$AC23 - 1,0,1,1)<>0, IF(LEN(OFFSET( Combine!AP$9,$AC23 - 1,0,1,1))=9,   RIGHT(OFFSET( Combine!AP$9,$AC23 - 1,0,1,1),5),    LEFT(RIGHT(OFFSET( Combine!AP$9,$AC23 - 1,0,1,1),6), 5)      ),\"\"))","v":""},"",{"$f":"IF( $AC23 = 0, \"\", IF( OFFSET( Combine!$AP$9,$AC23 - 1,0,1,1)<>0,IF(OR(AD23=\"LUMP\", AD23=\"LS\"), \"\", AD23),\"\"))","v":""},{"$f":"IF( $AC23 = 0, \"\", IF( OFFSET( Combine!$AP$9,$AC23 - 1,0,1,1)<>0, VLOOKUP( OFFSET( Combine!$AP$9,$AC23 - 1,0,1,1),[1]Items!$A$2:$E$10001,4,0),\"\"))","v":""},null,21,3,18,{"$f":"IF( $AC23 = 0, \"\", IF( OFFSET( Combine!$AP$9,$AC23 - 1,0,1,1)<>0, VLOOKUP( OFFSET( Combine!$AP$9,$AC23 - 1,0,1,1),[1]Items!$A$2:$E$10001,3,0),\"\"))","v":""}]
[{"$f":"IF( $AC24 = 0, \"\", IF( OFFSET( Combine!AQ$9,$AC24 - 1,0,1,1)<>0, IF(OR($AD24=\"LUMP\", $AD24=\"LS\"), \"LUMP\", OFFSET( Combine!AQ$9,$AC24 - 1,0,1,1)),\"\"))","v":""},{"$f":"IF( $AC24 = 0, \"\", IF( OFFSET( Combine!AR$9,$AC24 - 1,0,1,1)<>0, IF(OR($AD24=\"LUMP\", $AD24=\"LS\"), \"LUMP\", OFFSET( Combine!AR$9,$AC24 - 1,0,1,1)),\"\"))","v":""},{"$f":"IF( $AC24 = 0, \"\", IF( OFFSET( Combine!AS$9,$AC24 - 1,0,1,1)<>0, IF(OR($AD24=\"LUMP\", $AD24=\"LS\"), \"LUMP\", OFFSET( Combine!AS$9,$AC24 - 1,0,1,1)),\"\"))","v":""},{"$f":"IF( $AC24 = 0, \"\", IF( OFFSET( Combine!AT$9,$AC24 - 1,0,1,1)<>0, IF(OR($AD24=\"LUMP\", $AD24=\"LS\"), \"LUMP\", OFFSET( Combine!AT$9,$AC24 - 1,0,1,1)),\"\"))","v":""},{"$f":"IF( $AC24 = 0, \"\", IF( OFFSET( Combine!AU$9,$AC24 - 1,0,1,1)<>0, IF(OR($AD24=\"LUMP\", $AD24=\"LS\"), \"LUMP\", OFFSET( Combine!AU$9,$AC24 - 1,0,1,1)),\"\"))","v":""},{"$f":"IF( $AC24 = 0, \"\", IF( OFFSET( Combine!AV$9,$AC24 - 1,0,1,1)<>0, IF(OR($AD24=\"LUMP\", $AD24=\"LS\"), \"LUMP\", OFFSET( Combine!AV$9,$AC24 - 1,0,1,1)),\"\"))","v":""},{"$f":"IF( $AC24 = 0, \"\", IF( OFFSET( Combine!AW$9,$AC24 - 1,0,1,1)<>0, IF(OR($AD24=\"LUMP\", $AD24=\"LS\"), \"LUMP\", OFFSET( Combine!AW$9,$AC24 - 1,0,1,1)),\"\"))","v":""},{"$f":"IF( $AC24 = 0, \"\", IF( OFFSET( Combine!AX$9,$AC24 - 1,0,1,1)<>0, IF(OR($AD24=\"LUMP\", $AD24=\"LS\"), \"LUMP\", OFFSET( Combine!AX$9,$AC24 - 1,0,1,1)),\"\"))","v":""},{"$f":"IF( $AC24 = 0, \"\", IF( OFFSET( Combine!AY$9,$AC24 - 1,0,1,1)<>0, IF(OR($AD24=\"LUMP\", $AD24=\"LS\"), \"LUMP\", OFFSET( Combine!AY$9,$AC24 - 1,0,1,1)),\"\"))","v":""},{"$f":"IF( $AC24 = 0, \"\", IF( OFFSET( Combine!AZ$9,$AC24 - 1,0,1,1)<>0, IF(OR($AD24=\"LUMP\", $AD24=\"LS\"), \"LUMP\", OFFSET( Combine!AZ$9,$AC24 - 1,0,1,1)),\"\"))","v":""},{"$f":"IF( $AC24 = 0, \"\", IF( OFFSET( Combine!BA$9,$AC24 - 1,0,1,1)<>0, IF(OR($AD24=\"LUMP\", $AD24=\"LS\"), \"LUMP\", OFFSET( Combine!BA$9,$AC24 - 1,0,1,1)),\"\"))","v":""},{"$f":"IF( $AC24 = 0, \"\", IF( OFFSET( Combine!BB$9,$AC24 - 1,0,1,1)<>0, IF(OR($AD24=\"LUMP\", $AD24=\"LS\"), \"LUMP\", OFFSET( Combine!BB$9,$AC24 - 1,0,1,1)),\"\"))","v":""},{"$f":"IF( $AC24 = 0, \"\", IF( OFFSET( Combine!BC$9,$AC24 - 1,0,1,1)<>0, IF(OR($AD24=\"LUMP\", $AD24=\"LS\"), \"LUMP\", OFFSET( Combine!BC$9,$AC24 - 1,0,1,1)),\"\"))","v":""},{"$f":"IF( $AC24 = 0, \"\", IF( OFFSET( Combine!BD$9,$AC24 - 1,0,1,1)<>0, IF(OR($AD24=\"LUMP\", $AD24=\"LS\"), \"LUMP\", OFFSET( Combine!BD$9,$AC24 - 1,0,1,1)),\"\"))","v":""},{"$f":"IF( $AC24 = 0, \"\", IF( OFFSET( Combine!BE$9,$AC24 - 1,0,1,1)<>0, IF(OR($AD24=\"LUMP\", $AD24=\"LS\"), \"LUMP\", OFFSET( Combine!BE$9,$AC24 - 1,0,1,1)),\"\"))","v":""},{"$f":"IF( $AC24 = 0, \"\", IF( OFFSET( Combine!BF$9,$AC24 - 1,0,1,1)<>0, IF(OR($AD24=\"LUMP\", $AD24=\"LS\"), \"LUMP\", OFFSET( Combine!BF$9,$AC24 - 1,0,1,1)),\"\"))","v":""},{"$f":"IF( $AC24 = 0, \"\", IF( OFFSET( Combine!BG$9,$AC24 - 1,0,1,1)<>0, IF(OR($AD24=\"LUMP\", $AD24=\"LS\"), \"LUMP\", OFFSET( Combine!BG$9,$AC24 - 1,0,1,1)),\"\"))","v":""},{"$f":"IF( $AC24 = 0, \"\", IF( OFFSET( Combine!BH$9,$AC24 - 1,0,1,1)<>0, IF(OR($AD24=\"LUMP\", $AD24=\"LS\"), \"LUMP\", OFFSET( Combine!BH$9,$AC24 - 1,0,1,1)),\"\"))","v":""},{"$f":"IF( $AC24 = 0, \"\", IF( OFFSET( Combine!BI$9,$AC24 - 1,0,1,1)<>0, IF(OR($AD24=\"LUMP\", $AD24=\"LS\"), \"LUMP\", OFFSET( Combine!BI$9,$AC24 - 1,0,1,1)),\"\"))","v":""},{"$f":"IF( $AC24 = 0, \"\", IF( OFFSET( Combine!BJ$9,$AC24 - 1,0,1,1)<>0, IF(OR($AD24=\"LUMP\", $AD24=\"LS\"), \"LUMP\", OFFSET( Combine!BJ$9,$AC24 - 1,0,1,1)),\"\"))","v":""},{"$f":"IF( $AC24 = 0, \"\", IF( OFFSET( Combine!AP$9,$AC24 - 1,0,1,1)<>0, LEFT(OFFSET( Combine!AP$9,$AC24 - 1,0,1,1),3),\"\"))","v":""},{"$f":"IF( $AC24 = 0, \"\", IF( OFFSET( Combine!AP$9,$AC24 - 1,0,1,1)<>0, IF(LEN(OFFSET( Combine!AP$9,$AC24 - 1,0,1,1))=9,   RIGHT(OFFSET( Combine!AP$9,$AC24 - 1,0,1,1),5),    LEFT(RIGHT(OFFSET( Combine!AP$9,$AC24 - 1,0,1,1),6), 5)      ),\"\"))","v":""},"",{"$f":"IF( $AC24 = 0, \"\", IF( OFFSET( Combine!$AP$9,$AC24 - 1,0,1,1)<>0,IF(OR(AD24=\"LUMP\", AD24=\"LS\"), \"\", AD24),\"\"))","v":""},{"$f":"IF( $AC24 = 0, \"\", IF( OFFSET( Combine!$AP$9,$AC24 - 1,0,1,1)<>0, VLOOKUP( OFFSET( Combine!$AP$9,$AC24 - 1,0,1,1),[1]Items!$A$2:$E$10001,4,0),\"\"))","v":""},null,22,3,19,{"$f":"IF( $AC24 = 0, \"\", IF( OFFSET( Combine!$AP$9,$AC24 - 1,0,1,1)<>0, VLOOKUP( OFFSET( Combine!$AP$9,$AC24 - 1,0,1,1),[1]Items!$A$2:$E$10001,3,0),\"\"))","v":""}]
[{"$f":"IF( $AC25 = 0, \"\", IF( OFFSET( Combine!AQ$9,$AC25 - 1,0,1,1)<>0, IF(OR($AD25=\"LUMP\", $AD25=\"LS\"), \"LUMP\", OFFSET( Combine!AQ$9,$AC25 - 1,0,1,1)),\"\"))","v":""},{"$f":"IF( $AC25 = 0, \"\", IF( OFFSET( Combine!AR$9,$AC25 - 1,0,1,1)<>0, IF(OR($AD25=\"LUMP\", $AD25=\"LS\"), \"LUMP\", OFFSET( Combine!AR$9,$AC25 - 1,0,1,1)),\"\"))","v":""},{"$f":"IF( $AC25 = 0, \"\", IF( OFFSET( Combine!AS$9,$AC25 - 1,0,1,1)<>0, IF(OR($AD25=\"LUMP\", $AD25=\"LS\"), \"LUMP\", OFFSET( Combine!AS$9,$AC25 - 1,0,1,1)),\"\"))","v":""},{"$f":"IF( $AC25 = 0, \"\", IF( OFFSET( Combine!AT$9,$AC25 - 1,0,1,1)<>0, IF(OR($AD25=\"LUMP\", $AD25=\"LS\"), \"LUMP\", OFFSET( Combine!AT$9,$AC25 - 1,0,1,1)),\"\"))","v":""},{"$f":"IF( $AC25 = 0, \"\", IF( OFFSET( Combine!AU$9,$AC25 - 1,0,1,1)<>0, IF(OR($AD25=\"LUMP\", $AD25=\"LS\"), \"LUMP\", OFFSET( Combine!AU$9,$AC25 - 1,0,1,1)),\"\"))","v":""},{"$f":"IF( $AC25 = 0, \"\", IF( OFFSET( Combine!AV$9,$AC25 - 1,0,1,1)<>0, IF(OR($AD25=\"LUMP\", $AD25=\"LS\"), \"LUMP\", OFFSET( Combine!AV$9,$AC25 - 1,0,1,1)),\"\"))","v":""},{"$f":"IF( $AC25 = 0, \"\", IF( OFFSET( Combine!AW$9,$AC25 - 1,0,1,1)<>0, IF(OR($AD25=\"LUMP\", $AD25=\"LS\"), \"LUMP\", OFFSET( Combine!AW$9,$AC25 - 1,0,1,1)),\"\"))","v":""},{"$f":"IF( $AC25 = 0, \"\", IF( OFFSET( Combine!AX$9,$AC25 - 1,0,1,1)<>0, IF(OR($AD25=\"LUMP\", $AD25=\"LS\"), \"LUMP\", OFFSET( Combine!AX$9,$AC25 - 1,0,1,1)),\"\"))","v":""},{"$f":"IF( $AC25 = 0, \"\", IF( OFFSET( Combine!AY$9,$AC25 - 1,0,1,1)<>0, IF(OR($AD25=\"LUMP\", $AD25=\"LS\"), \"LUMP\", OFFSET( Combine!AY$9,$AC25 - 1,0,1,1)),\"\"))","v":""},{"$f":"IF( $AC25 = 0, \"\", IF( OFFSET( Combine!AZ$9,$AC25 - 1,0,1,1)<>0, IF(OR($AD25=\"LUMP\", $AD25=\"LS\"), \"LUMP\", OFFSET( Combine!AZ$9,$AC25 - 1,0,1,1)),\"\"))","v":""},{"$f":"IF( $AC25 = 0, \"\", IF( OFFSET( Combine!BA$9,$AC25 - 1,0,1,1)<>0, IF(OR($AD25=\"LUMP\", $AD25=\"LS\"), \"LUMP\", OFFSET( Combine!BA$9,$AC25 - 1,0,1,1)),\"\"))","v":""},{"$f":"IF( $AC25 = 0, \"\", IF( OFFSET( Combine!BB$9,$AC25 - 1,0,1,1)<>0, IF(OR($AD25=\"LUMP\", $AD25=\"LS\"), \"LUMP\", OFFSET( Combine!BB$9,$AC25 - 1,0,1,1)),\"\"))","v":""},{"$f":"IF( $AC25 = 0, \"\", IF( OFFSET( Combine!BC$9,$AC25 - 1,0,1,1)<>0, IF(OR($AD25=\"LUMP\", $AD25=\"LS\"), \"LUMP\", OFFSET( Combine!BC$9,$AC25 - 1,0,1,1)),\"\"))","v":""},{"$f":"IF( $AC25 = 0, \"\", IF( OFFSET( Combine!BD$9,$AC25 - 1,0,1,1)<>0, IF(OR($AD25=\"LUMP\", $AD25=\"LS\"), \"LUMP\", OFFSET( Combine!BD$9,$AC25 - 1,0,1,1)),\"\"))","v":""},{"$f":"IF( $AC25 = 0, \"\", IF( OFFSET( Combine!BE$9,$AC25 - 1,0,1,1)<>0, IF(OR($AD25=\"LUMP\", $AD25=\"LS\"), \"LUMP\", OFFSET( Combine!BE$9,$AC25 - 1,0,1,1)),\"\"))","v":""},{"$f":"IF( $AC25 = 0, \"\", IF( OFFSET( Combine!BF$9,$AC25 - 1,0,1,1)<>0, IF(OR($AD25=\"LUMP\", $AD25=\"LS\"), \"LUMP\", OFFSET( Combine!BF$9,$AC25 - 1,0,1,1)),\"\"))","v":""},{"$f":"IF( $AC25 = 0, \"\", IF( OFFSET( Combine!BG$9,$AC25 - 1,0,1,1)<>0, IF(OR($AD25=\"LUMP\", $AD25=\"LS\"), \"LUMP\", OFFSET( Combine!BG$9,$AC25 - 1,0,1,1)),\"\"))","v":""},{"$f":"IF( $AC25 = 0, \"\", IF( OFFSET( Combine!BH$9,$AC25 - 1,0,1,1)<>0, IF(OR($AD25=\"LUMP\", $AD25=\"LS\"), \"LUMP\", OFFSET( Combine!BH$9,$AC25 - 1,0,1,1)),\"\"))","v":""},{"$f":"IF( $AC25 = 0, \"\", IF( OFFSET( Combine!BI$9,$AC25 - 1,0,1,1)<>0, IF(OR($AD25=\"LUMP\", $AD25=\"LS\"), \"LUMP\", OFFSET( Combine!BI$9,$AC25 - 1,0,1,1)),\"\"))","v":""},{"$f":"IF( $AC25 = 0, \"\", IF( OFFSET( Combine!BJ$9,$AC25 - 1,0,1,1)<>0, IF(OR($AD25=\"LUMP\", $AD25=\"LS\"), \"LUMP\", OFFSET( Combine!BJ$9,$AC25 - 1,0,1,1)),\"\"))","v":""},{"$f":"IF( $AC25 = 0, \"\", IF( OFFSET( Combine!AP$9,$AC25 - 1,0,1,1)<>0, LEFT(OFFSET( Combine!AP$9,$AC25 - 1,0,1,1),3),\"\"))","v":""},{"$f":"IF( $AC25 = 0, \"\", IF( OFFSET( Combine!AP$9,$AC25 - 1,0,1,1)<>0, IF(LEN(OFFSET( Combine!AP$9,$AC25 - 1,0,1,1))=9,   RIGHT(OFFSET( Combine!AP$9,$AC25 - 1,0,1,1),5),    LEFT(RIGHT(OFFSET( Combine!AP$9,$AC25 - 1,0,1,1),6), 5)      ),\"\"))","v":""},"",{"$f":"IF( $AC25 = 0, \"\", IF( OFFSET( Combine!$AP$9,$AC25 - 1,0,1,1)<>0,IF(OR(AD25=\"LUMP\", AD25=\"LS\"), \"\", AD25),\"\"))","v":""},{"$f":"IF( $AC25 = 0, \"\", IF( OFFSET( Combine!$AP$9,$AC25 - 1,0,1,1)<>0, VLOOKUP( OFFSET( Combine!$AP$9,$AC25 - 1,0,1,1),[1]Items!$A$2:$E$10001,4,0),\"\"))","v":""},null,23,3,20,{"$f":"IF( $AC25 = 0, \"\", IF( OFFSET( Combine!$AP$9,$AC25 - 1,0,1,1)<>0, VLOOKUP( OFFSET( Combine!$AP$9,$AC25 - 1,0,1,1),[1]Items!$A$2:$E$10001,3,0),\"\"))","v":""}]
[{"$f":"IF( $AC26 = 0, \"\", IF( OFFSET( Combine!AQ$9,$AC26 - 1,0,1,1)<>0, IF(OR($AD26=\"LUMP\", $AD26=\"LS\"), \"LUMP\", OFFSET( Combine!AQ$9,$AC26 - 1,0,1,1)),\"\"))","v":""},{"$f":"IF( $AC26 = 0, \"\", IF( OFFSET( Combine!AR$9,$AC26 - 1,0,1,1)<>0, IF(OR($AD26=\"LUMP\", $AD26=\"LS\"), \"LUMP\", OFFSET( Combine!AR$9,$AC26 - 1,0,1,1)),\"\"))","v":""},{"$f":"IF( $AC26 = 0, \"\", IF( OFFSET( Combine!AS$9,$AC26 - 1,0,1,1)<>0, IF(OR($AD26=\"LUMP\", $AD26=\"LS\"), \"LUMP\", OFFSET( Combine!AS$9,$AC26 - 1,0,1,1)),\"\"))","v":""},{"$f":"IF( $AC26 = 0, \"\", IF( OFFSET( Combine!AT$9,$AC26 - 1,0,1,1)<>0, IF(OR($AD26=\"LUMP\", $AD26=\"LS\"), \"LUMP\", OFFSET( Combine!AT$9,$AC26 - 1,0,1,1)),\"\"))","v":""},{"$f":"IF( $AC26 = 0, \"\", IF( OFFSET( Combine!AU$9,$AC26 - 1,0,1,1)<>0, IF(OR($AD26=\"LUMP\", $AD26=\"LS\"), \"LUMP\", OFFSET( Combine!AU$9,$AC26 - 1,0,1,1)),\"\"))","v":""},{"$f":"IF( $AC26 = 0, \"\", IF( OFFSET( Combine!AV$9,$AC26 - 1,0,1,1)<>0, IF(OR($AD26=\"LUMP\", $AD26=\"LS\"), \"LUMP\", OFFSET( Combine!AV$9,$AC26 - 1,0,1,1)),\"\"))","v":""},{"$f":"IF( $AC26 = 0, \"\", IF( OFFSET( Combine!AW$9,$AC26 - 1,0,1,1)<>0, IF(OR($AD26=\"LUMP\", $AD26=\"LS\"), \"LUMP\", OFFSET( Combine!AW$9,$AC26 - 1,0,1,1)),\"\"))","v":""},{"$f":"IF( $AC26 = 0, \"\", IF( OFFSET( Combine!AX$9,$AC26 - 1,0,1,1)<>0, IF(OR($AD26=\"LUMP\", $AD26=\"LS\"), \"LUMP\", OFFSET( Combine!AX$9,$AC26 - 1,0,1,1)),\"\"))","v":""},{"$f":"IF( $AC26 = 0, \"\", IF( OFFSET( Combine!AY$9,$AC26 - 1,0,1,1)<>0, IF(OR($AD26=\"LUMP\", $AD26=\"LS\"), \"LUMP\", OFFSET( Combine!AY$9,$AC26 - 1,0,1,1)),\"\"))","v":""},{"$f":"IF( $AC26 = 0, \"\", IF( OFFSET( Combine!AZ$9,$AC26 - 1,0,1,1)<>0, IF(OR($AD26=\"LUMP\", $AD26=\"LS\"), \"LUMP\", OFFSET( Combine!AZ$9,$AC26 - 1,0,1,1)),\"\"))","v":""},{"$f":"IF( $AC26 = 0, \"\", IF( OFFSET( Combine!BA$9,$AC26 - 1,0,1,1)<>0, IF(OR($AD26=\"LUMP\", $AD26=\"LS\"), \"LUMP\", OFFSET( Combine!BA$9,$AC26 - 1,0,1,1)),\"\"))","v":""},{"$f":"IF( $AC26 = 0, \"\", IF( OFFSET( Combine!BB$9,$AC26 - 1,0,1,1)<>0, IF(OR($AD26=\"LUMP\", $AD26=\"LS\"), \"LUMP\", OFFSET( Combine!BB$9,$AC26 - 1,0,1,1)),\"\"))","v":""},{"$f":"IF( $AC26 = 0, \"\", IF( OFFSET( Combine!BC$9,$AC26 - 1,0,1,1)<>0, IF(OR($AD26=\"LUMP\", $AD26=\"LS\"), \"LUMP\", OFFSET( Combine!BC$9,$AC26 - 1,0,1,1)),\"\"))","v":""},{"$f":"IF( $AC26 = 0, \"\", IF( OFFSET( Combine!BD$9,$AC26 - 1,0,1,1)<>0, IF(OR($AD26=\"LUMP\", $AD26=\"LS\"), \"LUMP\", OFFSET( Combine!BD$9,$AC26 - 1,0,1,1)),\"\"))","v":""},{"$f":"IF( $AC26 = 0, \"\", IF( OFFSET( Combine!BE$9,$AC26 - 1,0,1,1)<>0, IF(OR($AD26=\"LUMP\", $AD26=\"LS\"), \"LUMP\", OFFSET( Combine!BE$9,$AC26 - 1,0,1,1)),\"\"))","v":""},{"$f":"IF( $AC26 = 0, \"\", IF( OFFSET( Combine!BF$9,$AC26 - 1,0,1,1)<>0, IF(OR($AD26=\"LUMP\", $AD26=\"LS\"), \"LUMP\", OFFSET( Combine!BF$9,$AC26 - 1,0,1,1)),\"\"))","v":""},{"$f":"IF( $AC26 = 0, \"\", IF( OFFSET( Combine!BG$9,$AC26 - 1,0,1,1)<>0, IF(OR($AD26=\"LUMP\", $AD26=\"LS\"), \"LUMP\", OFFSET( Combine!BG$9,$AC26 - 1,0,1,1)),\"\"))","v":""},{"$f":"IF( $AC26 = 0, \"\", IF( OFFSET( Combine!BH$9,$AC26 - 1,0,1,1)<>0, IF(OR($AD26=\"LUMP\", $AD26=\"LS\"), \"LUMP\", OFFSET( Combine!BH$9,$AC26 - 1,0,1,1)),\"\"))","v":""},{"$f":"IF( $AC26 = 0, \"\", IF( OFFSET( Combine!BI$9,$AC26 - 1,0,1,1)<>0, IF(OR($AD26=\"LUMP\", $AD26=\"LS\"), \"LUMP\", OFFSET( Combine!BI$9,$AC26 - 1,0,1,1)),\"\"))","v":""},{"$f":"IF( $AC26 = 0, \"\", IF( OFFSET( Combine!BJ$9,$AC26 - 1,0,1,1)<>0, IF(OR($AD26=\"LUMP\", $AD26=\"LS\"), \"LUMP\", OFFSET( Combine!BJ$9,$AC26 - 1,0,1,1)),\"\"))","v":""},{"$f":"IF( $AC26 = 0, \"\", IF( OFFSET( Combine!AP$9,$AC26 - 1,0,1,1)<>0, LEFT(OFFSET( Combine!AP$9,$AC26 - 1,0,1,1),3),\"\"))","v":""},{"$f":"IF( $AC26 = 0, \"\", IF( OFFSET( Combine!AP$9,$AC26 - 1,0,1,1)<>0, IF(LEN(OFFSET( Combine!AP$9,$AC26 - 1,0,1,1))=9,   RIGHT(OFFSET( Combine!AP$9,$AC26 - 1,0,1,1),5),    LEFT(RIGHT(OFFSET( Combine!AP$9,$AC26 - 1,0,1,1),6), 5)      ),\"\"))","v":""},"",{"$f":"IF( $AC26 = 0, \"\", IF( OFFSET( Combine!$AP$9,$AC26 - 1,0,1,1)<>0,IF(OR(AD26=\"LUMP\", AD26=\"LS\"), \"\", AD26),\"\"))","v":""},{"$f":"IF( $AC26 = 0, \"\", IF( OFFSET( Combine!$AP$9,$AC26 - 1,0,1,1)<>0, VLOOKUP( OFFSET( Combine!$AP$9,$AC26 - 1,0,1,1),[1]Items!$A$2:$E$10001,4,0),\"\"))","v":""},null,24,4,0,{"$f":"IF( $AC26 = 0, \"\", IF( OFFSET( Combine!$AP$9,$AC26 - 1,0,1,1)<>0, VLOOKUP( OFFSET( Combine!$AP$9,$AC26 - 1,0,1,1),[1]Items!$A$2:$E$10001,3,0),\"\"))","v":""}]
[{"$f":"IF( $AC27 = 0, \"\", IF( OFFSET( Combine!AQ$9,$AC27 - 1,0,1,1)<>0, IF(OR($AD27=\"LUMP\", $AD27=\"LS\"), \"LUMP\", OFFSET( Combine!AQ$9,$AC27 - 1,0,1,1)),\"\"))","v":""},{"$f":"IF( $AC27 = 0, \"\", IF( OFFSET( Combine!AR$9,$AC27 - 1,0,1,1)<>0, IF(OR($AD27=\"LUMP\", $AD27=\"LS\"), \"LUMP\", OFFSET( Combine!AR$9,$AC27 - 1,0,1,1)),\"\"))","v":""},{"$f":"IF( $AC27 = 0, \"\", IF( OFFSET( Combine!AS$9,$AC27 - 1,0,1,1)<>0, IF(OR($AD27=\"LUMP\", $AD27=\"LS\"), \"LUMP\", OFFSET( Combine!AS$9,$AC27 - 1,0,1,1)),\"\"))","v":""},{"$f":"IF( $AC27 = 0, \"\", IF( OFFSET( Combine!AT$9,$AC27 - 1,0,1,1)<>0, IF(OR($AD27=\"LUMP\", $AD27=\"LS\"), \"LUMP\", OFFSET( Combine!AT$9,$AC27 - 1,0,1,1)),\"\"))","v":""},{"$f":"IF( $AC27 = 0, \"\", IF( OFFSET( Combine!AU$9,$AC27 - 1,0,1,1)<>0, IF(OR($AD27=\"LUMP\", $AD27=\"LS\"), \"LUMP\", OFFSET( Combine!AU$9,$AC27 - 1,0,1,1)),\"\"))","v":""},{"$f":"IF( $AC27 = 0, \"\", IF( OFFSET( Combine!AV$9,$AC27 - 1,0,1,1)<>0, IF(OR($AD27=\"LUMP\", $AD27=\"LS\"), \"LUMP\", OFFSET( Combine!AV$9,$AC27 - 1,0,1,1)),\"\"))","v":""},{"$f":"IF( $AC27 = 0, \"\", IF( OFFSET( Combine!AW$9,$AC27 - 1,0,1,1)<>0, IF(OR($AD27=\"LUMP\", $AD27=\"LS\"), \"LUMP\", OFFSET( Combine!AW$9,$AC27 - 1,0,1,1)),\"\"))","v":""},{"$f":"IF( $AC27 = 0, \"\", IF( OFFSET( Combine!AX$9,$AC27 - 1,0,1,1)<>0, IF(OR($AD27=\"LUMP\", $AD27=\"LS\"), \"LUMP\", OFFSET( Combine!AX$9,$AC27 - 1,0,1,1)),\"\"))","v":""},{"$f":"IF( $AC27 = 0, \"\", IF( OFFSET( Combine!AY$9,$AC27 - 1,0,1,1)<>0, IF(OR($AD27=\"LUMP\", $AD27=\"LS\"), \"LUMP\", OFFSET( Combine!AY$9,$AC27 - 1,0,1,1)),\"\"))","v":""},{"$f":"IF( $AC27 = 0, \"\", IF( OFFSET( Combine!AZ$9,$AC27 - 1,0,1,1)<>0, IF(OR($AD27=\"LUMP\", $AD27=\"LS\"), \"LUMP\", OFFSET( Combine!AZ$9,$AC27 - 1,0,1,1)),\"\"))","v":""},{"$f":"IF( $AC27 = 0, \"\", IF( OFFSET( Combine!BA$9,$AC27 - 1,0,1,1)<>0, IF(OR($AD27=\"LUMP\", $AD27=\"LS\"), \"LUMP\", OFFSET( Combine!BA$9,$AC27 - 1,0,1,1)),\"\"))","v":""},{"$f":"IF( $AC27 = 0, \"\", IF( OFFSET( Combine!BB$9,$AC27 - 1,0,1,1)<>0, IF(OR($AD27=\"LUMP\", $AD27=\"LS\"), \"LUMP\", OFFSET( Combine!BB$9,$AC27 - 1,0,1,1)),\"\"))","v":""},{"$f":"IF( $AC27 = 0, \"\", IF( OFFSET( Combine!BC$9,$AC27 - 1,0,1,1)<>0, IF(OR($AD27=\"LUMP\", $AD27=\"LS\"), \"LUMP\", OFFSET( Combine!BC$9,$AC27 - 1,0,1,1)),\"\"))","v":""},{"$f":"IF( $AC27 = 0, \"\", IF( OFFSET( Combine!BD$9,$AC27 - 1,0,1,1)<>0, IF(OR($AD27=\"LUMP\", $AD27=\"LS\"), \"LUMP\", OFFSET( Combine!BD$9,$AC27 - 1,0,1,1)),\"\"))","v":""},{"$f":"IF( $AC27 = 0, \"\", IF( OFFSET( Combine!BE$9,$AC27 - 1,0,1,1)<>0, IF(OR($AD27=\"LUMP\", $AD27=\"LS\"), \"LUMP\", OFFSET( Combine!BE$9,$AC27 - 1,0,1,1)),\"\"))","v":""},{"$f":"IF( $AC27 = 0, \"\", IF( OFFSET( Combine!BF$9,$AC27 - 1,0,1,1)<>0, IF(OR($AD27=\"LUMP\", $AD27=\"LS\"), \"LUMP\", OFFSET( Combine!BF$9,$AC27 - 1,0,1,1)),\"\"))","v":""},{"$f":"IF( $AC27 = 0, \"\", IF( OFFSET( Combine!BG$9,$AC27 - 1,0,1,1)<>0, IF(OR($AD27=\"LUMP\", $AD27=\"LS\"), \"LUMP\", OFFSET( Combine!BG$9,$AC27 - 1,0,1,1)),\"\"))","v":""},{"$f":"IF( $AC27 = 0, \"\", IF( OFFSET( Combine!BH$9,$AC27 - 1,0,1,1)<>0, IF(OR($AD27=\"LUMP\", $AD27=\"LS\"), \"LUMP\", OFFSET( Combine!BH$9,$AC27 - 1,0,1,1)),\"\"))","v":""},{"$f":"IF( $AC27 = 0, \"\", IF( OFFSET( Combine!BI$9,$AC27 - 1,0,1,1)<>0, IF(OR($AD27=\"LUMP\", $AD27=\"LS\"), \"LUMP\", OFFSET( Combine!BI$9,$AC27 - 1,0,1,1)),\"\"))","v":""},{"$f":"IF( $AC27 = 0, \"\", IF( OFFSET( Combine!BJ$9,$AC27 - 1,0,1,1)<>0, IF(OR($AD27=\"LUMP\", $AD27=\"LS\"), \"LUMP\", OFFSET( Combine!BJ$9,$AC27 - 1,0,1,1)),\"\"))","v":""},{"$f":"IF( $AC27 = 0, \"\", IF( OFFSET( Combine!AP$9,$AC27 - 1,0,1,1)<>0, LEFT(OFFSET( Combine!AP$9,$AC27 - 1,0,1,1),3),\"\"))","v":""},{"$f":"IF( $AC27 = 0, \"\", IF( OFFSET( Combine!AP$9,$AC27 - 1,0,1,1)<>0, IF(LEN(OFFSET( Combine!AP$9,$AC27 - 1,0,1,1))=9,   RIGHT(OFFSET( Combine!AP$9,$AC27 - 1,0,1,1),5),    LEFT(RIGHT(OFFSET( Combine!AP$9,$AC27 - 1,0,1,1),6), 5)      ),\"\"))","v":""},"",{"$f":"IF( $AC27 = 0, \"\", IF( OFFSET( Combine!$AP$9,$AC27 - 1,0,1,1)<>0,IF(OR(AD27=\"LUMP\", AD27=\"LS\"), \"\", AD27),\"\"))","v":""},{"$f":"IF( $AC27 = 0, \"\", IF( OFFSET( Combine!$AP$9,$AC27 - 1,0,1,1)<>0, VLOOKUP( OFFSET( Combine!$AP$9,$AC27 - 1,0,1,1),[1]Items!$A$2:$E$10001,4,0),\"\"))","v":""},null,25,4,21,{"$f":"IF( $AC27 = 0, \"\", IF( OFFSET( Combine!$AP$9,$AC27 - 1,0,1,1)<>0, VLOOKUP( OFFSET( Combine!$AP$9,$AC27 - 1,0,1,1),[1]Items!$A$2:$E$10001,3,0),\"\"))","v":""}]
[{"$f":"IF( $AC28 = 0, \"\", IF( OFFSET( Combine!AQ$9,$AC28 - 1,0,1,1)<>0, IF(OR($AD28=\"LUMP\", $AD28=\"LS\"), \"LUMP\", OFFSET( Combine!AQ$9,$AC28 - 1,0,1,1)),\"\"))","v":""},{"$f":"IF( $AC28 = 0, \"\", IF( OFFSET( Combine!AR$9,$AC28 - 1,0,1,1)<>0, IF(OR($AD28=\"LUMP\", $AD28=\"LS\"), \"LUMP\", OFFSET( Combine!AR$9,$AC28 - 1,0,1,1)),\"\"))","v":""},{"$f":"IF( $AC28 = 0, \"\", IF( OFFSET( Combine!AS$9,$AC28 - 1,0,1,1)<>0, IF(OR($AD28=\"LUMP\", $AD28=\"LS\"), \"LUMP\", OFFSET( Combine!AS$9,$AC28 - 1,0,1,1)),\"\"))","v":""},{"$f":"IF( $AC28 = 0, \"\", IF( OFFSET( Combine!AT$9,$AC28 - 1,0,1,1)<>0, IF(OR($AD28=\"LUMP\", $AD28=\"LS\"), \"LUMP\", OFFSET( Combine!AT$9,$AC28 - 1,0,1,1)),\"\"))","v":""},{"$f":"IF( $AC28 = 0, \"\", IF( OFFSET( Combine!AU$9,$AC28 - 1,0,1,1)<>0, IF(OR($AD28=\"LUMP\", $AD28=\"LS\"), \"LUMP\", OFFSET( Combine!AU$9,$AC28 - 1,0,1,1)),\"\"))","v":""},{"$f":"IF( $AC28 = 0, \"\", IF( OFFSET( Combine!AV$9,$AC28 - 1,0,1,1)<>0, IF(OR($AD28=\"LUMP\", $AD28=\"LS\"), \"LUMP\", OFFSET( Combine!AV$9,$AC28 - 1,0,1,1)),\"\"))","v":""},{"$f":"IF( $AC28 = 0, \"\", IF( OFFSET( Combine!AW$9,$AC28 - 1,0,1,1)<>0, IF(OR($AD28=\"LUMP\", $AD28=\"LS\"), \"LUMP\", OFFSET( Combine!AW$9,$AC28 - 1,0,1,1)),\"\"))","v":""},{"$f":"IF( $AC28 = 0, \"\", IF( OFFSET( Combine!AX$9,$AC28 - 1,0,1,1)<>0, IF(OR($AD28=\"LUMP\", $AD28=\"LS\"), \"LUMP\", OFFSET( Combine!AX$9,$AC28 - 1,0,1,1)),\"\"))","v":""},{"$f":"IF( $AC28 = 0, \"\", IF( OFFSET( Combine!AY$9,$AC28 - 1,0,1,1)<>0, IF(OR($AD28=\"LUMP\", $AD28=\"LS\"), \"LUMP\", OFFSET( Combine!AY$9,$AC28 - 1,0,1,1)),\"\"))","v":""},{"$f":"IF( $AC28 = 0, \"\", IF( OFFSET( Combine!AZ$9,$AC28 - 1,0,1,1)<>0, IF(OR($AD28=\"LUMP\", $AD28=\"LS\"), \"LUMP\", OFFSET( Combine!AZ$9,$AC28 - 1,0,1,1)),\"\"))","v":""},{"$f":"IF( $AC28 = 0, \"\", IF( OFFSET( Combine!BA$9,$AC28 - 1,0,1,1)<>0, IF(OR($AD28=\"LUMP\", $AD28=\"LS\"), \"LUMP\", OFFSET( Combine!BA$9,$AC28 - 1,0,1,1)),\"\"))","v":""},{"$f":"IF( $AC28 = 0, \"\", IF( OFFSET( Combine!BB$9,$AC28 - 1,0,1,1)<>0, IF(OR($AD28=\"LUMP\", $AD28=\"LS\"), \"LUMP\", OFFSET( Combine!BB$9,$AC28 - 1,0,1,1)),\"\"))","v":""},{"$f":"IF( $AC28 = 0, \"\", IF( OFFSET( Combine!BC$9,$AC28 - 1,0,1,1)<>0, IF(OR($AD28=\"LUMP\", $AD28=\"LS\"), \"LUMP\", OFFSET( Combine!BC$9,$AC28 - 1,0,1,1)),\"\"))","v":""},{"$f":"IF( $AC28 = 0, \"\", IF( OFFSET( Combine!BD$9,$AC28 - 1,0,1,1)<>0, IF(OR($AD28=\"LUMP\", $AD28=\"LS\"), \"LUMP\", OFFSET( Combine!BD$9,$AC28 - 1,0,1,1)),\"\"))","v":""},{"$f":"IF( $AC28 = 0, \"\", IF( OFFSET( Combine!BE$9,$AC28 - 1,0,1,1)<>0, IF(OR($AD28=\"LUMP\", $AD28=\"LS\"), \"LUMP\", OFFSET( Combine!BE$9,$AC28 - 1,0,1,1)),\"\"))","v":""},{"$f":"IF( $AC28 = 0, \"\", IF( OFFSET( Combine!BF$9,$AC28 - 1,0,1,1)<>0, IF(OR($AD28=\"LUMP\", $AD28=\"LS\"), \"LUMP\", OFFSET( Combine!BF$9,$AC28 - 1,0,1,1)),\"\"))","v":""},{"$f":"IF( $AC28 = 0, \"\", IF( OFFSET( Combine!BG$9,$AC28 - 1,0,1,1)<>0, IF(OR($AD28=\"LUMP\", $AD28=\"LS\"), \"LUMP\", OFFSET( Combine!BG$9,$AC28 - 1,0,1,1)),\"\"))","v":""},{"$f":"IF( $AC28 = 0, \"\", IF( OFFSET( Combine!BH$9,$AC28 - 1,0,1,1)<>0, IF(OR($AD28=\"LUMP\", $AD28=\"LS\"), \"LUMP\", OFFSET( Combine!BH$9,$AC28 - 1,0,1,1)),\"\"))","v":""},{"$f":"IF( $AC28 = 0, \"\", IF( OFFSET( Combine!BI$9,$AC28 - 1,0,1,1)<>0, IF(OR($AD28=\"LUMP\", $AD28=\"LS\"), \"LUMP\", OFFSET( Combine!BI$9,$AC28 - 1,0,1,1)),\"\"))","v":""},{"$f":"IF( $AC28 = 0, \"\", IF( OFFSET( Combine!BJ$9,$AC28 - 1,0,1,1)<>0, IF(OR($AD28=\"LUMP\", $AD28=\"LS\"), \"LUMP\", OFFSET( Combine!BJ$9,$AC28 - 1,0,1,1)),\"\"))","v":""},{"$f":"IF( $AC28 = 0, \"\", IF( OFFSET( Combine!AP$9,$AC28 - 1,0,1,1)<>0, LEFT(OFFSET( Combine!AP$9,$AC28 - 1,0,1,1),3),\"\"))","v":""},{"$f":"IF( $AC28 = 0, \"\", IF( OFFSET( Combine!AP$9,$AC28 - 1,0,1,1)<>0, IF(LEN(OFFSET( Combine!AP$9,$AC28 - 1,0,1,1))=9,   RIGHT(OFFSET( Combine!AP$9,$AC28 - 1,0,1,1),5),    LEFT(RIGHT(OFFSET( Combine!AP$9,$AC28 - 1,0,1,1),6), 5)      ),\"\"))","v":""},"",{"$f":"IF( $AC28 = 0, \"\", IF( OFFSET( Combine!$AP$9,$AC28 - 1,0,1,1)<>0,IF(OR(AD28=\"LUMP\", AD28=\"LS\"), \"\", AD28),\"\"))","v":""},{"$f":"IF( $AC28 = 0, \"\", IF( OFFSET( Combine!$AP$9,$AC28 - 1,0,1,1)<>0, VLOOKUP( OFFSET( Combine!$AP$9,$AC28 - 1,0,1,1),[1]Items!$A$2:$E$10001,4,0),\"\"))","v":""},null,26,4,22,{"$f":"IF( $AC28 = 0, \"\", IF( OFFSET( Combine!$AP$9,$AC28 - 1,0,1,1)<>0, VLOOKUP( OFFSET( Combine!$AP$9,$AC28 - 1,0,1,1),[1]Items!$A$2:$E$10001,3,0),\"\"))","v":""}]
[{"$f":"IF( $AC29 = 0, \"\", IF( OFFSET( Combine!AQ$9,$AC29 - 1,0,1,1)<>0, IF(OR($AD29=\"LUMP\", $AD29=\"LS\"), \"LUMP\", OFFSET( Combine!AQ$9,$AC29 - 1,0,1,1)),\"\"))","v":""},{"$f":"IF( $AC29 = 0, \"\", IF( OFFSET( Combine!AR$9,$AC29 - 1,0,1,1)<>0, IF(OR($AD29=\"LUMP\", $AD29=\"LS\"), \"LUMP\", OFFSET( Combine!AR$9,$AC29 - 1,0,1,1)),\"\"))","v":""},{"$f":"IF( $AC29 = 0, \"\", IF( OFFSET( Combine!AS$9,$AC29 - 1,0,1,1)<>0, IF(OR($AD29=\"LUMP\", $AD29=\"LS\"), \"LUMP\", OFFSET( Combine!AS$9,$AC29 - 1,0,1,1)),\"\"))","v":""},{"$f":"IF( $AC29 = 0, \"\", IF( OFFSET( Combine!AT$9,$AC29 - 1,0,1,1)<>0, IF(OR($AD29=\"LUMP\", $AD29=\"LS\"), \"LUMP\", OFFSET( Combine!AT$9,$AC29 - 1,0,1,1)),\"\"))","v":""},{"$f":"IF( $AC29 = 0, \"\", IF( OFFSET( Combine!AU$9,$AC29 - 1,0,1,1)<>0, IF(OR($AD29=\"LUMP\", $AD29=\"LS\"), \"LUMP\", OFFSET( Combine!AU$9,$AC29 - 1,0,1,1)),\"\"))","v":""},{"$f":"IF( $AC29 = 0, \"\", IF( OFFSET( Combine!AV$9,$AC29 - 1,0,1,1)<>0, IF(OR($AD29=\"LUMP\", $AD29=\"LS\"), \"LUMP\", OFFSET( Combine!AV$9,$AC29 - 1,0,1,1)),\"\"))","v":""},{"$f":"IF( $AC29 = 0, \"\", IF( OFFSET( Combine!AW$9,$AC29 - 1,0,1,1)<>0, IF(OR($AD29=\"LUMP\", $AD29=\"LS\"), \"LUMP\", OFFSET( Combine!AW$9,$AC29 - 1,0,1,1)),\"\"))","v":""},{"$f":"IF( $AC29 = 0, \"\", IF( OFFSET( Combine!AX$9,$AC29 - 1,0,1,1)<>0, IF(OR($AD29=\"LUMP\", $AD29=\"LS\"), \"LUMP\", OFFSET( Combine!AX$9,$AC29 - 1,0,1,1)),\"\"))","v":""},{"$f":"IF( $AC29 = 0, \"\", IF( OFFSET( Combine!AY$9,$AC29 - 1,0,1,1)<>0, IF(OR($AD29=\"LUMP\", $AD29=\"LS\"), \"LUMP\", OFFSET( Combine!AY$9,$AC29 - 1,0,1,1)),\"\"))","v":""},{"$f":"IF( $AC29 = 0, \"\", IF( OFFSET( Combine!AZ$9,$AC29 - 1,0,1,1)<>0, IF(OR($AD29=\"LUMP\", $AD29=\"LS\"), \"LUMP\", OFFSET( Combine!AZ$9,$AC29 - 1,0,1,1)),\"\"))","v":""},{"$f":"IF( $AC29 = 0, \"\", IF( OFFSET( Combine!BA$9,$AC29 - 1,0,1,1)<>0, IF(OR($AD29=\"LUMP\", $AD29=\"LS\"), \"LUMP\", OFFSET( Combine!BA$9,$AC29 - 1,0,1,1)),\"\"))","v":""},{"$f":"IF( $AC29 = 0, \"\", IF( OFFSET( Combine!BB$9,$AC29 - 1,0,1,1)<>0, IF(OR($AD29=\"LUMP\", $AD29=\"LS\"), \"LUMP\", OFFSET( Combine!BB$9,$AC29 - 1,0,1,1)),\"\"))","v":""},{"$f":"IF( $AC29 = 0, \"\", IF( OFFSET( Combine!BC$9,$AC29 - 1,0,1,1)<>0, IF(OR($AD29=\"LUMP\", $AD29=\"LS\"), \"LUMP\", OFFSET( Combine!BC$9,$AC29 - 1,0,1,1)),\"\"))","v":""},{"$f":"IF( $AC29 = 0, \"\", IF( OFFSET( Combine!BD$9,$AC29 - 1,0,1,1)<>0, IF(OR($AD29=\"LUMP\", $AD29=\"LS\"), \"LUMP\", OFFSET( Combine!BD$9,$AC29 - 1,0,1,1)),\"\"))","v":""},{"$f":"IF( $AC29 = 0, \"\", IF( OFFSET( Combine!BE$9,$AC29 - 1,0,1,1)<>0, IF(OR($AD29=\"LUMP\", $AD29=\"LS\"), \"LUMP\", OFFSET( Combine!BE$9,$AC29 - 1,0,1,1)),\"\"))","v":""},{"$f":"IF( $AC29 = 0, \"\", IF( OFFSET( Combine!BF$9,$AC29 - 1,0,1,1)<>0, IF(OR($AD29=\"LUMP\", $AD29=\"LS\"), \"LUMP\", OFFSET( Combine!BF$9,$AC29 - 1,0,1,1)),\"\"))","v":""},{"$f":"IF( $AC29 = 0, \"\", IF( OFFSET( Combine!BG$9,$AC29 - 1,0,1,1)<>0, IF(OR($AD29=\"LUMP\", $AD29=\"LS\"), \"LUMP\", OFFSET( Combine!BG$9,$AC29 - 1,0,1,1)),\"\"))","v":""},{"$f":"IF( $AC29 = 0, \"\", IF( OFFSET( Combine!BH$9,$AC29 - 1,0,1,1)<>0, IF(OR($AD29=\"LUMP\", $AD29=\"LS\"), \"LUMP\", OFFSET( Combine!BH$9,$AC29 - 1,0,1,1)),\"\"))","v":""},{"$f":"IF( $AC29 = 0, \"\", IF( OFFSET( Combine!BI$9,$AC29 - 1,0,1,1)<>0, IF(OR($AD29=\"LUMP\", $AD29=\"LS\"), \"LUMP\", OFFSET( Combine!BI$9,$AC29 - 1,0,1,1)),\"\"))","v":""},{"$f":"IF( $AC29 = 0, \"\", IF( OFFSET( Combine!BJ$9,$AC29 - 1,0,1,1)<>0, IF(OR($AD29=\"LUMP\", $AD29=\"LS\"), \"LUMP\", OFFSET( Combine!BJ$9,$AC29 - 1,0,1,1)),\"\"))","v":""},{"$f":"IF( $AC29 = 0, \"\", IF( OFFSET( Combine!AP$9,$AC29 - 1,0,1,1)<>0, LEFT(OFFSET( Combine!AP$9,$AC29 - 1,0,1,1),3),\"\"))","v":""},{"$f":"IF( $AC29 = 0, \"\", IF( OFFSET( Combine!AP$9,$AC29 - 1,0,1,1)<>0, IF(LEN(OFFSET( Combine!AP$9,$AC29 - 1,0,1,1))=9,   RIGHT(OFFSET( Combine!AP$9,$AC29 - 1,0,1,1),5),    LEFT(RIGHT(OFFSET( Combine!AP$9,$AC29 - 1,0,1,1),6), 5)      ),\"\"))","v":""},"",{"$f":"IF( $AC29 = 0, \"\", IF( OFFSET( Combine!$AP$9,$AC29 - 1,0,1,1)<>0,IF(OR(AD29=\"LUMP\", AD29=\"LS\"), \"\", AD29),\"\"))","v":""},{"$f":"IF( $AC29 = 0, \"\", IF( OFFSET( Combine!$AP$9,$AC29 - 1,0,1,1)<>0, VLOOKUP( OFFSET( Combine!$AP$9,$AC29 - 1,0,1,1),[1]Items!$A$2:$E$10001,4,0),\"\"))","v":""},null,27,4,23,{"$f":"IF( $AC29 = 0, \"\", IF( OFFSET( Combine!$AP$9,$AC29 - 1,0,1,1)<>0, VLOOKUP( OFFSET( Combine!$AP$9,$AC29 - 1,0,1,1),[1]Items!$A$2:$E$10001,3,0),\"\"))","v":""}]
[{"$f":"IF( $AC30 = 0, \"\", IF( OFFSET( Combine!AQ$9,$AC30 - 1,0,1,1)<>0, IF(OR($AD30=\"LUMP\", $AD30=\"LS\"), \"LUMP\", OFFSET( Combine!AQ$9,$AC30 - 1,0,1,1)),\"\"))","v":""},{"$f":"IF( $AC30 = 0, \"\", IF( OFFSET( Combine!AR$9,$AC30 - 1,0,1,1)<>0, IF(OR($AD30=\"LUMP\", $AD30=\"LS\"), \"LUMP\", OFFSET( Combine!AR$9,$AC30 - 1,0,1,1)),\"\"))","v":""},{"$f":"IF( $AC30 = 0, \"\", IF( OFFSET( Combine!AS$9,$AC30 - 1,0,1,1)<>0, IF(OR($AD30=\"LUMP\", $AD30=\"LS\"), \"LUMP\", OFFSET( Combine!AS$9,$AC30 - 1,0,1,1)),\"\"))","v":""},{"$f":"IF( $AC30 = 0, \"\", IF( OFFSET( Combine!AT$9,$AC30 - 1,0,1,1)<>0, IF(OR($AD30=\"LUMP\", $AD30=\"LS\"), \"LUMP\", OFFSET( Combine!AT$9,$AC30 - 1,0,1,1)),\"\"))","v":""},{"$f":"IF( $AC30 = 0, \"\", IF( OFFSET( Combine!AU$9,$AC30 - 1,0,1,1)<>0, IF(OR($AD30=\"LUMP\", $AD30=\"LS\"), \"LUMP\", OFFSET( Combine!AU$9,$AC30 - 1,0,1,1)),\"\"))","v":""},{"$f":"IF( $AC30 = 0, \"\", IF( OFFSET( Combine!AV$9,$AC30 - 1,0,1,1)<>0, IF(OR($AD30=\"LUMP\", $AD30=\"LS\"), \"LUMP\", OFFSET( Combine!AV$9,$AC30 - 1,0,1,1)),\"\"))","v":""},{"$f":"IF( $AC30 = 0, \"\", IF( OFFSET( Combine!AW$9,$AC30 - 1,0,1,1)<>0, IF(OR($AD30=\"LUMP\", $AD30=\"LS\"), \"LUMP\", OFFSET( Combine!AW$9,$AC30 - 1,0,1,1)),\"\"))","v":""},{"$f":"IF( $AC30 = 0, \"\", IF( OFFSET( Combine!AX$9,$AC30 - 1,0,1,1)<>0, IF(OR($AD30=\"LUMP\", $AD30=\"LS\"), \"LUMP\", OFFSET( Combine!AX$9,$AC30 - 1,0,1,1)),\"\"))","v":""},{"$f":"IF( $AC30 = 0, \"\", IF( OFFSET( Combine!AY$9,$AC30 - 1,0,1,1)<>0, IF(OR($AD30=\"LUMP\", $AD30=\"LS\"), \"LUMP\", OFFSET( Combine!AY$9,$AC30 - 1,0,1,1)),\"\"))","v":""},{"$f":"IF( $AC30 = 0, \"\", IF( OFFSET( Combine!AZ$9,$AC30 - 1,0,1,1)<>0, IF(OR($AD30=\"LUMP\", $AD30=\"LS\"), \"LUMP\", OFFSET( Combine!AZ$9,$AC30 - 1,0,1,1)),\"\"))","v":""},{"$f":"IF( $AC30 = 0, \"\", IF( OFFSET( Combine!BA$9,$AC30 - 1,0,1,1)<>0, IF(OR($AD30=\"LUMP\", $AD30=\"LS\"), \"LUMP\", OFFSET( Combine!BA$9,$AC30 - 1,0,1,1)),\"\"))","v":""},{"$f":"IF( $AC30 = 0, \"\", IF( OFFSET( Combine!BB$9,$AC30 - 1,0,1,1)<>0, IF(OR($AD30=\"LUMP\", $AD30=\"LS\"), \"LUMP\", OFFSET( Combine!BB$9,$AC30 - 1,0,1,1)),\"\"))","v":""},{"$f":"IF( $AC30 = 0, \"\", IF( OFFSET( Combine!BC$9,$AC30 - 1,0,1,1)<>0, IF(OR($AD30=\"LUMP\", $AD30=\"LS\"), \"LUMP\", OFFSET( Combine!BC$9,$AC30 - 1,0,1,1)),\"\"))","v":""},{"$f":"IF( $AC30 = 0, \"\", IF( OFFSET( Combine!BD$9,$AC30 - 1,0,1,1)<>0, IF(OR($AD30=\"LUMP\", $AD30=\"LS\"), \"LUMP\", OFFSET( Combine!BD$9,$AC30 - 1,0,1,1)),\"\"))","v":""},{"$f":"IF( $AC30 = 0, \"\", IF( OFFSET( Combine!BE$9,$AC30 - 1,0,1,1)<>0, IF(OR($AD30=\"LUMP\", $AD30=\"LS\"), \"LUMP\", OFFSET( Combine!BE$9,$AC30 - 1,0,1,1)),\"\"))","v":""},{"$f":"IF( $AC30 = 0, \"\", IF( OFFSET( Combine!BF$9,$AC30 - 1,0,1,1)<>0, IF(OR($AD30=\"LUMP\", $AD30=\"LS\"), \"LUMP\", OFFSET( Combine!BF$9,$AC30 - 1,0,1,1)),\"\"))","v":""},{"$f":"IF( $AC30 = 0, \"\", IF( OFFSET( Combine!BG$9,$AC30 - 1,0,1,1)<>0, IF(OR($AD30=\"LUMP\", $AD30=\"LS\"), \"LUMP\", OFFSET( Combine!BG$9,$AC30 - 1,0,1,1)),\"\"))","v":""},{"$f":"IF( $AC30 = 0, \"\", IF( OFFSET( Combine!BH$9,$AC30 - 1,0,1,1)<>0, IF(OR($AD30=\"LUMP\", $AD30=\"LS\"), \"LUMP\", OFFSET( Combine!BH$9,$AC30 - 1,0,1,1)),\"\"))","v":""},{"$f":"IF( $AC30 = 0, \"\", IF( OFFSET( Combine!BI$9,$AC30 - 1,0,1,1)<>0, IF(OR($AD30=\"LUMP\", $AD30=\"LS\"), \"LUMP\", OFFSET( Combine!BI$9,$AC30 - 1,0,1,1)),\"\"))","v":""},{"$f":"IF( $AC30 = 0, \"\", IF( OFFSET( Combine!BJ$9,$AC30 - 1,0,1,1)<>0, IF(OR($AD30=\"LUMP\", $AD30=\"LS\"), \"LUMP\", OFFSET( Combine!BJ$9,$AC30 - 1,0,1,1)),\"\"))","v":""},{"$f":"IF( $AC30 = 0, \"\", IF( OFFSET( Combine!AP$9,$AC30 - 1,0,1,1)<>0, LEFT(OFFSET( Combine!AP$9,$AC30 - 1,0,1,1),3),\"\"))","v":""},{"$f":"IF( $AC30 = 0, \"\", IF( OFFSET( Combine!AP$9,$AC30 - 1,0,1,1)<>0, IF(LEN(OFFSET( Combine!AP$9,$AC30 - 1,0,1,1))=9,   RIGHT(OFFSET( Combine!AP$9,$AC30 - 1,0,1,1),5),    LEFT(RIGHT(OFFSET( Combine!AP$9,$AC30 - 1,0,1,1),6), 5)      ),\"\"))","v":""},"",{"$f":"IF( $AC30 = 0, \"\", IF( OFFSET( Combine!$AP$9,$AC30 - 1,0,1,1)<>0,IF(OR(AD30=\"LUMP\", AD30=\"LS\"), \"\", AD30),\"\"))","v":""},{"$f":"IF( $AC30 = 0, \"\", IF( OFFSET( Combine!$AP$9,$AC30 - 1,0,1,1)<>0, VLOOKUP( OFFSET( Combine!$AP$9,$AC30 - 1,0,1,1),[1]Items!$A$2:$E$10001,4,0),\"\"))","v":""},null,28,4,24,{"$f":"IF( $AC30 = 0, \"\", IF( OFFSET( Combine!$AP$9,$AC30 - 1,0,1,1)<>0, VLOOKUP( OFFSET( Combine!$AP$9,$AC30 - 1,0,1,1),[1]Items!$A$2:$E$10001,3,0),\"\"))","v":""}]
[{"$f":"IF( $AC31 = 0, \"\", IF( OFFSET( Combine!AQ$9,$AC31 - 1,0,1,1)<>0, IF(OR($AD31=\"LUMP\", $AD31=\"LS\"), \"LUMP\", OFFSET( Combine!AQ$9,$AC31 - 1,0,1,1)),\"\"))","v":""},{"$f":"IF( $AC31 = 0, \"\", IF( OFFSET( Combine!AR$9,$AC31 - 1,0,1,1)<>0, IF(OR($AD31=\"LUMP\", $AD31=\"LS\"), \"LUMP\", OFFSET( Combine!AR$9,$AC31 - 1,0,1,1)),\"\"))","v":""},{"$f":"IF( $AC31 = 0, \"\", IF( OFFSET( Combine!AS$9,$AC31 - 1,0,1,1)<>0, IF(OR($AD31=\"LUMP\", $AD31=\"LS\"), \"LUMP\", OFFSET( Combine!AS$9,$AC31 - 1,0,1,1)),\"\"))","v":""},{"$f":"IF( $AC31 = 0, \"\", IF( OFFSET( Combine!AT$9,$AC31 - 1,0,1,1)<>0, IF(OR($AD31=\"LUMP\", $AD31=\"LS\"), \"LUMP\", OFFSET( Combine!AT$9,$AC31 - 1,0,1,1)),\"\"))","v":""},{"$f":"IF( $AC31 = 0, \"\", IF( OFFSET( Combine!AU$9,$AC31 - 1,0,1,1)<>0, IF(OR($AD31=\"LUMP\", $AD31=\"LS\"), \"LUMP\", OFFSET( Combine!AU$9,$AC31 - 1,0,1,1)),\"\"))","v":""},{"$f":"IF( $AC31 = 0, \"\", IF( OFFSET( Combine!AV$9,$AC31 - 1,0,1,1)<>0, IF(OR($AD31=\"LUMP\", $AD31=\"LS\"), \"LUMP\", OFFSET( Combine!AV$9,$AC31 - 1,0,1,1)),\"\"))","v":""},{"$f":"IF( $AC31 = 0, \"\", IF( OFFSET( Combine!AW$9,$AC31 - 1,0,1,1)<>0, IF(OR($AD31=\"LUMP\", $AD31=\"LS\"), \"LUMP\", OFFSET( Combine!AW$9,$AC31 - 1,0,1,1)),\"\"))","v":""},{"$f":"IF( $AC31 = 0, \"\", IF( OFFSET( Combine!AX$9,$AC31 - 1,0,1,1)<>0, IF(OR($AD31=\"LUMP\", $AD31=\"LS\"), \"LUMP\", OFFSET( Combine!AX$9,$AC31 - 1,0,1,1)),\"\"))","v":""},{"$f":"IF( $AC31 = 0, \"\", IF( OFFSET( Combine!AY$9,$AC31 - 1,0,1,1)<>0, IF(OR($AD31=\"LUMP\", $AD31=\"LS\"), \"LUMP\", OFFSET( Combine!AY$9,$AC31 - 1,0,1,1)),\"\"))","v":""},{"$f":"IF( $AC31 = 0, \"\", IF( OFFSET( Combine!AZ$9,$AC31 - 1,0,1,1)<>0, IF(OR($AD31=\"LUMP\", $AD31=\"LS\"), \"LUMP\", OFFSET( Combine!AZ$9,$AC31 - 1,0,1,1)),\"\"))","v":""},{"$f":"IF( $AC31 = 0, \"\", IF( OFFSET( Combine!BA$9,$AC31 - 1,0,1,1)<>0, IF(OR($AD31=\"LUMP\", $AD31=\"LS\"), \"LUMP\", OFFSET( Combine!BA$9,$AC31 - 1,0,1,1)),\"\"))","v":""},{"$f":"IF( $AC31 = 0, \"\", IF( OFFSET( Combine!BB$9,$AC31 - 1,0,1,1)<>0, IF(OR($AD31=\"LUMP\", $AD31=\"LS\"), \"LUMP\", OFFSET( Combine!BB$9,$AC31 - 1,0,1,1)),\"\"))","v":""},{"$f":"IF( $AC31 = 0, \"\", IF( OFFSET( Combine!BC$9,$AC31 - 1,0,1,1)<>0, IF(OR($AD31=\"LUMP\", $AD31=\"LS\"), \"LUMP\", OFFSET( Combine!BC$9,$AC31 - 1,0,1,1)),\"\"))","v":""},{"$f":"IF( $AC31 = 0, \"\", IF( OFFSET( Combine!BD$9,$AC31 - 1,0,1,1)<>0, IF(OR($AD31=\"LUMP\", $AD31=\"LS\"), \"LUMP\", OFFSET( Combine!BD$9,$AC31 - 1,0,1,1)),\"\"))","v":""},{"$f":"IF( $AC31 = 0, \"\", IF( OFFSET( Combine!BE$9,$AC31 - 1,0,1,1)<>0, IF(OR($AD31=\"LUMP\", $AD31=\"LS\"), \"LUMP\", OFFSET( Combine!BE$9,$AC31 - 1,0,1,1)),\"\"))","v":""},{"$f":"IF( $AC31 = 0, \"\", IF( OFFSET( Combine!BF$9,$AC31 - 1,0,1,1)<>0, IF(OR($AD31=\"LUMP\", $AD31=\"LS\"), \"LUMP\", OFFSET( Combine!BF$9,$AC31 - 1,0,1,1)),\"\"))","v":""},{"$f":"IF( $AC31 = 0, \"\", IF( OFFSET( Combine!BG$9,$AC31 - 1,0,1,1)<>0, IF(OR($AD31=\"LUMP\", $AD31=\"LS\"), \"LUMP\", OFFSET( Combine!BG$9,$AC31 - 1,0,1,1)),\"\"))","v":""},{"$f":"IF( $AC31 = 0, \"\", IF( OFFSET( Combine!BH$9,$AC31 - 1,0,1,1)<>0, IF(OR($AD31=\"LUMP\", $AD31=\"LS\"), \"LUMP\", OFFSET( Combine!BH$9,$AC31 - 1,0,1,1)),\"\"))","v":""},{"$f":"IF( $AC31 = 0, \"\", IF( OFFSET( Combine!BI$9,$AC31 - 1,0,1,1)<>0, IF(OR($AD31=\"LUMP\", $AD31=\"LS\"), \"LUMP\", OFFSET( Combine!BI$9,$AC31 - 1,0,1,1)),\"\"))","v":""},{"$f":"IF( $AC31 = 0, \"\", IF( OFFSET( Combine!BJ$9,$AC31 - 1,0,1,1)<>0, IF(OR($AD31=\"LUMP\", $AD31=\"LS\"), \"LUMP\", OFFSET( Combine!BJ$9,$AC31 - 1,0,1,1)),\"\"))","v":""},{"$f":"IF( $AC31 = 0, \"\", IF( OFFSET( Combine!AP$9,$AC31 - 1,0,1,1)<>0, LEFT(OFFSET( Combine!AP$9,$AC31 - 1,0,1,1),3),\"\"))","v":""},{"$f":"IF( $AC31 = 0, \"\", IF( OFFSET( Combine!AP$9,$AC31 - 1,0,1,1)<>0, IF(LEN(OFFSET( Combine!AP$9,$AC31 - 1,0,1,1))=9,   RIGHT(OFFSET( Combine!AP$9,$AC31 - 1,0,1,1),5),    LEFT(RIGHT(OFFSET( Combine!AP$9,$AC31 - 1,0,1,1),6), 5)      ),\"\"))","v":""},"",{"$f":"IF( $AC31 = 0, \"\", IF( OFFSET( Combine!$AP$9,$AC31 - 1,0,1,1)<>0,IF(OR(AD31=\"LUMP\", AD31=\"LS\"), \"\", AD31),\"\"))","v":""},{"$f":"IF( $AC31 = 0, \"\", IF( OFFSET( Combine!$AP$9,$AC31 - 1,0,1,1)<>0, VLOOKUP( OFFSET( Combine!$AP$9,$AC31 - 1,0,1,1),[1]Items!$A$2:$E$10001,4,0),\"\"))","v":""},null,29,4,25,{"$f":"IF( $AC31 = 0, \"\", IF( OFFSET( Combine!$AP$9,$AC31 - 1,0,1,1)<>0, VLOOKUP( OFFSET( Combine!$AP$9,$AC31 - 1,0,1,1),[1]Items!$A$2:$E$10001,3,0),\"\"))","v":""}]
[{"$f":"IF( $AC32 = 0, \"\", IF( OFFSET( Combine!AQ$9,$AC32 - 1,0,1,1)<>0, IF(OR($AD32=\"LUMP\", $AD32=\"LS\"), \"LUMP\", OFFSET( Combine!AQ$9,$AC32 - 1,0,1,1)),\"\"))","v":""},{"$f":"IF( $AC32 = 0, \"\", IF( OFFSET( Combine!AR$9,$AC32 - 1,0,1,1)<>0, IF(OR($AD32=\"LUMP\", $AD32=\"LS\"), \"LUMP\", OFFSET( Combine!AR$9,$AC32 - 1,0,1,1)),\"\"))","v":""},{"$f":"IF( $AC32 = 0, \"\", IF( OFFSET( Combine!AS$9,$AC32 - 1,0,1,1)<>0, IF(OR($AD32=\"LUMP\", $AD32=\"LS\"), \"LUMP\", OFFSET( Combine!AS$9,$AC32 - 1,0,1,1)),\"\"))","v":""},{"$f":"IF( $AC32 = 0, \"\", IF( OFFSET( Combine!AT$9,$AC32 - 1,0,1,1)<>0, IF(OR($AD32=\"LUMP\", $AD32=\"LS\"), \"LUMP\", OFFSET( Combine!AT$9,$AC32 - 1,0,1,1)),\"\"))","v":""},{"$f":"IF( $AC32 = 0, \"\", IF( OFFSET( Combine!AU$9,$AC32 - 1,0,1,1)<>0, IF(OR($AD32=\"LUMP\", $AD32=\"LS\"), \"LUMP\", OFFSET( Combine!AU$9,$AC32 - 1,0,1,1)),\"\"))","v":""},{"$f":"IF( $AC32 = 0, \"\", IF( OFFSET( Combine!AV$9,$AC32 - 1,0,1,1)<>0, IF(OR($AD32=\"LUMP\", $AD32=\"LS\"), \"LUMP\", OFFSET( Combine!AV$9,$AC32 - 1,0,1,1)),\"\"))","v":""},{"$f":"IF( $AC32 = 0, \"\", IF( OFFSET( Combine!AW$9,$AC32 - 1,0,1,1)<>0, IF(OR($AD32=\"LUMP\", $AD32=\"LS\"), \"LUMP\", OFFSET( Combine!AW$9,$AC32 - 1,0,1,1)),\"\"))","v":""},{"$f":"IF( $AC32 = 0, \"\", IF( OFFSET( Combine!AX$9,$AC32 - 1,0,1,1)<>0, IF(OR($AD32=\"LUMP\", $AD32=\"LS\"), \"LUMP\", OFFSET( Combine!AX$9,$AC32 - 1,0,1,1)),\"\"))","v":""},{"$f":"IF( $AC32 = 0, \"\", IF( OFFSET( Combine!AY$9,$AC32 - 1,0,1,1)<>0, IF(OR($AD32=\"LUMP\", $AD32=\"LS\"), \"LUMP\", OFFSET( Combine!AY$9,$AC32 - 1,0,1,1)),\"\"))","v":""},{"$f":"IF( $AC32 = 0, \"\", IF( OFFSET( Combine!AZ$9,$AC32 - 1,0,1,1)<>0, IF(OR($AD32=\"LUMP\", $AD32=\"LS\"), \"LUMP\", OFFSET( Combine!AZ$9,$AC32 - 1,0,1,1)),\"\"))","v":""},{"$f":"IF( $AC32 = 0, \"\", IF( OFFSET( Combine!BA$9,$AC32 - 1,0,1,1)<>0, IF(OR($AD32=\"LUMP\", $AD32=\"LS\"), \"LUMP\", OFFSET( Combine!BA$9,$AC32 - 1,0,1,1)),\"\"))","v":""},{"$f":"IF( $AC32 = 0, \"\", IF( OFFSET( Combine!BB$9,$AC32 - 1,0,1,1)<>0, IF(OR($AD32=\"LUMP\", $AD32=\"LS\"), \"LUMP\", OFFSET( Combine!BB$9,$AC32 - 1,0,1,1)),\"\"))","v":""},{"$f":"IF( $AC32 = 0, \"\", IF( OFFSET( Combine!BC$9,$AC32 - 1,0,1,1)<>0, IF(OR($AD32=\"LUMP\", $AD32=\"LS\"), \"LUMP\", OFFSET( Combine!BC$9,$AC32 - 1,0,1,1)),\"\"))","v":""},{"$f":"IF( $AC32 = 0, \"\", IF( OFFSET( Combine!BD$9,$AC32 - 1,0,1,1)<>0, IF(OR($AD32=\"LUMP\", $AD32=\"LS\"), \"LUMP\", OFFSET( Combine!BD$9,$AC32 - 1,0,1,1)),\"\"))","v":""},{"$f":"IF( $AC32 = 0, \"\", IF( OFFSET( Combine!BE$9,$AC32 - 1,0,1,1)<>0, IF(OR($AD32=\"LUMP\", $AD32=\"LS\"), \"LUMP\", OFFSET( Combine!BE$9,$AC32 - 1,0,1,1)),\"\"))","v":""},{"$f":"IF( $AC32 = 0, \"\", IF( OFFSET( Combine!BF$9,$AC32 - 1,0,1,1)<>0, IF(OR($AD32=\"LUMP\", $AD32=\"LS\"), \"LUMP\", OFFSET( Combine!BF$9,$AC32 - 1,0,1,1)),\"\"))","v":""},{"$f":"IF( $AC32 = 0, \"\", IF( OFFSET( Combine!BG$9,$AC32 - 1,0,1,1)<>0, IF(OR($AD32=\"LUMP\", $AD32=\"LS\"), \"LUMP\", OFFSET( Combine!BG$9,$AC32 - 1,0,1,1)),\"\"))","v":""},{"$f":"IF( $AC32 = 0, \"\", IF( OFFSET( Combine!BH$9,$AC32 - 1,0,1,1)<>0, IF(OR($AD32=\"LUMP\", $AD32=\"LS\"), \"LUMP\", OFFSET( Combine!BH$9,$AC32 - 1,0,1,1)),\"\"))","v":""},{"$f":"IF( $AC32 = 0, \"\", IF( OFFSET( Combine!BI$9,$AC32 - 1,0,1,1)<>0, IF(OR($AD32=\"LUMP\", $AD32=\"LS\"), \"LUMP\", OFFSET( Combine!BI$9,$AC32 - 1,0,1,1)),\"\"))","v":""},{"$f":"IF( $AC32 = 0, \"\", IF( OFFSET( Combine!BJ$9,$AC32 - 1,0,1,1)<>0, IF(OR($AD32=\"LUMP\", $AD32=\"LS\"), \"LUMP\", OFFSET( Combine!BJ$9,$AC32 - 1,0,1,1)),\"\"))","v":""},{"$f":"IF( $AC32 = 0, \"\", IF( OFFSET( Combine!AP$9,$AC32 - 1,0,1,1)<>0, LEFT(OFFSET( Combine!AP$9,$AC32 - 1,0,1,1),3),\"\"))","v":""},{"$f":"IF( $AC32 = 0, \"\", IF( OFFSET( Combine!AP$9,$AC32 - 1,0,1,1)<>0, IF(LEN(OFFSET( Combine!AP$9,$AC32 - 1,0,1,1))=9,   RIGHT(OFFSET( Combine!AP$9,$AC32 - 1,0,1,1),5),    LEFT(RIGHT(OFFSET( Combine!AP$9,$AC32 - 1,0,1,1),6), 5)      ),\"\"))","v":""},"",{"$f":"IF( $AC32 = 0, \"\", IF( OFFSET( Combine!$AP$9,$AC32 - 1,0,1,1)<>0,IF(OR(AD32=\"LUMP\", AD32=\"LS\"), \"\", AD32),\"\"))","v":""},{"$f":"IF( $AC32 = 0, \"\", IF( OFFSET( Combine!$AP$9,$AC32 - 1,0,1,1)<>0, VLOOKUP( OFFSET( Combine!$AP$9,$AC32 - 1,0,1,1),[1]Items!$A$2:$E$10001,4,0),\"\"))","v":""},null,30,5,0,{"$f":"IF( $AC32 = 0, \"\", IF( OFFSET( Combine!$AP$9,$AC32 - 1,0,1,1)<>0, VLOOKUP( OFFSET( Combine!$AP$9,$AC32 - 1,0,1,1),[1]Items!$A$2:$E$10001,3,0),\"\"))","v":""}]
[{"$f":"IF( $AC33 = 0, \"\", IF( OFFSET( Combine!AQ$9,$AC33 - 1,0,1,1)<>0, IF(OR($AD33=\"LUMP\", $AD33=\"LS\"), \"LUMP\", OFFSET( Combine!AQ$9,$AC33 - 1,0,1,1)),\"\"))","v":""},{"$f":"IF( $AC33 = 0, \"\", IF( OFFSET( Combine!AR$9,$AC33 - 1,0,1,1)<>0, IF(OR($AD33=\"LUMP\", $AD33=\"LS\"), \"LUMP\", OFFSET( Combine!AR$9,$AC33 - 1,0,1,1)),\"\"))","v":""},{"$f":"IF( $AC33 = 0, \"\", IF( OFFSET( Combine!AS$9,$AC33 - 1,0,1,1)<>0, IF(OR($AD33=\"LUMP\", $AD33=\"LS\"), \"LUMP\", OFFSET( Combine!AS$9,$AC33 - 1,0,1,1)),\"\"))","v":""},{"$f":"IF( $AC33 = 0, \"\", IF( OFFSET( Combine!AT$9,$AC33 - 1,0,1,1)<>0, IF(OR($AD33=\"LUMP\", $AD33=\"LS\"), \"LUMP\", OFFSET( Combine!AT$9,$AC33 - 1,0,1,1)),\"\"))","v":""},{"$f":"IF( $AC33 = 0, \"\", IF( OFFSET( Combine!AU$9,$AC33 - 1,0,1,1)<>0, IF(OR($AD33=\"LUMP\", $AD33=\"LS\"), \"LUMP\", OFFSET( Combine!AU$9,$AC33 - 1,0,1,1)),\"\"))","v":""},{"$f":"IF( $AC33 = 0, \"\", IF( OFFSET( Combine!AV$9,$AC33 - 1,0,1,1)<>0, IF(OR($AD33=\"LUMP\", $AD33=\"LS\"), \"LUMP\", OFFSET( Combine!AV$9,$AC33 - 1,0,1,1)),\"\"))","v":""},{"$f":"IF( $AC33 = 0, \"\", IF( OFFSET( Combine!AW$9,$AC33 - 1,0,1,1)<>0, IF(OR($AD33=\"LUMP\", $AD33=\"LS\"), \"LUMP\", OFFSET( Combine!AW$9,$AC33 - 1,0,1,1)),\"\"))","v":""},{"$f":"IF( $AC33 = 0, \"\", IF( OFFSET( Combine!AX$9,$AC33 - 1,0,1,1)<>0, IF(OR($AD33=\"LUMP\", $AD33=\"LS\"), \"LUMP\", OFFSET( Combine!AX$9,$AC33 - 1,0,1,1)),\"\"))","v":""},{"$f":"IF( $AC33 = 0, \"\", IF( OFFSET( Combine!AY$9,$AC33 - 1,0,1,1)<>0, IF(OR($AD33=\"LUMP\", $AD33=\"LS\"), \"LUMP\", OFFSET( Combine!AY$9,$AC33 - 1,0,1,1)),\"\"))","v":""},{"$f":"IF( $AC33 = 0, \"\", IF( OFFSET( Combine!AZ$9,$AC33 - 1,0,1,1)<>0, IF(OR($AD33=\"LUMP\", $AD33=\"LS\"), \"LUMP\", OFFSET( Combine!AZ$9,$AC33 - 1,0,1,1)),\"\"))","v":""},{"$f":"IF( $AC33 = 0, \"\", IF( OFFSET( Combine!BA$9,$AC33 - 1,0,1,1)<>0, IF(OR($AD33=\"LUMP\", $AD33=\"LS\"), \"LUMP\", OFFSET( Combine!BA$9,$AC33 - 1,0,1,1)),\"\"))","v":""},{"$f":"IF( $AC33 = 0, \"\", IF( OFFSET( Combine!BB$9,$AC33 - 1,0,1,1)<>0, IF(OR($AD33=\"LUMP\", $AD33=\"LS\"), \"LUMP\", OFFSET( Combine!BB$9,$AC33 - 1,0,1,1)),\"\"))","v":""},{"$f":"IF( $AC33 = 0, \"\", IF( OFFSET( Combine!BC$9,$AC33 - 1,0,1,1)<>0, IF(OR($AD33=\"LUMP\", $AD33=\"LS\"), \"LUMP\", OFFSET( Combine!BC$9,$AC33 - 1,0,1,1)),\"\"))","v":""},{"$f":"IF( $AC33 = 0, \"\", IF( OFFSET( Combine!BD$9,$AC33 - 1,0,1,1)<>0, IF(OR($AD33=\"LUMP\", $AD33=\"LS\"), \"LUMP\", OFFSET( Combine!BD$9,$AC33 - 1,0,1,1)),\"\"))","v":""},{"$f":"IF( $AC33 = 0, \"\", IF( OFFSET( Combine!BE$9,$AC33 - 1,0,1,1)<>0, IF(OR($AD33=\"LUMP\", $AD33=\"LS\"), \"LUMP\", OFFSET( Combine!BE$9,$AC33 - 1,0,1,1)),\"\"))","v":""},{"$f":"IF( $AC33 = 0, \"\", IF( OFFSET( Combine!BF$9,$AC33 - 1,0,1,1)<>0, IF(OR($AD33=\"LUMP\", $AD33=\"LS\"), \"LUMP\", OFFSET( Combine!BF$9,$AC33 - 1,0,1,1)),\"\"))","v":""},{"$f":"IF( $AC33 = 0, \"\", IF( OFFSET( Combine!BG$9,$AC33 - 1,0,1,1)<>0, IF(OR($AD33=\"LUMP\", $AD33=\"LS\"), \"LUMP\", OFFSET( Combine!BG$9,$AC33 - 1,0,1,1)),\"\"))","v":""},{"$f":"IF( $AC33 = 0, \"\", IF( OFFSET( Combine!BH$9,$AC33 - 1,0,1,1)<>0, IF(OR($AD33=\"LUMP\", $AD33=\"LS\"), \"LUMP\", OFFSET( Combine!BH$9,$AC33 - 1,0,1,1)),\"\"))","v":""},{"$f":"IF( $AC33 = 0, \"\", IF( OFFSET( Combine!BI$9,$AC33 - 1,0,1,1)<>0, IF(OR($AD33=\"LUMP\", $AD33=\"LS\"), \"LUMP\", OFFSET( Combine!BI$9,$AC33 - 1,0,1,1)),\"\"))","v":""},{"$f":"IF( $AC33 = 0, \"\", IF( OFFSET( Combine!BJ$9,$AC33 - 1,0,1,1)<>0, IF(OR($AD33=\"LUMP\", $AD33=\"LS\"), \"LUMP\", OFFSET( Combine!BJ$9,$AC33 - 1,0,1,1)),\"\"))","v":""},{"$f":"IF( $AC33 = 0, \"\", IF( OFFSET( Combine!AP$9,$AC33 - 1,0,1,1)<>0, LEFT(OFFSET( Combine!AP$9,$AC33 - 1,0,1,1),3),\"\"))","v":""},{"$f":"IF( $AC33 = 0, \"\", IF( OFFSET( Combine!AP$9,$AC33 - 1,0,1,1)<>0, IF(LEN(OFFSET( Combine!AP$9,$AC33 - 1,0,1,1))=9,   RIGHT(OFFSET( Combine!AP$9,$AC33 - 1,0,1,1),5),    LEFT(RIGHT(OFFSET( Combine!AP$9,$AC33 - 1,0,1,1),6), 5)      ),\"\"))","v":""},"",{"$f":"IF( $AC33 = 0, \"\", IF( OFFSET( Combine!$AP$9,$AC33 - 1,0,1,1)<>0,IF(OR(AD33=\"LUMP\", AD33=\"LS\"), \"\", AD33),\"\"))","v":""},{"$f":"IF( $AC33 = 0, \"\", IF( OFFSET( Combine!$AP$9,$AC33 - 1,0,1,1)<>0, VLOOKUP( OFFSET( Combine!$AP$9,$AC33 - 1,0,1,1),[1]Items!$A$2:$E$10001,4,0),\"\"))","v":""},null,31,5,26,{"$f":"IF( $AC33 = 0, \"\", IF( OFFSET( Combine!$AP$9,$AC33 - 1,0,1,1)<>0, VLOOKUP( OFFSET( Combine!$AP$9,$AC33 - 1,0,1,1),[1]Items!$A$2:$E$10001,3,0),\"\"))","v":""}]
[{"$f":"IF( $AC34 = 0, \"\", IF( OFFSET( Combine!AQ$9,$AC34 - 1,0,1,1)<>0, IF(OR($AD34=\"LUMP\", $AD34=\"LS\"), \"LUMP\", OFFSET( Combine!AQ$9,$AC34 - 1,0,1,1)),\"\"))","v":""},{"$f":"IF( $AC34 = 0, \"\", IF( OFFSET( Combine!AR$9,$AC34 - 1,0,1,1)<>0, IF(OR($AD34=\"LUMP\", $AD34=\"LS\"), \"LUMP\", OFFSET( Combine!AR$9,$AC34 - 1,0,1,1)),\"\"))","v":""},{"$f":"IF( $AC34 = 0, \"\", IF( OFFSET( Combine!AS$9,$AC34 - 1,0,1,1)<>0, IF(OR($AD34=\"LUMP\", $AD34=\"LS\"), \"LUMP\", OFFSET( Combine!AS$9,$AC34 - 1,0,1,1)),\"\"))","v":""},{"$f":"IF( $AC34 = 0, \"\", IF( OFFSET( Combine!AT$9,$AC34 - 1,0,1,1)<>0, IF(OR($AD34=\"LUMP\", $AD34=\"LS\"), \"LUMP\", OFFSET( Combine!AT$9,$AC34 - 1,0,1,1)),\"\"))","v":""},{"$f":"IF( $AC34 = 0, \"\", IF( OFFSET( Combine!AU$9,$AC34 - 1,0,1,1)<>0, IF(OR($AD34=\"LUMP\", $AD34=\"LS\"), \"LUMP\", OFFSET( Combine!AU$9,$AC34 - 1,0,1,1)),\"\"))","v":""},{"$f":"IF( $AC34 = 0, \"\", IF( OFFSET( Combine!AV$9,$AC34 - 1,0,1,1)<>0, IF(OR($AD34=\"LUMP\", $AD34=\"LS\"), \"LUMP\", OFFSET( Combine!AV$9,$AC34 - 1,0,1,1)),\"\"))","v":""},{"$f":"IF( $AC34 = 0, \"\", IF( OFFSET( Combine!AW$9,$AC34 - 1,0,1,1)<>0, IF(OR($AD34=\"LUMP\", $AD34=\"LS\"), \"LUMP\", OFFSET( Combine!AW$9,$AC34 - 1,0,1,1)),\"\"))","v":""},{"$f":"IF( $AC34 = 0, \"\", IF( OFFSET( Combine!AX$9,$AC34 - 1,0,1,1)<>0, IF(OR($AD34=\"LUMP\", $AD34=\"LS\"), \"LUMP\", OFFSET( Combine!AX$9,$AC34 - 1,0,1,1)),\"\"))","v":""},{"$f":"IF( $AC34 = 0, \"\", IF( OFFSET( Combine!AY$9,$AC34 - 1,0,1,1)<>0, IF(OR($AD34=\"LUMP\", $AD34=\"LS\"), \"LUMP\", OFFSET( Combine!AY$9,$AC34 - 1,0,1,1)),\"\"))","v":""},{"$f":"IF( $AC34 = 0, \"\", IF( OFFSET( Combine!AZ$9,$AC34 - 1,0,1,1)<>0, IF(OR($AD34=\"LUMP\", $AD34=\"LS\"), \"LUMP\", OFFSET( Combine!AZ$9,$AC34 - 1,0,1,1)),\"\"))","v":""},{"$f":"IF( $AC34 = 0, \"\", IF( OFFSET( Combine!BA$9,$AC34 - 1,0,1,1)<>0, IF(OR($AD34=\"LUMP\", $AD34=\"LS\"), \"LUMP\", OFFSET( Combine!BA$9,$AC34 - 1,0,1,1)),\"\"))","v":""},{"$f":"IF( $AC34 = 0, \"\", IF( OFFSET( Combine!BB$9,$AC34 - 1,0,1,1)<>0, IF(OR($AD34=\"LUMP\", $AD34=\"LS\"), \"LUMP\", OFFSET( Combine!BB$9,$AC34 - 1,0,1,1)),\"\"))","v":""},{"$f":"IF( $AC34 = 0, \"\", IF( OFFSET( Combine!BC$9,$AC34 - 1,0,1,1)<>0, IF(OR($AD34=\"LUMP\", $AD34=\"LS\"), \"LUMP\", OFFSET( Combine!BC$9,$AC34 - 1,0,1,1)),\"\"))","v":""},{"$f":"IF( $AC34 = 0, \"\", IF( OFFSET( Combine!BD$9,$AC34 - 1,0,1,1)<>0, IF(OR($AD34=\"LUMP\", $AD34=\"LS\"), \"LUMP\", OFFSET( Combine!BD$9,$AC34 - 1,0,1,1)),\"\"))","v":""},{"$f":"IF( $AC34 = 0, \"\", IF( OFFSET( Combine!BE$9,$AC34 - 1,0,1,1)<>0, IF(OR($AD34=\"LUMP\", $AD34=\"LS\"), \"LUMP\", OFFSET( Combine!BE$9,$AC34 - 1,0,1,1)),\"\"))","v":""},{"$f":"IF( $AC34 = 0, \"\", IF( OFFSET( Combine!BF$9,$AC34 - 1,0,1,1)<>0, IF(OR($AD34=\"LUMP\", $AD34=\"LS\"), \"LUMP\", OFFSET( Combine!BF$9,$AC34 - 1,0,1,1)),\"\"))","v":""},{"$f":"IF( $AC34 = 0, \"\", IF( OFFSET( Combine!BG$9,$AC34 - 1,0,1,1)<>0, IF(OR($AD34=\"LUMP\", $AD34=\"LS\"), \"LUMP\", OFFSET( Combine!BG$9,$AC34 - 1,0,1,1)),\"\"))","v":""},{"$f":"IF( $AC34 = 0, \"\", IF( OFFSET( Combine!BH$9,$AC34 - 1,0,1,1)<>0, IF(OR($AD34=\"LUMP\", $AD34=\"LS\"), \"LUMP\", OFFSET( Combine!BH$9,$AC34 - 1,0,1,1)),\"\"))","v":""},{"$f":"IF( $AC34 = 0, \"\", IF( OFFSET( Combine!BI$9,$AC34 - 1,0,1,1)<>0, IF(OR($AD34=\"LUMP\", $AD34=\"LS\"), \"LUMP\", OFFSET( Combine!BI$9,$AC34 - 1,0,1,1)),\"\"))","v":""},{"$f":"IF( $AC34 = 0, \"\", IF( OFFSET( Combine!BJ$9,$AC34 - 1,0,1,1)<>0, IF(OR($AD34=\"LUMP\", $AD34=\"LS\"), \"LUMP\", OFFSET( Combine!BJ$9,$AC34 - 1,0,1,1)),\"\"))","v":""},{"$f":"IF( $AC34 = 0, \"\", IF( OFFSET( Combine!AP$9,$AC34 - 1,0,1,1)<>0, LEFT(OFFSET( Combine!AP$9,$AC34 - 1,0,1,1),3),\"\"))","v":""},{"$f":"IF( $AC34 = 0, \"\", IF( OFFSET( Combine!AP$9,$AC34 - 1,0,1,1)<>0, IF(LEN(OFFSET( Combine!AP$9,$AC34 - 1,0,1,1))=9,   RIGHT(OFFSET( Combine!AP$9,$AC34 - 1,0,1,1),5),    LEFT(RIGHT(OFFSET( Combine!AP$9,$AC34 - 1,0,1,1),6), 5)      ),\"\"))","v":""},"",{"$f":"IF( $AC34 = 0, \"\", IF( OFFSET( Combine!$AP$9,$AC34 - 1,0,1,1)<>0,IF(OR(AD34=\"LUMP\", AD34=\"LS\"), \"\", AD34),\"\"))","v":""},{"$f":"IF( $AC34 = 0, \"\", IF( OFFSET( Combine!$AP$9,$AC34 - 1,0,1,1)<>0, VLOOKUP( OFFSET( Combine!$AP$9,$AC34 - 1,0,1,1),[1]Items!$A$2:$E$10001,4,0),\"\"))","v":""},null,32,5,27,{"$f":"IF( $AC34 = 0, \"\", IF( OFFSET( Combine!$AP$9,$AC34 - 1,0,1,1)<>0, VLOOKUP( OFFSET( Combine!$AP$9,$AC34 - 1,0,1,1),[1]Items!$A$2:$E$10001,3,0),\"\"))","v":""}]
[{"$f":"IF( $AC35 = 0, \"\", IF( OFFSET( Combine!AQ$9,$AC35 - 1,0,1,1)<>0, IF(OR($AD35=\"LUMP\", $AD35=\"LS\"), \"LUMP\", OFFSET( Combine!AQ$9,$AC35 - 1,0,1,1)),\"\"))","v":""},{"$f":"IF( $AC35 = 0, \"\", IF( OFFSET( Combine!AR$9,$AC35 - 1,0,1,1)<>0, IF(OR($AD35=\"LUMP\", $AD35=\"LS\"), \"LUMP\", OFFSET( Combine!AR$9,$AC35 - 1,0,1,1)),\"\"))","v":""},{"$f":"IF( $AC35 = 0, \"\", IF( OFFSET( Combine!AS$9,$AC35 - 1,0,1,1)<>0, IF(OR($AD35=\"LUMP\", $AD35=\"LS\"), \"LUMP\", OFFSET( Combine!AS$9,$AC35 - 1,0,1,1)),\"\"))","v":""},{"$f":"IF( $AC35 = 0, \"\", IF( OFFSET( Combine!AT$9,$AC35 - 1,0,1,1)<>0, IF(OR($AD35=\"LUMP\", $AD35=\"LS\"), \"LUMP\", OFFSET( Combine!AT$9,$AC35 - 1,0,1,1)),\"\"))","v":""},{"$f":"IF( $AC35 = 0, \"\", IF( OFFSET( Combine!AU$9,$AC35 - 1,0,1,1)<>0, IF(OR($AD35=\"LUMP\", $AD35=\"LS\"), \"LUMP\", OFFSET( Combine!AU$9,$AC35 - 1,0,1,1)),\"\"))","v":""},{"$f":"IF( $AC35 = 0, \"\", IF( OFFSET( Combine!AV$9,$AC35 - 1,0,1,1)<>0, IF(OR($AD35=\"LUMP\", $AD35=\"LS\"), \"LUMP\", OFFSET( Combine!AV$9,$AC35 - 1,0,1,1)),\"\"))","v":""},{"$f":"IF( $AC35 = 0, \"\", IF( OFFSET( Combine!AW$9,$AC35 - 1,0,1,1)<>0, IF(OR($AD35=\"LUMP\", $AD35=\"LS\"), \"LUMP\", OFFSET( Combine!AW$9,$AC35 - 1,0,1,1)),\"\"))","v":""},{"$f":"IF( $AC35 = 0, \"\", IF( OFFSET( Combine!AX$9,$AC35 - 1,0,1,1)<>0, IF(OR($AD35=\"LUMP\", $AD35=\"LS\"), \"LUMP\", OFFSET( Combine!AX$9,$AC35 - 1,0,1,1)),\"\"))","v":""},{"$f":"IF( $AC35 = 0, \"\", IF( OFFSET( Combine!AY$9,$AC35 - 1,0,1,1)<>0, IF(OR($AD35=\"LUMP\", $AD35=\"LS\"), \"LUMP\", OFFSET( Combine!AY$9,$AC35 - 1,0,1,1)),\"\"))","v":""},{"$f":"IF( $AC35 = 0, \"\", IF( OFFSET( Combine!AZ$9,$AC35 - 1,0,1,1)<>0, IF(OR($AD35=\"LUMP\", $AD35=\"LS\"), \"LUMP\", OFFSET( Combine!AZ$9,$AC35 - 1,0,1,1)),\"\"))","v":""},{"$f":"IF( $AC35 = 0, \"\", IF( OFFSET( Combine!BA$9,$AC35 - 1,0,1,1)<>0, IF(OR($AD35=\"LUMP\", $AD35=\"LS\"), \"LUMP\", OFFSET( Combine!BA$9,$AC35 - 1,0,1,1)),\"\"))","v":""},{"$f":"IF( $AC35 = 0, \"\", IF( OFFSET( Combine!BB$9,$AC35 - 1,0,1,1)<>0, IF(OR($AD35=\"LUMP\", $AD35=\"LS\"), \"LUMP\", OFFSET( Combine!BB$9,$AC35 - 1,0,1,1)),\"\"))","v":""},{"$f":"IF( $AC35 = 0, \"\", IF( OFFSET( Combine!BC$9,$AC35 - 1,0,1,1)<>0, IF(OR($AD35=\"LUMP\", $AD35=\"LS\"), \"LUMP\", OFFSET( Combine!BC$9,$AC35 - 1,0,1,1)),\"\"))","v":""},{"$f":"IF( $AC35 = 0, \"\", IF( OFFSET( Combine!BD$9,$AC35 - 1,0,1,1)<>0, IF(OR($AD35=\"LUMP\", $AD35=\"LS\"), \"LUMP\", OFFSET( Combine!BD$9,$AC35 - 1,0,1,1)),\"\"))","v":""},{"$f":"IF( $AC35 = 0, \"\", IF( OFFSET( Combine!BE$9,$AC35 - 1,0,1,1)<>0, IF(OR($AD35=\"LUMP\", $AD35=\"LS\"), \"LUMP\", OFFSET( Combine!BE$9,$AC35 - 1,0,1,1)),\"\"))","v":""},{"$f":"IF( $AC35 = 0, \"\", IF( OFFSET( Combine!BF$9,$AC35 - 1,0,1,1)<>0, IF(OR($AD35=\"LUMP\", $AD35=\"LS\"), \"LUMP\", OFFSET( Combine!BF$9,$AC35 - 1,0,1,1)),\"\"))","v":""},{"$f":"IF( $AC35 = 0, \"\", IF( OFFSET( Combine!BG$9,$AC35 - 1,0,1,1)<>0, IF(OR($AD35=\"LUMP\", $AD35=\"LS\"), \"LUMP\", OFFSET( Combine!BG$9,$AC35 - 1,0,1,1)),\"\"))","v":""},{"$f":"IF( $AC35 = 0, \"\", IF( OFFSET( Combine!BH$9,$AC35 - 1,0,1,1)<>0, IF(OR($AD35=\"LUMP\", $AD35=\"LS\"), \"LUMP\", OFFSET( Combine!BH$9,$AC35 - 1,0,1,1)),\"\"))","v":""},{"$f":"IF( $AC35 = 0, \"\", IF( OFFSET( Combine!BI$9,$AC35 - 1,0,1,1)<>0, IF(OR($AD35=\"LUMP\", $AD35=\"LS\"), \"LUMP\", OFFSET( Combine!BI$9,$AC35 - 1,0,1,1)),\"\"))","v":""},{"$f":"IF( $AC35 = 0, \"\", IF( OFFSET( Combine!BJ$9,$AC35 - 1,0,1,1)<>0, IF(OR($AD35=\"LUMP\", $AD35=\"LS\"), \"LUMP\", OFFSET( Combine!BJ$9,$AC35 - 1,0,1,1)),\"\"))","v":""},{"$f":"IF( $AC35 = 0, \"\", IF( OFFSET( Combine!AP$9,$AC35 - 1,0,1,1)<>0, LEFT(OFFSET( Combine!AP$9,$AC35 - 1,0,1,1),3),\"\"))","v":""},{"$f":"IF( $AC35 = 0, \"\", IF( OFFSET( Combine!AP$9,$AC35 - 1,0,1,1)<>0, IF(LEN(OFFSET( Combine!AP$9,$AC35 - 1,0,1,1))=9,   RIGHT(OFFSET( Combine!AP$9,$AC35 - 1,0,1,1),5),    LEFT(RIGHT(OFFSET( Combine!AP$9,$AC35 - 1,0,1,1),6), 5)      ),\"\"))","v":""},"",{"$f":"IF( $AC35 = 0, \"\", IF( OFFSET( Combine!$AP$9,$AC35 - 1,0,1,1)<>0,IF(OR(AD35=\"LUMP\", AD35=\"LS\"), \"\", AD35),\"\"))","v":""},{"$f":"IF( $AC35 = 0, \"\", IF( OFFSET( Combine!$AP$9,$AC35 - 1,0,1,1)<>0, VLOOKUP( OFFSET( Combine!$AP$9,$AC35 - 1,0,1,1),[1]Items!$A$2:$E$10001,4,0),\"\"))","v":""},null,33,{"$f":"INT(AA35/6)","v":5},{"$f":"IF(  (AA35 - 6*AB35) = 0, 0, AA35 - AB35 )","v":28},{"$f":"IF( $AC35 = 0, \"\", IF( OFFSET( Combine!$AP$9,$AC35 - 1,0,1,1)<>0, VLOOKUP( OFFSET( Combine!$AP$9,$AC35 - 1,0,1,1),[1]Items!$A$2:$E$10001,3,0),\"\"))","v":""}]
[{"$f":"IF( $AC36 = 0, \"\", IF( OFFSET( Combine!AQ$9,$AC36 - 1,0,1,1)<>0, IF(OR($AD36=\"LUMP\", $AD36=\"LS\"), \"LUMP\", OFFSET( Combine!AQ$9,$AC36 - 1,0,1,1)),\"\"))","v":""},{"$f":"IF( $AC36 = 0, \"\", IF( OFFSET( Combine!AR$9,$AC36 - 1,0,1,1)<>0, IF(OR($AD36=\"LUMP\", $AD36=\"LS\"), \"LUMP\", OFFSET( Combine!AR$9,$AC36 - 1,0,1,1)),\"\"))","v":""},{"$f":"IF( $AC36 = 0, \"\", IF( OFFSET( Combine!AS$9,$AC36 - 1,0,1,1)<>0, IF(OR($AD36=\"LUMP\", $AD36=\"LS\"), \"LUMP\", OFFSET( Combine!AS$9,$AC36 - 1,0,1,1)),\"\"))","v":""},{"$f":"IF( $AC36 = 0, \"\", IF( OFFSET( Combine!AT$9,$AC36 - 1,0,1,1)<>0, IF(OR($AD36=\"LUMP\", $AD36=\"LS\"), \"LUMP\", OFFSET( Combine!AT$9,$AC36 - 1,0,1,1)),\"\"))","v":""},{"$f":"IF( $AC36 = 0, \"\", IF( OFFSET( Combine!AU$9,$AC36 - 1,0,1,1)<>0, IF(OR($AD36=\"LUMP\", $AD36=\"LS\"), \"LUMP\", OFFSET( Combine!AU$9,$AC36 - 1,0,1,1)),\"\"))","v":""},{"$f":"IF( $AC36 = 0, \"\", IF( OFFSET( Combine!AV$9,$AC36 - 1,0,1,1)<>0, IF(OR($AD36=\"LUMP\", $AD36=\"LS\"), \"LUMP\", OFFSET( Combine!AV$9,$AC36 - 1,0,1,1)),\"\"))","v":""},{"$f":"IF( $AC36 = 0, \"\", IF( OFFSET( Combine!AW$9,$AC36 - 1,0,1,1)<>0, IF(OR($AD36=\"LUMP\", $AD36=\"LS\"), \"LUMP\", OFFSET( Combine!AW$9,$AC36 - 1,0,1,1)),\"\"))","v":""},{"$f":"IF( $AC36 = 0, \"\", IF( OFFSET( Combine!AX$9,$AC36 - 1,0,1,1)<>0, IF(OR($AD36=\"LUMP\", $AD36=\"LS\"), \"LUMP\", OFFSET( Combine!AX$9,$AC36 - 1,0,1,1)),\"\"))","v":""},{"$f":"IF( $AC36 = 0, \"\", IF( OFFSET( Combine!AY$9,$AC36 - 1,0,1,1)<>0, IF(OR($AD36=\"LUMP\", $AD36=\"LS\"), \"LUMP\", OFFSET( Combine!AY$9,$AC36 - 1,0,1,1)),\"\"))","v":""},{"$f":"IF( $AC36 = 0, \"\", IF( OFFSET( Combine!AZ$9,$AC36 - 1,0,1,1)<>0, IF(OR($AD36=\"LUMP\", $AD36=\"LS\"), \"LUMP\", OFFSET( Combine!AZ$9,$AC36 - 1,0,1,1)),\"\"))","v":""},{"$f":"IF( $AC36 = 0, \"\", IF( OFFSET( Combine!BA$9,$AC36 - 1,0,1,1)<>0, IF(OR($AD36=\"LUMP\", $AD36=\"LS\"), \"LUMP\", OFFSET( Combine!BA$9,$AC36 - 1,0,1,1)),\"\"))","v":""},{"$f":"IF( $AC36 = 0, \"\", IF( OFFSET( Combine!BB$9,$AC36 - 1,0,1,1)<>0, IF(OR($AD36=\"LUMP\", $AD36=\"LS\"), \"LUMP\", OFFSET( Combine!BB$9,$AC36 - 1,0,1,1)),\"\"))","v":""},{"$f":"IF( $AC36 = 0, \"\", IF( OFFSET( Combine!BC$9,$AC36 - 1,0,1,1)<>0, IF(OR($AD36=\"LUMP\", $AD36=\"LS\"), \"LUMP\", OFFSET( Combine!BC$9,$AC36 - 1,0,1,1)),\"\"))","v":""},{"$f":"IF( $AC36 = 0, \"\", IF( OFFSET( Combine!BD$9,$AC36 - 1,0,1,1)<>0, IF(OR($AD36=\"LUMP\", $AD36=\"LS\"), \"LUMP\", OFFSET( Combine!BD$9,$AC36 - 1,0,1,1)),\"\"))","v":""},{"$f":"IF( $AC36 = 0, \"\", IF( OFFSET( Combine!BE$9,$AC36 - 1,0,1,1)<>0, IF(OR($AD36=\"LUMP\", $AD36=\"LS\"), \"LUMP\", OFFSET( Combine!BE$9,$AC36 - 1,0,1,1)),\"\"))","v":""},{"$f":"IF( $AC36 = 0, \"\", IF( OFFSET( Combine!BF$9,$AC36 - 1,0,1,1)<>0, IF(OR($AD36=\"LUMP\", $AD36=\"LS\"), \"LUMP\", OFFSET( Combine!BF$9,$AC36 - 1,0,1,1)),\"\"))","v":""},{"$f":"IF( $AC36 = 0, \"\", IF( OFFSET( Combine!BG$9,$AC36 - 1,0,1,1)<>0, IF(OR($AD36=\"LUMP\", $AD36=\"LS\"), \"LUMP\", OFFSET( Combine!BG$9,$AC36 - 1,0,1,1)),\"\"))","v":""},{"$f":"IF( $AC36 = 0, \"\", IF( OFFSET( Combine!BH$9,$AC36 - 1,0,1,1)<>0, IF(OR($AD36=\"LUMP\", $AD36=\"LS\"), \"LUMP\", OFFSET( Combine!BH$9,$AC36 - 1,0,1,1)),\"\"))","v":""},{"$f":"IF( $AC36 = 0, \"\", IF( OFFSET( Combine!BI$9,$AC36 - 1,0,1,1)<>0, IF(OR($AD36=\"LUMP\", $AD36=\"LS\"), \"LUMP\", OFFSET( Combine!BI$9,$AC36 - 1,0,1,1)),\"\"))","v":""},{"$f":"IF( $AC36 = 0, \"\", IF( OFFSET( Combine!BJ$9,$AC36 - 1,0,1,1)<>0, IF(OR($AD36=\"LUMP\", $AD36=\"LS\"), \"LUMP\", OFFSET( Combine!BJ$9,$AC36 - 1,0,1,1)),\"\"))","v":""},{"$f":"IF( $AC36 = 0, \"\", IF( OFFSET( Combine!AP$9,$AC36 - 1,0,1,1)<>0, LEFT(OFFSET( Combine!AP$9,$AC36 - 1,0,1,1),3),\"\"))","v":""},{"$f":"IF( $AC36 = 0, \"\", IF( OFFSET( Combine!AP$9,$AC36 - 1,0,1,1)<>0, IF(LEN(OFFSET( Combine!AP$9,$AC36 - 1,0,1,1))=9,   RIGHT(OFFSET( Combine!AP$9,$AC36 - 1,0,1,1),5),    LEFT(RIGHT(OFFSET( Combine!AP$9,$AC36 - 1,0,1,1),6), 5)      ),\"\"))","v":""},"",{"$f":"IF( $AC36 = 0, \"\", IF( OFFSET( Combine!$AP$9,$AC36 - 1,0,1,1)<>0,IF(OR(AD36=\"LUMP\", AD36=\"LS\"), \"\", AD36),\"\"))","v":""},{"$f":"IF( $AC36 = 0, \"\", IF( OFFSET( Combine!$AP$9,$AC36 - 1,0,1,1)<>0, VLOOKUP( OFFSET( Combine!$AP$9,$AC36 - 1,0,1,1),[1]Items!$A$2:$E$10001,4,0),\"\"))","v":""},null,{"$f":"AA35+1","v":34},5,29,{"$f":"IF( $AC36 = 0, \"\", IF( OFFSET( Combine!$AP$9,$AC36 - 1,0,1,1)<>0, VLOOKUP( OFFSET( Combine!$AP$9,$AC36 - 1,0,1,1),[1]Items!$A$2:$E$10001,3,0),\"\"))","v":""}]
[{"$f":"IF( $AC37 = 0, \"\", IF( OFFSET( Combine!AQ$9,$AC37 - 1,0,1,1)<>0, IF(OR($AD37=\"LUMP\", $AD37=\"LS\"), \"LUMP\", OFFSET( Combine!AQ$9,$AC37 - 1,0,1,1)),\"\"))","v":""},{"$f":"IF( $AC37 = 0, \"\", IF( OFFSET( Combine!AR$9,$AC37 - 1,0,1,1)<>0, IF(OR($AD37=\"LUMP\", $AD37=\"LS\"), \"LUMP\", OFFSET( Combine!AR$9,$AC37 - 1,0,1,1)),\"\"))","v":""},{"$f":"IF( $AC37 = 0, \"\", IF( OFFSET( Combine!AS$9,$AC37 - 1,0,1,1)<>0, IF(OR($AD37=\"LUMP\", $AD37=\"LS\"), \"LUMP\", OFFSET( Combine!AS$9,$AC37 - 1,0,1,1)),\"\"))","v":""},{"$f":"IF( $AC37 = 0, \"\", IF( OFFSET( Combine!AT$9,$AC37 - 1,0,1,1)<>0, IF(OR($AD37=\"LUMP\", $AD37=\"LS\"), \"LUMP\", OFFSET( Combine!AT$9,$AC37 - 1,0,1,1)),\"\"))","v":""},{"$f":"IF( $AC37 = 0, \"\", IF( OFFSET( Combine!AU$9,$AC37 - 1,0,1,1)<>0, IF(OR($AD37=\"LUMP\", $AD37=\"LS\"), \"LUMP\", OFFSET( Combine!AU$9,$AC37 - 1,0,1,1)),\"\"))","v":""},{"$f":"IF( $AC37 = 0, \"\", IF( OFFSET( Combine!AV$9,$AC37 - 1,0,1,1)<>0, IF(OR($AD37=\"LUMP\", $AD37=\"LS\"), \"LUMP\", OFFSET( Combine!AV$9,$AC37 - 1,0,1,1)),\"\"))","v":""},{"$f":"IF( $AC37 = 0, \"\", IF( OFFSET( Combine!AW$9,$AC37 - 1,0,1,1)<>0, IF(OR($AD37=\"LUMP\", $AD37=\"LS\"), \"LUMP\", OFFSET( Combine!AW$9,$AC37 - 1,0,1,1)),\"\"))","v":""},{"$f":"IF( $AC37 = 0, \"\", IF( OFFSET( Combine!AX$9,$AC37 - 1,0,1,1)<>0, IF(OR($AD37=\"LUMP\", $AD37=\"LS\"), \"LUMP\", OFFSET( Combine!AX$9,$AC37 - 1,0,1,1)),\"\"))","v":""},{"$f":"IF( $AC37 = 0, \"\", IF( OFFSET( Combine!AY$9,$AC37 - 1,0,1,1)<>0, IF(OR($AD37=\"LUMP\", $AD37=\"LS\"), \"LUMP\", OFFSET( Combine!AY$9,$AC37 - 1,0,1,1)),\"\"))","v":""},{"$f":"IF( $AC37 = 0, \"\", IF( OFFSET( Combine!AZ$9,$AC37 - 1,0,1,1)<>0, IF(OR($AD37=\"LUMP\", $AD37=\"LS\"), \"LUMP\", OFFSET( Combine!AZ$9,$AC37 - 1,0,1,1)),\"\"))","v":""},{"$f":"IF( $AC37 = 0, \"\", IF( OFFSET( Combine!BA$9,$AC37 - 1,0,1,1)<>0, IF(OR($AD37=\"LUMP\", $AD37=\"LS\"), \"LUMP\", OFFSET( Combine!BA$9,$AC37 - 1,0,1,1)),\"\"))","v":""},{"$f":"IF( $AC37 = 0, \"\", IF( OFFSET( Combine!BB$9,$AC37 - 1,0,1,1)<>0, IF(OR($AD37=\"LUMP\", $AD37=\"LS\"), \"LUMP\", OFFSET( Combine!BB$9,$AC37 - 1,0,1,1)),\"\"))","v":""},{"$f":"IF( $AC37 = 0, \"\", IF( OFFSET( Combine!BC$9,$AC37 - 1,0,1,1)<>0, IF(OR($AD37=\"LUMP\", $AD37=\"LS\"), \"LUMP\", OFFSET( Combine!BC$9,$AC37 - 1,0,1,1)),\"\"))","v":""},{"$f":"IF( $AC37 = 0, \"\", IF( OFFSET( Combine!BD$9,$AC37 - 1,0,1,1)<>0, IF(OR($AD37=\"LUMP\", $AD37=\"LS\"), \"LUMP\", OFFSET( Combine!BD$9,$AC37 - 1,0,1,1)),\"\"))","v":""},{"$f":"IF( $AC37 = 0, \"\", IF( OFFSET( Combine!BE$9,$AC37 - 1,0,1,1)<>0, IF(OR($AD37=\"LUMP\", $AD37=\"LS\"), \"LUMP\", OFFSET( Combine!BE$9,$AC37 - 1,0,1,1)),\"\"))","v":""},{"$f":"IF( $AC37 = 0, \"\", IF( OFFSET( Combine!BF$9,$AC37 - 1,0,1,1)<>0, IF(OR($AD37=\"LUMP\", $AD37=\"LS\"), \"LUMP\", OFFSET( Combine!BF$9,$AC37 - 1,0,1,1)),\"\"))","v":""},{"$f":"IF( $AC37 = 0, \"\", IF( OFFSET( Combine!BG$9,$AC37 - 1,0,1,1)<>0, IF(OR($AD37=\"LUMP\", $AD37=\"LS\"), \"LUMP\", OFFSET( Combine!BG$9,$AC37 - 1,0,1,1)),\"\"))","v":""},{"$f":"IF( $AC37 = 0, \"\", IF( OFFSET( Combine!BH$9,$AC37 - 1,0,1,1)<>0, IF(OR($AD37=\"LUMP\", $AD37=\"LS\"), \"LUMP\", OFFSET( Combine!BH$9,$AC37 - 1,0,1,1)),\"\"))","v":""},{"$f":"IF( $AC37 = 0, \"\", IF( OFFSET( Combine!BI$9,$AC37 - 1,0,1,1)<>0, IF(OR($AD37=\"LUMP\", $AD37=\"LS\"), \"LUMP\", OFFSET( Combine!BI$9,$AC37 - 1,0,1,1)),\"\"))","v":""},{"$f":"IF( $AC37 = 0, \"\", IF( OFFSET( Combine!BJ$9,$AC37 - 1,0,1,1)<>0, IF(OR($AD37=\"LUMP\", $AD37=\"LS\"), \"LUMP\", OFFSET( Combine!BJ$9,$AC37 - 1,0,1,1)),\"\"))","v":""},{"$f":"IF( $AC37 = 0, \"\", IF( OFFSET( Combine!AP$9,$AC37 - 1,0,1,1)<>0, LEFT(OFFSET( Combine!AP$9,$AC37 - 1,0,1,1),3),\"\"))","v":""},{"$f":"IF( $AC37 = 0, \"\", IF( OFFSET( Combine!AP$9,$AC37 - 1,0,1,1)<>0, IF(LEN(OFFSET( Combine!AP$9,$AC37 - 1,0,1,1))=9,   RIGHT(OFFSET( Combine!AP$9,$AC37 - 1,0,1,1),5),    LEFT(RIGHT(OFFSET( Combine!AP$9,$AC37 - 1,0,1,1),6), 5)      ),\"\"))","v":""},"",{"$f":"IF( $AC37 = 0, \"\", IF( OFFSET( Combine!$AP$9,$AC37 - 1,0,1,1)<>0,IF(OR(AD37=\"LUMP\", AD37=\"LS\"), \"\", AD37),\"\"))","v":""},{"$f":"IF( $AC37 = 0, \"\", IF( OFFSET( Combine!$AP$9,$AC37 - 1,0,1,1)<>0, VLOOKUP( OFFSET( Combine!$AP$9,$AC37 - 1,0,1,1),[1]Items!$A$2:$E$10001,4,0),\"\"))","v":""},null,35,5,30,{"$f":"IF( $AC37 = 0, \"\", IF( OFFSET( Combine!$AP$9,$AC37 - 1,0,1,1)<>0, VLOOKUP( OFFSET( Combine!$AP$9,$AC37 - 1,0,1,1),[1]Items!$A$2:$E$10001,3,0),\"\"))","v":""}]
[{"$f":"IF( $AC38 = 0, \"\", IF( OFFSET( Combine!AQ$9,$AC38 - 1,0,1,1)<>0, IF(OR($AD38=\"LUMP\", $AD38=\"LS\"), \"LUMP\", OFFSET( Combine!AQ$9,$AC38 - 1,0,1,1)),\"\"))","v":""},{"$f":"IF( $AC38 = 0, \"\", IF( OFFSET( Combine!AR$9,$AC38 - 1,0,1,1)<>0, IF(OR($AD38=\"LUMP\", $AD38=\"LS\"), \"LUMP\", OFFSET( Combine!AR$9,$AC38 - 1,0,1,1)),\"\"))","v":""},{"$f":"IF( $AC38 = 0, \"\", IF( OFFSET( Combine!AS$9,$AC38 - 1,0,1,1)<>0, IF(OR($AD38=\"LUMP\", $AD38=\"LS\"), \"LUMP\", OFFSET( Combine!AS$9,$AC38 - 1,0,1,1)),\"\"))","v":""},{"$f":"IF( $AC38 = 0, \"\", IF( OFFSET( Combine!AT$9,$AC38 - 1,0,1,1)<>0, IF(OR($AD38=\"LUMP\", $AD38=\"LS\"), \"LUMP\", OFFSET( Combine!AT$9,$AC38 - 1,0,1,1)),\"\"))","v":""},{"$f":"IF( $AC38 = 0, \"\", IF( OFFSET( Combine!AU$9,$AC38 - 1,0,1,1)<>0, IF(OR($AD38=\"LUMP\", $AD38=\"LS\"), \"LUMP\", OFFSET( Combine!AU$9,$AC38 - 1,0,1,1)),\"\"))","v":""},{"$f":"IF( $AC38 = 0, \"\", IF( OFFSET( Combine!AV$9,$AC38 - 1,0,1,1)<>0, IF(OR($AD38=\"LUMP\", $AD38=\"LS\"), \"LUMP\", OFFSET( Combine!AV$9,$AC38 - 1,0,1,1)),\"\"))","v":""},{"$f":"IF( $AC38 = 0, \"\", IF( OFFSET( Combine!AW$9,$AC38 - 1,0,1,1)<>0, IF(OR($AD38=\"LUMP\", $AD38=\"LS\"), \"LUMP\", OFFSET( Combine!AW$9,$AC38 - 1,0,1,1)),\"\"))","v":""},{"$f":"IF( $AC38 = 0, \"\", IF( OFFSET( Combine!AX$9,$AC38 - 1,0,1,1)<>0, IF(OR($AD38=\"LUMP\", $AD38=\"LS\"), \"LUMP\", OFFSET( Combine!AX$9,$AC38 - 1,0,1,1)),\"\"))","v":""},{"$f":"IF( $AC38 = 0, \"\", IF( OFFSET( Combine!AY$9,$AC38 - 1,0,1,1)<>0, IF(OR($AD38=\"LUMP\", $AD38=\"LS\"), \"LUMP\", OFFSET( Combine!AY$9,$AC38 - 1,0,1,1)),\"\"))","v":""},{"$f":"IF( $AC38 = 0, \"\", IF( OFFSET( Combine!AZ$9,$AC38 - 1,0,1,1)<>0, IF(OR($AD38=\"LUMP\", $AD38=\"LS\"), \"LUMP\", OFFSET( Combine!AZ$9,$AC38 - 1,0,1,1)),\"\"))","v":""},{"$f":"IF( $AC38 = 0, \"\", IF( OFFSET( Combine!BA$9,$AC38 - 1,0,1,1)<>0, IF(OR($AD38=\"LUMP\", $AD38=\"LS\"), \"LUMP\", OFFSET( Combine!BA$9,$AC38 - 1,0,1,1)),\"\"))","v":""},{"$f":"IF( $AC38 = 0, \"\", IF( OFFSET( Combine!BB$9,$AC38 - 1,0,1,1)<>0, IF(OR($AD38=\"LUMP\", $AD38=\"LS\"), \"LUMP\", OFFSET( Combine!BB$9,$AC38 - 1,0,1,1)),\"\"))","v":""},{"$f":"IF( $AC38 = 0, \"\", IF( OFFSET( Combine!BC$9,$AC38 - 1,0,1,1)<>0, IF(OR($AD38=\"LUMP\", $AD38=\"LS\"), \"LUMP\", OFFSET( Combine!BC$9,$AC38 - 1,0,1,1)),\"\"))","v":""},{"$f":"IF( $AC38 = 0, \"\", IF( OFFSET( Combine!BD$9,$AC38 - 1,0,1,1)<>0, IF(OR($AD38=\"LUMP\", $AD38=\"LS\"), \"LUMP\", OFFSET( Combine!BD$9,$AC38 - 1,0,1,1)),\"\"))","v":""},{"$f":"IF( $AC38 = 0, \"\", IF( OFFSET( Combine!BE$9,$AC38 - 1,0,1,1)<>0, IF(OR($AD38=\"LUMP\", $AD38=\"LS\"), \"LUMP\", OFFSET( Combine!BE$9,$AC38 - 1,0,1,1)),\"\"))","v":""},{"$f":"IF( $AC38 = 0, \"\", IF( OFFSET( Combine!BF$9,$AC38 - 1,0,1,1)<>0, IF(OR($AD38=\"LUMP\", $AD38=\"LS\"), \"LUMP\", OFFSET( Combine!BF$9,$AC38 - 1,0,1,1)),\"\"))","v":""},{"$f":"IF( $AC38 = 0, \"\", IF( OFFSET( Combine!BG$9,$AC38 - 1,0,1,1)<>0, IF(OR($AD38=\"LUMP\", $AD38=\"LS\"), \"LUMP\", OFFSET( Combine!BG$9,$AC38 - 1,0,1,1)),\"\"))","v":""},{"$f":"IF( $AC38 = 0, \"\", IF( OFFSET( Combine!BH$9,$AC38 - 1,0,1,1)<>0, IF(OR($AD38=\"LUMP\", $AD38=\"LS\"), \"LUMP\", OFFSET( Combine!BH$9,$AC38 - 1,0,1,1)),\"\"))","v":""},{"$f":"IF( $AC38 = 0, \"\", IF( OFFSET( Combine!BI$9,$AC38 - 1,0,1,1)<>0, IF(OR($AD38=\"LUMP\", $AD38=\"LS\"), \"LUMP\", OFFSET( Combine!BI$9,$AC38 - 1,0,1,1)),\"\"))","v":""},{"$f":"IF( $AC38 = 0, \"\", IF( OFFSET( Combine!BJ$9,$AC38 - 1,0,1,1)<>0, IF(OR($AD38=\"LUMP\", $AD38=\"LS\"), \"LUMP\", OFFSET( Combine!BJ$9,$AC38 - 1,0,1,1)),\"\"))","v":""},{"$f":"IF( $AC38 = 0, \"\", IF( OFFSET( Combine!AP$9,$AC38 - 1,0,1,1)<>0, LEFT(OFFSET( Combine!AP$9,$AC38 - 1,0,1,1),3),\"\"))","v":""},{"$f":"IF( $AC38 = 0, \"\", IF( OFFSET( Combine!AP$9,$AC38 - 1,0,1,1)<>0, IF(LEN(OFFSET( Combine!AP$9,$AC38 - 1,0,1,1))=9,   RIGHT(OFFSET( Combine!AP$9,$AC38 - 1,0,1,1),5),    LEFT(RIGHT(OFFSET( Combine!AP$9,$AC38 - 1,0,1,1),6), 5)      ),\"\"))","v":""},"",{"$f":"IF( $AC38 = 0, \"\", IF( OFFSET( Combine!$AP$9,$AC38 - 1,0,1,1)<>0,IF(OR(AD38=\"LUMP\", AD38=\"LS\"), \"\", AD38),\"\"))","v":""},{"$f":"IF( $AC38 = 0, \"\", IF( OFFSET( Combine!$AP$9,$AC38 - 1,0,1,1)<>0, VLOOKUP( OFFSET( Combine!$AP$9,$AC38 - 1,0,1,1),[1]Items!$A$2:$E$10001,4,0),\"\"))","v":""},null,36,6,0,{"$f":"IF( $AC38 = 0, \"\", IF( OFFSET( Combine!$AP$9,$AC38 - 1,0,1,1)<>0, VLOOKUP( OFFSET( Combine!$AP$9,$AC38 - 1,0,1,1),[1]Items!$A$2:$E$10001,3,0),\"\"))","v":""}]
[{"$f":"IF( $AC39 = 0, \"\", IF( OFFSET( Combine!AQ$9,$AC39 - 1,0,1,1)<>0, IF(OR($AD39=\"LUMP\", $AD39=\"LS\"), \"LUMP\", OFFSET( Combine!AQ$9,$AC39 - 1,0,1,1)),\"\"))","v":""},{"$f":"IF( $AC39 = 0, \"\", IF( OFFSET( Combine!AR$9,$AC39 - 1,0,1,1)<>0, IF(OR($AD39=\"LUMP\", $AD39=\"LS\"), \"LUMP\", OFFSET( Combine!AR$9,$AC39 - 1,0,1,1)),\"\"))","v":""},{"$f":"IF( $AC39 = 0, \"\", IF( OFFSET( Combine!AS$9,$AC39 - 1,0,1,1)<>0, IF(OR($AD39=\"LUMP\", $AD39=\"LS\"), \"LUMP\", OFFSET( Combine!AS$9,$AC39 - 1,0,1,1)),\"\"))","v":""},{"$f":"IF( $AC39 = 0, \"\", IF( OFFSET( Combine!AT$9,$AC39 - 1,0,1,1)<>0, IF(OR($AD39=\"LUMP\", $AD39=\"LS\"), \"LUMP\", OFFSET( Combine!AT$9,$AC39 - 1,0,1,1)),\"\"))","v":""},{"$f":"IF( $AC39 = 0, \"\", IF( OFFSET( Combine!AU$9,$AC39 - 1,0,1,1)<>0, IF(OR($AD39=\"LUMP\", $AD39=\"LS\"), \"LUMP\", OFFSET( Combine!AU$9,$AC39 - 1,0,1,1)),\"\"))","v":""},{"$f":"IF( $AC39 = 0, \"\", IF( OFFSET( Combine!AV$9,$AC39 - 1,0,1,1)<>0, IF(OR($AD39=\"LUMP\", $AD39=\"LS\"), \"LUMP\", OFFSET( Combine!AV$9,$AC39 - 1,0,1,1)),\"\"))","v":""},{"$f":"IF( $AC39 = 0, \"\", IF( OFFSET( Combine!AW$9,$AC39 - 1,0,1,1)<>0, IF(OR($AD39=\"LUMP\", $AD39=\"LS\"), \"LUMP\", OFFSET( Combine!AW$9,$AC39 - 1,0,1,1)),\"\"))","v":""},{"$f":"IF( $AC39 = 0, \"\", IF( OFFSET( Combine!AX$9,$AC39 - 1,0,1,1)<>0, IF(OR($AD39=\"LUMP\", $AD39=\"LS\"), \"LUMP\", OFFSET( Combine!AX$9,$AC39 - 1,0,1,1)),\"\"))","v":""},{"$f":"IF( $AC39 = 0, \"\", IF( OFFSET( Combine!AY$9,$AC39 - 1,0,1,1)<>0, IF(OR($AD39=\"LUMP\", $AD39=\"LS\"), \"LUMP\", OFFSET( Combine!AY$9,$AC39 - 1,0,1,1)),\"\"))","v":""},{"$f":"IF( $AC39 = 0, \"\", IF( OFFSET( Combine!AZ$9,$AC39 - 1,0,1,1)<>0, IF(OR($AD39=\"LUMP\", $AD39=\"LS\"), \"LUMP\", OFFSET( Combine!AZ$9,$AC39 - 1,0,1,1)),\"\"))","v":""},{"$f":"IF( $AC39 = 0, \"\", IF( OFFSET( Combine!BA$9,$AC39 - 1,0,1,1)<>0, IF(OR($AD39=\"LUMP\", $AD39=\"LS\"), \"LUMP\", OFFSET( Combine!BA$9,$AC39 - 1,0,1,1)),\"\"))","v":""},{"$f":"IF( $AC39 = 0, \"\", IF( OFFSET( Combine!BB$9,$AC39 - 1,0,1,1)<>0, IF(OR($AD39=\"LUMP\", $AD39=\"LS\"), \"LUMP\", OFFSET( Combine!BB$9,$AC39 - 1,0,1,1)),\"\"))","v":""},{"$f":"IF( $AC39 = 0, \"\", IF( OFFSET( Combine!BC$9,$AC39 - 1,0,1,1)<>0, IF(OR($AD39=\"LUMP\", $AD39=\"LS\"), \"LUMP\", OFFSET( Combine!BC$9,$AC39 - 1,0,1,1)),\"\"))","v":""},{"$f":"IF( $AC39 = 0, \"\", IF( OFFSET( Combine!BD$9,$AC39 - 1,0,1,1)<>0, IF(OR($AD39=\"LUMP\", $AD39=\"LS\"), \"LUMP\", OFFSET( Combine!BD$9,$AC39 - 1,0,1,1)),\"\"))","v":""},{"$f":"IF( $AC39 = 0, \"\", IF( OFFSET( Combine!BE$9,$AC39 - 1,0,1,1)<>0, IF(OR($AD39=\"LUMP\", $AD39=\"LS\"), \"LUMP\", OFFSET( Combine!BE$9,$AC39 - 1,0,1,1)),\"\"))","v":""},{"$f":"IF( $AC39 = 0, \"\", IF( OFFSET( Combine!BF$9,$AC39 - 1,0,1,1)<>0, IF(OR($AD39=\"LUMP\", $AD39=\"LS\"), \"LUMP\", OFFSET( Combine!BF$9,$AC39 - 1,0,1,1)),\"\"))","v":""},{"$f":"IF( $AC39 = 0, \"\", IF( OFFSET( Combine!BG$9,$AC39 - 1,0,1,1)<>0, IF(OR($AD39=\"LUMP\", $AD39=\"LS\"), \"LUMP\", OFFSET( Combine!BG$9,$AC39 - 1,0,1,1)),\"\"))","v":""},{"$f":"IF( $AC39 = 0, \"\", IF( OFFSET( Combine!BH$9,$AC39 - 1,0,1,1)<>0, IF(OR($AD39=\"LUMP\", $AD39=\"LS\"), \"LUMP\", OFFSET( Combine!BH$9,$AC39 - 1,0,1,1)),\"\"))","v":""},{"$f":"IF( $AC39 = 0, \"\", IF( OFFSET( Combine!BI$9,$AC39 - 1,0,1,1)<>0, IF(OR($AD39=\"LUMP\", $AD39=\"LS\"), \"LUMP\", OFFSET( Combine!BI$9,$AC39 - 1,0,1,1)),\"\"))","v":""},{"$f":"IF( $AC39 = 0, \"\", IF( OFFSET( Combine!BJ$9,$AC39 - 1,0,1,1)<>0, IF(OR($AD39=\"LUMP\", $AD39=\"LS\"), \"LUMP\", OFFSET( Combine!BJ$9,$AC39 - 1,0,1,1)),\"\"))","v":""},{"$f":"IF( $AC39 = 0, \"\", IF( OFFSET( Combine!AP$9,$AC39 - 1,0,1,1)<>0, LEFT(OFFSET( Combine!AP$9,$AC39 - 1,0,1,1),3),\"\"))","v":""},{"$f":"IF( $AC39 = 0, \"\", IF( OFFSET( Combine!AP$9,$AC39 - 1,0,1,1)<>0, IF(LEN(OFFSET( Combine!AP$9,$AC39 - 1,0,1,1))=9,   RIGHT(OFFSET( Combine!AP$9,$AC39 - 1,0,1,1),5),    LEFT(RIGHT(OFFSET( Combine!AP$9,$AC39 - 1,0,1,1),6), 5)      ),\"\"))","v":""},"",{"$f":"IF( $AC39 = 0, \"\", IF( OFFSET( Combine!$AP$9,$AC39 - 1,0,1,1)<>0,IF(OR(AD39=\"LUMP\", AD39=\"LS\"), \"\", AD39),\"\"))","v":""},{"$f":"IF( $AC39 = 0, \"\", IF( OFFSET( Combine!$AP$9,$AC39 - 1,0,1,1)<>0, VLOOKUP( OFFSET( Combine!$AP$9,$AC39 - 1,0,1,1),[1]Items!$A$2:$E$10001,4,0),\"\"))","v":""},null,37,6,31,{"$f":"IF( $AC39 = 0, \"\", IF( OFFSET( Combine!$AP$9,$AC39 - 1,0,1,1)<>0, VLOOKUP( OFFSET( Combine!$AP$9,$AC39 - 1,0,1,1),[1]Items!$A$2:$E$10001,3,0),\"\"))","v":""}]
[{"$f":"IF( $AC40 = 0, \"\", IF( OFFSET( Combine!AQ$9,$AC40 - 1,0,1,1)<>0, IF(OR($AD40=\"LUMP\", $AD40=\"LS\"), \"LUMP\", OFFSET( Combine!AQ$9,$AC40 - 1,0,1,1)),\"\"))","v":""},{"$f":"IF( $AC40 = 0, \"\", IF( OFFSET( Combine!AR$9,$AC40 - 1,0,1,1)<>0, IF(OR($AD40=\"LUMP\", $AD40=\"LS\"), \"LUMP\", OFFSET( Combine!AR$9,$AC40 - 1,0,1,1)),\"\"))","v":""},{"$f":"IF( $AC40 = 0, \"\", IF( OFFSET( Combine!AS$9,$AC40 - 1,0,1,1)<>0, IF(OR($AD40=\"LUMP\", $AD40=\"LS\"), \"LUMP\", OFFSET( Combine!AS$9,$AC40 - 1,0,1,1)),\"\"))","v":""},{"$f":"IF( $AC40 = 0, \"\", IF( OFFSET( Combine!AT$9,$AC40 - 1,0,1,1)<>0, IF(OR($AD40=\"LUMP\", $AD40=\"LS\"), \"LUMP\", OFFSET( Combine!AT$9,$AC40 - 1,0,1,1)),\"\"))","v":""},{"$f":"IF( $AC40 = 0, \"\", IF( OFFSET( Combine!AU$9,$AC40 - 1,0,1,1)<>0, IF(OR($AD40=\"LUMP\", $AD40=\"LS\"), \"LUMP\", OFFSET( Combine!AU$9,$AC40 - 1,0,1,1)),\"\"))","v":""},{"$f":"IF( $AC40 = 0, \"\", IF( OFFSET( Combine!AV$9,$AC40 - 1,0,1,1)<>0, IF(OR($AD40=\"LUMP\", $AD40=\"LS\"), \"LUMP\", OFFSET( Combine!AV$9,$AC40 - 1,0,1,1)),\"\"))","v":""},{"$f":"IF( $AC40 = 0, \"\", IF( OFFSET( Combine!AW$9,$AC40 - 1,0,1,1)<>0, IF(OR($AD40=\"LUMP\", $AD40=\"LS\"), \"LUMP\", OFFSET( Combine!AW$9,$AC40 - 1,0,1,1)),\"\"))","v":""},{"$f":"IF( $AC40 = 0, \"\", IF( OFFSET( Combine!AX$9,$AC40 - 1,0,1,1)<>0, IF(OR($AD40=\"LUMP\", $AD40=\"LS\"), \"LUMP\", OFFSET( Combine!AX$9,$AC40 - 1,0,1,1)),\"\"))","v":""},{"$f":"IF( $AC40 = 0, \"\", IF( OFFSET( Combine!AY$9,$AC40 - 1,0,1,1)<>0, IF(OR($AD40=\"LUMP\", $AD40=\"LS\"), \"LUMP\", OFFSET( Combine!AY$9,$AC40 - 1,0,1,1)),\"\"))","v":""},{"$f":"IF( $AC40 = 0, \"\", IF( OFFSET( Combine!AZ$9,$AC40 - 1,0,1,1)<>0, IF(OR($AD40=\"LUMP\", $AD40=\"LS\"), \"LUMP\", OFFSET( Combine!AZ$9,$AC40 - 1,0,1,1)),\"\"))","v":""},{"$f":"IF( $AC40 = 0, \"\", IF( OFFSET( Combine!BA$9,$AC40 - 1,0,1,1)<>0, IF(OR($AD40=\"LUMP\", $AD40=\"LS\"), \"LUMP\", OFFSET( Combine!BA$9,$AC40 - 1,0,1,1)),\"\"))","v":""},{"$f":"IF( $AC40 = 0, \"\", IF( OFFSET( Combine!BB$9,$AC40 - 1,0,1,1)<>0, IF(OR($AD40=\"LUMP\", $AD40=\"LS\"), \"LUMP\", OFFSET( Combine!BB$9,$AC40 - 1,0,1,1)),\"\"))","v":""},{"$f":"IF( $AC40 = 0, \"\", IF( OFFSET( Combine!BC$9,$AC40 - 1,0,1,1)<>0, IF(OR($AD40=\"LUMP\", $AD40=\"LS\"), \"LUMP\", OFFSET( Combine!BC$9,$AC40 - 1,0,1,1)),\"\"))","v":""},{"$f":"IF( $AC40 = 0, \"\", IF( OFFSET( Combine!BD$9,$AC40 - 1,0,1,1)<>0, IF(OR($AD40=\"LUMP\", $AD40=\"LS\"), \"LUMP\", OFFSET( Combine!BD$9,$AC40 - 1,0,1,1)),\"\"))","v":""},{"$f":"IF( $AC40 = 0, \"\", IF( OFFSET( Combine!BE$9,$AC40 - 1,0,1,1)<>0, IF(OR($AD40=\"LUMP\", $AD40=\"LS\"), \"LUMP\", OFFSET( Combine!BE$9,$AC40 - 1,0,1,1)),\"\"))","v":""},{"$f":"IF( $AC40 = 0, \"\", IF( OFFSET( Combine!BF$9,$AC40 - 1,0,1,1)<>0, IF(OR($AD40=\"LUMP\", $AD40=\"LS\"), \"LUMP\", OFFSET( Combine!BF$9,$AC40 - 1,0,1,1)),\"\"))","v":""},{"$f":"IF( $AC40 = 0, \"\", IF( OFFSET( Combine!BG$9,$AC40 - 1,0,1,1)<>0, IF(OR($AD40=\"LUMP\", $AD40=\"LS\"), \"LUMP\", OFFSET( Combine!BG$9,$AC40 - 1,0,1,1)),\"\"))","v":""},{"$f":"IF( $AC40 = 0, \"\", IF( OFFSET( Combine!BH$9,$AC40 - 1,0,1,1)<>0, IF(OR($AD40=\"LUMP\", $AD40=\"LS\"), \"LUMP\", OFFSET( Combine!BH$9,$AC40 - 1,0,1,1)),\"\"))","v":""},{"$f":"IF( $AC40 = 0, \"\", IF( OFFSET( Combine!BI$9,$AC40 - 1,0,1,1)<>0, IF(OR($AD40=\"LUMP\", $AD40=\"LS\"), \"LUMP\", OFFSET( Combine!BI$9,$AC40 - 1,0,1,1)),\"\"))","v":""},{"$f":"IF( $AC40 = 0, \"\", IF( OFFSET( Combine!BJ$9,$AC40 - 1,0,1,1)<>0, IF(OR($AD40=\"LUMP\", $AD40=\"LS\"), \"LUMP\", OFFSET( Combine!BJ$9,$AC40 - 1,0,1,1)),\"\"))","v":""},{"$f":"IF( $AC40 = 0, \"\", IF( OFFSET( Combine!AP$9,$AC40 - 1,0,1,1)<>0, LEFT(OFFSET( Combine!AP$9,$AC40 - 1,0,1,1),3),\"\"))","v":""},{"$f":"IF( $AC40 = 0, \"\", IF( OFFSET( Combine!AP$9,$AC40 - 1,0,1,1)<>0, IF(LEN(OFFSET( Combine!AP$9,$AC40 - 1,0,1,1))=9,   RIGHT(OFFSET( Combine!AP$9,$AC40 - 1,0,1,1),5),    LEFT(RIGHT(OFFSET( Combine!AP$9,$AC40 - 1,0,1,1),6), 5)      ),\"\"))","v":""},"",{"$f":"IF( $AC40 = 0, \"\", IF( OFFSET( Combine!$AP$9,$AC40 - 1,0,1,1)<>0,IF(OR(AD40=\"LUMP\", AD40=\"LS\"), \"\", AD40),\"\"))","v":""},{"$f":"IF( $AC40 = 0, \"\", IF( OFFSET( Combine!$AP$9,$AC40 - 1,0,1,1)<>0, VLOOKUP( OFFSET( Combine!$AP$9,$AC40 - 1,0,1,1),[1]Items!$A$2:$E$10001,4,0),\"\"))","v":""},null,38,6,32,{"$f":"IF( $AC40 = 0, \"\", IF( OFFSET( Combine!$AP$9,$AC40 - 1,0,1,1)<>0, VLOOKUP( OFFSET( Combine!$AP$9,$AC40 - 1,0,1,1),[1]Items!$A$2:$E$10001,3,0),\"\"))","v":""}]
[{"$f":"IF( $AC41 = 0, \"\", IF( OFFSET( Combine!AQ$9,$AC41 - 1,0,1,1)<>0, IF(OR($AD41=\"LUMP\", $AD41=\"LS\"), \"LUMP\", OFFSET( Combine!AQ$9,$AC41 - 1,0,1,1)),\"\"))","v":""},{"$f":"IF( $AC41 = 0, \"\", IF( OFFSET( Combine!AR$9,$AC41 - 1,0,1,1)<>0, IF(OR($AD41=\"LUMP\", $AD41=\"LS\"), \"LUMP\", OFFSET( Combine!AR$9,$AC41 - 1,0,1,1)),\"\"))","v":""},{"$f":"IF( $AC41 = 0, \"\", IF( OFFSET( Combine!AS$9,$AC41 - 1,0,1,1)<>0, IF(OR($AD41=\"LUMP\", $AD41=\"LS\"), \"LUMP\", OFFSET( Combine!AS$9,$AC41 - 1,0,1,1)),\"\"))","v":""},{"$f":"IF( $AC41 = 0, \"\", IF( OFFSET( Combine!AT$9,$AC41 - 1,0,1,1)<>0, IF(OR($AD41=\"LUMP\", $AD41=\"LS\"), \"LUMP\", OFFSET( Combine!AT$9,$AC41 - 1,0,1,1)),\"\"))","v":""},{"$f":"IF( $AC41 = 0, \"\", IF( OFFSET( Combine!AU$9,$AC41 - 1,0,1,1)<>0, IF(OR($AD41=\"LUMP\", $AD41=\"LS\"), \"LUMP\", OFFSET( Combine!AU$9,$AC41 - 1,0,1,1)),\"\"))","v":""},{"$f":"IF( $AC41 = 0, \"\", IF( OFFSET( Combine!AV$9,$AC41 - 1,0,1,1)<>0, IF(OR($AD41=\"LUMP\", $AD41=\"LS\"), \"LUMP\", OFFSET( Combine!AV$9,$AC41 - 1,0,1,1)),\"\"))","v":""},{"$f":"IF( $AC41 = 0, \"\", IF( OFFSET( Combine!AW$9,$AC41 - 1,0,1,1)<>0, IF(OR($AD41=\"LUMP\", $AD41=\"LS\"), \"LUMP\", OFFSET( Combine!AW$9,$AC41 - 1,0,1,1)),\"\"))","v":""},{"$f":"IF( $AC41 = 0, \"\", IF( OFFSET( Combine!AX$9,$AC41 - 1,0,1,1)<>0, IF(OR($AD41=\"LUMP\", $AD41=\"LS\"), \"LUMP\", OFFSET( Combine!AX$9,$AC41 - 1,0,1,1)),\"\"))","v":""},{"$f":"IF( $AC41 = 0, \"\", IF( OFFSET( Combine!AY$9,$AC41 - 1,0,1,1)<>0, IF(OR($AD41=\"LUMP\", $AD41=\"LS\"), \"LUMP\", OFFSET( Combine!AY$9,$AC41 - 1,0,1,1)),\"\"))","v":""},{"$f":"IF( $AC41 = 0, \"\", IF( OFFSET( Combine!AZ$9,$AC41 - 1,0,1,1)<>0, IF(OR($AD41=\"LUMP\", $AD41=\"LS\"), \"LUMP\", OFFSET( Combine!AZ$9,$AC41 - 1,0,1,1)),\"\"))","v":""},{"$f":"IF( $AC41 = 0, \"\", IF( OFFSET( Combine!BA$9,$AC41 - 1,0,1,1)<>0, IF(OR($AD41=\"LUMP\", $AD41=\"LS\"), \"LUMP\", OFFSET( Combine!BA$9,$AC41 - 1,0,1,1)),\"\"))","v":""},{"$f":"IF( $AC41 = 0, \"\", IF( OFFSET( Combine!BB$9,$AC41 - 1,0,1,1)<>0, IF(OR($AD41=\"LUMP\", $AD41=\"LS\"), \"LUMP\", OFFSET( Combine!BB$9,$AC41 - 1,0,1,1)),\"\"))","v":""},{"$f":"IF( $AC41 = 0, \"\", IF( OFFSET( Combine!BC$9,$AC41 - 1,0,1,1)<>0, IF(OR($AD41=\"LUMP\", $AD41=\"LS\"), \"LUMP\", OFFSET( Combine!BC$9,$AC41 - 1,0,1,1)),\"\"))","v":""},{"$f":"IF( $AC41 = 0, \"\", IF( OFFSET( Combine!BD$9,$AC41 - 1,0,1,1)<>0, IF(OR($AD41=\"LUMP\", $AD41=\"LS\"), \"LUMP\", OFFSET( Combine!BD$9,$AC41 - 1,0,1,1)),\"\"))","v":""},{"$f":"IF( $AC41 = 0, \"\", IF( OFFSET( Combine!BE$9,$AC41 - 1,0,1,1)<>0, IF(OR($AD41=\"LUMP\", $AD41=\"LS\"), \"LUMP\", OFFSET( Combine!BE$9,$AC41 - 1,0,1,1)),\"\"))","v":""},{"$f":"IF( $AC41 = 0, \"\", IF( OFFSET( Combine!BF$9,$AC41 - 1,0,1,1)<>0, IF(OR($AD41=\"LUMP\", $AD41=\"LS\"), \"LUMP\", OFFSET( Combine!BF$9,$AC41 - 1,0,1,1)),\"\"))","v":""},{"$f":"IF( $AC41 = 0, \"\", IF( OFFSET( Combine!BG$9,$AC41 - 1,0,1,1)<>0, IF(OR($AD41=\"LUMP\", $AD41=\"LS\"), \"LUMP\", OFFSET( Combine!BG$9,$AC41 - 1,0,1,1)),\"\"))","v":""},{"$f":"IF( $AC41 = 0, \"\", IF( OFFSET( Combine!BH$9,$AC41 - 1,0,1,1)<>0, IF(OR($AD41=\"LUMP\", $AD41=\"LS\"), \"LUMP\", OFFSET( Combine!BH$9,$AC41 - 1,0,1,1)),\"\"))","v":""},{"$f":"IF( $AC41 = 0, \"\", IF( OFFSET( Combine!BI$9,$AC41 - 1,0,1,1)<>0, IF(OR($AD41=\"LUMP\", $AD41=\"LS\"), \"LUMP\", OFFSET( Combine!BI$9,$AC41 - 1,0,1,1)),\"\"))","v":""},{"$f":"IF( $AC41 = 0, \"\", IF( OFFSET( Combine!BJ$9,$AC41 - 1,0,1,1)<>0, IF(OR($AD41=\"LUMP\", $AD41=\"LS\"), \"LUMP\", OFFSET( Combine!BJ$9,$AC41 - 1,0,1,1)),\"\"))","v":""},{"$f":"IF( $AC41 = 0, \"\", IF( OFFSET( Combine!AP$9,$AC41 - 1,0,1,1)<>0, LEFT(OFFSET( Combine!AP$9,$AC41 - 1,0,1,1),3),\"\"))","v":""},{"$f":"IF( $AC41 = 0, \"\", IF( OFFSET( Combine!AP$9,$AC41 - 1,0,1,1)<>0, IF(LEN(OFFSET( Combine!AP$9,$AC41 - 1,0,1,1))=9,   RIGHT(OFFSET( Combine!AP$9,$AC41 - 1,0,1,1),5),    LEFT(RIGHT(OFFSET( Combine!AP$9,$AC41 - 1,0,1,1),6), 5)      ),\"\"))","v":""},"",{"$f":"IF( $AC41 = 0, \"\", IF( OFFSET( Combine!$AP$9,$AC41 - 1,0,1,1)<>0,IF(OR(AD41=\"LUMP\", AD41=\"LS\"), \"\", AD41),\"\"))","v":""},{"$f":"IF( $AC41 = 0, \"\", IF( OFFSET( Combine!$AP$9,$AC41 - 1,0,1,1)<>0, VLOOKUP( OFFSET( Combine!$AP$9,$AC41 - 1,0,1,1),[1]Items!$A$2:$E$10001,4,0),\"\"))","v":""},null,39,6,33,{"$f":"IF( $AC41 = 0, \"\", IF( OFFSET( Combine!$AP$9,$AC41 - 1,0,1,1)<>0, VLOOKUP( OFFSET( Combine!$AP$9,$AC41 - 1,0,1,1),[1]Items!$A$2:$E$10001,3,0),\"\"))","v":""}]
[{"$f":"IF( $AC42 = 0, \"\", IF( OFFSET( Combine!AQ$9,$AC42 - 1,0,1,1)<>0, IF(OR($AD42=\"LUMP\", $AD42=\"LS\"), \"LUMP\", OFFSET( Combine!AQ$9,$AC42 - 1,0,1,1)),\"\"))","v":""},{"$f":"IF( $AC42 = 0, \"\", IF( OFFSET( Combine!AR$9,$AC42 - 1,0,1,1)<>0, IF(OR($AD42=\"LUMP\", $AD42=\"LS\"), \"LUMP\", OFFSET( Combine!AR$9,$AC42 - 1,0,1,1)),\"\"))","v":""},{"$f":"IF( $AC42 = 0, \"\", IF( OFFSET( Combine!AS$9,$AC42 - 1,0,1,1)<>0, IF(OR($AD42=\"LUMP\", $AD42=\"LS\"), \"LUMP\", OFFSET( Combine!AS$9,$AC42 - 1,0,1,1)),\"\"))","v":""},{"$f":"IF( $AC42 = 0, \"\", IF( OFFSET( Combine!AT$9,$AC42 - 1,0,1,1)<>0, IF(OR($AD42=\"LUMP\", $AD42=\"LS\"), \"LUMP\", OFFSET( Combine!AT$9,$AC42 - 1,0,1,1)),\"\"))","v":""},{"$f":"IF( $AC42 = 0, \"\", IF( OFFSET( Combine!AU$9,$AC42 - 1,0,1,1)<>0, IF(OR($AD42=\"LUMP\", $AD42=\"LS\"), \"LUMP\", OFFSET( Combine!AU$9,$AC42 - 1,0,1,1)),\"\"))","v":""},{"$f":"IF( $AC42 = 0, \"\", IF( OFFSET( Combine!AV$9,$AC42 - 1,0,1,1)<>0, IF(OR($AD42=\"LUMP\", $AD42=\"LS\"), \"LUMP\", OFFSET( Combine!AV$9,$AC42 - 1,0,1,1)),\"\"))","v":""},{"$f":"IF( $AC42 = 0, \"\", IF( OFFSET( Combine!AW$9,$AC42 - 1,0,1,1)<>0, IF(OR($AD42=\"LUMP\", $AD42=\"LS\"), \"LUMP\", OFFSET( Combine!AW$9,$AC42 - 1,0,1,1)),\"\"))","v":""},{"$f":"IF( $AC42 = 0, \"\", IF( OFFSET( Combine!AX$9,$AC42 - 1,0,1,1)<>0, IF(OR($AD42=\"LUMP\", $AD42=\"LS\"), \"LUMP\", OFFSET( Combine!AX$9,$AC42 - 1,0,1,1)),\"\"))","v":""},{"$f":"IF( $AC42 = 0, \"\", IF( OFFSET( Combine!AY$9,$AC42 - 1,0,1,1)<>0, IF(OR($AD42=\"LUMP\", $AD42=\"LS\"), \"LUMP\", OFFSET( Combine!AY$9,$AC42 - 1,0,1,1)),\"\"))","v":""},{"$f":"IF( $AC42 = 0, \"\", IF( OFFSET( Combine!AZ$9,$AC42 - 1,0,1,1)<>0, IF(OR($AD42=\"LUMP\", $AD42=\"LS\"), \"LUMP\", OFFSET( Combine!AZ$9,$AC42 - 1,0,1,1)),\"\"))","v":""},{"$f":"IF( $AC42 = 0, \"\", IF( OFFSET( Combine!BA$9,$AC42 - 1,0,1,1)<>0, IF(OR($AD42=\"LUMP\", $AD42=\"LS\"), \"LUMP\", OFFSET( Combine!BA$9,$AC42 - 1,0,1,1)),\"\"))","v":""},{"$f":"IF( $AC42 = 0, \"\", IF( OFFSET( Combine!BB$9,$AC42 - 1,0,1,1)<>0, IF(OR($AD42=\"LUMP\", $AD42=\"LS\"), \"LUMP\", OFFSET( Combine!BB$9,$AC42 - 1,0,1,1)),\"\"))","v":""},{"$f":"IF( $AC42 = 0, \"\", IF( OFFSET( Combine!BC$9,$AC42 - 1,0,1,1)<>0, IF(OR($AD42=\"LUMP\", $AD42=\"LS\"), \"LUMP\", OFFSET( Combine!BC$9,$AC42 - 1,0,1,1)),\"\"))","v":""},{"$f":"IF( $AC42 = 0, \"\", IF( OFFSET( Combine!BD$9,$AC42 - 1,0,1,1)<>0, IF(OR($AD42=\"LUMP\", $AD42=\"LS\"), \"LUMP\", OFFSET( Combine!BD$9,$AC42 - 1,0,1,1)),\"\"))","v":""},{"$f":"IF( $AC42 = 0, \"\", IF( OFFSET( Combine!BE$9,$AC42 - 1,0,1,1)<>0, IF(OR($AD42=\"LUMP\", $AD42=\"LS\"), \"LUMP\", OFFSET( Combine!BE$9,$AC42 - 1,0,1,1)),\"\"))","v":""},{"$f":"IF( $AC42 = 0, \"\", IF( OFFSET( Combine!BF$9,$AC42 - 1,0,1,1)<>0, IF(OR($AD42=\"LUMP\", $AD42=\"LS\"), \"LUMP\", OFFSET( Combine!BF$9,$AC42 - 1,0,1,1)),\"\"))","v":""},{"$f":"IF( $AC42 = 0, \"\", IF( OFFSET( Combine!BG$9,$AC42 - 1,0,1,1)<>0, IF(OR($AD42=\"LUMP\", $AD42=\"LS\"), \"LUMP\", OFFSET( Combine!BG$9,$AC42 - 1,0,1,1)),\"\"))","v":""},{"$f":"IF( $AC42 = 0, \"\", IF( OFFSET( Combine!BH$9,$AC42 - 1,0,1,1)<>0, IF(OR($AD42=\"LUMP\", $AD42=\"LS\"), \"LUMP\", OFFSET( Combine!BH$9,$AC42 - 1,0,1,1)),\"\"))","v":""},{"$f":"IF( $AC42 = 0, \"\", IF( OFFSET( Combine!BI$9,$AC42 - 1,0,1,1)<>0, IF(OR($AD42=\"LUMP\", $AD42=\"LS\"), \"LUMP\", OFFSET( Combine!BI$9,$AC42 - 1,0,1,1)),\"\"))","v":""},{"$f":"IF( $AC42 = 0, \"\", IF( OFFSET( Combine!BJ$9,$AC42 - 1,0,1,1)<>0, IF(OR($AD42=\"LUMP\", $AD42=\"LS\"), \"LUMP\", OFFSET( Combine!BJ$9,$AC42 - 1,0,1,1)),\"\"))","v":""},{"$f":"IF( $AC42 = 0, \"\", IF( OFFSET( Combine!AP$9,$AC42 - 1,0,1,1)<>0, LEFT(OFFSET( Combine!AP$9,$AC42 - 1,0,1,1),3),\"\"))","v":""},{"$f":"IF( $AC42 = 0, \"\", IF( OFFSET( Combine!AP$9,$AC42 - 1,0,1,1)<>0, IF(LEN(OFFSET( Combine!AP$9,$AC42 - 1,0,1,1))=9,   RIGHT(OFFSET( Combine!AP$9,$AC42 - 1,0,1,1),5),    LEFT(RIGHT(OFFSET( Combine!AP$9,$AC42 - 1,0,1,1),6), 5)      ),\"\"))","v":""},"",{"$f":"IF( $AC42 = 0, \"\", IF( OFFSET( Combine!$AP$9,$AC42 - 1,0,1,1)<>0,IF(OR(AD42=\"LUMP\", AD42=\"LS\"), \"\", AD42),\"\"))","v":""},{"$f":"IF( $AC42 = 0, \"\", IF( OFFSET( Combine!$AP$9,$AC42 - 1,0,1,1)<>0, VLOOKUP( OFFSET( Combine!$AP$9,$AC42 - 1,0,1,1),[1]Items!$A$2:$E$10001,4,0),\"\"))","v":""},null,40,6,34,{"$f":"IF( $AC42 = 0, \"\", IF( OFFSET( Combine!$AP$9,$AC42 - 1,0,1,1)<>0, VLOOKUP( OFFSET( Combine!$AP$9,$AC42 - 1,0,1,1),[1]Items!$A$2:$E$10001,3,0),\"\"))","v":""}]
[{"$f":"IF( $AC43 = 0, \"\", IF( OFFSET( Combine!AQ$9,$AC43 - 1,0,1,1)<>0, IF(OR($AD43=\"LUMP\", $AD43=\"LS\"), \"LUMP\", OFFSET( Combine!AQ$9,$AC43 - 1,0,1,1)),\"\"))","v":""},{"$f":"IF( $AC43 = 0, \"\", IF( OFFSET( Combine!AR$9,$AC43 - 1,0,1,1)<>0, IF(OR($AD43=\"LUMP\", $AD43=\"LS\"), \"LUMP\", OFFSET( Combine!AR$9,$AC43 - 1,0,1,1)),\"\"))","v":""},{"$f":"IF( $AC43 = 0, \"\", IF( OFFSET( Combine!AS$9,$AC43 - 1,0,1,1)<>0, IF(OR($AD43=\"LUMP\", $AD43=\"LS\"), \"LUMP\", OFFSET( Combine!AS$9,$AC43 - 1,0,1,1)),\"\"))","v":""},{"$f":"IF( $AC43 = 0, \"\", IF( OFFSET( Combine!AT$9,$AC43 - 1,0,1,1)<>0, IF(OR($AD43=\"LUMP\", $AD43=\"LS\"), \"LUMP\", OFFSET( Combine!AT$9,$AC43 - 1,0,1,1)),\"\"))","v":""},{"$f":"IF( $AC43 = 0, \"\", IF( OFFSET( Combine!AU$9,$AC43 - 1,0,1,1)<>0, IF(OR($AD43=\"LUMP\", $AD43=\"LS\"), \"LUMP\", OFFSET( Combine!AU$9,$AC43 - 1,0,1,1)),\"\"))","v":""},{"$f":"IF( $AC43 = 0, \"\", IF( OFFSET( Combine!AV$9,$AC43 - 1,0,1,1)<>0, IF(OR($AD43=\"LUMP\", $AD43=\"LS\"), \"LUMP\", OFFSET( Combine!AV$9,$AC43 - 1,0,1,1)),\"\"))","v":""},{"$f":"IF( $AC43 = 0, \"\", IF( OFFSET( Combine!AW$9,$AC43 - 1,0,1,1)<>0, IF(OR($AD43=\"LUMP\", $AD43=\"LS\"), \"LUMP\", OFFSET( Combine!AW$9,$AC43 - 1,0,1,1)),\"\"))","v":""},{"$f":"IF( $AC43 = 0, \"\", IF( OFFSET( Combine!AX$9,$AC43 - 1,0,1,1)<>0, IF(OR($AD43=\"LUMP\", $AD43=\"LS\"), \"LUMP\", OFFSET( Combine!AX$9,$AC43 - 1,0,1,1)),\"\"))","v":""},{"$f":"IF( $AC43 = 0, \"\", IF( OFFSET( Combine!AY$9,$AC43 - 1,0,1,1)<>0, IF(OR($AD43=\"LUMP\", $AD43=\"LS\"), \"LUMP\", OFFSET( Combine!AY$9,$AC43 - 1,0,1,1)),\"\"))","v":""},{"$f":"IF( $AC43 = 0, \"\", IF( OFFSET( Combine!AZ$9,$AC43 - 1,0,1,1)<>0, IF(OR($AD43=\"LUMP\", $AD43=\"LS\"), \"LUMP\", OFFSET( Combine!AZ$9,$AC43 - 1,0,1,1)),\"\"))","v":""},{"$f":"IF( $AC43 = 0, \"\", IF( OFFSET( Combine!BA$9,$AC43 - 1,0,1,1)<>0, IF(OR($AD43=\"LUMP\", $AD43=\"LS\"), \"LUMP\", OFFSET( Combine!BA$9,$AC43 - 1,0,1,1)),\"\"))","v":""},{"$f":"IF( $AC43 = 0, \"\", IF( OFFSET( Combine!BB$9,$AC43 - 1,0,1,1)<>0, IF(OR($AD43=\"LUMP\", $AD43=\"LS\"), \"LUMP\", OFFSET( Combine!BB$9,$AC43 - 1,0,1,1)),\"\"))","v":""},{"$f":"IF( $AC43 = 0, \"\", IF( OFFSET( Combine!BC$9,$AC43 - 1,0,1,1)<>0, IF(OR($AD43=\"LUMP\", $AD43=\"LS\"), \"LUMP\", OFFSET( Combine!BC$9,$AC43 - 1,0,1,1)),\"\"))","v":""},{"$f":"IF( $AC43 = 0, \"\", IF( OFFSET( Combine!BD$9,$AC43 - 1,0,1,1)<>0, IF(OR($AD43=\"LUMP\", $AD43=\"LS\"), \"LUMP\", OFFSET( Combine!BD$9,$AC43 - 1,0,1,1)),\"\"))","v":""},{"$f":"IF( $AC43 = 0, \"\", IF( OFFSET( Combine!BE$9,$AC43 - 1,0,1,1)<>0, IF(OR($AD43=\"LUMP\", $AD43=\"LS\"), \"LUMP\", OFFSET( Combine!BE$9,$AC43 - 1,0,1,1)),\"\"))","v":""},{"$f":"IF( $AC43 = 0, \"\", IF( OFFSET( Combine!BF$9,$AC43 - 1,0,1,1)<>0, IF(OR($AD43=\"LUMP\", $AD43=\"LS\"), \"LUMP\", OFFSET( Combine!BF$9,$AC43 - 1,0,1,1)),\"\"))","v":""},{"$f":"IF( $AC43 = 0, \"\", IF( OFFSET( Combine!BG$9,$AC43 - 1,0,1,1)<>0, IF(OR($AD43=\"LUMP\", $AD43=\"LS\"), \"LUMP\", OFFSET( Combine!BG$9,$AC43 - 1,0,1,1)),\"\"))","v":""},{"$f":"IF( $AC43 = 0, \"\", IF( OFFSET( Combine!BH$9,$AC43 - 1,0,1,1)<>0, IF(OR($AD43=\"LUMP\", $AD43=\"LS\"), \"LUMP\", OFFSET( Combine!BH$9,$AC43 - 1,0,1,1)),\"\"))","v":""},{"$f":"IF( $AC43 = 0, \"\", IF( OFFSET( Combine!BI$9,$AC43 - 1,0,1,1)<>0, IF(OR($AD43=\"LUMP\", $AD43=\"LS\"), \"LUMP\", OFFSET( Combine!BI$9,$AC43 - 1,0,1,1)),\"\"))","v":""},{"$f":"IF( $AC43 = 0, \"\", IF( OFFSET( Combine!BJ$9,$AC43 - 1,0,1,1)<>0, IF(OR($AD43=\"LUMP\", $AD43=\"LS\"), \"LUMP\", OFFSET( Combine!BJ$9,$AC43 - 1,0,1,1)),\"\"))","v":""},{"$f":"IF( $AC43 = 0, \"\", IF( OFFSET( Combine!AP$9,$AC43 - 1,0,1,1)<>0, LEFT(OFFSET( Combine!AP$9,$AC43 - 1,0,1,1),3),\"\"))","v":""},{"$f":"IF( $AC43 = 0, \"\", IF( OFFSET( Combine!AP$9,$AC43 - 1,0,1,1)<>0, IF(LEN(OFFSET( Combine!AP$9,$AC43 - 1,0,1,1))=9,   RIGHT(OFFSET( Combine!AP$9,$AC43 - 1,0,1,1),5),    LEFT(RIGHT(OFFSET( Combine!AP$9,$AC43 - 1,0,1,1),6), 5)      ),\"\"))","v":""},"",{"$f":"IF( $AC43 = 0, \"\", IF( OFFSET( Combine!$AP$9,$AC43 - 1,0,1,1)<>0,IF(OR(AD43=\"LUMP\", AD43=\"LS\"), \"\", AD43),\"\"))","v":""},{"$f":"IF( $AC43 = 0, \"\", IF( OFFSET( Combine!$AP$9,$AC43 - 1,0,1,1)<>0, VLOOKUP( OFFSET( Combine!$AP$9,$AC43 - 1,0,1,1),[1]Items!$A$2:$E$10001,4,0),\"\"))","v":""},null,41,6,35,{"$f":"IF( $AC43 = 0, \"\", IF( OFFSET( Combine!$AP$9,$AC43 - 1,0,1,1)<>0, VLOOKUP( OFFSET( Combine!$AP$9,$AC43 - 1,0,1,1),[1]Items!$A$2:$E$10001,3,0),\"\"))","v":""}]
[{"$f":"IF( $AC44 = 0, \"\", IF( OFFSET( Combine!AQ$9,$AC44 - 1,0,1,1)<>0, IF(OR($AD44=\"LUMP\", $AD44=\"LS\"), \"LUMP\", OFFSET( Combine!AQ$9,$AC44 - 1,0,1,1)),\"\"))","v":""},{"$f":"IF( $AC44 = 0, \"\", IF( OFFSET( Combine!AR$9,$AC44 - 1,0,1,1)<>0, IF(OR($AD44=\"LUMP\", $AD44=\"LS\"), \"LUMP\", OFFSET( Combine!AR$9,$AC44 - 1,0,1,1)),\"\"))","v":""},{"$f":"IF( $AC44 = 0, \"\", IF( OFFSET( Combine!AS$9,$AC44 - 1,0,1,1)<>0, IF(OR($AD44=\"LUMP\", $AD44=\"LS\"), \"LUMP\", OFFSET( Combine!AS$9,$AC44 - 1,0,1,1)),\"\"))","v":""},{"$f":"IF( $AC44 = 0, \"\", IF( OFFSET( Combine!AT$9,$AC44 - 1,0,1,1)<>0, IF(OR($AD44=\"LUMP\", $AD44=\"LS\"), \"LUMP\", OFFSET( Combine!AT$9,$AC44 - 1,0,1,1)),\"\"))","v":""},{"$f":"IF( $AC44 = 0, \"\", IF( OFFSET( Combine!AU$9,$AC44 - 1,0,1,1)<>0, IF(OR($AD44=\"LUMP\", $AD44=\"LS\"), \"LUMP\", OFFSET( Combine!AU$9,$AC44 - 1,0,1,1)),\"\"))","v":""},{"$f":"IF( $AC44 = 0, \"\", IF( OFFSET( Combine!AV$9,$AC44 - 1,0,1,1)<>0, IF(OR($AD44=\"LUMP\", $AD44=\"LS\"), \"LUMP\", OFFSET( Combine!AV$9,$AC44 - 1,0,1,1)),\"\"))","v":""},{"$f":"IF( $AC44 = 0, \"\", IF( OFFSET( Combine!AW$9,$AC44 - 1,0,1,1)<>0, IF(OR($AD44=\"LUMP\", $AD44=\"LS\"), \"LUMP\", OFFSET( Combine!AW$9,$AC44 - 1,0,1,1)),\"\"))","v":""},{"$f":"IF( $AC44 = 0, \"\", IF( OFFSET( Combine!AX$9,$AC44 - 1,0,1,1)<>0, IF(OR($AD44=\"LUMP\", $AD44=\"LS\"), \"LUMP\", OFFSET( Combine!AX$9,$AC44 - 1,0,1,1)),\"\"))","v":""},{"$f":"IF( $AC44 = 0, \"\", IF( OFFSET( Combine!AY$9,$AC44 - 1,0,1,1)<>0, IF(OR($AD44=\"LUMP\", $AD44=\"LS\"), \"LUMP\", OFFSET( Combine!AY$9,$AC44 - 1,0,1,1)),\"\"))","v":""},{"$f":"IF( $AC44 = 0, \"\", IF( OFFSET( Combine!AZ$9,$AC44 - 1,0,1,1)<>0, IF(OR($AD44=\"LUMP\", $AD44=\"LS\"), \"LUMP\", OFFSET( Combine!AZ$9,$AC44 - 1,0,1,1)),\"\"))","v":""},{"$f":"IF( $AC44 = 0, \"\", IF( OFFSET( Combine!BA$9,$AC44 - 1,0,1,1)<>0, IF(OR($AD44=\"LUMP\", $AD44=\"LS\"), \"LUMP\", OFFSET( Combine!BA$9,$AC44 - 1,0,1,1)),\"\"))","v":""},{"$f":"IF( $AC44 = 0, \"\", IF( OFFSET( Combine!BB$9,$AC44 - 1,0,1,1)<>0, IF(OR($AD44=\"LUMP\", $AD44=\"LS\"), \"LUMP\", OFFSET( Combine!BB$9,$AC44 - 1,0,1,1)),\"\"))","v":""},{"$f":"IF( $AC44 = 0, \"\", IF( OFFSET( Combine!BC$9,$AC44 - 1,0,1,1)<>0, IF(OR($AD44=\"LUMP\", $AD44=\"LS\"), \"LUMP\", OFFSET( Combine!BC$9,$AC44 - 1,0,1,1)),\"\"))","v":""},{"$f":"IF( $AC44 = 0, \"\", IF( OFFSET( Combine!BD$9,$AC44 - 1,0,1,1)<>0, IF(OR($AD44=\"LUMP\", $AD44=\"LS\"), \"LUMP\", OFFSET( Combine!BD$9,$AC44 - 1,0,1,1)),\"\"))","v":""},{"$f":"IF( $AC44 = 0, \"\", IF( OFFSET( Combine!BE$9,$AC44 - 1,0,1,1)<>0, IF(OR($AD44=\"LUMP\", $AD44=\"LS\"), \"LUMP\", OFFSET( Combine!BE$9,$AC44 - 1,0,1,1)),\"\"))","v":""},{"$f":"IF( $AC44 = 0, \"\", IF( OFFSET( Combine!BF$9,$AC44 - 1,0,1,1)<>0, IF(OR($AD44=\"LUMP\", $AD44=\"LS\"), \"LUMP\", OFFSET( Combine!BF$9,$AC44 - 1,0,1,1)),\"\"))","v":""},{"$f":"IF( $AC44 = 0, \"\", IF( OFFSET( Combine!BG$9,$AC44 - 1,0,1,1)<>0, IF(OR($AD44=\"LUMP\", $AD44=\"LS\"), \"LUMP\", OFFSET( Combine!BG$9,$AC44 - 1,0,1,1)),\"\"))","v":""},{"$f":"IF( $AC44 = 0, \"\", IF( OFFSET( Combine!BH$9,$AC44 - 1,0,1,1)<>0, IF(OR($AD44=\"LUMP\", $AD44=\"LS\"), \"LUMP\", OFFSET( Combine!BH$9,$AC44 - 1,0,1,1)),\"\"))","v":""},{"$f":"IF( $AC44 = 0, \"\", IF( OFFSET( Combine!BI$9,$AC44 - 1,0,1,1)<>0, IF(OR($AD44=\"LUMP\", $AD44=\"LS\"), \"LUMP\", OFFSET( Combine!BI$9,$AC44 - 1,0,1,1)),\"\"))","v":""},{"$f":"IF( $AC44 = 0, \"\", IF( OFFSET( Combine!BJ$9,$AC44 - 1,0,1,1)<>0, IF(OR($AD44=\"LUMP\", $AD44=\"LS\"), \"LUMP\", OFFSET( Combine!BJ$9,$AC44 - 1,0,1,1)),\"\"))","v":""},{"$f":"IF( $AC44 = 0, \"\", IF( OFFSET( Combine!AP$9,$AC44 - 1,0,1,1)<>0, LEFT(OFFSET( Combine!AP$9,$AC44 - 1,0,1,1),3),\"\"))","v":""},{"$f":"IF( $AC44 = 0, \"\", IF( OFFSET( Combine!AP$9,$AC44 - 1,0,1,1)<>0, IF(LEN(OFFSET( Combine!AP$9,$AC44 - 1,0,1,1))=9,   RIGHT(OFFSET( Combine!AP$9,$AC44 - 1,0,1,1),5),    LEFT(RIGHT(OFFSET( Combine!AP$9,$AC44 - 1,0,1,1),6), 5)      ),\"\"))","v":""},"",{"$f":"IF( $AC44 = 0, \"\", IF( OFFSET( Combine!$AP$9,$AC44 - 1,0,1,1)<>0,IF(OR(AD44=\"LUMP\", AD44=\"LS\"), \"\", AD44),\"\"))","v":""},{"$f":"IF( $AC44 = 0, \"\", IF( OFFSET( Combine!$AP$9,$AC44 - 1,0,1,1)<>0, VLOOKUP( OFFSET( Combine!$AP$9,$AC44 - 1,0,1,1),[1]Items!$A$2:$E$10001,4,0),\"\"))","v":""},null,42,7,0,{"$f":"IF( $AC44 = 0, \"\", IF( OFFSET( Combine!$AP$9,$AC44 - 1,0,1,1)<>0, VLOOKUP( OFFSET( Combine!$AP$9,$AC44 - 1,0,1,1),[1]Items!$A$2:$E$10001,3,0),\"\"))","v":""}]
[{"$f":"IF( $AC45 = 0, \"\", IF( OFFSET( Combine!AQ$9,$AC45 - 1,0,1,1)<>0, IF(OR($AD45=\"LUMP\", $AD45=\"LS\"), \"LUMP\", OFFSET( Combine!AQ$9,$AC45 - 1,0,1,1)),\"\"))","v":""},{"$f":"IF( $AC45 = 0, \"\", IF( OFFSET( Combine!AR$9,$AC45 - 1,0,1,1)<>0, IF(OR($AD45=\"LUMP\", $AD45=\"LS\"), \"LUMP\", OFFSET( Combine!AR$9,$AC45 - 1,0,1,1)),\"\"))","v":""},{"$f":"IF( $AC45 = 0, \"\", IF( OFFSET( Combine!AS$9,$AC45 - 1,0,1,1)<>0, IF(OR($AD45=\"LUMP\", $AD45=\"LS\"), \"LUMP\", OFFSET( Combine!AS$9,$AC45 - 1,0,1,1)),\"\"))","v":""},{"$f":"IF( $AC45 = 0, \"\", IF( OFFSET( Combine!AT$9,$AC45 - 1,0,1,1)<>0, IF(OR($AD45=\"LUMP\", $AD45=\"LS\"), \"LUMP\", OFFSET( Combine!AT$9,$AC45 - 1,0,1,1)),\"\"))","v":""},{"$f":"IF( $AC45 = 0, \"\", IF( OFFSET( Combine!AU$9,$AC45 - 1,0,1,1)<>0, IF(OR($AD45=\"LUMP\", $AD45=\"LS\"), \"LUMP\", OFFSET( Combine!AU$9,$AC45 - 1,0,1,1)),\"\"))","v":""},{"$f":"IF( $AC45 = 0, \"\", IF( OFFSET( Combine!AV$9,$AC45 - 1,0,1,1)<>0, IF(OR($AD45=\"LUMP\", $AD45=\"LS\"), \"LUMP\", OFFSET( Combine!AV$9,$AC45 - 1,0,1,1)),\"\"))","v":""},{"$f":"IF( $AC45 = 0, \"\", IF( OFFSET( Combine!AW$9,$AC45 - 1,0,1,1)<>0, IF(OR($AD45=\"LUMP\", $AD45=\"LS\"), \"LUMP\", OFFSET( Combine!AW$9,$AC45 - 1,0,1,1)),\"\"))","v":""},{"$f":"IF( $AC45 = 0, \"\", IF( OFFSET( Combine!AX$9,$AC45 - 1,0,1,1)<>0, IF(OR($AD45=\"LUMP\", $AD45=\"LS\"), \"LUMP\", OFFSET( Combine!AX$9,$AC45 - 1,0,1,1)),\"\"))","v":""},{"$f":"IF( $AC45 = 0, \"\", IF( OFFSET( Combine!AY$9,$AC45 - 1,0,1,1)<>0, IF(OR($AD45=\"LUMP\", $AD45=\"LS\"), \"LUMP\", OFFSET( Combine!AY$9,$AC45 - 1,0,1,1)),\"\"))","v":""},{"$f":"IF( $AC45 = 0, \"\", IF( OFFSET( Combine!AZ$9,$AC45 - 1,0,1,1)<>0, IF(OR($AD45=\"LUMP\", $AD45=\"LS\"), \"LUMP\", OFFSET( Combine!AZ$9,$AC45 - 1,0,1,1)),\"\"))","v":""},{"$f":"IF( $AC45 = 0, \"\", IF( OFFSET( Combine!BA$9,$AC45 - 1,0,1,1)<>0, IF(OR($AD45=\"LUMP\", $AD45=\"LS\"), \"LUMP\", OFFSET( Combine!BA$9,$AC45 - 1,0,1,1)),\"\"))","v":""},{"$f":"IF( $AC45 = 0, \"\", IF( OFFSET( Combine!BB$9,$AC45 - 1,0,1,1)<>0, IF(OR($AD45=\"LUMP\", $AD45=\"LS\"), \"LUMP\", OFFSET( Combine!BB$9,$AC45 - 1,0,1,1)),\"\"))","v":""},{"$f":"IF( $AC45 = 0, \"\", IF( OFFSET( Combine!BC$9,$AC45 - 1,0,1,1)<>0, IF(OR($AD45=\"LUMP\", $AD45=\"LS\"), \"LUMP\", OFFSET( Combine!BC$9,$AC45 - 1,0,1,1)),\"\"))","v":""},{"$f":"IF( $AC45 = 0, \"\", IF( OFFSET( Combine!BD$9,$AC45 - 1,0,1,1)<>0, IF(OR($AD45=\"LUMP\", $AD45=\"LS\"), \"LUMP\", OFFSET( Combine!BD$9,$AC45 - 1,0,1,1)),\"\"))","v":""},{"$f":"IF( $AC45 = 0, \"\", IF( OFFSET( Combine!BE$9,$AC45 - 1,0,1,1)<>0, IF(OR($AD45=\"LUMP\", $AD45=\"LS\"), \"LUMP\", OFFSET( Combine!BE$9,$AC45 - 1,0,1,1)),\"\"))","v":""},{"$f":"IF( $AC45 = 0, \"\", IF( OFFSET( Combine!BF$9,$AC45 - 1,0,1,1)<>0, IF(OR($AD45=\"LUMP\", $AD45=\"LS\"), \"LUMP\", OFFSET( Combine!BF$9,$AC45 - 1,0,1,1)),\"\"))","v":""},{"$f":"IF( $AC45 = 0, \"\", IF( OFFSET( Combine!BG$9,$AC45 - 1,0,1,1)<>0, IF(OR($AD45=\"LUMP\", $AD45=\"LS\"), \"LUMP\", OFFSET( Combine!BG$9,$AC45 - 1,0,1,1)),\"\"))","v":""},{"$f":"IF( $AC45 = 0, \"\", IF( OFFSET( Combine!BH$9,$AC45 - 1,0,1,1)<>0, IF(OR($AD45=\"LUMP\", $AD45=\"LS\"), \"LUMP\", OFFSET( Combine!BH$9,$AC45 - 1,0,1,1)),\"\"))","v":""},{"$f":"IF( $AC45 = 0, \"\", IF( OFFSET( Combine!BI$9,$AC45 - 1,0,1,1)<>0, IF(OR($AD45=\"LUMP\", $AD45=\"LS\"), \"LUMP\", OFFSET( Combine!BI$9,$AC45 - 1,0,1,1)),\"\"))","v":""},{"$f":"IF( $AC45 = 0, \"\", IF( OFFSET( Combine!BJ$9,$AC45 - 1,0,1,1)<>0, IF(OR($AD45=\"LUMP\", $AD45=\"LS\"), \"LUMP\", OFFSET( Combine!BJ$9,$AC45 - 1,0,1,1)),\"\"))","v":""},{"$f":"IF( $AC45 = 0, \"\", IF( OFFSET( Combine!AP$9,$AC45 - 1,0,1,1)<>0, LEFT(OFFSET( Combine!AP$9,$AC45 - 1,0,1,1),3),\"\"))","v":""},{"$f":"IF( $AC45 = 0, \"\", IF( OFFSET( Combine!AP$9,$AC45 - 1,0,1,1)<>0, IF(LEN(OFFSET( Combine!AP$9,$AC45 - 1,0,1,1))=9,   RIGHT(OFFSET( Combine!AP$9,$AC45 - 1,0,1,1),5),    LEFT(RIGHT(OFFSET( Combine!AP$9,$AC45 - 1,0,1,1),6), 5)      ),\"\"))","v":""},"",{"$f":"IF( $AC45 = 0, \"\", IF( OFFSET( Combine!$AP$9,$AC45 - 1,0,1,1)<>0,IF(OR(AD45=\"LUMP\", AD45=\"LS\"), \"\", AD45),\"\"))","v":""},{"$f":"IF( $AC45 = 0, \"\", IF( OFFSET( Combine!$AP$9,$AC45 - 1,0,1,1)<>0, VLOOKUP( OFFSET( Combine!$AP$9,$AC45 - 1,0,1,1),[1]Items!$A$2:$E$10001,4,0),\"\"))","v":""},null,43,7,36,{"$f":"IF( $AC45 = 0, \"\", IF( OFFSET( Combine!$AP$9,$AC45 - 1,0,1,1)<>0, VLOOKUP( OFFSET( Combine!$AP$9,$AC45 - 1,0,1,1),[1]Items!$A$2:$E$10001,3,0),\"\"))","v":""}]
[{"$f":"IF( $AC46 = 0, \"\", IF( OFFSET( Combine!AQ$9,$AC46 - 1,0,1,1)<>0, IF(OR($AD46=\"LUMP\", $AD46=\"LS\"), \"LUMP\", OFFSET( Combine!AQ$9,$AC46 - 1,0,1,1)),\"\"))","v":""},{"$f":"IF( $AC46 = 0, \"\", IF( OFFSET( Combine!AR$9,$AC46 - 1,0,1,1)<>0, IF(OR($AD46=\"LUMP\", $AD46=\"LS\"), \"LUMP\", OFFSET( Combine!AR$9,$AC46 - 1,0,1,1)),\"\"))","v":""},{"$f":"IF( $AC46 = 0, \"\", IF( OFFSET( Combine!AS$9,$AC46 - 1,0,1,1)<>0, IF(OR($AD46=\"LUMP\", $AD46=\"LS\"), \"LUMP\", OFFSET( Combine!AS$9,$AC46 - 1,0,1,1)),\"\"))","v":""},{"$f":"IF( $AC46 = 0, \"\", IF( OFFSET( Combine!AT$9,$AC46 - 1,0,1,1)<>0, IF(OR($AD46=\"LUMP\", $AD46=\"LS\"), \"LUMP\", OFFSET( Combine!AT$9,$AC46 - 1,0,1,1)),\"\"))","v":""},{"$f":"IF( $AC46 = 0, \"\", IF( OFFSET( Combine!AU$9,$AC46 - 1,0,1,1)<>0, IF(OR($AD46=\"LUMP\", $AD46=\"LS\"), \"LUMP\", OFFSET( Combine!AU$9,$AC46 - 1,0,1,1)),\"\"))","v":""},{"$f":"IF( $AC46 = 0, \"\", IF( OFFSET( Combine!AV$9,$AC46 - 1,0,1,1)<>0, IF(OR($AD46=\"LUMP\", $AD46=\"LS\"), \"LUMP\", OFFSET( Combine!AV$9,$AC46 - 1,0,1,1)),\"\"))","v":""},{"$f":"IF( $AC46 = 0, \"\", IF( OFFSET( Combine!AW$9,$AC46 - 1,0,1,1)<>0, IF(OR($AD46=\"LUMP\", $AD46=\"LS\"), \"LUMP\", OFFSET( Combine!AW$9,$AC46 - 1,0,1,1)),\"\"))","v":""},{"$f":"IF( $AC46 = 0, \"\", IF( OFFSET( Combine!AX$9,$AC46 - 1,0,1,1)<>0, IF(OR($AD46=\"LUMP\", $AD46=\"LS\"), \"LUMP\", OFFSET( Combine!AX$9,$AC46 - 1,0,1,1)),\"\"))","v":""},{"$f":"IF( $AC46 = 0, \"\", IF( OFFSET( Combine!AY$9,$AC46 - 1,0,1,1)<>0, IF(OR($AD46=\"LUMP\", $AD46=\"LS\"), \"LUMP\", OFFSET( Combine!AY$9,$AC46 - 1,0,1,1)),\"\"))","v":""},{"$f":"IF( $AC46 = 0, \"\", IF( OFFSET( Combine!AZ$9,$AC46 - 1,0,1,1)<>0, IF(OR($AD46=\"LUMP\", $AD46=\"LS\"), \"LUMP\", OFFSET( Combine!AZ$9,$AC46 - 1,0,1,1)),\"\"))","v":""},{"$f":"IF( $AC46 = 0, \"\", IF( OFFSET( Combine!BA$9,$AC46 - 1,0,1,1)<>0, IF(OR($AD46=\"LUMP\", $AD46=\"LS\"), \"LUMP\", OFFSET( Combine!BA$9,$AC46 - 1,0,1,1)),\"\"))","v":""},{"$f":"IF( $AC46 = 0, \"\", IF( OFFSET( Combine!BB$9,$AC46 - 1,0,1,1)<>0, IF(OR($AD46=\"LUMP\", $AD46=\"LS\"), \"LUMP\", OFFSET( Combine!BB$9,$AC46 - 1,0,1,1)),\"\"))","v":""},{"$f":"IF( $AC46 = 0, \"\", IF( OFFSET( Combine!BC$9,$AC46 - 1,0,1,1)<>0, IF(OR($AD46=\"LUMP\", $AD46=\"LS\"), \"LUMP\", OFFSET( Combine!BC$9,$AC46 - 1,0,1,1)),\"\"))","v":""},{"$f":"IF( $AC46 = 0, \"\", IF( OFFSET( Combine!BD$9,$AC46 - 1,0,1,1)<>0, IF(OR($AD46=\"LUMP\", $AD46=\"LS\"), \"LUMP\", OFFSET( Combine!BD$9,$AC46 - 1,0,1,1)),\"\"))","v":""},{"$f":"IF( $AC46 = 0, \"\", IF( OFFSET( Combine!BE$9,$AC46 - 1,0,1,1)<>0, IF(OR($AD46=\"LUMP\", $AD46=\"LS\"), \"LUMP\", OFFSET( Combine!BE$9,$AC46 - 1,0,1,1)),\"\"))","v":""},{"$f":"IF( $AC46 = 0, \"\", IF( OFFSET( Combine!BF$9,$AC46 - 1,0,1,1)<>0, IF(OR($AD46=\"LUMP\", $AD46=\"LS\"), \"LUMP\", OFFSET( Combine!BF$9,$AC46 - 1,0,1,1)),\"\"))","v":""},{"$f":"IF( $AC46 = 0, \"\", IF( OFFSET( Combine!BG$9,$AC46 - 1,0,1,1)<>0, IF(OR($AD46=\"LUMP\", $AD46=\"LS\"), \"LUMP\", OFFSET( Combine!BG$9,$AC46 - 1,0,1,1)),\"\"))","v":""},{"$f":"IF( $AC46 = 0, \"\", IF( OFFSET( Combine!BH$9,$AC46 - 1,0,1,1)<>0, IF(OR($AD46=\"LUMP\", $AD46=\"LS\"), \"LUMP\", OFFSET( Combine!BH$9,$AC46 - 1,0,1,1)),\"\"))","v":""},{"$f":"IF( $AC46 = 0, \"\", IF( OFFSET( Combine!BI$9,$AC46 - 1,0,1,1)<>0, IF(OR($AD46=\"LUMP\", $AD46=\"LS\"), \"LUMP\", OFFSET( Combine!BI$9,$AC46 - 1,0,1,1)),\"\"))","v":""},{"$f":"IF( $AC46 = 0, \"\", IF( OFFSET( Combine!BJ$9,$AC46 - 1,0,1,1)<>0, IF(OR($AD46=\"LUMP\", $AD46=\"LS\"), \"LUMP\", OFFSET( Combine!BJ$9,$AC46 - 1,0,1,1)),\"\"))","v":""},{"$f":"IF( $AC46 = 0, \"\", IF( OFFSET( Combine!AP$9,$AC46 - 1,0,1,1)<>0, LEFT(OFFSET( Combine!AP$9,$AC46 - 1,0,1,1),3),\"\"))","v":""},{"$f":"IF( $AC46 = 0, \"\", IF( OFFSET( Combine!AP$9,$AC46 - 1,0,1,1)<>0, IF(LEN(OFFSET( Combine!AP$9,$AC46 - 1,0,1,1))=9,   RIGHT(OFFSET( Combine!AP$9,$AC46 - 1,0,1,1),5),    LEFT(RIGHT(OFFSET( Combine!AP$9,$AC46 - 1,0,1,1),6), 5)      ),\"\"))","v":""},"",{"$f":"IF( $AC46 = 0, \"\", IF( OFFSET( Combine!$AP$9,$AC46 - 1,0,1,1)<>0,IF(OR(AD46=\"LUMP\", AD46=\"LS\"), \"\", AD46),\"\"))","v":""},{"$f":"IF( $AC46 = 0, \"\", IF( OFFSET( Combine!$AP$9,$AC46 - 1,0,1,1)<>0, VLOOKUP( OFFSET( Combine!$AP$9,$AC46 - 1,0,1,1),[1]Items!$A$2:$E$10001,4,0),\"\"))","v":""},null,44,7,37,{"$f":"IF( $AC46 = 0, \"\", IF( OFFSET( Combine!$AP$9,$AC46 - 1,0,1,1)<>0, VLOOKUP( OFFSET( Combine!$AP$9,$AC46 - 1,0,1,1),[1]Items!$A$2:$E$10001,3,0),\"\"))","v":""}]
[{"$f":"IF( $AC47 = 0, \"\", IF( OFFSET( Combine!AQ$9,$AC47 - 1,0,1,1)<>0, IF(OR($AD47=\"LUMP\", $AD47=\"LS\"), \"LUMP\", OFFSET( Combine!AQ$9,$AC47 - 1,0,1,1)),\"\"))","v":""},{"$f":"IF( $AC47 = 0, \"\", IF( OFFSET( Combine!AR$9,$AC47 - 1,0,1,1)<>0, IF(OR($AD47=\"LUMP\", $AD47=\"LS\"), \"LUMP\", OFFSET( Combine!AR$9,$AC47 - 1,0,1,1)),\"\"))","v":""},{"$f":"IF( $AC47 = 0, \"\", IF( OFFSET( Combine!AS$9,$AC47 - 1,0,1,1)<>0, IF(OR($AD47=\"LUMP\", $AD47=\"LS\"), \"LUMP\", OFFSET( Combine!AS$9,$AC47 - 1,0,1,1)),\"\"))","v":""},{"$f":"IF( $AC47 = 0, \"\", IF( OFFSET( Combine!AT$9,$AC47 - 1,0,1,1)<>0, IF(OR($AD47=\"LUMP\", $AD47=\"LS\"), \"LUMP\", OFFSET( Combine!AT$9,$AC47 - 1,0,1,1)),\"\"))","v":""},{"$f":"IF( $AC47 = 0, \"\", IF( OFFSET( Combine!AU$9,$AC47 - 1,0,1,1)<>0, IF(OR($AD47=\"LUMP\", $AD47=\"LS\"), \"LUMP\", OFFSET( Combine!AU$9,$AC47 - 1,0,1,1)),\"\"))","v":""},{"$f":"IF( $AC47 = 0, \"\", IF( OFFSET( Combine!AV$9,$AC47 - 1,0,1,1)<>0, IF(OR($AD47=\"LUMP\", $AD47=\"LS\"), \"LUMP\", OFFSET( Combine!AV$9,$AC47 - 1,0,1,1)),\"\"))","v":""},{"$f":"IF( $AC47 = 0, \"\", IF( OFFSET( Combine!AW$9,$AC47 - 1,0,1,1)<>0, IF(OR($AD47=\"LUMP\", $AD47=\"LS\"), \"LUMP\", OFFSET( Combine!AW$9,$AC47 - 1,0,1,1)),\"\"))","v":""},{"$f":"IF( $AC47 = 0, \"\", IF( OFFSET( Combine!AX$9,$AC47 - 1,0,1,1)<>0, IF(OR($AD47=\"LUMP\", $AD47=\"LS\"), \"LUMP\", OFFSET( Combine!AX$9,$AC47 - 1,0,1,1)),\"\"))","v":""},{"$f":"IF( $AC47 = 0, \"\", IF( OFFSET( Combine!AY$9,$AC47 - 1,0,1,1)<>0, IF(OR($AD47=\"LUMP\", $AD47=\"LS\"), \"LUMP\", OFFSET( Combine!AY$9,$AC47 - 1,0,1,1)),\"\"))","v":""},{"$f":"IF( $AC47 = 0, \"\", IF( OFFSET( Combine!AZ$9,$AC47 - 1,0,1,1)<>0, IF(OR($AD47=\"LUMP\", $AD47=\"LS\"), \"LUMP\", OFFSET( Combine!AZ$9,$AC47 - 1,0,1,1)),\"\"))","v":""},{"$f":"IF( $AC47 = 0, \"\", IF( OFFSET( Combine!BA$9,$AC47 - 1,0,1,1)<>0, IF(OR($AD47=\"LUMP\", $AD47=\"LS\"), \"LUMP\", OFFSET( Combine!BA$9,$AC47 - 1,0,1,1)),\"\"))","v":""},{"$f":"IF( $AC47 = 0, \"\", IF( OFFSET( Combine!BB$9,$AC47 - 1,0,1,1)<>0, IF(OR($AD47=\"LUMP\", $AD47=\"LS\"), \"LUMP\", OFFSET( Combine!BB$9,$AC47 - 1,0,1,1)),\"\"))","v":""},{"$f":"IF( $AC47 = 0, \"\", IF( OFFSET( Combine!BC$9,$AC47 - 1,0,1,1)<>0, IF(OR($AD47=\"LUMP\", $AD47=\"LS\"), \"LUMP\", OFFSET( Combine!BC$9,$AC47 - 1,0,1,1)),\"\"))","v":""},{"$f":"IF( $AC47 = 0, \"\", IF( OFFSET( Combine!BD$9,$AC47 - 1,0,1,1)<>0, IF(OR($AD47=\"LUMP\", $AD47=\"LS\"), \"LUMP\", OFFSET( Combine!BD$9,$AC47 - 1,0,1,1)),\"\"))","v":""},{"$f":"IF( $AC47 = 0, \"\", IF( OFFSET( Combine!BE$9,$AC47 - 1,0,1,1)<>0, IF(OR($AD47=\"LUMP\", $AD47=\"LS\"), \"LUMP\", OFFSET( Combine!BE$9,$AC47 - 1,0,1,1)),\"\"))","v":""},{"$f":"IF( $AC47 = 0, \"\", IF( OFFSET( Combine!BF$9,$AC47 - 1,0,1,1)<>0, IF(OR($AD47=\"LUMP\", $AD47=\"LS\"), \"LUMP\", OFFSET( Combine!BF$9,$AC47 - 1,0,1,1)),\"\"))","v":""},{"$f":"IF( $AC47 = 0, \"\", IF( OFFSET( Combine!BG$9,$AC47 - 1,0,1,1)<>0, IF(OR($AD47=\"LUMP\", $AD47=\"LS\"), \"LUMP\", OFFSET( Combine!BG$9,$AC47 - 1,0,1,1)),\"\"))","v":""},{"$f":"IF( $AC47 = 0, \"\", IF( OFFSET( Combine!BH$9,$AC47 - 1,0,1,1)<>0, IF(OR($AD47=\"LUMP\", $AD47=\"LS\"), \"LUMP\", OFFSET( Combine!BH$9,$AC47 - 1,0,1,1)),\"\"))","v":""},{"$f":"IF( $AC47 = 0, \"\", IF( OFFSET( Combine!BI$9,$AC47 - 1,0,1,1)<>0, IF(OR($AD47=\"LUMP\", $AD47=\"LS\"), \"LUMP\", OFFSET( Combine!BI$9,$AC47 - 1,0,1,1)),\"\"))","v":""},{"$f":"IF( $AC47 = 0, \"\", IF( OFFSET( Combine!BJ$9,$AC47 - 1,0,1,1)<>0, IF(OR($AD47=\"LUMP\", $AD47=\"LS\"), \"LUMP\", OFFSET( Combine!BJ$9,$AC47 - 1,0,1,1)),\"\"))","v":""},{"$f":"IF( $AC47 = 0, \"\", IF( OFFSET( Combine!AP$9,$AC47 - 1,0,1,1)<>0, LEFT(OFFSET( Combine!AP$9,$AC47 - 1,0,1,1),3),\"\"))","v":""},{"$f":"IF( $AC47 = 0, \"\", IF( OFFSET( Combine!AP$9,$AC47 - 1,0,1,1)<>0, IF(LEN(OFFSET( Combine!AP$9,$AC47 - 1,0,1,1))=9,   RIGHT(OFFSET( Combine!AP$9,$AC47 - 1,0,1,1),5),    LEFT(RIGHT(OFFSET( Combine!AP$9,$AC47 - 1,0,1,1),6), 5)      ),\"\"))","v":""},"",{"$f":"IF( $AC47 = 0, \"\", IF( OFFSET( Combine!$AP$9,$AC47 - 1,0,1,1)<>0,IF(OR(AD47=\"LUMP\", AD47=\"LS\"), \"\", AD47),\"\"))","v":""},{"$f":"IF( $AC47 = 0, \"\", IF( OFFSET( Combine!$AP$9,$AC47 - 1,0,1,1)<>0, VLOOKUP( OFFSET( Combine!$AP$9,$AC47 - 1,0,1,1),[1]Items!$A$2:$E$10001,4,0),\"\"))","v":""},null,45,7,38,{"$f":"IF( $AC47 = 0, \"\", IF( OFFSET( Combine!$AP$9,$AC47 - 1,0,1,1)<>0, VLOOKUP( OFFSET( Combine!$AP$9,$AC47 - 1,0,1,1),[1]Items!$A$2:$E$10001,3,0),\"\"))","v":""}]
[{"$f":"IF( $AC48 = 0, \"\", IF( OFFSET( Combine!AQ$9,$AC48 - 1,0,1,1)<>0, IF(OR($AD48=\"LUMP\", $AD48=\"LS\"), \"LUMP\", OFFSET( Combine!AQ$9,$AC48 - 1,0,1,1)),\"\"))","v":""},{"$f":"IF( $AC48 = 0, \"\", IF( OFFSET( Combine!AR$9,$AC48 - 1,0,1,1)<>0, IF(OR($AD48=\"LUMP\", $AD48=\"LS\"), \"LUMP\", OFFSET( Combine!AR$9,$AC48 - 1,0,1,1)),\"\"))","v":""},{"$f":"IF( $AC48 = 0, \"\", IF( OFFSET( Combine!AS$9,$AC48 - 1,0,1,1)<>0, IF(OR($AD48=\"LUMP\", $AD48=\"LS\"), \"LUMP\", OFFSET( Combine!AS$9,$AC48 - 1,0,1,1)),\"\"))","v":""},{"$f":"IF( $AC48 = 0, \"\", IF( OFFSET( Combine!AT$9,$AC48 - 1,0,1,1)<>0, IF(OR($AD48=\"LUMP\", $AD48=\"LS\"), \"LUMP\", OFFSET( Combine!AT$9,$AC48 - 1,0,1,1)),\"\"))","v":""},{"$f":"IF( $AC48 = 0, \"\", IF( OFFSET( Combine!AU$9,$AC48 - 1,0,1,1)<>0, IF(OR($AD48=\"LUMP\", $AD48=\"LS\"), \"LUMP\", OFFSET( Combine!AU$9,$AC48 - 1,0,1,1)),\"\"))","v":""},{"$f":"IF( $AC48 = 0, \"\", IF( OFFSET( Combine!AV$9,$AC48 - 1,0,1,1)<>0, IF(OR($AD48=\"LUMP\", $AD48=\"LS\"), \"LUMP\", OFFSET( Combine!AV$9,$AC48 - 1,0,1,1)),\"\"))","v":""},{"$f":"IF( $AC48 = 0, \"\", IF( OFFSET( Combine!AW$9,$AC48 - 1,0,1,1)<>0, IF(OR($AD48=\"LUMP\", $AD48=\"LS\"), \"LUMP\", OFFSET( Combine!AW$9,$AC48 - 1,0,1,1)),\"\"))","v":""},{"$f":"IF( $AC48 = 0, \"\", IF( OFFSET( Combine!AX$9,$AC48 - 1,0,1,1)<>0, IF(OR($AD48=\"LUMP\", $AD48=\"LS\"), \"LUMP\", OFFSET( Combine!AX$9,$AC48 - 1,0,1,1)),\"\"))","v":""},{"$f":"IF( $AC48 = 0, \"\", IF( OFFSET( Combine!AY$9,$AC48 - 1,0,1,1)<>0, IF(OR($AD48=\"LUMP\", $AD48=\"LS\"), \"LUMP\", OFFSET( Combine!AY$9,$AC48 - 1,0,1,1)),\"\"))","v":""},{"$f":"IF( $AC48 = 0, \"\", IF( OFFSET( Combine!AZ$9,$AC48 - 1,0,1,1)<>0, IF(OR($AD48=\"LUMP\", $AD48=\"LS\"), \"LUMP\", OFFSET( Combine!AZ$9,$AC48 - 1,0,1,1)),\"\"))","v":""},{"$f":"IF( $AC48 = 0, \"\", IF( OFFSET( Combine!BA$9,$AC48 - 1,0,1,1)<>0, IF(OR($AD48=\"LUMP\", $AD48=\"LS\"), \"LUMP\", OFFSET( Combine!BA$9,$AC48 - 1,0,1,1)),\"\"))","v":""},{"$f":"IF( $AC48 = 0, \"\", IF( OFFSET( Combine!BB$9,$AC48 - 1,0,1,1)<>0, IF(OR($AD48=\"LUMP\", $AD48=\"LS\"), \"LUMP\", OFFSET( Combine!BB$9,$AC48 - 1,0,1,1)),\"\"))","v":""},{"$f":"IF( $AC48 = 0, \"\", IF( OFFSET( Combine!BC$9,$AC48 - 1,0,1,1)<>0, IF(OR($AD48=\"LUMP\", $AD48=\"LS\"), \"LUMP\", OFFSET( Combine!BC$9,$AC48 - 1,0,1,1)),\"\"))","v":""},{"$f":"IF( $AC48 = 0, \"\", IF( OFFSET( Combine!BD$9,$AC48 - 1,0,1,1)<>0, IF(OR($AD48=\"LUMP\", $AD48=\"LS\"), \"LUMP\", OFFSET( Combine!BD$9,$AC48 - 1,0,1,1)),\"\"))","v":""},{"$f":"IF( $AC48 = 0, \"\", IF( OFFSET( Combine!BE$9,$AC48 - 1,0,1,1)<>0, IF(OR($AD48=\"LUMP\", $AD48=\"LS\"), \"LUMP\", OFFSET( Combine!BE$9,$AC48 - 1,0,1,1)),\"\"))","v":""},{"$f":"IF( $AC48 = 0, \"\", IF( OFFSET( Combine!BF$9,$AC48 - 1,0,1,1)<>0, IF(OR($AD48=\"LUMP\", $AD48=\"LS\"), \"LUMP\", OFFSET( Combine!BF$9,$AC48 - 1,0,1,1)),\"\"))","v":""},{"$f":"IF( $AC48 = 0, \"\", IF( OFFSET( Combine!BG$9,$AC48 - 1,0,1,1)<>0, IF(OR($AD48=\"LUMP\", $AD48=\"LS\"), \"LUMP\", OFFSET( Combine!BG$9,$AC48 - 1,0,1,1)),\"\"))","v":""},{"$f":"IF( $AC48 = 0, \"\", IF( OFFSET( Combine!BH$9,$AC48 - 1,0,1,1)<>0, IF(OR($AD48=\"LUMP\", $AD48=\"LS\"), \"LUMP\", OFFSET( Combine!BH$9,$AC48 - 1,0,1,1)),\"\"))","v":""},{"$f":"IF( $AC48 = 0, \"\", IF( OFFSET( Combine!BI$9,$AC48 - 1,0,1,1)<>0, IF(OR($AD48=\"LUMP\", $AD48=\"LS\"), \"LUMP\", OFFSET( Combine!BI$9,$AC48 - 1,0,1,1)),\"\"))","v":""},{"$f":"IF( $AC48 = 0, \"\", IF( OFFSET( Combine!BJ$9,$AC48 - 1,0,1,1)<>0, IF(OR($AD48=\"LUMP\", $AD48=\"LS\"), \"LUMP\", OFFSET( Combine!BJ$9,$AC48 - 1,0,1,1)),\"\"))","v":""},{"$f":"IF( $AC48 = 0, \"\", IF( OFFSET( Combine!AP$9,$AC48 - 1,0,1,1)<>0, LEFT(OFFSET( Combine!AP$9,$AC48 - 1,0,1,1),3),\"\"))","v":""},{"$f":"IF( $AC48 = 0, \"\", IF( OFFSET( Combine!AP$9,$AC48 - 1,0,1,1)<>0, IF(LEN(OFFSET( Combine!AP$9,$AC48 - 1,0,1,1))=9,   RIGHT(OFFSET( Combine!AP$9,$AC48 - 1,0,1,1),5),    LEFT(RIGHT(OFFSET( Combine!AP$9,$AC48 - 1,0,1,1),6), 5)      ),\"\"))","v":""},"",{"$f":"IF( $AC48 = 0, \"\", IF( OFFSET( Combine!$AP$9,$AC48 - 1,0,1,1)<>0,IF(OR(AD48=\"LUMP\", AD48=\"LS\"), \"\", AD48),\"\"))","v":""},{"$f":"IF( $AC48 = 0, \"\", IF( OFFSET( Combine!$AP$9,$AC48 - 1,0,1,1)<>0, VLOOKUP( OFFSET( Combine!$AP$9,$AC48 - 1,0,1,1),[1]Items!$A$2:$E$10001,4,0),\"\"))","v":""},null,46,7,39,{"$f":"IF( $AC48 = 0, \"\", IF( OFFSET( Combine!$AP$9,$AC48 - 1,0,1,1)<>0, VLOOKUP( OFFSET( Combine!$AP$9,$AC48 - 1,0,1,1),[1]Items!$A$2:$E$10001,3,0),\"\"))","v":""}]
[{"$f":"IF( $AC49 = 0, \"\", IF( OFFSET( Combine!AQ$9,$AC49 - 1,0,1,1)<>0, IF(OR($AD49=\"LUMP\", $AD49=\"LS\"), \"LUMP\", OFFSET( Combine!AQ$9,$AC49 - 1,0,1,1)),\"\"))","v":""},{"$f":"IF( $AC49 = 0, \"\", IF( OFFSET( Combine!AR$9,$AC49 - 1,0,1,1)<>0, IF(OR($AD49=\"LUMP\", $AD49=\"LS\"), \"LUMP\", OFFSET( Combine!AR$9,$AC49 - 1,0,1,1)),\"\"))","v":""},{"$f":"IF( $AC49 = 0, \"\", IF( OFFSET( Combine!AS$9,$AC49 - 1,0,1,1)<>0, IF(OR($AD49=\"LUMP\", $AD49=\"LS\"), \"LUMP\", OFFSET( Combine!AS$9,$AC49 - 1,0,1,1)),\"\"))","v":""},{"$f":"IF( $AC49 = 0, \"\", IF( OFFSET( Combine!AT$9,$AC49 - 1,0,1,1)<>0, IF(OR($AD49=\"LUMP\", $AD49=\"LS\"), \"LUMP\", OFFSET( Combine!AT$9,$AC49 - 1,0,1,1)),\"\"))","v":""},{"$f":"IF( $AC49 = 0, \"\", IF( OFFSET( Combine!AU$9,$AC49 - 1,0,1,1)<>0, IF(OR($AD49=\"LUMP\", $AD49=\"LS\"), \"LUMP\", OFFSET( Combine!AU$9,$AC49 - 1,0,1,1)),\"\"))","v":""},{"$f":"IF( $AC49 = 0, \"\", IF( OFFSET( Combine!AV$9,$AC49 - 1,0,1,1)<>0, IF(OR($AD49=\"LUMP\", $AD49=\"LS\"), \"LUMP\", OFFSET( Combine!AV$9,$AC49 - 1,0,1,1)),\"\"))","v":""},{"$f":"IF( $AC49 = 0, \"\", IF( OFFSET( Combine!AW$9,$AC49 - 1,0,1,1)<>0, IF(OR($AD49=\"LUMP\", $AD49=\"LS\"), \"LUMP\", OFFSET( Combine!AW$9,$AC49 - 1,0,1,1)),\"\"))","v":""},{"$f":"IF( $AC49 = 0, \"\", IF( OFFSET( Combine!AX$9,$AC49 - 1,0,1,1)<>0, IF(OR($AD49=\"LUMP\", $AD49=\"LS\"), \"LUMP\", OFFSET( Combine!AX$9,$AC49 - 1,0,1,1)),\"\"))","v":""},{"$f":"IF( $AC49 = 0, \"\", IF( OFFSET( Combine!AY$9,$AC49 - 1,0,1,1)<>0, IF(OR($AD49=\"LUMP\", $AD49=\"LS\"), \"LUMP\", OFFSET( Combine!AY$9,$AC49 - 1,0,1,1)),\"\"))","v":""},{"$f":"IF( $AC49 = 0, \"\", IF( OFFSET( Combine!AZ$9,$AC49 - 1,0,1,1)<>0, IF(OR($AD49=\"LUMP\", $AD49=\"LS\"), \"LUMP\", OFFSET( Combine!AZ$9,$AC49 - 1,0,1,1)),\"\"))","v":""},{"$f":"IF( $AC49 = 0, \"\", IF( OFFSET( Combine!BA$9,$AC49 - 1,0,1,1)<>0, IF(OR($AD49=\"LUMP\", $AD49=\"LS\"), \"LUMP\", OFFSET( Combine!BA$9,$AC49 - 1,0,1,1)),\"\"))","v":""},{"$f":"IF( $AC49 = 0, \"\", IF( OFFSET( Combine!BB$9,$AC49 - 1,0,1,1)<>0, IF(OR($AD49=\"LUMP\", $AD49=\"LS\"), \"LUMP\", OFFSET( Combine!BB$9,$AC49 - 1,0,1,1)),\"\"))","v":""},{"$f":"IF( $AC49 = 0, \"\", IF( OFFSET( Combine!BC$9,$AC49 - 1,0,1,1)<>0, IF(OR($AD49=\"LUMP\", $AD49=\"LS\"), \"LUMP\", OFFSET( Combine!BC$9,$AC49 - 1,0,1,1)),\"\"))","v":""},{"$f":"IF( $AC49 = 0, \"\", IF( OFFSET( Combine!BD$9,$AC49 - 1,0,1,1)<>0, IF(OR($AD49=\"LUMP\", $AD49=\"LS\"), \"LUMP\", OFFSET( Combine!BD$9,$AC49 - 1,0,1,1)),\"\"))","v":""},{"$f":"IF( $AC49 = 0, \"\", IF( OFFSET( Combine!BE$9,$AC49 - 1,0,1,1)<>0, IF(OR($AD49=\"LUMP\", $AD49=\"LS\"), \"LUMP\", OFFSET( Combine!BE$9,$AC49 - 1,0,1,1)),\"\"))","v":""},{"$f":"IF( $AC49 = 0, \"\", IF( OFFSET( Combine!BF$9,$AC49 - 1,0,1,1)<>0, IF(OR($AD49=\"LUMP\", $AD49=\"LS\"), \"LUMP\", OFFSET( Combine!BF$9,$AC49 - 1,0,1,1)),\"\"))","v":""},{"$f":"IF( $AC49 = 0, \"\", IF( OFFSET( Combine!BG$9,$AC49 - 1,0,1,1)<>0, IF(OR($AD49=\"LUMP\", $AD49=\"LS\"), \"LUMP\", OFFSET( Combine!BG$9,$AC49 - 1,0,1,1)),\"\"))","v":""},{"$f":"IF( $AC49 = 0, \"\", IF( OFFSET( Combine!BH$9,$AC49 - 1,0,1,1)<>0, IF(OR($AD49=\"LUMP\", $AD49=\"LS\"), \"LUMP\", OFFSET( Combine!BH$9,$AC49 - 1,0,1,1)),\"\"))","v":""},{"$f":"IF( $AC49 = 0, \"\", IF( OFFSET( Combine!BI$9,$AC49 - 1,0,1,1)<>0, IF(OR($AD49=\"LUMP\", $AD49=\"LS\"), \"LUMP\", OFFSET( Combine!BI$9,$AC49 - 1,0,1,1)),\"\"))","v":""},{"$f":"IF( $AC49 = 0, \"\", IF( OFFSET( Combine!BJ$9,$AC49 - 1,0,1,1)<>0, IF(OR($AD49=\"LUMP\", $AD49=\"LS\"), \"LUMP\", OFFSET( Combine!BJ$9,$AC49 - 1,0,1,1)),\"\"))","v":""},{"$f":"IF( $AC49 = 0, \"\", IF( OFFSET( Combine!AP$9,$AC49 - 1,0,1,1)<>0, LEFT(OFFSET( Combine!AP$9,$AC49 - 1,0,1,1),3),\"\"))","v":""},{"$f":"IF( $AC49 = 0, \"\", IF( OFFSET( Combine!AP$9,$AC49 - 1,0,1,1)<>0, IF(LEN(OFFSET( Combine!AP$9,$AC49 - 1,0,1,1))=9,   RIGHT(OFFSET( Combine!AP$9,$AC49 - 1,0,1,1),5),    LEFT(RIGHT(OFFSET( Combine!AP$9,$AC49 - 1,0,1,1),6), 5)      ),\"\"))","v":""},"",{"$f":"IF( $AC49 = 0, \"\", IF( OFFSET( Combine!$AP$9,$AC49 - 1,0,1,1)<>0,IF(OR(AD49=\"LUMP\", AD49=\"LS\"), \"\", AD49),\"\"))","v":""},{"$f":"IF( $AC49 = 0, \"\", IF( OFFSET( Combine!$AP$9,$AC49 - 1,0,1,1)<>0, VLOOKUP( OFFSET( Combine!$AP$9,$AC49 - 1,0,1,1),[1]Items!$A$2:$E$10001,4,0),\"\"))","v":""},null,47,7,40,{"$f":"IF( $AC49 = 0, \"\", IF( OFFSET( Combine!$AP$9,$AC49 - 1,0,1,1)<>0, VLOOKUP( OFFSET( Combine!$AP$9,$AC49 - 1,0,1,1),[1]Items!$A$2:$E$10001,3,0),\"\"))","v":""}]
[{"$f":"IF( $AC50 = 0, \"\", IF( OFFSET( Combine!AQ$9,$AC50 - 1,0,1,1)<>0, IF(OR($AD50=\"LUMP\", $AD50=\"LS\"), \"LUMP\", OFFSET( Combine!AQ$9,$AC50 - 1,0,1,1)),\"\"))","v":""},{"$f":"IF( $AC50 = 0, \"\", IF( OFFSET( Combine!AR$9,$AC50 - 1,0,1,1)<>0, IF(OR($AD50=\"LUMP\", $AD50=\"LS\"), \"LUMP\", OFFSET( Combine!AR$9,$AC50 - 1,0,1,1)),\"\"))","v":""},{"$f":"IF( $AC50 = 0, \"\", IF( OFFSET( Combine!AS$9,$AC50 - 1,0,1,1)<>0, IF(OR($AD50=\"LUMP\", $AD50=\"LS\"), \"LUMP\", OFFSET( Combine!AS$9,$AC50 - 1,0,1,1)),\"\"))","v":""},{"$f":"IF( $AC50 = 0, \"\", IF( OFFSET( Combine!AT$9,$AC50 - 1,0,1,1)<>0, IF(OR($AD50=\"LUMP\", $AD50=\"LS\"), \"LUMP\", OFFSET( Combine!AT$9,$AC50 - 1,0,1,1)),\"\"))","v":""},{"$f":"IF( $AC50 = 0, \"\", IF( OFFSET( Combine!AU$9,$AC50 - 1,0,1,1)<>0, IF(OR($AD50=\"LUMP\", $AD50=\"LS\"), \"LUMP\", OFFSET( Combine!AU$9,$AC50 - 1,0,1,1)),\"\"))","v":""},{"$f":"IF( $AC50 = 0, \"\", IF( OFFSET( Combine!AV$9,$AC50 - 1,0,1,1)<>0, IF(OR($AD50=\"LUMP\", $AD50=\"LS\"), \"LUMP\", OFFSET( Combine!AV$9,$AC50 - 1,0,1,1)),\"\"))","v":""},{"$f":"IF( $AC50 = 0, \"\", IF( OFFSET( Combine!AW$9,$AC50 - 1,0,1,1)<>0, IF(OR($AD50=\"LUMP\", $AD50=\"LS\"), \"LUMP\", OFFSET( Combine!AW$9,$AC50 - 1,0,1,1)),\"\"))","v":""},{"$f":"IF( $AC50 = 0, \"\", IF( OFFSET( Combine!AX$9,$AC50 - 1,0,1,1)<>0, IF(OR($AD50=\"LUMP\", $AD50=\"LS\"), \"LUMP\", OFFSET( Combine!AX$9,$AC50 - 1,0,1,1)),\"\"))","v":""},{"$f":"IF( $AC50 = 0, \"\", IF( OFFSET( Combine!AY$9,$AC50 - 1,0,1,1)<>0, IF(OR($AD50=\"LUMP\", $AD50=\"LS\"), \"LUMP\", OFFSET( Combine!AY$9,$AC50 - 1,0,1,1)),\"\"))","v":""},{"$f":"IF( $AC50 = 0, \"\", IF( OFFSET( Combine!AZ$9,$AC50 - 1,0,1,1)<>0, IF(OR($AD50=\"LUMP\", $AD50=\"LS\"), \"LUMP\", OFFSET( Combine!AZ$9,$AC50 - 1,0,1,1)),\"\"))","v":""},{"$f":"IF( $AC50 = 0, \"\", IF( OFFSET( Combine!BA$9,$AC50 - 1,0,1,1)<>0, IF(OR($AD50=\"LUMP\", $AD50=\"LS\"), \"LUMP\", OFFSET( Combine!BA$9,$AC50 - 1,0,1,1)),\"\"))","v":""},{"$f":"IF( $AC50 = 0, \"\", IF( OFFSET( Combine!BB$9,$AC50 - 1,0,1,1)<>0, IF(OR($AD50=\"LUMP\", $AD50=\"LS\"), \"LUMP\", OFFSET( Combine!BB$9,$AC50 - 1,0,1,1)),\"\"))","v":""},{"$f":"IF( $AC50 = 0, \"\", IF( OFFSET( Combine!BC$9,$AC50 - 1,0,1,1)<>0, IF(OR($AD50=\"LUMP\", $AD50=\"LS\"), \"LUMP\", OFFSET( Combine!BC$9,$AC50 - 1,0,1,1)),\"\"))","v":""},{"$f":"IF( $AC50 = 0, \"\", IF( OFFSET( Combine!BD$9,$AC50 - 1,0,1,1)<>0, IF(OR($AD50=\"LUMP\", $AD50=\"LS\"), \"LUMP\", OFFSET( Combine!BD$9,$AC50 - 1,0,1,1)),\"\"))","v":""},{"$f":"IF( $AC50 = 0, \"\", IF( OFFSET( Combine!BE$9,$AC50 - 1,0,1,1)<>0, IF(OR($AD50=\"LUMP\", $AD50=\"LS\"), \"LUMP\", OFFSET( Combine!BE$9,$AC50 - 1,0,1,1)),\"\"))","v":""},{"$f":"IF( $AC50 = 0, \"\", IF( OFFSET( Combine!BF$9,$AC50 - 1,0,1,1)<>0, IF(OR($AD50=\"LUMP\", $AD50=\"LS\"), \"LUMP\", OFFSET( Combine!BF$9,$AC50 - 1,0,1,1)),\"\"))","v":""},{"$f":"IF( $AC50 = 0, \"\", IF( OFFSET( Combine!BG$9,$AC50 - 1,0,1,1)<>0, IF(OR($AD50=\"LUMP\", $AD50=\"LS\"), \"LUMP\", OFFSET( Combine!BG$9,$AC50 - 1,0,1,1)),\"\"))","v":""},{"$f":"IF( $AC50 = 0, \"\", IF( OFFSET( Combine!BH$9,$AC50 - 1,0,1,1)<>0, IF(OR($AD50=\"LUMP\", $AD50=\"LS\"), \"LUMP\", OFFSET( Combine!BH$9,$AC50 - 1,0,1,1)),\"\"))","v":""},{"$f":"IF( $AC50 = 0, \"\", IF( OFFSET( Combine!BI$9,$AC50 - 1,0,1,1)<>0, IF(OR($AD50=\"LUMP\", $AD50=\"LS\"), \"LUMP\", OFFSET( Combine!BI$9,$AC50 - 1,0,1,1)),\"\"))","v":""},{"$f":"IF( $AC50 = 0, \"\", IF( OFFSET( Combine!BJ$9,$AC50 - 1,0,1,1)<>0, IF(OR($AD50=\"LUMP\", $AD50=\"LS\"), \"LUMP\", OFFSET( Combine!BJ$9,$AC50 - 1,0,1,1)),\"\"))","v":""},{"$f":"IF( $AC50 = 0, \"\", IF( OFFSET( Combine!AP$9,$AC50 - 1,0,1,1)<>0, LEFT(OFFSET( Combine!AP$9,$AC50 - 1,0,1,1),3),\"\"))","v":""},{"$f":"IF( $AC50 = 0, \"\", IF( OFFSET( Combine!AP$9,$AC50 - 1,0,1,1)<>0, IF(LEN(OFFSET( Combine!AP$9,$AC50 - 1,0,1,1))=9,   RIGHT(OFFSET( Combine!AP$9,$AC50 - 1,0,1,1),5),    LEFT(RIGHT(OFFSET( Combine!AP$9,$AC50 - 1,0,1,1),6), 5)      ),\"\"))","v":""},"",{"$f":"IF( $AC50 = 0, \"\", IF( OFFSET( Combine!$AP$9,$AC50 - 1,0,1,1)<>0,IF(OR(AD50=\"LUMP\", AD50=\"LS\"), \"\", AD50),\"\"))","v":""},{"$f":"IF( $AC50 = 0, \"\", IF( OFFSET( Combine!$AP$9,$AC50 - 1,0,1,1)<>0, VLOOKUP( OFFSET( Combine!$AP$9,$AC50 - 1,0,1,1),[1]Items!$A$2:$E$10001,4,0),\"\"))","v":""},null,48,8,0,{"$f":"IF( $AC50 = 0, \"\", IF( OFFSET( Combine!$AP$9,$AC50 - 1,0,1,1)<>0, VLOOKUP( OFFSET( Combine!$AP$9,$AC50 - 1,0,1,1),[1]Items!$A$2:$E$10001,3,0),\"\"))","v":""}]
[{"$f":"IF( $AC51 = 0, \"\", IF( OFFSET( Combine!AQ$9,$AC51 - 1,0,1,1)<>0, IF(OR($AD51=\"LUMP\", $AD51=\"LS\"), \"LUMP\", OFFSET( Combine!AQ$9,$AC51 - 1,0,1,1)),\"\"))","v":""},{"$f":"IF( $AC51 = 0, \"\", IF( OFFSET( Combine!AR$9,$AC51 - 1,0,1,1)<>0, IF(OR($AD51=\"LUMP\", $AD51=\"LS\"), \"LUMP\", OFFSET( Combine!AR$9,$AC51 - 1,0,1,1)),\"\"))","v":""},{"$f":"IF( $AC51 = 0, \"\", IF( OFFSET( Combine!AS$9,$AC51 - 1,0,1,1)<>0, IF(OR($AD51=\"LUMP\", $AD51=\"LS\"), \"LUMP\", OFFSET( Combine!AS$9,$AC51 - 1,0,1,1)),\"\"))","v":""},{"$f":"IF( $AC51 = 0, \"\", IF( OFFSET( Combine!AT$9,$AC51 - 1,0,1,1)<>0, IF(OR($AD51=\"LUMP\", $AD51=\"LS\"), \"LUMP\", OFFSET( Combine!AT$9,$AC51 - 1,0,1,1)),\"\"))","v":""},{"$f":"IF( $AC51 = 0, \"\", IF( OFFSET( Combine!AU$9,$AC51 - 1,0,1,1)<>0, IF(OR($AD51=\"LUMP\", $AD51=\"LS\"), \"LUMP\", OFFSET( Combine!AU$9,$AC51 - 1,0,1,1)),\"\"))","v":""},{"$f":"IF( $AC51 = 0, \"\", IF( OFFSET( Combine!AV$9,$AC51 - 1,0,1,1)<>0, IF(OR($AD51=\"LUMP\", $AD51=\"LS\"), \"LUMP\", OFFSET( Combine!AV$9,$AC51 - 1,0,1,1)),\"\"))","v":""},{"$f":"IF( $AC51 = 0, \"\", IF( OFFSET( Combine!AW$9,$AC51 - 1,0,1,1)<>0, IF(OR($AD51=\"LUMP\", $AD51=\"LS\"), \"LUMP\", OFFSET( Combine!AW$9,$AC51 - 1,0,1,1)),\"\"))","v":""},{"$f":"IF( $AC51 = 0, \"\", IF( OFFSET( Combine!AX$9,$AC51 - 1,0,1,1)<>0, IF(OR($AD51=\"LUMP\", $AD51=\"LS\"), \"LUMP\", OFFSET( Combine!AX$9,$AC51 - 1,0,1,1)),\"\"))","v":""},{"$f":"IF( $AC51 = 0, \"\", IF( OFFSET( Combine!AY$9,$AC51 - 1,0,1,1)<>0, IF(OR($AD51=\"LUMP\", $AD51=\"LS\"), \"LUMP\", OFFSET( Combine!AY$9,$AC51 - 1,0,1,1)),\"\"))","v":""},{"$f":"IF( $AC51 = 0, \"\", IF( OFFSET( Combine!AZ$9,$AC51 - 1,0,1,1)<>0, IF(OR($AD51=\"LUMP\", $AD51=\"LS\"), \"LUMP\", OFFSET( Combine!AZ$9,$AC51 - 1,0,1,1)),\"\"))","v":""},{"$f":"IF( $AC51 = 0, \"\", IF( OFFSET( Combine!BA$9,$AC51 - 1,0,1,1)<>0, IF(OR($AD51=\"LUMP\", $AD51=\"LS\"), \"LUMP\", OFFSET( Combine!BA$9,$AC51 - 1,0,1,1)),\"\"))","v":""},{"$f":"IF( $AC51 = 0, \"\", IF( OFFSET( Combine!BB$9,$AC51 - 1,0,1,1)<>0, IF(OR($AD51=\"LUMP\", $AD51=\"LS\"), \"LUMP\", OFFSET( Combine!BB$9,$AC51 - 1,0,1,1)),\"\"))","v":""},{"$f":"IF( $AC51 = 0, \"\", IF( OFFSET( Combine!BC$9,$AC51 - 1,0,1,1)<>0, IF(OR($AD51=\"LUMP\", $AD51=\"LS\"), \"LUMP\", OFFSET( Combine!BC$9,$AC51 - 1,0,1,1)),\"\"))","v":""},{"$f":"IF( $AC51 = 0, \"\", IF( OFFSET( Combine!BD$9,$AC51 - 1,0,1,1)<>0, IF(OR($AD51=\"LUMP\", $AD51=\"LS\"), \"LUMP\", OFFSET( Combine!BD$9,$AC51 - 1,0,1,1)),\"\"))","v":""},{"$f":"IF( $AC51 = 0, \"\", IF( OFFSET( Combine!BE$9,$AC51 - 1,0,1,1)<>0, IF(OR($AD51=\"LUMP\", $AD51=\"LS\"), \"LUMP\", OFFSET( Combine!BE$9,$AC51 - 1,0,1,1)),\"\"))","v":""},{"$f":"IF( $AC51 = 0, \"\", IF( OFFSET( Combine!BF$9,$AC51 - 1,0,1,1)<>0, IF(OR($AD51=\"LUMP\", $AD51=\"LS\"), \"LUMP\", OFFSET( Combine!BF$9,$AC51 - 1,0,1,1)),\"\"))","v":""},{"$f":"IF( $AC51 = 0, \"\", IF( OFFSET( Combine!BG$9,$AC51 - 1,0,1,1)<>0, IF(OR($AD51=\"LUMP\", $AD51=\"LS\"), \"LUMP\", OFFSET( Combine!BG$9,$AC51 - 1,0,1,1)),\"\"))","v":""},{"$f":"IF( $AC51 = 0, \"\", IF( OFFSET( Combine!BH$9,$AC51 - 1,0,1,1)<>0, IF(OR($AD51=\"LUMP\", $AD51=\"LS\"), \"LUMP\", OFFSET( Combine!BH$9,$AC51 - 1,0,1,1)),\"\"))","v":""},{"$f":"IF( $AC51 = 0, \"\", IF( OFFSET( Combine!BI$9,$AC51 - 1,0,1,1)<>0, IF(OR($AD51=\"LUMP\", $AD51=\"LS\"), \"LUMP\", OFFSET( Combine!BI$9,$AC51 - 1,0,1,1)),\"\"))","v":""},{"$f":"IF( $AC51 = 0, \"\", IF( OFFSET( Combine!BJ$9,$AC51 - 1,0,1,1)<>0, IF(OR($AD51=\"LUMP\", $AD51=\"LS\"), \"LUMP\", OFFSET( Combine!BJ$9,$AC51 - 1,0,1,1)),\"\"))","v":""},{"$f":"IF( $AC51 = 0, \"\", IF( OFFSET( Combine!AP$9,$AC51 - 1,0,1,1)<>0, LEFT(OFFSET( Combine!AP$9,$AC51 - 1,0,1,1),3),\"\"))","v":""},{"$f":"IF( $AC51 = 0, \"\", IF( OFFSET( Combine!AP$9,$AC51 - 1,0,1,1)<>0, IF(LEN(OFFSET( Combine!AP$9,$AC51 - 1,0,1,1))=9,   RIGHT(OFFSET( Combine!AP$9,$AC51 - 1,0,1,1),5),    LEFT(RIGHT(OFFSET( Combine!AP$9,$AC51 - 1,0,1,1),6), 5)      ),\"\"))","v":""},"",{"$f":"IF( $AC51 = 0, \"\", IF( OFFSET( Combine!$AP$9,$AC51 - 1,0,1,1)<>0,IF(OR(AD51=\"LUMP\", AD51=\"LS\"), \"\", AD51),\"\"))","v":""},{"$f":"IF( $AC51 = 0, \"\", IF( OFFSET( Combine!$AP$9,$AC51 - 1,0,1,1)<>0, VLOOKUP( OFFSET( Combine!$AP$9,$AC51 - 1,0,1,1),[1]Items!$A$2:$E$10001,4,0),\"\"))","v":""},null,49,8,41,{"$f":"IF( $AC51 = 0, \"\", IF( OFFSET( Combine!$AP$9,$AC51 - 1,0,1,1)<>0, VLOOKUP( OFFSET( Combine!$AP$9,$AC51 - 1,0,1,1),[1]Items!$A$2:$E$10001,3,0),\"\"))","v":""}]
[{"$f":"IF( $AC52 = 0, \"\", IF( OFFSET( Combine!AQ$9,$AC52 - 1,0,1,1)<>0, IF(OR($AD52=\"LUMP\", $AD52=\"LS\"), \"LUMP\", OFFSET( Combine!AQ$9,$AC52 - 1,0,1,1)),\"\"))","v":""},{"$f":"IF( $AC52 = 0, \"\", IF( OFFSET( Combine!AR$9,$AC52 - 1,0,1,1)<>0, IF(OR($AD52=\"LUMP\", $AD52=\"LS\"), \"LUMP\", OFFSET( Combine!AR$9,$AC52 - 1,0,1,1)),\"\"))","v":""},{"$f":"IF( $AC52 = 0, \"\", IF( OFFSET( Combine!AS$9,$AC52 - 1,0,1,1)<>0, IF(OR($AD52=\"LUMP\", $AD52=\"LS\"), \"LUMP\", OFFSET( Combine!AS$9,$AC52 - 1,0,1,1)),\"\"))","v":""},{"$f":"IF( $AC52 = 0, \"\", IF( OFFSET( Combine!AT$9,$AC52 - 1,0,1,1)<>0, IF(OR($AD52=\"LUMP\", $AD52=\"LS\"), \"LUMP\", OFFSET( Combine!AT$9,$AC52 - 1,0,1,1)),\"\"))","v":""},{"$f":"IF( $AC52 = 0, \"\", IF( OFFSET( Combine!AU$9,$AC52 - 1,0,1,1)<>0, IF(OR($AD52=\"LUMP\", $AD52=\"LS\"), \"LUMP\", OFFSET( Combine!AU$9,$AC52 - 1,0,1,1)),\"\"))","v":""},{"$f":"IF( $AC52 = 0, \"\", IF( OFFSET( Combine!AV$9,$AC52 - 1,0,1,1)<>0, IF(OR($AD52=\"LUMP\", $AD52=\"LS\"), \"LUMP\", OFFSET( Combine!AV$9,$AC52 - 1,0,1,1)),\"\"))","v":""},{"$f":"IF( $AC52 = 0, \"\", IF( OFFSET( Combine!AW$9,$AC52 - 1,0,1,1)<>0, IF(OR($AD52=\"LUMP\", $AD52=\"LS\"), \"LUMP\", OFFSET( Combine!AW$9,$AC52 - 1,0,1,1)),\"\"))","v":""},{"$f":"IF( $AC52 = 0, \"\", IF( OFFSET( Combine!AX$9,$AC52 - 1,0,1,1)<>0, IF(OR($AD52=\"LUMP\", $AD52=\"LS\"), \"LUMP\", OFFSET( Combine!AX$9,$AC52 - 1,0,1,1)),\"\"))","v":""},{"$f":"IF( $AC52 = 0, \"\", IF( OFFSET( Combine!AY$9,$AC52 - 1,0,1,1)<>0, IF(OR($AD52=\"LUMP\", $AD52=\"LS\"), \"LUMP\", OFFSET( Combine!AY$9,$AC52 - 1,0,1,1)),\"\"))","v":""},{"$f":"IF( $AC52 = 0, \"\", IF( OFFSET( Combine!AZ$9,$AC52 - 1,0,1,1)<>0, IF(OR($AD52=\"LUMP\", $AD52=\"LS\"), \"LUMP\", OFFSET( Combine!AZ$9,$AC52 - 1,0,1,1)),\"\"))","v":""},{"$f":"IF( $AC52 = 0, \"\", IF( OFFSET( Combine!BA$9,$AC52 - 1,0,1,1)<>0, IF(OR($AD52=\"LUMP\", $AD52=\"LS\"), \"LUMP\", OFFSET( Combine!BA$9,$AC52 - 1,0,1,1)),\"\"))","v":""},{"$f":"IF( $AC52 = 0, \"\", IF( OFFSET( Combine!BB$9,$AC52 - 1,0,1,1)<>0, IF(OR($AD52=\"LUMP\", $AD52=\"LS\"), \"LUMP\", OFFSET( Combine!BB$9,$AC52 - 1,0,1,1)),\"\"))","v":""},{"$f":"IF( $AC52 = 0, \"\", IF( OFFSET( Combine!BC$9,$AC52 - 1,0,1,1)<>0, IF(OR($AD52=\"LUMP\", $AD52=\"LS\"), \"LUMP\", OFFSET( Combine!BC$9,$AC52 - 1,0,1,1)),\"\"))","v":""},{"$f":"IF( $AC52 = 0, \"\", IF( OFFSET( Combine!BD$9,$AC52 - 1,0,1,1)<>0, IF(OR($AD52=\"LUMP\", $AD52=\"LS\"), \"LUMP\", OFFSET( Combine!BD$9,$AC52 - 1,0,1,1)),\"\"))","v":""},{"$f":"IF( $AC52 = 0, \"\", IF( OFFSET( Combine!BE$9,$AC52 - 1,0,1,1)<>0, IF(OR($AD52=\"LUMP\", $AD52=\"LS\"), \"LUMP\", OFFSET( Combine!BE$9,$AC52 - 1,0,1,1)),\"\"))","v":""},{"$f":"IF( $AC52 = 0, \"\", IF( OFFSET( Combine!BF$9,$AC52 - 1,0,1,1)<>0, IF(OR($AD52=\"LUMP\", $AD52=\"LS\"), \"LUMP\", OFFSET( Combine!BF$9,$AC52 - 1,0,1,1)),\"\"))","v":""},{"$f":"IF( $AC52 = 0, \"\", IF( OFFSET( Combine!BG$9,$AC52 - 1,0,1,1)<>0, IF(OR($AD52=\"LUMP\", $AD52=\"LS\"), \"LUMP\", OFFSET( Combine!BG$9,$AC52 - 1,0,1,1)),\"\"))","v":""},{"$f":"IF( $AC52 = 0, \"\", IF( OFFSET( Combine!BH$9,$AC52 - 1,0,1,1)<>0, IF(OR($AD52=\"LUMP\", $AD52=\"LS\"), \"LUMP\", OFFSET( Combine!BH$9,$AC52 - 1,0,1,1)),\"\"))","v":""},{"$f":"IF( $AC52 = 0, \"\", IF( OFFSET( Combine!BI$9,$AC52 - 1,0,1,1)<>0, IF(OR($AD52=\"LUMP\", $AD52=\"LS\"), \"LUMP\", OFFSET( Combine!BI$9,$AC52 - 1,0,1,1)),\"\"))","v":""},{"$f":"IF( $AC52 = 0, \"\", IF( OFFSET( Combine!BJ$9,$AC52 - 1,0,1,1)<>0, IF(OR($AD52=\"LUMP\", $AD52=\"LS\"), \"LUMP\", OFFSET( Combine!BJ$9,$AC52 - 1,0,1,1)),\"\"))","v":""},{"$f":"IF( $AC52 = 0, \"\", IF( OFFSET( Combine!AP$9,$AC52 - 1,0,1,1)<>0, LEFT(OFFSET( Combine!AP$9,$AC52 - 1,0,1,1),3),\"\"))","v":""},{"$f":"IF( $AC52 = 0, \"\", IF( OFFSET( Combine!AP$9,$AC52 - 1,0,1,1)<>0, IF(LEN(OFFSET( Combine!AP$9,$AC52 - 1,0,1,1))=9,   RIGHT(OFFSET( Combine!AP$9,$AC52 - 1,0,1,1),5),    LEFT(RIGHT(OFFSET( Combine!AP$9,$AC52 - 1,0,1,1),6), 5)      ),\"\"))","v":""},"",{"$f":"IF( $AC52 = 0, \"\", IF( OFFSET( Combine!$AP$9,$AC52 - 1,0,1,1)<>0,IF(OR(AD52=\"LUMP\", AD52=\"LS\"), \"\", AD52),\"\"))","v":""},{"$f":"IF( $AC52 = 0, \"\", IF( OFFSET( Combine!$AP$9,$AC52 - 1,0,1,1)<>0, VLOOKUP( OFFSET( Combine!$AP$9,$AC52 - 1,0,1,1),[1]Items!$A$2:$E$10001,4,0),\"\"))","v":""},null,50,8,42,{"$f":"IF( $AC52 = 0, \"\", IF( OFFSET( Combine!$AP$9,$AC52 - 1,0,1,1)<>0, VLOOKUP( OFFSET( Combine!$AP$9,$AC52 - 1,0,1,1),[1]Items!$A$2:$E$10001,3,0),\"\"))","v":""}]
[{"$f":"IF( $AC53 = 0, \"\", IF( OFFSET( Combine!AQ$9,$AC53 - 1,0,1,1)<>0, IF(OR($AD53=\"LUMP\", $AD53=\"LS\"), \"LUMP\", OFFSET( Combine!AQ$9,$AC53 - 1,0,1,1)),\"\"))","v":""},{"$f":"IF( $AC53 = 0, \"\", IF( OFFSET( Combine!AR$9,$AC53 - 1,0,1,1)<>0, IF(OR($AD53=\"LUMP\", $AD53=\"LS\"), \"LUMP\", OFFSET( Combine!AR$9,$AC53 - 1,0,1,1)),\"\"))","v":""},{"$f":"IF( $AC53 = 0, \"\", IF( OFFSET( Combine!AS$9,$AC53 - 1,0,1,1)<>0, IF(OR($AD53=\"LUMP\", $AD53=\"LS\"), \"LUMP\", OFFSET( Combine!AS$9,$AC53 - 1,0,1,1)),\"\"))","v":""},{"$f":"IF( $AC53 = 0, \"\", IF( OFFSET( Combine!AT$9,$AC53 - 1,0,1,1)<>0, IF(OR($AD53=\"LUMP\", $AD53=\"LS\"), \"LUMP\", OFFSET( Combine!AT$9,$AC53 - 1,0,1,1)),\"\"))","v":""},{"$f":"IF( $AC53 = 0, \"\", IF( OFFSET( Combine!AU$9,$AC53 - 1,0,1,1)<>0, IF(OR($AD53=\"LUMP\", $AD53=\"LS\"), \"LUMP\", OFFSET( Combine!AU$9,$AC53 - 1,0,1,1)),\"\"))","v":""},{"$f":"IF( $AC53 = 0, \"\", IF( OFFSET( Combine!AV$9,$AC53 - 1,0,1,1)<>0, IF(OR($AD53=\"LUMP\", $AD53=\"LS\"), \"LUMP\", OFFSET( Combine!AV$9,$AC53 - 1,0,1,1)),\"\"))","v":""},{"$f":"IF( $AC53 = 0, \"\", IF( OFFSET( Combine!AW$9,$AC53 - 1,0,1,1)<>0, IF(OR($AD53=\"LUMP\", $AD53=\"LS\"), \"LUMP\", OFFSET( Combine!AW$9,$AC53 - 1,0,1,1)),\"\"))","v":""},{"$f":"IF( $AC53 = 0, \"\", IF( OFFSET( Combine!AX$9,$AC53 - 1,0,1,1)<>0, IF(OR($AD53=\"LUMP\", $AD53=\"LS\"), \"LUMP\", OFFSET( Combine!AX$9,$AC53 - 1,0,1,1)),\"\"))","v":""},{"$f":"IF( $AC53 = 0, \"\", IF( OFFSET( Combine!AY$9,$AC53 - 1,0,1,1)<>0, IF(OR($AD53=\"LUMP\", $AD53=\"LS\"), \"LUMP\", OFFSET( Combine!AY$9,$AC53 - 1,0,1,1)),\"\"))","v":""},{"$f":"IF( $AC53 = 0, \"\", IF( OFFSET( Combine!AZ$9,$AC53 - 1,0,1,1)<>0, IF(OR($AD53=\"LUMP\", $AD53=\"LS\"), \"LUMP\", OFFSET( Combine!AZ$9,$AC53 - 1,0,1,1)),\"\"))","v":""},{"$f":"IF( $AC53 = 0, \"\", IF( OFFSET( Combine!BA$9,$AC53 - 1,0,1,1)<>0, IF(OR($AD53=\"LUMP\", $AD53=\"LS\"), \"LUMP\", OFFSET( Combine!BA$9,$AC53 - 1,0,1,1)),\"\"))","v":""},{"$f":"IF( $AC53 = 0, \"\", IF( OFFSET( Combine!BB$9,$AC53 - 1,0,1,1)<>0, IF(OR($AD53=\"LUMP\", $AD53=\"LS\"), \"LUMP\", OFFSET( Combine!BB$9,$AC53 - 1,0,1,1)),\"\"))","v":""},{"$f":"IF( $AC53 = 0, \"\", IF( OFFSET( Combine!BC$9,$AC53 - 1,0,1,1)<>0, IF(OR($AD53=\"LUMP\", $AD53=\"LS\"), \"LUMP\", OFFSET( Combine!BC$9,$AC53 - 1,0,1,1)),\"\"))","v":""},{"$f":"IF( $AC53 = 0, \"\", IF( OFFSET( Combine!BD$9,$AC53 - 1,0,1,1)<>0, IF(OR($AD53=\"LUMP\", $AD53=\"LS\"), \"LUMP\", OFFSET( Combine!BD$9,$AC53 - 1,0,1,1)),\"\"))","v":""},{"$f":"IF( $AC53 = 0, \"\", IF( OFFSET( Combine!BE$9,$AC53 - 1,0,1,1)<>0, IF(OR($AD53=\"LUMP\", $AD53=\"LS\"), \"LUMP\", OFFSET( Combine!BE$9,$AC53 - 1,0,1,1)),\"\"))","v":""},{"$f":"IF( $AC53 = 0, \"\", IF( OFFSET( Combine!BF$9,$AC53 - 1,0,1,1)<>0, IF(OR($AD53=\"LUMP\", $AD53=\"LS\"), \"LUMP\", OFFSET( Combine!BF$9,$AC53 - 1,0,1,1)),\"\"))","v":""},{"$f":"IF( $AC53 = 0, \"\", IF( OFFSET( Combine!BG$9,$AC53 - 1,0,1,1)<>0, IF(OR($AD53=\"LUMP\", $AD53=\"LS\"), \"LUMP\", OFFSET( Combine!BG$9,$AC53 - 1,0,1,1)),\"\"))","v":""},{"$f":"IF( $AC53 = 0, \"\", IF( OFFSET( Combine!BH$9,$AC53 - 1,0,1,1)<>0, IF(OR($AD53=\"LUMP\", $AD53=\"LS\"), \"LUMP\", OFFSET( Combine!BH$9,$AC53 - 1,0,1,1)),\"\"))","v":""},{"$f":"IF( $AC53 = 0, \"\", IF( OFFSET( Combine!BI$9,$AC53 - 1,0,1,1)<>0, IF(OR($AD53=\"LUMP\", $AD53=\"LS\"), \"LUMP\", OFFSET( Combine!BI$9,$AC53 - 1,0,1,1)),\"\"))","v":""},{"$f":"IF( $AC53 = 0, \"\", IF( OFFSET( Combine!BJ$9,$AC53 - 1,0,1,1)<>0, IF(OR($AD53=\"LUMP\", $AD53=\"LS\"), \"LUMP\", OFFSET( Combine!BJ$9,$AC53 - 1,0,1,1)),\"\"))","v":""},{"$f":"IF( $AC53 = 0, \"\", IF( OFFSET( Combine!AP$9,$AC53 - 1,0,1,1)<>0, LEFT(OFFSET( Combine!AP$9,$AC53 - 1,0,1,1),3),\"\"))","v":""},{"$f":"IF( $AC53 = 0, \"\", IF( OFFSET( Combine!AP$9,$AC53 - 1,0,1,1)<>0, IF(LEN(OFFSET( Combine!AP$9,$AC53 - 1,0,1,1))=9,   RIGHT(OFFSET( Combine!AP$9,$AC53 - 1,0,1,1),5),    LEFT(RIGHT(OFFSET( Combine!AP$9,$AC53 - 1,0,1,1),6), 5)      ),\"\"))","v":""},"",{"$f":"IF( $AC53 = 0, \"\", IF( OFFSET( Combine!$AP$9,$AC53 - 1,0,1,1)<>0,IF(OR(AD53=\"LUMP\", AD53=\"LS\"), \"\", AD53),\"\"))","v":""},{"$f":"IF( $AC53 = 0, \"\", IF( OFFSET( Combine!$AP$9,$AC53 - 1,0,1,1)<>0, VLOOKUP( OFFSET( Combine!$AP$9,$AC53 - 1,0,1,1),[1]Items!$A$2:$E$10001,4,0),\"\"))","v":""},null,51,8,43,{"$f":"IF( $AC53 = 0, \"\", IF( OFFSET( Combine!$AP$9,$AC53 - 1,0,1,1)<>0, VLOOKUP( OFFSET( Combine!$AP$9,$AC53 - 1,0,1,1),[1]Items!$A$2:$E$10001,3,0),\"\"))","v":""}]
[{"$f":"IF( $AC54 = 0, \"\", IF( OFFSET( Combine!AQ$9,$AC54 - 1,0,1,1)<>0, IF(OR($AD54=\"LUMP\", $AD54=\"LS\"), \"LUMP\", OFFSET( Combine!AQ$9,$AC54 - 1,0,1,1)),\"\"))","v":""},{"$f":"IF( $AC54 = 0, \"\", IF( OFFSET( Combine!AR$9,$AC54 - 1,0,1,1)<>0, IF(OR($AD54=\"LUMP\", $AD54=\"LS\"), \"LUMP\", OFFSET( Combine!AR$9,$AC54 - 1,0,1,1)),\"\"))","v":""},{"$f":"IF( $AC54 = 0, \"\", IF( OFFSET( Combine!AS$9,$AC54 - 1,0,1,1)<>0, IF(OR($AD54=\"LUMP\", $AD54=\"LS\"), \"LUMP\", OFFSET( Combine!AS$9,$AC54 - 1,0,1,1)),\"\"))","v":""},{"$f":"IF( $AC54 = 0, \"\", IF( OFFSET( Combine!AT$9,$AC54 - 1,0,1,1)<>0, IF(OR($AD54=\"LUMP\", $AD54=\"LS\"), \"LUMP\", OFFSET( Combine!AT$9,$AC54 - 1,0,1,1)),\"\"))","v":""},{"$f":"IF( $AC54 = 0, \"\", IF( OFFSET( Combine!AU$9,$AC54 - 1,0,1,1)<>0, IF(OR($AD54=\"LUMP\", $AD54=\"LS\"), \"LUMP\", OFFSET( Combine!AU$9,$AC54 - 1,0,1,1)),\"\"))","v":""},{"$f":"IF( $AC54 = 0, \"\", IF( OFFSET( Combine!AV$9,$AC54 - 1,0,1,1)<>0, IF(OR($AD54=\"LUMP\", $AD54=\"LS\"), \"LUMP\", OFFSET( Combine!AV$9,$AC54 - 1,0,1,1)),\"\"))","v":""},{"$f":"IF( $AC54 = 0, \"\", IF( OFFSET( Combine!AW$9,$AC54 - 1,0,1,1)<>0, IF(OR($AD54=\"LUMP\", $AD54=\"LS\"), \"LUMP\", OFFSET( Combine!AW$9,$AC54 - 1,0,1,1)),\"\"))","v":""},{"$f":"IF( $AC54 = 0, \"\", IF( OFFSET( Combine!AX$9,$AC54 - 1,0,1,1)<>0, IF(OR($AD54=\"LUMP\", $AD54=\"LS\"), \"LUMP\", OFFSET( Combine!AX$9,$AC54 - 1,0,1,1)),\"\"))","v":""},{"$f":"IF( $AC54 = 0, \"\", IF( OFFSET( Combine!AY$9,$AC54 - 1,0,1,1)<>0, IF(OR($AD54=\"LUMP\", $AD54=\"LS\"), \"LUMP\", OFFSET( Combine!AY$9,$AC54 - 1,0,1,1)),\"\"))","v":""},{"$f":"IF( $AC54 = 0, \"\", IF( OFFSET( Combine!AZ$9,$AC54 - 1,0,1,1)<>0, IF(OR($AD54=\"LUMP\", $AD54=\"LS\"), \"LUMP\", OFFSET( Combine!AZ$9,$AC54 - 1,0,1,1)),\"\"))","v":""},{"$f":"IF( $AC54 = 0, \"\", IF( OFFSET( Combine!BA$9,$AC54 - 1,0,1,1)<>0, IF(OR($AD54=\"LUMP\", $AD54=\"LS\"), \"LUMP\", OFFSET( Combine!BA$9,$AC54 - 1,0,1,1)),\"\"))","v":""},{"$f":"IF( $AC54 = 0, \"\", IF( OFFSET( Combine!BB$9,$AC54 - 1,0,1,1)<>0, IF(OR($AD54=\"LUMP\", $AD54=\"LS\"), \"LUMP\", OFFSET( Combine!BB$9,$AC54 - 1,0,1,1)),\"\"))","v":""},{"$f":"IF( $AC54 = 0, \"\", IF( OFFSET( Combine!BC$9,$AC54 - 1,0,1,1)<>0, IF(OR($AD54=\"LUMP\", $AD54=\"LS\"), \"LUMP\", OFFSET( Combine!BC$9,$AC54 - 1,0,1,1)),\"\"))","v":""},{"$f":"IF( $AC54 = 0, \"\", IF( OFFSET( Combine!BD$9,$AC54 - 1,0,1,1)<>0, IF(OR($AD54=\"LUMP\", $AD54=\"LS\"), \"LUMP\", OFFSET( Combine!BD$9,$AC54 - 1,0,1,1)),\"\"))","v":""},{"$f":"IF( $AC54 = 0, \"\", IF( OFFSET( Combine!BE$9,$AC54 - 1,0,1,1)<>0, IF(OR($AD54=\"LUMP\", $AD54=\"LS\"), \"LUMP\", OFFSET( Combine!BE$9,$AC54 - 1,0,1,1)),\"\"))","v":""},{"$f":"IF( $AC54 = 0, \"\", IF( OFFSET( Combine!BF$9,$AC54 - 1,0,1,1)<>0, IF(OR($AD54=\"LUMP\", $AD54=\"LS\"), \"LUMP\", OFFSET( Combine!BF$9,$AC54 - 1,0,1,1)),\"\"))","v":""},{"$f":"IF( $AC54 = 0, \"\", IF( OFFSET( Combine!BG$9,$AC54 - 1,0,1,1)<>0, IF(OR($AD54=\"LUMP\", $AD54=\"LS\"), \"LUMP\", OFFSET( Combine!BG$9,$AC54 - 1,0,1,1)),\"\"))","v":""},{"$f":"IF( $AC54 = 0, \"\", IF( OFFSET( Combine!BH$9,$AC54 - 1,0,1,1)<>0, IF(OR($AD54=\"LUMP\", $AD54=\"LS\"), \"LUMP\", OFFSET( Combine!BH$9,$AC54 - 1,0,1,1)),\"\"))","v":""},{"$f":"IF( $AC54 = 0, \"\", IF( OFFSET( Combine!BI$9,$AC54 - 1,0,1,1)<>0, IF(OR($AD54=\"LUMP\", $AD54=\"LS\"), \"LUMP\", OFFSET( Combine!BI$9,$AC54 - 1,0,1,1)),\"\"))","v":""},{"$f":"IF( $AC54 = 0, \"\", IF( OFFSET( Combine!BJ$9,$AC54 - 1,0,1,1)<>0, IF(OR($AD54=\"LUMP\", $AD54=\"LS\"), \"LUMP\", OFFSET( Combine!BJ$9,$AC54 - 1,0,1,1)),\"\"))","v":""},{"$f":"IF( $AC54 = 0, \"\", IF( OFFSET( Combine!AP$9,$AC54 - 1,0,1,1)<>0, LEFT(OFFSET( Combine!AP$9,$AC54 - 1,0,1,1),3),\"\"))","v":""},{"$f":"IF( $AC54 = 0, \"\", IF( OFFSET( Combine!AP$9,$AC54 - 1,0,1,1)<>0, IF(LEN(OFFSET( Combine!AP$9,$AC54 - 1,0,1,1))=9,   RIGHT(OFFSET( Combine!AP$9,$AC54 - 1,0,1,1),5),    LEFT(RIGHT(OFFSET( Combine!AP$9,$AC54 - 1,0,1,1),6), 5)      ),\"\"))","v":""},"",{"$f":"IF( $AC54 = 0, \"\", IF( OFFSET( Combine!$AP$9,$AC54 - 1,0,1,1)<>0,IF(OR(AD54=\"LUMP\", AD54=\"LS\"), \"\", AD54),\"\"))","v":""},{"$f":"IF( $AC54 = 0, \"\", IF( OFFSET( Combine!$AP$9,$AC54 - 1,0,1,1)<>0, VLOOKUP( OFFSET( Combine!$AP$9,$AC54 - 1,0,1,1),[1]Items!$A$2:$E$10001,4,0),\"\"))","v":""},null,52,8,44,{"$f":"IF( $AC54 = 0, \"\", IF( OFFSET( Combine!$AP$9,$AC54 - 1,0,1,1)<>0, VLOOKUP( OFFSET( Combine!$AP$9,$AC54 - 1,0,1,1),[1]Items!$A$2:$E$10001,3,0),\"\"))","v":""}]
[{"$f":"IF( $AC55 = 0, \"\", IF( OFFSET( Combine!AQ$9,$AC55 - 1,0,1,1)<>0, IF(OR($AD55=\"LUMP\", $AD55=\"LS\"), \"LUMP\", OFFSET( Combine!AQ$9,$AC55 - 1,0,1,1)),\"\"))","v":""},{"$f":"IF( $AC55 = 0, \"\", IF( OFFSET( Combine!AR$9,$AC55 - 1,0,1,1)<>0, IF(OR($AD55=\"LUMP\", $AD55=\"LS\"), \"LUMP\", OFFSET( Combine!AR$9,$AC55 - 1,0,1,1)),\"\"))","v":""},{"$f":"IF( $AC55 = 0, \"\", IF( OFFSET( Combine!AS$9,$AC55 - 1,0,1,1)<>0, IF(OR($AD55=\"LUMP\", $AD55=\"LS\"), \"LUMP\", OFFSET( Combine!AS$9,$AC55 - 1,0,1,1)),\"\"))","v":""},{"$f":"IF( $AC55 = 0, \"\", IF( OFFSET( Combine!AT$9,$AC55 - 1,0,1,1)<>0, IF(OR($AD55=\"LUMP\", $AD55=\"LS\"), \"LUMP\", OFFSET( Combine!AT$9,$AC55 - 1,0,1,1)),\"\"))","v":""},{"$f":"IF( $AC55 = 0, \"\", IF( OFFSET( Combine!AU$9,$AC55 - 1,0,1,1)<>0, IF(OR($AD55=\"LUMP\", $AD55=\"LS\"), \"LUMP\", OFFSET( Combine!AU$9,$AC55 - 1,0,1,1)),\"\"))","v":""},{"$f":"IF( $AC55 = 0, \"\", IF( OFFSET( Combine!AV$9,$AC55 - 1,0,1,1)<>0, IF(OR($AD55=\"LUMP\", $AD55=\"LS\"), \"LUMP\", OFFSET( Combine!AV$9,$AC55 - 1,0,1,1)),\"\"))","v":""},{"$f":"IF( $AC55 = 0, \"\", IF( OFFSET( Combine!AW$9,$AC55 - 1,0,1,1)<>0, IF(OR($AD55=\"LUMP\", $AD55=\"LS\"), \"LUMP\", OFFSET( Combine!AW$9,$AC55 - 1,0,1,1)),\"\"))","v":""},{"$f":"IF( $AC55 = 0, \"\", IF( OFFSET( Combine!AX$9,$AC55 - 1,0,1,1)<>0, IF(OR($AD55=\"LUMP\", $AD55=\"LS\"), \"LUMP\", OFFSET( Combine!AX$9,$AC55 - 1,0,1,1)),\"\"))","v":""},{"$f":"IF( $AC55 = 0, \"\", IF( OFFSET( Combine!AY$9,$AC55 - 1,0,1,1)<>0, IF(OR($AD55=\"LUMP\", $AD55=\"LS\"), \"LUMP\", OFFSET( Combine!AY$9,$AC55 - 1,0,1,1)),\"\"))","v":""},{"$f":"IF( $AC55 = 0, \"\", IF( OFFSET( Combine!AZ$9,$AC55 - 1,0,1,1)<>0, IF(OR($AD55=\"LUMP\", $AD55=\"LS\"), \"LUMP\", OFFSET( Combine!AZ$9,$AC55 - 1,0,1,1)),\"\"))","v":""},{"$f":"IF( $AC55 = 0, \"\", IF( OFFSET( Combine!BA$9,$AC55 - 1,0,1,1)<>0, IF(OR($AD55=\"LUMP\", $AD55=\"LS\"), \"LUMP\", OFFSET( Combine!BA$9,$AC55 - 1,0,1,1)),\"\"))","v":""},{"$f":"IF( $AC55 = 0, \"\", IF( OFFSET( Combine!BB$9,$AC55 - 1,0,1,1)<>0, IF(OR($AD55=\"LUMP\", $AD55=\"LS\"), \"LUMP\", OFFSET( Combine!BB$9,$AC55 - 1,0,1,1)),\"\"))","v":""},{"$f":"IF( $AC55 = 0, \"\", IF( OFFSET( Combine!BC$9,$AC55 - 1,0,1,1)<>0, IF(OR($AD55=\"LUMP\", $AD55=\"LS\"), \"LUMP\", OFFSET( Combine!BC$9,$AC55 - 1,0,1,1)),\"\"))","v":""},{"$f":"IF( $AC55 = 0, \"\", IF( OFFSET( Combine!BD$9,$AC55 - 1,0,1,1)<>0, IF(OR($AD55=\"LUMP\", $AD55=\"LS\"), \"LUMP\", OFFSET( Combine!BD$9,$AC55 - 1,0,1,1)),\"\"))","v":""},{"$f":"IF( $AC55 = 0, \"\", IF( OFFSET( Combine!BE$9,$AC55 - 1,0,1,1)<>0, IF(OR($AD55=\"LUMP\", $AD55=\"LS\"), \"LUMP\", OFFSET( Combine!BE$9,$AC55 - 1,0,1,1)),\"\"))","v":""},{"$f":"IF( $AC55 = 0, \"\", IF( OFFSET( Combine!BF$9,$AC55 - 1,0,1,1)<>0, IF(OR($AD55=\"LUMP\", $AD55=\"LS\"), \"LUMP\", OFFSET( Combine!BF$9,$AC55 - 1,0,1,1)),\"\"))","v":""},{"$f":"IF( $AC55 = 0, \"\", IF( OFFSET( Combine!BG$9,$AC55 - 1,0,1,1)<>0, IF(OR($AD55=\"LUMP\", $AD55=\"LS\"), \"LUMP\", OFFSET( Combine!BG$9,$AC55 - 1,0,1,1)),\"\"))","v":""},{"$f":"IF( $AC55 = 0, \"\", IF( OFFSET( Combine!BH$9,$AC55 - 1,0,1,1)<>0, IF(OR($AD55=\"LUMP\", $AD55=\"LS\"), \"LUMP\", OFFSET( Combine!BH$9,$AC55 - 1,0,1,1)),\"\"))","v":""},{"$f":"IF( $AC55 = 0, \"\", IF( OFFSET( Combine!BI$9,$AC55 - 1,0,1,1)<>0, IF(OR($AD55=\"LUMP\", $AD55=\"LS\"), \"LUMP\", OFFSET( Combine!BI$9,$AC55 - 1,0,1,1)),\"\"))","v":""},{"$f":"IF( $AC55 = 0, \"\", IF( OFFSET( Combine!BJ$9,$AC55 - 1,0,1,1)<>0, IF(OR($AD55=\"LUMP\", $AD55=\"LS\"), \"LUMP\", OFFSET( Combine!BJ$9,$AC55 - 1,0,1,1)),\"\"))","v":""},{"$f":"IF( $AC55 = 0, \"\", IF( OFFSET( Combine!AP$9,$AC55 - 1,0,1,1)<>0, LEFT(OFFSET( Combine!AP$9,$AC55 - 1,0,1,1),3),\"\"))","v":""},{"$f":"IF( $AC55 = 0, \"\", IF( OFFSET( Combine!AP$9,$AC55 - 1,0,1,1)<>0, IF(LEN(OFFSET( Combine!AP$9,$AC55 - 1,0,1,1))=9,   RIGHT(OFFSET( Combine!AP$9,$AC55 - 1,0,1,1),5),    LEFT(RIGHT(OFFSET( Combine!AP$9,$AC55 - 1,0,1,1),6), 5)      ),\"\"))","v":""},"",{"$f":"IF( $AC55 = 0, \"\", IF( OFFSET( Combine!$AP$9,$AC55 - 1,0,1,1)<>0,IF(OR(AD55=\"LUMP\", AD55=\"LS\"), \"\", AD55),\"\"))","v":""},{"$f":"IF( $AC55 = 0, \"\", IF( OFFSET( Combine!$AP$9,$AC55 - 1,0,1,1)<>0, VLOOKUP( OFFSET( Combine!$AP$9,$AC55 - 1,0,1,1),[1]Items!$A$2:$E$10001,4,0),\"\"))","v":""},null,53,8,45,{"$f":"IF( $AC55 = 0, \"\", IF( OFFSET( Combine!$AP$9,$AC55 - 1,0,1,1)<>0, VLOOKUP( OFFSET( Combine!$AP$9,$AC55 - 1,0,1,1),[1]Items!$A$2:$E$10001,3,0),\"\"))","v":""}]
[{"$f":"IF( $AC56 = 0, \"\", IF( OFFSET( Combine!AQ$9,$AC56 - 1,0,1,1)<>0, IF(OR($AD56=\"LUMP\", $AD56=\"LS\"), \"LUMP\", OFFSET( Combine!AQ$9,$AC56 - 1,0,1,1)),\"\"))","v":""},{"$f":"IF( $AC56 = 0, \"\", IF( OFFSET( Combine!AR$9,$AC56 - 1,0,1,1)<>0, IF(OR($AD56=\"LUMP\", $AD56=\"LS\"), \"LUMP\", OFFSET( Combine!AR$9,$AC56 - 1,0,1,1)),\"\"))","v":""},{"$f":"IF( $AC56 = 0, \"\", IF( OFFSET( Combine!AS$9,$AC56 - 1,0,1,1)<>0, IF(OR($AD56=\"LUMP\", $AD56=\"LS\"), \"LUMP\", OFFSET( Combine!AS$9,$AC56 - 1,0,1,1)),\"\"))","v":""},{"$f":"IF( $AC56 = 0, \"\", IF( OFFSET( Combine!AT$9,$AC56 - 1,0,1,1)<>0, IF(OR($AD56=\"LUMP\", $AD56=\"LS\"), \"LUMP\", OFFSET( Combine!AT$9,$AC56 - 1,0,1,1)),\"\"))","v":""},{"$f":"IF( $AC56 = 0, \"\", IF( OFFSET( Combine!AU$9,$AC56 - 1,0,1,1)<>0, IF(OR($AD56=\"LUMP\", $AD56=\"LS\"), \"LUMP\", OFFSET( Combine!AU$9,$AC56 - 1,0,1,1)),\"\"))","v":""},{"$f":"IF( $AC56 = 0, \"\", IF( OFFSET( Combine!AV$9,$AC56 - 1,0,1,1)<>0, IF(OR($AD56=\"LUMP\", $AD56=\"LS\"), \"LUMP\", OFFSET( Combine!AV$9,$AC56 - 1,0,1,1)),\"\"))","v":""},{"$f":"IF( $AC56 = 0, \"\", IF( OFFSET( Combine!AW$9,$AC56 - 1,0,1,1)<>0, IF(OR($AD56=\"LUMP\", $AD56=\"LS\"), \"LUMP\", OFFSET( Combine!AW$9,$AC56 - 1,0,1,1)),\"\"))","v":""},{"$f":"IF( $AC56 = 0, \"\", IF( OFFSET( Combine!AX$9,$AC56 - 1,0,1,1)<>0, IF(OR($AD56=\"LUMP\", $AD56=\"LS\"), \"LUMP\", OFFSET( Combine!AX$9,$AC56 - 1,0,1,1)),\"\"))","v":""},{"$f":"IF( $AC56 = 0, \"\", IF( OFFSET( Combine!AY$9,$AC56 - 1,0,1,1)<>0, IF(OR($AD56=\"LUMP\", $AD56=\"LS\"), \"LUMP\", OFFSET( Combine!AY$9,$AC56 - 1,0,1,1)),\"\"))","v":""},{"$f":"IF( $AC56 = 0, \"\", IF( OFFSET( Combine!AZ$9,$AC56 - 1,0,1,1)<>0, IF(OR($AD56=\"LUMP\", $AD56=\"LS\"), \"LUMP\", OFFSET( Combine!AZ$9,$AC56 - 1,0,1,1)),\"\"))","v":""},{"$f":"IF( $AC56 = 0, \"\", IF( OFFSET( Combine!BA$9,$AC56 - 1,0,1,1)<>0, IF(OR($AD56=\"LUMP\", $AD56=\"LS\"), \"LUMP\", OFFSET( Combine!BA$9,$AC56 - 1,0,1,1)),\"\"))","v":""},{"$f":"IF( $AC56 = 0, \"\", IF( OFFSET( Combine!BB$9,$AC56 - 1,0,1,1)<>0, IF(OR($AD56=\"LUMP\", $AD56=\"LS\"), \"LUMP\", OFFSET( Combine!BB$9,$AC56 - 1,0,1,1)),\"\"))","v":""},{"$f":"IF( $AC56 = 0, \"\", IF( OFFSET( Combine!BC$9,$AC56 - 1,0,1,1)<>0, IF(OR($AD56=\"LUMP\", $AD56=\"LS\"), \"LUMP\", OFFSET( Combine!BC$9,$AC56 - 1,0,1,1)),\"\"))","v":""},{"$f":"IF( $AC56 = 0, \"\", IF( OFFSET( Combine!BD$9,$AC56 - 1,0,1,1)<>0, IF(OR($AD56=\"LUMP\", $AD56=\"LS\"), \"LUMP\", OFFSET( Combine!BD$9,$AC56 - 1,0,1,1)),\"\"))","v":""},{"$f":"IF( $AC56 = 0, \"\", IF( OFFSET( Combine!BE$9,$AC56 - 1,0,1,1)<>0, IF(OR($AD56=\"LUMP\", $AD56=\"LS\"), \"LUMP\", OFFSET( Combine!BE$9,$AC56 - 1,0,1,1)),\"\"))","v":""},{"$f":"IF( $AC56 = 0, \"\", IF( OFFSET( Combine!BF$9,$AC56 - 1,0,1,1)<>0, IF(OR($AD56=\"LUMP\", $AD56=\"LS\"), \"LUMP\", OFFSET( Combine!BF$9,$AC56 - 1,0,1,1)),\"\"))","v":""},{"$f":"IF( $AC56 = 0, \"\", IF( OFFSET( Combine!BG$9,$AC56 - 1,0,1,1)<>0, IF(OR($AD56=\"LUMP\", $AD56=\"LS\"), \"LUMP\", OFFSET( Combine!BG$9,$AC56 - 1,0,1,1)),\"\"))","v":""},{"$f":"IF( $AC56 = 0, \"\", IF( OFFSET( Combine!BH$9,$AC56 - 1,0,1,1)<>0, IF(OR($AD56=\"LUMP\", $AD56=\"LS\"), \"LUMP\", OFFSET( Combine!BH$9,$AC56 - 1,0,1,1)),\"\"))","v":""},{"$f":"IF( $AC56 = 0, \"\", IF( OFFSET( Combine!BI$9,$AC56 - 1,0,1,1)<>0, IF(OR($AD56=\"LUMP\", $AD56=\"LS\"), \"LUMP\", OFFSET( Combine!BI$9,$AC56 - 1,0,1,1)),\"\"))","v":""},{"$f":"IF( $AC56 = 0, \"\", IF( OFFSET( Combine!BJ$9,$AC56 - 1,0,1,1)<>0, IF(OR($AD56=\"LUMP\", $AD56=\"LS\"), \"LUMP\", OFFSET( Combine!BJ$9,$AC56 - 1,0,1,1)),\"\"))","v":""},{"$f":"IF( $AC56 = 0, \"\", IF( OFFSET( Combine!AP$9,$AC56 - 1,0,1,1)<>0, LEFT(OFFSET( Combine!AP$9,$AC56 - 1,0,1,1),3),\"\"))","v":""},{"$f":"IF( $AC56 = 0, \"\", IF( OFFSET( Combine!AP$9,$AC56 - 1,0,1,1)<>0, IF(LEN(OFFSET( Combine!AP$9,$AC56 - 1,0,1,1))=9,   RIGHT(OFFSET( Combine!AP$9,$AC56 - 1,0,1,1),5),    LEFT(RIGHT(OFFSET( Combine!AP$9,$AC56 - 1,0,1,1),6), 5)      ),\"\"))","v":""},"",{"$f":"IF( $AC56 = 0, \"\", IF( OFFSET( Combine!$AP$9,$AC56 - 1,0,1,1)<>0,IF(OR(AD56=\"LUMP\", AD56=\"LS\"), \"\", AD56),\"\"))","v":""},{"$f":"IF( $AC56 = 0, \"\", IF( OFFSET( Combine!$AP$9,$AC56 - 1,0,1,1)<>0, VLOOKUP( OFFSET( Combine!$AP$9,$AC56 - 1,0,1,1),[1]Items!$A$2:$E$10001,4,0),\"\"))","v":""},null,54,9,0,{"$f":"IF( $AC56 = 0, \"\", IF( OFFSET( Combine!$AP$9,$AC56 - 1,0,1,1)<>0, VLOOKUP( OFFSET( Combine!$AP$9,$AC56 - 1,0,1,1),[1]Items!$A$2:$E$10001,3,0),\"\"))","v":""}]
[{"$f":"IF( $AC57 = 0, \"\", IF( OFFSET( Combine!AQ$9,$AC57 - 1,0,1,1)<>0, IF(OR($AD57=\"LUMP\", $AD57=\"LS\"), \"LUMP\", OFFSET( Combine!AQ$9,$AC57 - 1,0,1,1)),\"\"))","v":""},{"$f":"IF( $AC57 = 0, \"\", IF( OFFSET( Combine!AR$9,$AC57 - 1,0,1,1)<>0, IF(OR($AD57=\"LUMP\", $AD57=\"LS\"), \"LUMP\", OFFSET( Combine!AR$9,$AC57 - 1,0,1,1)),\"\"))","v":""},{"$f":"IF( $AC57 = 0, \"\", IF( OFFSET( Combine!AS$9,$AC57 - 1,0,1,1)<>0, IF(OR($AD57=\"LUMP\", $AD57=\"LS\"), \"LUMP\", OFFSET( Combine!AS$9,$AC57 - 1,0,1,1)),\"\"))","v":""},{"$f":"IF( $AC57 = 0, \"\", IF( OFFSET( Combine!AT$9,$AC57 - 1,0,1,1)<>0, IF(OR($AD57=\"LUMP\", $AD57=\"LS\"), \"LUMP\", OFFSET( Combine!AT$9,$AC57 - 1,0,1,1)),\"\"))","v":""},{"$f":"IF( $AC57 = 0, \"\", IF( OFFSET( Combine!AU$9,$AC57 - 1,0,1,1)<>0, IF(OR($AD57=\"LUMP\", $AD57=\"LS\"), \"LUMP\", OFFSET( Combine!AU$9,$AC57 - 1,0,1,1)),\"\"))","v":""},{"$f":"IF( $AC57 = 0, \"\", IF( OFFSET( Combine!AV$9,$AC57 - 1,0,1,1)<>0, IF(OR($AD57=\"LUMP\", $AD57=\"LS\"), \"LUMP\", OFFSET( Combine!AV$9,$AC57 - 1,0,1,1)),\"\"))","v":""},{"$f":"IF( $AC57 = 0, \"\", IF( OFFSET( Combine!AW$9,$AC57 - 1,0,1,1)<>0, IF(OR($AD57=\"LUMP\", $AD57=\"LS\"), \"LUMP\", OFFSET( Combine!AW$9,$AC57 - 1,0,1,1)),\"\"))","v":""},{"$f":"IF( $AC57 = 0, \"\", IF( OFFSET( Combine!AX$9,$AC57 - 1,0,1,1)<>0, IF(OR($AD57=\"LUMP\", $AD57=\"LS\"), \"LUMP\", OFFSET( Combine!AX$9,$AC57 - 1,0,1,1)),\"\"))","v":""},{"$f":"IF( $AC57 = 0, \"\", IF( OFFSET( Combine!AY$9,$AC57 - 1,0,1,1)<>0, IF(OR($AD57=\"LUMP\", $AD57=\"LS\"), \"LUMP\", OFFSET( Combine!AY$9,$AC57 - 1,0,1,1)),\"\"))","v":""},{"$f":"IF( $AC57 = 0, \"\", IF( OFFSET( Combine!AZ$9,$AC57 - 1,0,1,1)<>0, IF(OR($AD57=\"LUMP\", $AD57=\"LS\"), \"LUMP\", OFFSET( Combine!AZ$9,$AC57 - 1,0,1,1)),\"\"))","v":""},{"$f":"IF( $AC57 = 0, \"\", IF( OFFSET( Combine!BA$9,$AC57 - 1,0,1,1)<>0, IF(OR($AD57=\"LUMP\", $AD57=\"LS\"), \"LUMP\", OFFSET( Combine!BA$9,$AC57 - 1,0,1,1)),\"\"))","v":""},{"$f":"IF( $AC57 = 0, \"\", IF( OFFSET( Combine!BB$9,$AC57 - 1,0,1,1)<>0, IF(OR($AD57=\"LUMP\", $AD57=\"LS\"), \"LUMP\", OFFSET( Combine!BB$9,$AC57 - 1,0,1,1)),\"\"))","v":""},{"$f":"IF( $AC57 = 0, \"\", IF( OFFSET( Combine!BC$9,$AC57 - 1,0,1,1)<>0, IF(OR($AD57=\"LUMP\", $AD57=\"LS\"), \"LUMP\", OFFSET( Combine!BC$9,$AC57 - 1,0,1,1)),\"\"))","v":""},{"$f":"IF( $AC57 = 0, \"\", IF( OFFSET( Combine!BD$9,$AC57 - 1,0,1,1)<>0, IF(OR($AD57=\"LUMP\", $AD57=\"LS\"), \"LUMP\", OFFSET( Combine!BD$9,$AC57 - 1,0,1,1)),\"\"))","v":""},{"$f":"IF( $AC57 = 0, \"\", IF( OFFSET( Combine!BE$9,$AC57 - 1,0,1,1)<>0, IF(OR($AD57=\"LUMP\", $AD57=\"LS\"), \"LUMP\", OFFSET( Combine!BE$9,$AC57 - 1,0,1,1)),\"\"))","v":""},{"$f":"IF( $AC57 = 0, \"\", IF( OFFSET( Combine!BF$9,$AC57 - 1,0,1,1)<>0, IF(OR($AD57=\"LUMP\", $AD57=\"LS\"), \"LUMP\", OFFSET( Combine!BF$9,$AC57 - 1,0,1,1)),\"\"))","v":""},{"$f":"IF( $AC57 = 0, \"\", IF( OFFSET( Combine!BG$9,$AC57 - 1,0,1,1)<>0, IF(OR($AD57=\"LUMP\", $AD57=\"LS\"), \"LUMP\", OFFSET( Combine!BG$9,$AC57 - 1,0,1,1)),\"\"))","v":""},{"$f":"IF( $AC57 = 0, \"\", IF( OFFSET( Combine!BH$9,$AC57 - 1,0,1,1)<>0, IF(OR($AD57=\"LUMP\", $AD57=\"LS\"), \"LUMP\", OFFSET( Combine!BH$9,$AC57 - 1,0,1,1)),\"\"))","v":""},{"$f":"IF( $AC57 = 0, \"\", IF( OFFSET( Combine!BI$9,$AC57 - 1,0,1,1)<>0, IF(OR($AD57=\"LUMP\", $AD57=\"LS\"), \"LUMP\", OFFSET( Combine!BI$9,$AC57 - 1,0,1,1)),\"\"))","v":""},{"$f":"IF( $AC57 = 0, \"\", IF( OFFSET( Combine!BJ$9,$AC57 - 1,0,1,1)<>0, IF(OR($AD57=\"LUMP\", $AD57=\"LS\"), \"LUMP\", OFFSET( Combine!BJ$9,$AC57 - 1,0,1,1)),\"\"))","v":""},{"$f":"IF( $AC57 = 0, \"\", IF( OFFSET( Combine!AP$9,$AC57 - 1,0,1,1)<>0, LEFT(OFFSET( Combine!AP$9,$AC57 - 1,0,1,1),3),\"\"))","v":""},{"$f":"IF( $AC57 = 0, \"\", IF( OFFSET( Combine!AP$9,$AC57 - 1,0,1,1)<>0, IF(LEN(OFFSET( Combine!AP$9,$AC57 - 1,0,1,1))=9,   RIGHT(OFFSET( Combine!AP$9,$AC57 - 1,0,1,1),5),    LEFT(RIGHT(OFFSET( Combine!AP$9,$AC57 - 1,0,1,1),6), 5)      ),\"\"))","v":""},"",{"$f":"IF( $AC57 = 0, \"\", IF( OFFSET( Combine!$AP$9,$AC57 - 1,0,1,1)<>0,IF(OR(AD57=\"LUMP\", AD57=\"LS\"), \"\", AD57),\"\"))","v":""},{"$f":"IF( $AC57 = 0, \"\", IF( OFFSET( Combine!$AP$9,$AC57 - 1,0,1,1)<>0, VLOOKUP( OFFSET( Combine!$AP$9,$AC57 - 1,0,1,1),[1]Items!$A$2:$E$10001,4,0),\"\"))","v":""},null,55,9,46,{"$f":"IF( $AC57 = 0, \"\", IF( OFFSET( Combine!$AP$9,$AC57 - 1,0,1,1)<>0, VLOOKUP( OFFSET( Combine!$AP$9,$AC57 - 1,0,1,1),[1]Items!$A$2:$E$10001,3,0),\"\"))","v":""}]
[{"$f":"IF( $AC58 = 0, \"\", IF( OFFSET( Combine!AQ$9,$AC58 - 1,0,1,1)<>0, IF(OR($AD58=\"LUMP\", $AD58=\"LS\"), \"LUMP\", OFFSET( Combine!AQ$9,$AC58 - 1,0,1,1)),\"\"))","v":""},{"$f":"IF( $AC58 = 0, \"\", IF( OFFSET( Combine!AR$9,$AC58 - 1,0,1,1)<>0, IF(OR($AD58=\"LUMP\", $AD58=\"LS\"), \"LUMP\", OFFSET( Combine!AR$9,$AC58 - 1,0,1,1)),\"\"))","v":""},{"$f":"IF( $AC58 = 0, \"\", IF( OFFSET( Combine!AS$9,$AC58 - 1,0,1,1)<>0, IF(OR($AD58=\"LUMP\", $AD58=\"LS\"), \"LUMP\", OFFSET( Combine!AS$9,$AC58 - 1,0,1,1)),\"\"))","v":""},{"$f":"IF( $AC58 = 0, \"\", IF( OFFSET( Combine!AT$9,$AC58 - 1,0,1,1)<>0, IF(OR($AD58=\"LUMP\", $AD58=\"LS\"), \"LUMP\", OFFSET( Combine!AT$9,$AC58 - 1,0,1,1)),\"\"))","v":""},{"$f":"IF( $AC58 = 0, \"\", IF( OFFSET( Combine!AU$9,$AC58 - 1,0,1,1)<>0, IF(OR($AD58=\"LUMP\", $AD58=\"LS\"), \"LUMP\", OFFSET( Combine!AU$9,$AC58 - 1,0,1,1)),\"\"))","v":""},{"$f":"IF( $AC58 = 0, \"\", IF( OFFSET( Combine!AV$9,$AC58 - 1,0,1,1)<>0, IF(OR($AD58=\"LUMP\", $AD58=\"LS\"), \"LUMP\", OFFSET( Combine!AV$9,$AC58 - 1,0,1,1)),\"\"))","v":""},{"$f":"IF( $AC58 = 0, \"\", IF( OFFSET( Combine!AW$9,$AC58 - 1,0,1,1)<>0, IF(OR($AD58=\"LUMP\", $AD58=\"LS\"), \"LUMP\", OFFSET( Combine!AW$9,$AC58 - 1,0,1,1)),\"\"))","v":""},{"$f":"IF( $AC58 = 0, \"\", IF( OFFSET( Combine!AX$9,$AC58 - 1,0,1,1)<>0, IF(OR($AD58=\"LUMP\", $AD58=\"LS\"), \"LUMP\", OFFSET( Combine!AX$9,$AC58 - 1,0,1,1)),\"\"))","v":""},{"$f":"IF( $AC58 = 0, \"\", IF( OFFSET( Combine!AY$9,$AC58 - 1,0,1,1)<>0, IF(OR($AD58=\"LUMP\", $AD58=\"LS\"), \"LUMP\", OFFSET( Combine!AY$9,$AC58 - 1,0,1,1)),\"\"))","v":""},{"$f":"IF( $AC58 = 0, \"\", IF( OFFSET( Combine!AZ$9,$AC58 - 1,0,1,1)<>0, IF(OR($AD58=\"LUMP\", $AD58=\"LS\"), \"LUMP\", OFFSET( Combine!AZ$9,$AC58 - 1,0,1,1)),\"\"))","v":""},{"$f":"IF( $AC58 = 0, \"\", IF( OFFSET( Combine!BA$9,$AC58 - 1,0,1,1)<>0, IF(OR($AD58=\"LUMP\", $AD58=\"LS\"), \"LUMP\", OFFSET( Combine!BA$9,$AC58 - 1,0,1,1)),\"\"))","v":""},{"$f":"IF( $AC58 = 0, \"\", IF( OFFSET( Combine!BB$9,$AC58 - 1,0,1,1)<>0, IF(OR($AD58=\"LUMP\", $AD58=\"LS\"), \"LUMP\", OFFSET( Combine!BB$9,$AC58 - 1,0,1,1)),\"\"))","v":""},{"$f":"IF( $AC58 = 0, \"\", IF( OFFSET( Combine!BC$9,$AC58 - 1,0,1,1)<>0, IF(OR($AD58=\"LUMP\", $AD58=\"LS\"), \"LUMP\", OFFSET( Combine!BC$9,$AC58 - 1,0,1,1)),\"\"))","v":""},{"$f":"IF( $AC58 = 0, \"\", IF( OFFSET( Combine!BD$9,$AC58 - 1,0,1,1)<>0, IF(OR($AD58=\"LUMP\", $AD58=\"LS\"), \"LUMP\", OFFSET( Combine!BD$9,$AC58 - 1,0,1,1)),\"\"))","v":""},{"$f":"IF( $AC58 = 0, \"\", IF( OFFSET( Combine!BE$9,$AC58 - 1,0,1,1)<>0, IF(OR($AD58=\"LUMP\", $AD58=\"LS\"), \"LUMP\", OFFSET( Combine!BE$9,$AC58 - 1,0,1,1)),\"\"))","v":""},{"$f":"IF( $AC58 = 0, \"\", IF( OFFSET( Combine!BF$9,$AC58 - 1,0,1,1)<>0, IF(OR($AD58=\"LUMP\", $AD58=\"LS\"), \"LUMP\", OFFSET( Combine!BF$9,$AC58 - 1,0,1,1)),\"\"))","v":""},{"$f":"IF( $AC58 = 0, \"\", IF( OFFSET( Combine!BG$9,$AC58 - 1,0,1,1)<>0, IF(OR($AD58=\"LUMP\", $AD58=\"LS\"), \"LUMP\", OFFSET( Combine!BG$9,$AC58 - 1,0,1,1)),\"\"))","v":""},{"$f":"IF( $AC58 = 0, \"\", IF( OFFSET( Combine!BH$9,$AC58 - 1,0,1,1)<>0, IF(OR($AD58=\"LUMP\", $AD58=\"LS\"), \"LUMP\", OFFSET( Combine!BH$9,$AC58 - 1,0,1,1)),\"\"))","v":""},{"$f":"IF( $AC58 = 0, \"\", IF( OFFSET( Combine!BI$9,$AC58 - 1,0,1,1)<>0, IF(OR($AD58=\"LUMP\", $AD58=\"LS\"), \"LUMP\", OFFSET( Combine!BI$9,$AC58 - 1,0,1,1)),\"\"))","v":""},{"$f":"IF( $AC58 = 0, \"\", IF( OFFSET( Combine!BJ$9,$AC58 - 1,0,1,1)<>0, IF(OR($AD58=\"LUMP\", $AD58=\"LS\"), \"LUMP\", OFFSET( Combine!BJ$9,$AC58 - 1,0,1,1)),\"\"))","v":""},{"$f":"IF( $AC58 = 0, \"\", IF( OFFSET( Combine!AP$9,$AC58 - 1,0,1,1)<>0, LEFT(OFFSET( Combine!AP$9,$AC58 - 1,0,1,1),3),\"\"))","v":""},{"$f":"IF( $AC58 = 0, \"\", IF( OFFSET( Combine!AP$9,$AC58 - 1,0,1,1)<>0, IF(LEN(OFFSET( Combine!AP$9,$AC58 - 1,0,1,1))=9,   RIGHT(OFFSET( Combine!AP$9,$AC58 - 1,0,1,1),5),    LEFT(RIGHT(OFFSET( Combine!AP$9,$AC58 - 1,0,1,1),6), 5)      ),\"\"))","v":""},"",{"$f":"IF( $AC58 = 0, \"\", IF( OFFSET( Combine!$AP$9,$AC58 - 1,0,1,1)<>0,IF(OR(AD58=\"LUMP\", AD58=\"LS\"), \"\", AD58),\"\"))","v":""},{"$f":"IF( $AC58 = 0, \"\", IF( OFFSET( Combine!$AP$9,$AC58 - 1,0,1,1)<>0, VLOOKUP( OFFSET( Combine!$AP$9,$AC58 - 1,0,1,1),[1]Items!$A$2:$E$10001,4,0),\"\"))","v":""},null,56,9,47,{"$f":"IF( $AC58 = 0, \"\", IF( OFFSET( Combine!$AP$9,$AC58 - 1,0,1,1)<>0, VLOOKUP( OFFSET( Combine!$AP$9,$AC58 - 1,0,1,1),[1]Items!$A$2:$E$10001,3,0),\"\"))","v":""}]
[{"$f":"IF( $AC59 = 0, \"\", IF( OFFSET( Combine!AQ$9,$AC59 - 1,0,1,1)<>0, IF(OR($AD59=\"LUMP\", $AD59=\"LS\"), \"LUMP\", OFFSET( Combine!AQ$9,$AC59 - 1,0,1,1)),\"\"))","v":""},{"$f":"IF( $AC59 = 0, \"\", IF( OFFSET( Combine!AR$9,$AC59 - 1,0,1,1)<>0, IF(OR($AD59=\"LUMP\", $AD59=\"LS\"), \"LUMP\", OFFSET( Combine!AR$9,$AC59 - 1,0,1,1)),\"\"))","v":""},{"$f":"IF( $AC59 = 0, \"\", IF( OFFSET( Combine!AS$9,$AC59 - 1,0,1,1)<>0, IF(OR($AD59=\"LUMP\", $AD59=\"LS\"), \"LUMP\", OFFSET( Combine!AS$9,$AC59 - 1,0,1,1)),\"\"))","v":""},{"$f":"IF( $AC59 = 0, \"\", IF( OFFSET( Combine!AT$9,$AC59 - 1,0,1,1)<>0, IF(OR($AD59=\"LUMP\", $AD59=\"LS\"), \"LUMP\", OFFSET( Combine!AT$9,$AC59 - 1,0,1,1)),\"\"))","v":""},{"$f":"IF( $AC59 = 0, \"\", IF( OFFSET( Combine!AU$9,$AC59 - 1,0,1,1)<>0, IF(OR($AD59=\"LUMP\", $AD59=\"LS\"), \"LUMP\", OFFSET( Combine!AU$9,$AC59 - 1,0,1,1)),\"\"))","v":""},{"$f":"IF( $AC59 = 0, \"\", IF( OFFSET( Combine!AV$9,$AC59 - 1,0,1,1)<>0, IF(OR($AD59=\"LUMP\", $AD59=\"LS\"), \"LUMP\", OFFSET( Combine!AV$9,$AC59 - 1,0,1,1)),\"\"))","v":""},{"$f":"IF( $AC59 = 0, \"\", IF( OFFSET( Combine!AW$9,$AC59 - 1,0,1,1)<>0, IF(OR($AD59=\"LUMP\", $AD59=\"LS\"), \"LUMP\", OFFSET( Combine!AW$9,$AC59 - 1,0,1,1)),\"\"))","v":""},{"$f":"IF( $AC59 = 0, \"\", IF( OFFSET( Combine!AX$9,$AC59 - 1,0,1,1)<>0, IF(OR($AD59=\"LUMP\", $AD59=\"LS\"), \"LUMP\", OFFSET( Combine!AX$9,$AC59 - 1,0,1,1)),\"\"))","v":""},{"$f":"IF( $AC59 = 0, \"\", IF( OFFSET( Combine!AY$9,$AC59 - 1,0,1,1)<>0, IF(OR($AD59=\"LUMP\", $AD59=\"LS\"), \"LUMP\", OFFSET( Combine!AY$9,$AC59 - 1,0,1,1)),\"\"))","v":""},{"$f":"IF( $AC59 = 0, \"\", IF( OFFSET( Combine!AZ$9,$AC59 - 1,0,1,1)<>0, IF(OR($AD59=\"LUMP\", $AD59=\"LS\"), \"LUMP\", OFFSET( Combine!AZ$9,$AC59 - 1,0,1,1)),\"\"))","v":""},{"$f":"IF( $AC59 = 0, \"\", IF( OFFSET( Combine!BA$9,$AC59 - 1,0,1,1)<>0, IF(OR($AD59=\"LUMP\", $AD59=\"LS\"), \"LUMP\", OFFSET( Combine!BA$9,$AC59 - 1,0,1,1)),\"\"))","v":""},{"$f":"IF( $AC59 = 0, \"\", IF( OFFSET( Combine!BB$9,$AC59 - 1,0,1,1)<>0, IF(OR($AD59=\"LUMP\", $AD59=\"LS\"), \"LUMP\", OFFSET( Combine!BB$9,$AC59 - 1,0,1,1)),\"\"))","v":""},{"$f":"IF( $AC59 = 0, \"\", IF( OFFSET( Combine!BC$9,$AC59 - 1,0,1,1)<>0, IF(OR($AD59=\"LUMP\", $AD59=\"LS\"), \"LUMP\", OFFSET( Combine!BC$9,$AC59 - 1,0,1,1)),\"\"))","v":""},{"$f":"IF( $AC59 = 0, \"\", IF( OFFSET( Combine!BD$9,$AC59 - 1,0,1,1)<>0, IF(OR($AD59=\"LUMP\", $AD59=\"LS\"), \"LUMP\", OFFSET( Combine!BD$9,$AC59 - 1,0,1,1)),\"\"))","v":""},{"$f":"IF( $AC59 = 0, \"\", IF( OFFSET( Combine!BE$9,$AC59 - 1,0,1,1)<>0, IF(OR($AD59=\"LUMP\", $AD59=\"LS\"), \"LUMP\", OFFSET( Combine!BE$9,$AC59 - 1,0,1,1)),\"\"))","v":""},{"$f":"IF( $AC59 = 0, \"\", IF( OFFSET( Combine!BF$9,$AC59 - 1,0,1,1)<>0, IF(OR($AD59=\"LUMP\", $AD59=\"LS\"), \"LUMP\", OFFSET( Combine!BF$9,$AC59 - 1,0,1,1)),\"\"))","v":""},{"$f":"IF( $AC59 = 0, \"\", IF( OFFSET( Combine!BG$9,$AC59 - 1,0,1,1)<>0, IF(OR($AD59=\"LUMP\", $AD59=\"LS\"), \"LUMP\", OFFSET( Combine!BG$9,$AC59 - 1,0,1,1)),\"\"))","v":""},{"$f":"IF( $AC59 = 0, \"\", IF( OFFSET( Combine!BH$9,$AC59 - 1,0,1,1)<>0, IF(OR($AD59=\"LUMP\", $AD59=\"LS\"), \"LUMP\", OFFSET( Combine!BH$9,$AC59 - 1,0,1,1)),\"\"))","v":""},{"$f":"IF( $AC59 = 0, \"\", IF( OFFSET( Combine!BI$9,$AC59 - 1,0,1,1)<>0, IF(OR($AD59=\"LUMP\", $AD59=\"LS\"), \"LUMP\", OFFSET( Combine!BI$9,$AC59 - 1,0,1,1)),\"\"))","v":""},{"$f":"IF( $AC59 = 0, \"\", IF( OFFSET( Combine!BJ$9,$AC59 - 1,0,1,1)<>0, IF(OR($AD59=\"LUMP\", $AD59=\"LS\"), \"LUMP\", OFFSET( Combine!BJ$9,$AC59 - 1,0,1,1)),\"\"))","v":""},{"$f":"IF( $AC59 = 0, \"\", IF( OFFSET( Combine!AP$9,$AC59 - 1,0,1,1)<>0, LEFT(OFFSET( Combine!AP$9,$AC59 - 1,0,1,1),3),\"\"))","v":""},{"$f":"IF( $AC59 = 0, \"\", IF( OFFSET( Combine!AP$9,$AC59 - 1,0,1,1)<>0, IF(LEN(OFFSET( Combine!AP$9,$AC59 - 1,0,1,1))=9,   RIGHT(OFFSET( Combine!AP$9,$AC59 - 1,0,1,1),5),    LEFT(RIGHT(OFFSET( Combine!AP$9,$AC59 - 1,0,1,1),6), 5)      ),\"\"))","v":""},"",{"$f":"IF( $AC59 = 0, \"\", IF( OFFSET( Combine!$AP$9,$AC59 - 1,0,1,1)<>0,IF(OR(AD59=\"LUMP\", AD59=\"LS\"), \"\", AD59),\"\"))","v":""},{"$f":"IF( $AC59 = 0, \"\", IF( OFFSET( Combine!$AP$9,$AC59 - 1,0,1,1)<>0, VLOOKUP( OFFSET( Combine!$AP$9,$AC59 - 1,0,1,1),[1]Items!$A$2:$E$10001,4,0),\"\"))","v":""},null,57,9,48,{"$f":"IF( $AC59 = 0, \"\", IF( OFFSET( Combine!$AP$9,$AC59 - 1,0,1,1)<>0, VLOOKUP( OFFSET( Combine!$AP$9,$AC59 - 1,0,1,1),[1]Items!$A$2:$E$10001,3,0),\"\"))","v":""}]
[{"$f":"IF( $AC60 = 0, \"\", IF( OFFSET( Combine!AQ$9,$AC60 - 1,0,1,1)<>0, IF(OR($AD60=\"LUMP\", $AD60=\"LS\"), \"LUMP\", OFFSET( Combine!AQ$9,$AC60 - 1,0,1,1)),\"\"))","v":""},{"$f":"IF( $AC60 = 0, \"\", IF( OFFSET( Combine!AR$9,$AC60 - 1,0,1,1)<>0, IF(OR($AD60=\"LUMP\", $AD60=\"LS\"), \"LUMP\", OFFSET( Combine!AR$9,$AC60 - 1,0,1,1)),\"\"))","v":""},{"$f":"IF( $AC60 = 0, \"\", IF( OFFSET( Combine!AS$9,$AC60 - 1,0,1,1)<>0, IF(OR($AD60=\"LUMP\", $AD60=\"LS\"), \"LUMP\", OFFSET( Combine!AS$9,$AC60 - 1,0,1,1)),\"\"))","v":""},{"$f":"IF( $AC60 = 0, \"\", IF( OFFSET( Combine!AT$9,$AC60 - 1,0,1,1)<>0, IF(OR($AD60=\"LUMP\", $AD60=\"LS\"), \"LUMP\", OFFSET( Combine!AT$9,$AC60 - 1,0,1,1)),\"\"))","v":""},{"$f":"IF( $AC60 = 0, \"\", IF( OFFSET( Combine!AU$9,$AC60 - 1,0,1,1)<>0, IF(OR($AD60=\"LUMP\", $AD60=\"LS\"), \"LUMP\", OFFSET( Combine!AU$9,$AC60 - 1,0,1,1)),\"\"))","v":""},{"$f":"IF( $AC60 = 0, \"\", IF( OFFSET( Combine!AV$9,$AC60 - 1,0,1,1)<>0, IF(OR($AD60=\"LUMP\", $AD60=\"LS\"), \"LUMP\", OFFSET( Combine!AV$9,$AC60 - 1,0,1,1)),\"\"))","v":""},{"$f":"IF( $AC60 = 0, \"\", IF( OFFSET( Combine!AW$9,$AC60 - 1,0,1,1)<>0, IF(OR($AD60=\"LUMP\", $AD60=\"LS\"), \"LUMP\", OFFSET( Combine!AW$9,$AC60 - 1,0,1,1)),\"\"))","v":""},{"$f":"IF( $AC60 = 0, \"\", IF( OFFSET( Combine!AX$9,$AC60 - 1,0,1,1)<>0, IF(OR($AD60=\"LUMP\", $AD60=\"LS\"), \"LUMP\", OFFSET( Combine!AX$9,$AC60 - 1,0,1,1)),\"\"))","v":""},{"$f":"IF( $AC60 = 0, \"\", IF( OFFSET( Combine!AY$9,$AC60 - 1,0,1,1)<>0, IF(OR($AD60=\"LUMP\", $AD60=\"LS\"), \"LUMP\", OFFSET( Combine!AY$9,$AC60 - 1,0,1,1)),\"\"))","v":""},{"$f":"IF( $AC60 = 0, \"\", IF( OFFSET( Combine!AZ$9,$AC60 - 1,0,1,1)<>0, IF(OR($AD60=\"LUMP\", $AD60=\"LS\"), \"LUMP\", OFFSET( Combine!AZ$9,$AC60 - 1,0,1,1)),\"\"))","v":""},{"$f":"IF( $AC60 = 0, \"\", IF( OFFSET( Combine!BA$9,$AC60 - 1,0,1,1)<>0, IF(OR($AD60=\"LUMP\", $AD60=\"LS\"), \"LUMP\", OFFSET( Combine!BA$9,$AC60 - 1,0,1,1)),\"\"))","v":""},{"$f":"IF( $AC60 = 0, \"\", IF( OFFSET( Combine!BB$9,$AC60 - 1,0,1,1)<>0, IF(OR($AD60=\"LUMP\", $AD60=\"LS\"), \"LUMP\", OFFSET( Combine!BB$9,$AC60 - 1,0,1,1)),\"\"))","v":""},{"$f":"IF( $AC60 = 0, \"\", IF( OFFSET( Combine!BC$9,$AC60 - 1,0,1,1)<>0, IF(OR($AD60=\"LUMP\", $AD60=\"LS\"), \"LUMP\", OFFSET( Combine!BC$9,$AC60 - 1,0,1,1)),\"\"))","v":""},{"$f":"IF( $AC60 = 0, \"\", IF( OFFSET( Combine!BD$9,$AC60 - 1,0,1,1)<>0, IF(OR($AD60=\"LUMP\", $AD60=\"LS\"), \"LUMP\", OFFSET( Combine!BD$9,$AC60 - 1,0,1,1)),\"\"))","v":""},{"$f":"IF( $AC60 = 0, \"\", IF( OFFSET( Combine!BE$9,$AC60 - 1,0,1,1)<>0, IF(OR($AD60=\"LUMP\", $AD60=\"LS\"), \"LUMP\", OFFSET( Combine!BE$9,$AC60 - 1,0,1,1)),\"\"))","v":""},{"$f":"IF( $AC60 = 0, \"\", IF( OFFSET( Combine!BF$9,$AC60 - 1,0,1,1)<>0, IF(OR($AD60=\"LUMP\", $AD60=\"LS\"), \"LUMP\", OFFSET( Combine!BF$9,$AC60 - 1,0,1,1)),\"\"))","v":""},{"$f":"IF( $AC60 = 0, \"\", IF( OFFSET( Combine!BG$9,$AC60 - 1,0,1,1)<>0, IF(OR($AD60=\"LUMP\", $AD60=\"LS\"), \"LUMP\", OFFSET( Combine!BG$9,$AC60 - 1,0,1,1)),\"\"))","v":""},{"$f":"IF( $AC60 = 0, \"\", IF( OFFSET( Combine!BH$9,$AC60 - 1,0,1,1)<>0, IF(OR($AD60=\"LUMP\", $AD60=\"LS\"), \"LUMP\", OFFSET( Combine!BH$9,$AC60 - 1,0,1,1)),\"\"))","v":""},{"$f":"IF( $AC60 = 0, \"\", IF( OFFSET( Combine!BI$9,$AC60 - 1,0,1,1)<>0, IF(OR($AD60=\"LUMP\", $AD60=\"LS\"), \"LUMP\", OFFSET( Combine!BI$9,$AC60 - 1,0,1,1)),\"\"))","v":""},{"$f":"IF( $AC60 = 0, \"\", IF( OFFSET( Combine!BJ$9,$AC60 - 1,0,1,1)<>0, IF(OR($AD60=\"LUMP\", $AD60=\"LS\"), \"LUMP\", OFFSET( Combine!BJ$9,$AC60 - 1,0,1,1)),\"\"))","v":""},{"$f":"IF( $AC60 = 0, \"\", IF( OFFSET( Combine!AP$9,$AC60 - 1,0,1,1)<>0, LEFT(OFFSET( Combine!AP$9,$AC60 - 1,0,1,1),3),\"\"))","v":""},{"$f":"IF( $AC60 = 0, \"\", IF( OFFSET( Combine!AP$9,$AC60 - 1,0,1,1)<>0, IF(LEN(OFFSET( Combine!AP$9,$AC60 - 1,0,1,1))=9,   RIGHT(OFFSET( Combine!AP$9,$AC60 - 1,0,1,1),5),    LEFT(RIGHT(OFFSET( Combine!AP$9,$AC60 - 1,0,1,1),6), 5)      ),\"\"))","v":""},"",{"$f":"IF( $AC60 = 0, \"\", IF( OFFSET( Combine!$AP$9,$AC60 - 1,0,1,1)<>0,IF(OR(AD60=\"LUMP\", AD60=\"LS\"), \"\", AD60),\"\"))","v":""},{"$f":"IF( $AC60 = 0, \"\", IF( OFFSET( Combine!$AP$9,$AC60 - 1,0,1,1)<>0, VLOOKUP( OFFSET( Combine!$AP$9,$AC60 - 1,0,1,1),[1]Items!$A$2:$E$10001,4,0),\"\"))","v":""},null,58,9,49,{"$f":"IF( $AC60 = 0, \"\", IF( OFFSET( Combine!$AP$9,$AC60 - 1,0,1,1)<>0, VLOOKUP( OFFSET( Combine!$AP$9,$AC60 - 1,0,1,1),[1]Items!$A$2:$E$10001,3,0),\"\"))","v":""}]
[{"$f":"IF( $AC61 = 0, \"\", IF( OFFSET( Combine!AQ$9,$AC61 - 1,0,1,1)<>0, IF(OR($AD61=\"LUMP\", $AD61=\"LS\"), \"LUMP\", OFFSET( Combine!AQ$9,$AC61 - 1,0,1,1)),\"\"))","v":""},{"$f":"IF( $AC61 = 0, \"\", IF( OFFSET( Combine!AR$9,$AC61 - 1,0,1,1)<>0, IF(OR($AD61=\"LUMP\", $AD61=\"LS\"), \"LUMP\", OFFSET( Combine!AR$9,$AC61 - 1,0,1,1)),\"\"))","v":""},{"$f":"IF( $AC61 = 0, \"\", IF( OFFSET( Combine!AS$9,$AC61 - 1,0,1,1)<>0, IF(OR($AD61=\"LUMP\", $AD61=\"LS\"), \"LUMP\", OFFSET( Combine!AS$9,$AC61 - 1,0,1,1)),\"\"))","v":""},{"$f":"IF( $AC61 = 0, \"\", IF( OFFSET( Combine!AT$9,$AC61 - 1,0,1,1)<>0, IF(OR($AD61=\"LUMP\", $AD61=\"LS\"), \"LUMP\", OFFSET( Combine!AT$9,$AC61 - 1,0,1,1)),\"\"))","v":""},{"$f":"IF( $AC61 = 0, \"\", IF( OFFSET( Combine!AU$9,$AC61 - 1,0,1,1)<>0, IF(OR($AD61=\"LUMP\", $AD61=\"LS\"), \"LUMP\", OFFSET( Combine!AU$9,$AC61 - 1,0,1,1)),\"\"))","v":""},{"$f":"IF( $AC61 = 0, \"\", IF( OFFSET( Combine!AV$9,$AC61 - 1,0,1,1)<>0, IF(OR($AD61=\"LUMP\", $AD61=\"LS\"), \"LUMP\", OFFSET( Combine!AV$9,$AC61 - 1,0,1,1)),\"\"))","v":""},{"$f":"IF( $AC61 = 0, \"\", IF( OFFSET( Combine!AW$9,$AC61 - 1,0,1,1)<>0, IF(OR($AD61=\"LUMP\", $AD61=\"LS\"), \"LUMP\", OFFSET( Combine!AW$9,$AC61 - 1,0,1,1)),\"\"))","v":""},{"$f":"IF( $AC61 = 0, \"\", IF( OFFSET( Combine!AX$9,$AC61 - 1,0,1,1)<>0, IF(OR($AD61=\"LUMP\", $AD61=\"LS\"), \"LUMP\", OFFSET( Combine!AX$9,$AC61 - 1,0,1,1)),\"\"))","v":""},{"$f":"IF( $AC61 = 0, \"\", IF( OFFSET( Combine!AY$9,$AC61 - 1,0,1,1)<>0, IF(OR($AD61=\"LUMP\", $AD61=\"LS\"), \"LUMP\", OFFSET( Combine!AY$9,$AC61 - 1,0,1,1)),\"\"))","v":""},{"$f":"IF( $AC61 = 0, \"\", IF( OFFSET( Combine!AZ$9,$AC61 - 1,0,1,1)<>0, IF(OR($AD61=\"LUMP\", $AD61=\"LS\"), \"LUMP\", OFFSET( Combine!AZ$9,$AC61 - 1,0,1,1)),\"\"))","v":""},{"$f":"IF( $AC61 = 0, \"\", IF( OFFSET( Combine!BA$9,$AC61 - 1,0,1,1)<>0, IF(OR($AD61=\"LUMP\", $AD61=\"LS\"), \"LUMP\", OFFSET( Combine!BA$9,$AC61 - 1,0,1,1)),\"\"))","v":""},{"$f":"IF( $AC61 = 0, \"\", IF( OFFSET( Combine!BB$9,$AC61 - 1,0,1,1)<>0, IF(OR($AD61=\"LUMP\", $AD61=\"LS\"), \"LUMP\", OFFSET( Combine!BB$9,$AC61 - 1,0,1,1)),\"\"))","v":""},{"$f":"IF( $AC61 = 0, \"\", IF( OFFSET( Combine!BC$9,$AC61 - 1,0,1,1)<>0, IF(OR($AD61=\"LUMP\", $AD61=\"LS\"), \"LUMP\", OFFSET( Combine!BC$9,$AC61 - 1,0,1,1)),\"\"))","v":""},{"$f":"IF( $AC61 = 0, \"\", IF( OFFSET( Combine!BD$9,$AC61 - 1,0,1,1)<>0, IF(OR($AD61=\"LUMP\", $AD61=\"LS\"), \"LUMP\", OFFSET( Combine!BD$9,$AC61 - 1,0,1,1)),\"\"))","v":""},{"$f":"IF( $AC61 = 0, \"\", IF( OFFSET( Combine!BE$9,$AC61 - 1,0,1,1)<>0, IF(OR($AD61=\"LUMP\", $AD61=\"LS\"), \"LUMP\", OFFSET( Combine!BE$9,$AC61 - 1,0,1,1)),\"\"))","v":""},{"$f":"IF( $AC61 = 0, \"\", IF( OFFSET( Combine!BF$9,$AC61 - 1,0,1,1)<>0, IF(OR($AD61=\"LUMP\", $AD61=\"LS\"), \"LUMP\", OFFSET( Combine!BF$9,$AC61 - 1,0,1,1)),\"\"))","v":""},{"$f":"IF( $AC61 = 0, \"\", IF( OFFSET( Combine!BG$9,$AC61 - 1,0,1,1)<>0, IF(OR($AD61=\"LUMP\", $AD61=\"LS\"), \"LUMP\", OFFSET( Combine!BG$9,$AC61 - 1,0,1,1)),\"\"))","v":""},{"$f":"IF( $AC61 = 0, \"\", IF( OFFSET( Combine!BH$9,$AC61 - 1,0,1,1)<>0, IF(OR($AD61=\"LUMP\", $AD61=\"LS\"), \"LUMP\", OFFSET( Combine!BH$9,$AC61 - 1,0,1,1)),\"\"))","v":""},{"$f":"IF( $AC61 = 0, \"\", IF( OFFSET( Combine!BI$9,$AC61 - 1,0,1,1)<>0, IF(OR($AD61=\"LUMP\", $AD61=\"LS\"), \"LUMP\", OFFSET( Combine!BI$9,$AC61 - 1,0,1,1)),\"\"))","v":""},{"$f":"IF( $AC61 = 0, \"\", IF( OFFSET( Combine!BJ$9,$AC61 - 1,0,1,1)<>0, IF(OR($AD61=\"LUMP\", $AD61=\"LS\"), \"LUMP\", OFFSET( Combine!BJ$9,$AC61 - 1,0,1,1)),\"\"))","v":""},{"$f":"IF( $AC61 = 0, \"\", IF( OFFSET( Combine!AP$9,$AC61 - 1,0,1,1)<>0, LEFT(OFFSET( Combine!AP$9,$AC61 - 1,0,1,1),3),\"\"))","v":""},{"$f":"IF( $AC61 = 0, \"\", IF( OFFSET( Combine!AP$9,$AC61 - 1,0,1,1)<>0, IF(LEN(OFFSET( Combine!AP$9,$AC61 - 1,0,1,1))=9,   RIGHT(OFFSET( Combine!AP$9,$AC61 - 1,0,1,1),5),    LEFT(RIGHT(OFFSET( Combine!AP$9,$AC61 - 1,0,1,1),6), 5)      ),\"\"))","v":""},"",{"$f":"IF( $AC61 = 0, \"\", IF( OFFSET( Combine!$AP$9,$AC61 - 1,0,1,1)<>0,IF(OR(AD61=\"LUMP\", AD61=\"LS\"), \"\", AD61),\"\"))","v":""},{"$f":"IF( $AC61 = 0, \"\", IF( OFFSET( Combine!$AP$9,$AC61 - 1,0,1,1)<>0, VLOOKUP( OFFSET( Combine!$AP$9,$AC61 - 1,0,1,1),[1]Items!$A$2:$E$10001,4,0),\"\"))","v":""},null,59,9,50,{"$f":"IF( $AC61 = 0, \"\", IF( OFFSET( Combine!$AP$9,$AC61 - 1,0,1,1)<>0, VLOOKUP( OFFSET( Combine!$AP$9,$AC61 - 1,0,1,1),[1]Items!$A$2:$E$10001,3,0),\"\"))","v":""}]
[{"$f":"IF( $AC62 = 0, \"\", IF( OFFSET( Combine!AQ$9,$AC62 - 1,0,1,1)<>0, IF(OR($AD62=\"LUMP\", $AD62=\"LS\"), \"LUMP\", OFFSET( Combine!AQ$9,$AC62 - 1,0,1,1)),\"\"))","v":""},{"$f":"IF( $AC62 = 0, \"\", IF( OFFSET( Combine!AR$9,$AC62 - 1,0,1,1)<>0, IF(OR($AD62=\"LUMP\", $AD62=\"LS\"), \"LUMP\", OFFSET( Combine!AR$9,$AC62 - 1,0,1,1)),\"\"))","v":""},{"$f":"IF( $AC62 = 0, \"\", IF( OFFSET( Combine!AS$9,$AC62 - 1,0,1,1)<>0, IF(OR($AD62=\"LUMP\", $AD62=\"LS\"), \"LUMP\", OFFSET( Combine!AS$9,$AC62 - 1,0,1,1)),\"\"))","v":""},{"$f":"IF( $AC62 = 0, \"\", IF( OFFSET( Combine!AT$9,$AC62 - 1,0,1,1)<>0, IF(OR($AD62=\"LUMP\", $AD62=\"LS\"), \"LUMP\", OFFSET( Combine!AT$9,$AC62 - 1,0,1,1)),\"\"))","v":""},{"$f":"IF( $AC62 = 0, \"\", IF( OFFSET( Combine!AU$9,$AC62 - 1,0,1,1)<>0, IF(OR($AD62=\"LUMP\", $AD62=\"LS\"), \"LUMP\", OFFSET( Combine!AU$9,$AC62 - 1,0,1,1)),\"\"))","v":""},{"$f":"IF( $AC62 = 0, \"\", IF( OFFSET( Combine!AV$9,$AC62 - 1,0,1,1)<>0, IF(OR($AD62=\"LUMP\", $AD62=\"LS\"), \"LUMP\", OFFSET( Combine!AV$9,$AC62 - 1,0,1,1)),\"\"))","v":""},{"$f":"IF( $AC62 = 0, \"\", IF( OFFSET( Combine!AW$9,$AC62 - 1,0,1,1)<>0, IF(OR($AD62=\"LUMP\", $AD62=\"LS\"), \"LUMP\", OFFSET( Combine!AW$9,$AC62 - 1,0,1,1)),\"\"))","v":""},{"$f":"IF( $AC62 = 0, \"\", IF( OFFSET( Combine!AX$9,$AC62 - 1,0,1,1)<>0, IF(OR($AD62=\"LUMP\", $AD62=\"LS\"), \"LUMP\", OFFSET( Combine!AX$9,$AC62 - 1,0,1,1)),\"\"))","v":""},{"$f":"IF( $AC62 = 0, \"\", IF( OFFSET( Combine!AY$9,$AC62 - 1,0,1,1)<>0, IF(OR($AD62=\"LUMP\", $AD62=\"LS\"), \"LUMP\", OFFSET( Combine!AY$9,$AC62 - 1,0,1,1)),\"\"))","v":""},{"$f":"IF( $AC62 = 0, \"\", IF( OFFSET( Combine!AZ$9,$AC62 - 1,0,1,1)<>0, IF(OR($AD62=\"LUMP\", $AD62=\"LS\"), \"LUMP\", OFFSET( Combine!AZ$9,$AC62 - 1,0,1,1)),\"\"))","v":""},{"$f":"IF( $AC62 = 0, \"\", IF( OFFSET( Combine!BA$9,$AC62 - 1,0,1,1)<>0, IF(OR($AD62=\"LUMP\", $AD62=\"LS\"), \"LUMP\", OFFSET( Combine!BA$9,$AC62 - 1,0,1,1)),\"\"))","v":""},{"$f":"IF( $AC62 = 0, \"\", IF( OFFSET( Combine!BB$9,$AC62 - 1,0,1,1)<>0, IF(OR($AD62=\"LUMP\", $AD62=\"LS\"), \"LUMP\", OFFSET( Combine!BB$9,$AC62 - 1,0,1,1)),\"\"))","v":""},{"$f":"IF( $AC62 = 0, \"\", IF( OFFSET( Combine!BC$9,$AC62 - 1,0,1,1)<>0, IF(OR($AD62=\"LUMP\", $AD62=\"LS\"), \"LUMP\", OFFSET( Combine!BC$9,$AC62 - 1,0,1,1)),\"\"))","v":""},{"$f":"IF( $AC62 = 0, \"\", IF( OFFSET( Combine!BD$9,$AC62 - 1,0,1,1)<>0, IF(OR($AD62=\"LUMP\", $AD62=\"LS\"), \"LUMP\", OFFSET( Combine!BD$9,$AC62 - 1,0,1,1)),\"\"))","v":""},{"$f":"IF( $AC62 = 0, \"\", IF( OFFSET( Combine!BE$9,$AC62 - 1,0,1,1)<>0, IF(OR($AD62=\"LUMP\", $AD62=\"LS\"), \"LUMP\", OFFSET( Combine!BE$9,$AC62 - 1,0,1,1)),\"\"))","v":""},{"$f":"IF( $AC62 = 0, \"\", IF( OFFSET( Combine!BF$9,$AC62 - 1,0,1,1)<>0, IF(OR($AD62=\"LUMP\", $AD62=\"LS\"), \"LUMP\", OFFSET( Combine!BF$9,$AC62 - 1,0,1,1)),\"\"))","v":""},{"$f":"IF( $AC62 = 0, \"\", IF( OFFSET( Combine!BG$9,$AC62 - 1,0,1,1)<>0, IF(OR($AD62=\"LUMP\", $AD62=\"LS\"), \"LUMP\", OFFSET( Combine!BG$9,$AC62 - 1,0,1,1)),\"\"))","v":""},{"$f":"IF( $AC62 = 0, \"\", IF( OFFSET( Combine!BH$9,$AC62 - 1,0,1,1)<>0, IF(OR($AD62=\"LUMP\", $AD62=\"LS\"), \"LUMP\", OFFSET( Combine!BH$9,$AC62 - 1,0,1,1)),\"\"))","v":""},{"$f":"IF( $AC62 = 0, \"\", IF( OFFSET( Combine!BI$9,$AC62 - 1,0,1,1)<>0, IF(OR($AD62=\"LUMP\", $AD62=\"LS\"), \"LUMP\", OFFSET( Combine!BI$9,$AC62 - 1,0,1,1)),\"\"))","v":""},{"$f":"IF( $AC62 = 0, \"\", IF( OFFSET( Combine!BJ$9,$AC62 - 1,0,1,1)<>0, IF(OR($AD62=\"LUMP\", $AD62=\"LS\"), \"LUMP\", OFFSET( Combine!BJ$9,$AC62 - 1,0,1,1)),\"\"))","v":""},{"$f":"IF( $AC62 = 0, \"\", IF( OFFSET( Combine!AP$9,$AC62 - 1,0,1,1)<>0, LEFT(OFFSET( Combine!AP$9,$AC62 - 1,0,1,1),3),\"\"))","v":""},{"$f":"IF( $AC62 = 0, \"\", IF( OFFSET( Combine!AP$9,$AC62 - 1,0,1,1)<>0, IF(LEN(OFFSET( Combine!AP$9,$AC62 - 1,0,1,1))=9,   RIGHT(OFFSET( Combine!AP$9,$AC62 - 1,0,1,1),5),    LEFT(RIGHT(OFFSET( Combine!AP$9,$AC62 - 1,0,1,1),6), 5)      ),\"\"))","v":""},"",{"$f":"IF( $AC62 = 0, \"\", IF( OFFSET( Combine!$AP$9,$AC62 - 1,0,1,1)<>0,IF(OR(AD62=\"LUMP\", AD62=\"LS\"), \"\", AD62),\"\"))","v":""},{"$f":"IF( $AC62 = 0, \"\", IF( OFFSET( Combine!$AP$9,$AC62 - 1,0,1,1)<>0, VLOOKUP( OFFSET( Combine!$AP$9,$AC62 - 1,0,1,1),[1]Items!$A$2:$E$10001,4,0),\"\"))","v":""},null,60,10,0,{"$f":"IF( $AC62 = 0, \"\", IF( OFFSET( Combine!$AP$9,$AC62 - 1,0,1,1)<>0, VLOOKUP( OFFSET( Combine!$AP$9,$AC62 - 1,0,1,1),[1]Items!$A$2:$E$10001,3,0),\"\"))","v":""}]
[{"$f":"IF( $AC63 = 0, \"\", IF( OFFSET( Combine!AQ$9,$AC63 - 1,0,1,1)<>0, IF(OR($AD63=\"LUMP\", $AD63=\"LS\"), \"LUMP\", OFFSET( Combine!AQ$9,$AC63 - 1,0,1,1)),\"\"))","v":""},{"$f":"IF( $AC63 = 0, \"\", IF( OFFSET( Combine!AR$9,$AC63 - 1,0,1,1)<>0, IF(OR($AD63=\"LUMP\", $AD63=\"LS\"), \"LUMP\", OFFSET( Combine!AR$9,$AC63 - 1,0,1,1)),\"\"))","v":""},{"$f":"IF( $AC63 = 0, \"\", IF( OFFSET( Combine!AS$9,$AC63 - 1,0,1,1)<>0, IF(OR($AD63=\"LUMP\", $AD63=\"LS\"), \"LUMP\", OFFSET( Combine!AS$9,$AC63 - 1,0,1,1)),\"\"))","v":""},{"$f":"IF( $AC63 = 0, \"\", IF( OFFSET( Combine!AT$9,$AC63 - 1,0,1,1)<>0, IF(OR($AD63=\"LUMP\", $AD63=\"LS\"), \"LUMP\", OFFSET( Combine!AT$9,$AC63 - 1,0,1,1)),\"\"))","v":""},{"$f":"IF( $AC63 = 0, \"\", IF( OFFSET( Combine!AU$9,$AC63 - 1,0,1,1)<>0, IF(OR($AD63=\"LUMP\", $AD63=\"LS\"), \"LUMP\", OFFSET( Combine!AU$9,$AC63 - 1,0,1,1)),\"\"))","v":""},{"$f":"IF( $AC63 = 0, \"\", IF( OFFSET( Combine!AV$9,$AC63 - 1,0,1,1)<>0, IF(OR($AD63=\"LUMP\", $AD63=\"LS\"), \"LUMP\", OFFSET( Combine!AV$9,$AC63 - 1,0,1,1)),\"\"))","v":""},{"$f":"IF( $AC63 = 0, \"\", IF( OFFSET( Combine!AW$9,$AC63 - 1,0,1,1)<>0, IF(OR($AD63=\"LUMP\", $AD63=\"LS\"), \"LUMP\", OFFSET( Combine!AW$9,$AC63 - 1,0,1,1)),\"\"))","v":""},{"$f":"IF( $AC63 = 0, \"\", IF( OFFSET( Combine!AX$9,$AC63 - 1,0,1,1)<>0, IF(OR($AD63=\"LUMP\", $AD63=\"LS\"), \"LUMP\", OFFSET( Combine!AX$9,$AC63 - 1,0,1,1)),\"\"))","v":""},{"$f":"IF( $AC63 = 0, \"\", IF( OFFSET( Combine!AY$9,$AC63 - 1,0,1,1)<>0, IF(OR($AD63=\"LUMP\", $AD63=\"LS\"), \"LUMP\", OFFSET( Combine!AY$9,$AC63 - 1,0,1,1)),\"\"))","v":""},{"$f":"IF( $AC63 = 0, \"\", IF( OFFSET( Combine!AZ$9,$AC63 - 1,0,1,1)<>0, IF(OR($AD63=\"LUMP\", $AD63=\"LS\"), \"LUMP\", OFFSET( Combine!AZ$9,$AC63 - 1,0,1,1)),\"\"))","v":""},{"$f":"IF( $AC63 = 0, \"\", IF( OFFSET( Combine!BA$9,$AC63 - 1,0,1,1)<>0, IF(OR($AD63=\"LUMP\", $AD63=\"LS\"), \"LUMP\", OFFSET( Combine!BA$9,$AC63 - 1,0,1,1)),\"\"))","v":""},{"$f":"IF( $AC63 = 0, \"\", IF( OFFSET( Combine!BB$9,$AC63 - 1,0,1,1)<>0, IF(OR($AD63=\"LUMP\", $AD63=\"LS\"), \"LUMP\", OFFSET( Combine!BB$9,$AC63 - 1,0,1,1)),\"\"))","v":""},{"$f":"IF( $AC63 = 0, \"\", IF( OFFSET( Combine!BC$9,$AC63 - 1,0,1,1)<>0, IF(OR($AD63=\"LUMP\", $AD63=\"LS\"), \"LUMP\", OFFSET( Combine!BC$9,$AC63 - 1,0,1,1)),\"\"))","v":""},{"$f":"IF( $AC63 = 0, \"\", IF( OFFSET( Combine!BD$9,$AC63 - 1,0,1,1)<>0, IF(OR($AD63=\"LUMP\", $AD63=\"LS\"), \"LUMP\", OFFSET( Combine!BD$9,$AC63 - 1,0,1,1)),\"\"))","v":""},{"$f":"IF( $AC63 = 0, \"\", IF( OFFSET( Combine!BE$9,$AC63 - 1,0,1,1)<>0, IF(OR($AD63=\"LUMP\", $AD63=\"LS\"), \"LUMP\", OFFSET( Combine!BE$9,$AC63 - 1,0,1,1)),\"\"))","v":""},{"$f":"IF( $AC63 = 0, \"\", IF( OFFSET( Combine!BF$9,$AC63 - 1,0,1,1)<>0, IF(OR($AD63=\"LUMP\", $AD63=\"LS\"), \"LUMP\", OFFSET( Combine!BF$9,$AC63 - 1,0,1,1)),\"\"))","v":""},{"$f":"IF( $AC63 = 0, \"\", IF( OFFSET( Combine!BG$9,$AC63 - 1,0,1,1)<>0, IF(OR($AD63=\"LUMP\", $AD63=\"LS\"), \"LUMP\", OFFSET( Combine!BG$9,$AC63 - 1,0,1,1)),\"\"))","v":""},{"$f":"IF( $AC63 = 0, \"\", IF( OFFSET( Combine!BH$9,$AC63 - 1,0,1,1)<>0, IF(OR($AD63=\"LUMP\", $AD63=\"LS\"), \"LUMP\", OFFSET( Combine!BH$9,$AC63 - 1,0,1,1)),\"\"))","v":""},{"$f":"IF( $AC63 = 0, \"\", IF( OFFSET( Combine!BI$9,$AC63 - 1,0,1,1)<>0, IF(OR($AD63=\"LUMP\", $AD63=\"LS\"), \"LUMP\", OFFSET( Combine!BI$9,$AC63 - 1,0,1,1)),\"\"))","v":""},{"$f":"IF( $AC63 = 0, \"\", IF( OFFSET( Combine!BJ$9,$AC63 - 1,0,1,1)<>0, IF(OR($AD63=\"LUMP\", $AD63=\"LS\"), \"LUMP\", OFFSET( Combine!BJ$9,$AC63 - 1,0,1,1)),\"\"))","v":""},{"$f":"IF( $AC63 = 0, \"\", IF( OFFSET( Combine!AP$9,$AC63 - 1,0,1,1)<>0, LEFT(OFFSET( Combine!AP$9,$AC63 - 1,0,1,1),3),\"\"))","v":""},{"$f":"IF( $AC63 = 0, \"\", IF( OFFSET( Combine!AP$9,$AC63 - 1,0,1,1)<>0, IF(LEN(OFFSET( Combine!AP$9,$AC63 - 1,0,1,1))=9,   RIGHT(OFFSET( Combine!AP$9,$AC63 - 1,0,1,1),5),    LEFT(RIGHT(OFFSET( Combine!AP$9,$AC63 - 1,0,1,1),6), 5)      ),\"\"))","v":""},"",{"$f":"IF( $AC63 = 0, \"\", IF( OFFSET( Combine!$AP$9,$AC63 - 1,0,1,1)<>0,IF(OR(AD63=\"LUMP\", AD63=\"LS\"), \"\", AD63),\"\"))","v":""},{"$f":"IF( $AC63 = 0, \"\", IF( OFFSET( Combine!$AP$9,$AC63 - 1,0,1,1)<>0, VLOOKUP( OFFSET( Combine!$AP$9,$AC63 - 1,0,1,1),[1]Items!$A$2:$E$10001,4,0),\"\"))","v":""},null,61,10,51,{"$f":"IF( $AC63 = 0, \"\", IF( OFFSET( Combine!$AP$9,$AC63 - 1,0,1,1)<>0, VLOOKUP( OFFSET( Combine!$AP$9,$AC63 - 1,0,1,1),[1]Items!$A$2:$E$10001,3,0),\"\"))","v":""}]
[{"$f":"IF( $AC64 = 0, \"\", IF( OFFSET( Combine!AQ$9,$AC64 - 1,0,1,1)<>0, IF(OR($AD64=\"LUMP\", $AD64=\"LS\"), \"LUMP\", OFFSET( Combine!AQ$9,$AC64 - 1,0,1,1)),\"\"))","v":""},{"$f":"IF( $AC64 = 0, \"\", IF( OFFSET( Combine!AR$9,$AC64 - 1,0,1,1)<>0, IF(OR($AD64=\"LUMP\", $AD64=\"LS\"), \"LUMP\", OFFSET( Combine!AR$9,$AC64 - 1,0,1,1)),\"\"))","v":""},{"$f":"IF( $AC64 = 0, \"\", IF( OFFSET( Combine!AS$9,$AC64 - 1,0,1,1)<>0, IF(OR($AD64=\"LUMP\", $AD64=\"LS\"), \"LUMP\", OFFSET( Combine!AS$9,$AC64 - 1,0,1,1)),\"\"))","v":""},{"$f":"IF( $AC64 = 0, \"\", IF( OFFSET( Combine!AT$9,$AC64 - 1,0,1,1)<>0, IF(OR($AD64=\"LUMP\", $AD64=\"LS\"), \"LUMP\", OFFSET( Combine!AT$9,$AC64 - 1,0,1,1)),\"\"))","v":""},{"$f":"IF( $AC64 = 0, \"\", IF( OFFSET( Combine!AU$9,$AC64 - 1,0,1,1)<>0, IF(OR($AD64=\"LUMP\", $AD64=\"LS\"), \"LUMP\", OFFSET( Combine!AU$9,$AC64 - 1,0,1,1)),\"\"))","v":""},{"$f":"IF( $AC64 = 0, \"\", IF( OFFSET( Combine!AV$9,$AC64 - 1,0,1,1)<>0, IF(OR($AD64=\"LUMP\", $AD64=\"LS\"), \"LUMP\", OFFSET( Combine!AV$9,$AC64 - 1,0,1,1)),\"\"))","v":""},{"$f":"IF( $AC64 = 0, \"\", IF( OFFSET( Combine!AW$9,$AC64 - 1,0,1,1)<>0, IF(OR($AD64=\"LUMP\", $AD64=\"LS\"), \"LUMP\", OFFSET( Combine!AW$9,$AC64 - 1,0,1,1)),\"\"))","v":""},{"$f":"IF( $AC64 = 0, \"\", IF( OFFSET( Combine!AX$9,$AC64 - 1,0,1,1)<>0, IF(OR($AD64=\"LUMP\", $AD64=\"LS\"), \"LUMP\", OFFSET( Combine!AX$9,$AC64 - 1,0,1,1)),\"\"))","v":""},{"$f":"IF( $AC64 = 0, \"\", IF( OFFSET( Combine!AY$9,$AC64 - 1,0,1,1)<>0, IF(OR($AD64=\"LUMP\", $AD64=\"LS\"), \"LUMP\", OFFSET( Combine!AY$9,$AC64 - 1,0,1,1)),\"\"))","v":""},{"$f":"IF( $AC64 = 0, \"\", IF( OFFSET( Combine!AZ$9,$AC64 - 1,0,1,1)<>0, IF(OR($AD64=\"LUMP\", $AD64=\"LS\"), \"LUMP\", OFFSET( Combine!AZ$9,$AC64 - 1,0,1,1)),\"\"))","v":""},{"$f":"IF( $AC64 = 0, \"\", IF( OFFSET( Combine!BA$9,$AC64 - 1,0,1,1)<>0, IF(OR($AD64=\"LUMP\", $AD64=\"LS\"), \"LUMP\", OFFSET( Combine!BA$9,$AC64 - 1,0,1,1)),\"\"))","v":""},{"$f":"IF( $AC64 = 0, \"\", IF( OFFSET( Combine!BB$9,$AC64 - 1,0,1,1)<>0, IF(OR($AD64=\"LUMP\", $AD64=\"LS\"), \"LUMP\", OFFSET( Combine!BB$9,$AC64 - 1,0,1,1)),\"\"))","v":""},{"$f":"IF( $AC64 = 0, \"\", IF( OFFSET( Combine!BC$9,$AC64 - 1,0,1,1)<>0, IF(OR($AD64=\"LUMP\", $AD64=\"LS\"), \"LUMP\", OFFSET( Combine!BC$9,$AC64 - 1,0,1,1)),\"\"))","v":""},{"$f":"IF( $AC64 = 0, \"\", IF( OFFSET( Combine!BD$9,$AC64 - 1,0,1,1)<>0, IF(OR($AD64=\"LUMP\", $AD64=\"LS\"), \"LUMP\", OFFSET( Combine!BD$9,$AC64 - 1,0,1,1)),\"\"))","v":""},{"$f":"IF( $AC64 = 0, \"\", IF( OFFSET( Combine!BE$9,$AC64 - 1,0,1,1)<>0, IF(OR($AD64=\"LUMP\", $AD64=\"LS\"), \"LUMP\", OFFSET( Combine!BE$9,$AC64 - 1,0,1,1)),\"\"))","v":""},{"$f":"IF( $AC64 = 0, \"\", IF( OFFSET( Combine!BF$9,$AC64 - 1,0,1,1)<>0, IF(OR($AD64=\"LUMP\", $AD64=\"LS\"), \"LUMP\", OFFSET( Combine!BF$9,$AC64 - 1,0,1,1)),\"\"))","v":""},{"$f":"IF( $AC64 = 0, \"\", IF( OFFSET( Combine!BG$9,$AC64 - 1,0,1,1)<>0, IF(OR($AD64=\"LUMP\", $AD64=\"LS\"), \"LUMP\", OFFSET( Combine!BG$9,$AC64 - 1,0,1,1)),\"\"))","v":""},{"$f":"IF( $AC64 = 0, \"\", IF( OFFSET( Combine!BH$9,$AC64 - 1,0,1,1)<>0, IF(OR($AD64=\"LUMP\", $AD64=\"LS\"), \"LUMP\", OFFSET( Combine!BH$9,$AC64 - 1,0,1,1)),\"\"))","v":""},{"$f":"IF( $AC64 = 0, \"\", IF( OFFSET( Combine!BI$9,$AC64 - 1,0,1,1)<>0, IF(OR($AD64=\"LUMP\", $AD64=\"LS\"), \"LUMP\", OFFSET( Combine!BI$9,$AC64 - 1,0,1,1)),\"\"))","v":""},{"$f":"IF( $AC64 = 0, \"\", IF( OFFSET( Combine!BJ$9,$AC64 - 1,0,1,1)<>0, IF(OR($AD64=\"LUMP\", $AD64=\"LS\"), \"LUMP\", OFFSET( Combine!BJ$9,$AC64 - 1,0,1,1)),\"\"))","v":""},{"$f":"IF( $AC64 = 0, \"\", IF( OFFSET( Combine!AP$9,$AC64 - 1,0,1,1)<>0, LEFT(OFFSET( Combine!AP$9,$AC64 - 1,0,1,1),3),\"\"))","v":""},{"$f":"IF( $AC64 = 0, \"\", IF( OFFSET( Combine!AP$9,$AC64 - 1,0,1,1)<>0, IF(LEN(OFFSET( Combine!AP$9,$AC64 - 1,0,1,1))=9,   RIGHT(OFFSET( Combine!AP$9,$AC64 - 1,0,1,1),5),    LEFT(RIGHT(OFFSET( Combine!AP$9,$AC64 - 1,0,1,1),6), 5)      ),\"\"))","v":""},"",{"$f":"IF( $AC64 = 0, \"\", IF( OFFSET( Combine!$AP$9,$AC64 - 1,0,1,1)<>0,IF(OR(AD64=\"LUMP\", AD64=\"LS\"), \"\", AD64),\"\"))","v":""},{"$f":"IF( $AC64 = 0, \"\", IF( OFFSET( Combine!$AP$9,$AC64 - 1,0,1,1)<>0, VLOOKUP( OFFSET( Combine!$AP$9,$AC64 - 1,0,1,1),[1]Items!$A$2:$E$10001,4,0),\"\"))","v":""},null,62,10,52,{"$f":"IF( $AC64 = 0, \"\", IF( OFFSET( Combine!$AP$9,$AC64 - 1,0,1,1)<>0, VLOOKUP( OFFSET( Combine!$AP$9,$AC64 - 1,0,1,1),[1]Items!$A$2:$E$10001,3,0),\"\"))","v":""}]
[{"$f":"IF( $AC65 = 0, \"\", IF( OFFSET( Combine!AQ$9,$AC65 - 1,0,1,1)<>0, IF(OR($AD65=\"LUMP\", $AD65=\"LS\"), \"LUMP\", OFFSET( Combine!AQ$9,$AC65 - 1,0,1,1)),\"\"))","v":""},{"$f":"IF( $AC65 = 0, \"\", IF( OFFSET( Combine!AR$9,$AC65 - 1,0,1,1)<>0, IF(OR($AD65=\"LUMP\", $AD65=\"LS\"), \"LUMP\", OFFSET( Combine!AR$9,$AC65 - 1,0,1,1)),\"\"))","v":""},{"$f":"IF( $AC65 = 0, \"\", IF( OFFSET( Combine!AS$9,$AC65 - 1,0,1,1)<>0, IF(OR($AD65=\"LUMP\", $AD65=\"LS\"), \"LUMP\", OFFSET( Combine!AS$9,$AC65 - 1,0,1,1)),\"\"))","v":""},{"$f":"IF( $AC65 = 0, \"\", IF( OFFSET( Combine!AT$9,$AC65 - 1,0,1,1)<>0, IF(OR($AD65=\"LUMP\", $AD65=\"LS\"), \"LUMP\", OFFSET( Combine!AT$9,$AC65 - 1,0,1,1)),\"\"))","v":""},{"$f":"IF( $AC65 = 0, \"\", IF( OFFSET( Combine!AU$9,$AC65 - 1,0,1,1)<>0, IF(OR($AD65=\"LUMP\", $AD65=\"LS\"), \"LUMP\", OFFSET( Combine!AU$9,$AC65 - 1,0,1,1)),\"\"))","v":""},{"$f":"IF( $AC65 = 0, \"\", IF( OFFSET( Combine!AV$9,$AC65 - 1,0,1,1)<>0, IF(OR($AD65=\"LUMP\", $AD65=\"LS\"), \"LUMP\", OFFSET( Combine!AV$9,$AC65 - 1,0,1,1)),\"\"))","v":""},{"$f":"IF( $AC65 = 0, \"\", IF( OFFSET( Combine!AW$9,$AC65 - 1,0,1,1)<>0, IF(OR($AD65=\"LUMP\", $AD65=\"LS\"), \"LUMP\", OFFSET( Combine!AW$9,$AC65 - 1,0,1,1)),\"\"))","v":""},{"$f":"IF( $AC65 = 0, \"\", IF( OFFSET( Combine!AX$9,$AC65 - 1,0,1,1)<>0, IF(OR($AD65=\"LUMP\", $AD65=\"LS\"), \"LUMP\", OFFSET( Combine!AX$9,$AC65 - 1,0,1,1)),\"\"))","v":""},{"$f":"IF( $AC65 = 0, \"\", IF( OFFSET( Combine!AY$9,$AC65 - 1,0,1,1)<>0, IF(OR($AD65=\"LUMP\", $AD65=\"LS\"), \"LUMP\", OFFSET( Combine!AY$9,$AC65 - 1,0,1,1)),\"\"))","v":""},{"$f":"IF( $AC65 = 0, \"\", IF( OFFSET( Combine!AZ$9,$AC65 - 1,0,1,1)<>0, IF(OR($AD65=\"LUMP\", $AD65=\"LS\"), \"LUMP\", OFFSET( Combine!AZ$9,$AC65 - 1,0,1,1)),\"\"))","v":""},{"$f":"IF( $AC65 = 0, \"\", IF( OFFSET( Combine!BA$9,$AC65 - 1,0,1,1)<>0, IF(OR($AD65=\"LUMP\", $AD65=\"LS\"), \"LUMP\", OFFSET( Combine!BA$9,$AC65 - 1,0,1,1)),\"\"))","v":""},{"$f":"IF( $AC65 = 0, \"\", IF( OFFSET( Combine!BB$9,$AC65 - 1,0,1,1)<>0, IF(OR($AD65=\"LUMP\", $AD65=\"LS\"), \"LUMP\", OFFSET( Combine!BB$9,$AC65 - 1,0,1,1)),\"\"))","v":""},{"$f":"IF( $AC65 = 0, \"\", IF( OFFSET( Combine!BC$9,$AC65 - 1,0,1,1)<>0, IF(OR($AD65=\"LUMP\", $AD65=\"LS\"), \"LUMP\", OFFSET( Combine!BC$9,$AC65 - 1,0,1,1)),\"\"))","v":""},{"$f":"IF( $AC65 = 0, \"\", IF( OFFSET( Combine!BD$9,$AC65 - 1,0,1,1)<>0, IF(OR($AD65=\"LUMP\", $AD65=\"LS\"), \"LUMP\", OFFSET( Combine!BD$9,$AC65 - 1,0,1,1)),\"\"))","v":""},{"$f":"IF( $AC65 = 0, \"\", IF( OFFSET( Combine!BE$9,$AC65 - 1,0,1,1)<>0, IF(OR($AD65=\"LUMP\", $AD65=\"LS\"), \"LUMP\", OFFSET( Combine!BE$9,$AC65 - 1,0,1,1)),\"\"))","v":""},{"$f":"IF( $AC65 = 0, \"\", IF( OFFSET( Combine!BF$9,$AC65 - 1,0,1,1)<>0, IF(OR($AD65=\"LUMP\", $AD65=\"LS\"), \"LUMP\", OFFSET( Combine!BF$9,$AC65 - 1,0,1,1)),\"\"))","v":""},{"$f":"IF( $AC65 = 0, \"\", IF( OFFSET( Combine!BG$9,$AC65 - 1,0,1,1)<>0, IF(OR($AD65=\"LUMP\", $AD65=\"LS\"), \"LUMP\", OFFSET( Combine!BG$9,$AC65 - 1,0,1,1)),\"\"))","v":""},{"$f":"IF( $AC65 = 0, \"\", IF( OFFSET( Combine!BH$9,$AC65 - 1,0,1,1)<>0, IF(OR($AD65=\"LUMP\", $AD65=\"LS\"), \"LUMP\", OFFSET( Combine!BH$9,$AC65 - 1,0,1,1)),\"\"))","v":""},{"$f":"IF( $AC65 = 0, \"\", IF( OFFSET( Combine!BI$9,$AC65 - 1,0,1,1)<>0, IF(OR($AD65=\"LUMP\", $AD65=\"LS\"), \"LUMP\", OFFSET( Combine!BI$9,$AC65 - 1,0,1,1)),\"\"))","v":""},{"$f":"IF( $AC65 = 0, \"\", IF( OFFSET( Combine!BJ$9,$AC65 - 1,0,1,1)<>0, IF(OR($AD65=\"LUMP\", $AD65=\"LS\"), \"LUMP\", OFFSET( Combine!BJ$9,$AC65 - 1,0,1,1)),\"\"))","v":""},{"$f":"IF( $AC65 = 0, \"\", IF( OFFSET( Combine!AP$9,$AC65 - 1,0,1,1)<>0, LEFT(OFFSET( Combine!AP$9,$AC65 - 1,0,1,1),3),\"\"))","v":""},{"$f":"IF( $AC65 = 0, \"\", IF( OFFSET( Combine!AP$9,$AC65 - 1,0,1,1)<>0, IF(LEN(OFFSET( Combine!AP$9,$AC65 - 1,0,1,1))=9,   RIGHT(OFFSET( Combine!AP$9,$AC65 - 1,0,1,1),5),    LEFT(RIGHT(OFFSET( Combine!AP$9,$AC65 - 1,0,1,1),6), 5)      ),\"\"))","v":""},"",{"$f":"IF( $AC65 = 0, \"\", IF( OFFSET( Combine!$AP$9,$AC65 - 1,0,1,1)<>0,IF(OR(AD65=\"LUMP\", AD65=\"LS\"), \"\", AD65),\"\"))","v":""},{"$f":"IF( $AC65 = 0, \"\", IF( OFFSET( Combine!$AP$9,$AC65 - 1,0,1,1)<>0, VLOOKUP( OFFSET( Combine!$AP$9,$AC65 - 1,0,1,1),[1]Items!$A$2:$E$10001,4,0),\"\"))","v":""},null,63,10,53,{"$f":"IF( $AC65 = 0, \"\", IF( OFFSET( Combine!$AP$9,$AC65 - 1,0,1,1)<>0, VLOOKUP( OFFSET( Combine!$AP$9,$AC65 - 1,0,1,1),[1]Items!$A$2:$E$10001,3,0),\"\"))","v":""}]
[{"$f":"IF( $AC66 = 0, \"\", IF( OFFSET( Combine!AQ$9,$AC66 - 1,0,1,1)<>0, IF(OR($AD66=\"LUMP\", $AD66=\"LS\"), \"LUMP\", OFFSET( Combine!AQ$9,$AC66 - 1,0,1,1)),\"\"))","v":""},{"$f":"IF( $AC66 = 0, \"\", IF( OFFSET( Combine!AR$9,$AC66 - 1,0,1,1)<>0, IF(OR($AD66=\"LUMP\", $AD66=\"LS\"), \"LUMP\", OFFSET( Combine!AR$9,$AC66 - 1,0,1,1)),\"\"))","v":""},{"$f":"IF( $AC66 = 0, \"\", IF( OFFSET( Combine!AS$9,$AC66 - 1,0,1,1)<>0, IF(OR($AD66=\"LUMP\", $AD66=\"LS\"), \"LUMP\", OFFSET( Combine!AS$9,$AC66 - 1,0,1,1)),\"\"))","v":""},{"$f":"IF( $AC66 = 0, \"\", IF( OFFSET( Combine!AT$9,$AC66 - 1,0,1,1)<>0, IF(OR($AD66=\"LUMP\", $AD66=\"LS\"), \"LUMP\", OFFSET( Combine!AT$9,$AC66 - 1,0,1,1)),\"\"))","v":""},{"$f":"IF( $AC66 = 0, \"\", IF( OFFSET( Combine!AU$9,$AC66 - 1,0,1,1)<>0, IF(OR($AD66=\"LUMP\", $AD66=\"LS\"), \"LUMP\", OFFSET( Combine!AU$9,$AC66 - 1,0,1,1)),\"\"))","v":""},{"$f":"IF( $AC66 = 0, \"\", IF( OFFSET( Combine!AV$9,$AC66 - 1,0,1,1)<>0, IF(OR($AD66=\"LUMP\", $AD66=\"LS\"), \"LUMP\", OFFSET( Combine!AV$9,$AC66 - 1,0,1,1)),\"\"))","v":""},{"$f":"IF( $AC66 = 0, \"\", IF( OFFSET( Combine!AW$9,$AC66 - 1,0,1,1)<>0, IF(OR($AD66=\"LUMP\", $AD66=\"LS\"), \"LUMP\", OFFSET( Combine!AW$9,$AC66 - 1,0,1,1)),\"\"))","v":""},{"$f":"IF( $AC66 = 0, \"\", IF( OFFSET( Combine!AX$9,$AC66 - 1,0,1,1)<>0, IF(OR($AD66=\"LUMP\", $AD66=\"LS\"), \"LUMP\", OFFSET( Combine!AX$9,$AC66 - 1,0,1,1)),\"\"))","v":""},{"$f":"IF( $AC66 = 0, \"\", IF( OFFSET( Combine!AY$9,$AC66 - 1,0,1,1)<>0, IF(OR($AD66=\"LUMP\", $AD66=\"LS\"), \"LUMP\", OFFSET( Combine!AY$9,$AC66 - 1,0,1,1)),\"\"))","v":""},{"$f":"IF( $AC66 = 0, \"\", IF( OFFSET( Combine!AZ$9,$AC66 - 1,0,1,1)<>0, IF(OR($AD66=\"LUMP\", $AD66=\"LS\"), \"LUMP\", OFFSET( Combine!AZ$9,$AC66 - 1,0,1,1)),\"\"))","v":""},{"$f":"IF( $AC66 = 0, \"\", IF( OFFSET( Combine!BA$9,$AC66 - 1,0,1,1)<>0, IF(OR($AD66=\"LUMP\", $AD66=\"LS\"), \"LUMP\", OFFSET( Combine!BA$9,$AC66 - 1,0,1,1)),\"\"))","v":""},{"$f":"IF( $AC66 = 0, \"\", IF( OFFSET( Combine!BB$9,$AC66 - 1,0,1,1)<>0, IF(OR($AD66=\"LUMP\", $AD66=\"LS\"), \"LUMP\", OFFSET( Combine!BB$9,$AC66 - 1,0,1,1)),\"\"))","v":""},{"$f":"IF( $AC66 = 0, \"\", IF( OFFSET( Combine!BC$9,$AC66 - 1,0,1,1)<>0, IF(OR($AD66=\"LUMP\", $AD66=\"LS\"), \"LUMP\", OFFSET( Combine!BC$9,$AC66 - 1,0,1,1)),\"\"))","v":""},{"$f":"IF( $AC66 = 0, \"\", IF( OFFSET( Combine!BD$9,$AC66 - 1,0,1,1)<>0, IF(OR($AD66=\"LUMP\", $AD66=\"LS\"), \"LUMP\", OFFSET( Combine!BD$9,$AC66 - 1,0,1,1)),\"\"))","v":""},{"$f":"IF( $AC66 = 0, \"\", IF( OFFSET( Combine!BE$9,$AC66 - 1,0,1,1)<>0, IF(OR($AD66=\"LUMP\", $AD66=\"LS\"), \"LUMP\", OFFSET( Combine!BE$9,$AC66 - 1,0,1,1)),\"\"))","v":""},{"$f":"IF( $AC66 = 0, \"\", IF( OFFSET( Combine!BF$9,$AC66 - 1,0,1,1)<>0, IF(OR($AD66=\"LUMP\", $AD66=\"LS\"), \"LUMP\", OFFSET( Combine!BF$9,$AC66 - 1,0,1,1)),\"\"))","v":""},{"$f":"IF( $AC66 = 0, \"\", IF( OFFSET( Combine!BG$9,$AC66 - 1,0,1,1)<>0, IF(OR($AD66=\"LUMP\", $AD66=\"LS\"), \"LUMP\", OFFSET( Combine!BG$9,$AC66 - 1,0,1,1)),\"\"))","v":""},{"$f":"IF( $AC66 = 0, \"\", IF( OFFSET( Combine!BH$9,$AC66 - 1,0,1,1)<>0, IF(OR($AD66=\"LUMP\", $AD66=\"LS\"), \"LUMP\", OFFSET( Combine!BH$9,$AC66 - 1,0,1,1)),\"\"))","v":""},{"$f":"IF( $AC66 = 0, \"\", IF( OFFSET( Combine!BI$9,$AC66 - 1,0,1,1)<>0, IF(OR($AD66=\"LUMP\", $AD66=\"LS\"), \"LUMP\", OFFSET( Combine!BI$9,$AC66 - 1,0,1,1)),\"\"))","v":""},{"$f":"IF( $AC66 = 0, \"\", IF( OFFSET( Combine!BJ$9,$AC66 - 1,0,1,1)<>0, IF(OR($AD66=\"LUMP\", $AD66=\"LS\"), \"LUMP\", OFFSET( Combine!BJ$9,$AC66 - 1,0,1,1)),\"\"))","v":""},{"$f":"IF( $AC66 = 0, \"\", IF( OFFSET( Combine!AP$9,$AC66 - 1,0,1,1)<>0, LEFT(OFFSET( Combine!AP$9,$AC66 - 1,0,1,1),3),\"\"))","v":""},{"$f":"IF( $AC66 = 0, \"\", IF( OFFSET( Combine!AP$9,$AC66 - 1,0,1,1)<>0, IF(LEN(OFFSET( Combine!AP$9,$AC66 - 1,0,1,1))=9,   RIGHT(OFFSET( Combine!AP$9,$AC66 - 1,0,1,1),5),    LEFT(RIGHT(OFFSET( Combine!AP$9,$AC66 - 1,0,1,1),6), 5)      ),\"\"))","v":""},"",{"$f":"IF( $AC66 = 0, \"\", IF( OFFSET( Combine!$AP$9,$AC66 - 1,0,1,1)<>0,IF(OR(AD66=\"LUMP\", AD66=\"LS\"), \"\", AD66),\"\"))","v":""},{"$f":"IF( $AC66 = 0, \"\", IF( OFFSET( Combine!$AP$9,$AC66 - 1,0,1,1)<>0, VLOOKUP( OFFSET( Combine!$AP$9,$AC66 - 1,0,1,1),[1]Items!$A$2:$E$10001,4,0),\"\"))","v":""},null,64,10,54,{"$f":"IF( $AC66 = 0, \"\", IF( OFFSET( Combine!$AP$9,$AC66 - 1,0,1,1)<>0, VLOOKUP( OFFSET( Combine!$AP$9,$AC66 - 1,0,1,1),[1]Items!$A$2:$E$10001,3,0),\"\"))","v":""}]
[{"$f":"IF( $AC67 = 0, \"\", IF( OFFSET( Combine!AQ$9,$AC67 - 1,0,1,1)<>0, IF(OR($AD67=\"LUMP\", $AD67=\"LS\"), \"LUMP\", OFFSET( Combine!AQ$9,$AC67 - 1,0,1,1)),\"\"))","v":""},{"$f":"IF( $AC67 = 0, \"\", IF( OFFSET( Combine!AR$9,$AC67 - 1,0,1,1)<>0, IF(OR($AD67=\"LUMP\", $AD67=\"LS\"), \"LUMP\", OFFSET( Combine!AR$9,$AC67 - 1,0,1,1)),\"\"))","v":""},{"$f":"IF( $AC67 = 0, \"\", IF( OFFSET( Combine!AS$9,$AC67 - 1,0,1,1)<>0, IF(OR($AD67=\"LUMP\", $AD67=\"LS\"), \"LUMP\", OFFSET( Combine!AS$9,$AC67 - 1,0,1,1)),\"\"))","v":""},{"$f":"IF( $AC67 = 0, \"\", IF( OFFSET( Combine!AT$9,$AC67 - 1,0,1,1)<>0, IF(OR($AD67=\"LUMP\", $AD67=\"LS\"), \"LUMP\", OFFSET( Combine!AT$9,$AC67 - 1,0,1,1)),\"\"))","v":""},{"$f":"IF( $AC67 = 0, \"\", IF( OFFSET( Combine!AU$9,$AC67 - 1,0,1,1)<>0, IF(OR($AD67=\"LUMP\", $AD67=\"LS\"), \"LUMP\", OFFSET( Combine!AU$9,$AC67 - 1,0,1,1)),\"\"))","v":""},{"$f":"IF( $AC67 = 0, \"\", IF( OFFSET( Combine!AV$9,$AC67 - 1,0,1,1)<>0, IF(OR($AD67=\"LUMP\", $AD67=\"LS\"), \"LUMP\", OFFSET( Combine!AV$9,$AC67 - 1,0,1,1)),\"\"))","v":""},{"$f":"IF( $AC67 = 0, \"\", IF( OFFSET( Combine!AW$9,$AC67 - 1,0,1,1)<>0, IF(OR($AD67=\"LUMP\", $AD67=\"LS\"), \"LUMP\", OFFSET( Combine!AW$9,$AC67 - 1,0,1,1)),\"\"))","v":""},{"$f":"IF( $AC67 = 0, \"\", IF( OFFSET( Combine!AX$9,$AC67 - 1,0,1,1)<>0, IF(OR($AD67=\"LUMP\", $AD67=\"LS\"), \"LUMP\", OFFSET( Combine!AX$9,$AC67 - 1,0,1,1)),\"\"))","v":""},{"$f":"IF( $AC67 = 0, \"\", IF( OFFSET( Combine!AY$9,$AC67 - 1,0,1,1)<>0, IF(OR($AD67=\"LUMP\", $AD67=\"LS\"), \"LUMP\", OFFSET( Combine!AY$9,$AC67 - 1,0,1,1)),\"\"))","v":""},{"$f":"IF( $AC67 = 0, \"\", IF( OFFSET( Combine!AZ$9,$AC67 - 1,0,1,1)<>0, IF(OR($AD67=\"LUMP\", $AD67=\"LS\"), \"LUMP\", OFFSET( Combine!AZ$9,$AC67 - 1,0,1,1)),\"\"))","v":""},{"$f":"IF( $AC67 = 0, \"\", IF( OFFSET( Combine!BA$9,$AC67 - 1,0,1,1)<>0, IF(OR($AD67=\"LUMP\", $AD67=\"LS\"), \"LUMP\", OFFSET( Combine!BA$9,$AC67 - 1,0,1,1)),\"\"))","v":""},{"$f":"IF( $AC67 = 0, \"\", IF( OFFSET( Combine!BB$9,$AC67 - 1,0,1,1)<>0, IF(OR($AD67=\"LUMP\", $AD67=\"LS\"), \"LUMP\", OFFSET( Combine!BB$9,$AC67 - 1,0,1,1)),\"\"))","v":""},{"$f":"IF( $AC67 = 0, \"\", IF( OFFSET( Combine!BC$9,$AC67 - 1,0,1,1)<>0, IF(OR($AD67=\"LUMP\", $AD67=\"LS\"), \"LUMP\", OFFSET( Combine!BC$9,$AC67 - 1,0,1,1)),\"\"))","v":""},{"$f":"IF( $AC67 = 0, \"\", IF( OFFSET( Combine!BD$9,$AC67 - 1,0,1,1)<>0, IF(OR($AD67=\"LUMP\", $AD67=\"LS\"), \"LUMP\", OFFSET( Combine!BD$9,$AC67 - 1,0,1,1)),\"\"))","v":""},{"$f":"IF( $AC67 = 0, \"\", IF( OFFSET( Combine!BE$9,$AC67 - 1,0,1,1)<>0, IF(OR($AD67=\"LUMP\", $AD67=\"LS\"), \"LUMP\", OFFSET( Combine!BE$9,$AC67 - 1,0,1,1)),\"\"))","v":""},{"$f":"IF( $AC67 = 0, \"\", IF( OFFSET( Combine!BF$9,$AC67 - 1,0,1,1)<>0, IF(OR($AD67=\"LUMP\", $AD67=\"LS\"), \"LUMP\", OFFSET( Combine!BF$9,$AC67 - 1,0,1,1)),\"\"))","v":""},{"$f":"IF( $AC67 = 0, \"\", IF( OFFSET( Combine!BG$9,$AC67 - 1,0,1,1)<>0, IF(OR($AD67=\"LUMP\", $AD67=\"LS\"), \"LUMP\", OFFSET( Combine!BG$9,$AC67 - 1,0,1,1)),\"\"))","v":""},{"$f":"IF( $AC67 = 0, \"\", IF( OFFSET( Combine!BH$9,$AC67 - 1,0,1,1)<>0, IF(OR($AD67=\"LUMP\", $AD67=\"LS\"), \"LUMP\", OFFSET( Combine!BH$9,$AC67 - 1,0,1,1)),\"\"))","v":""},{"$f":"IF( $AC67 = 0, \"\", IF( OFFSET( Combine!BI$9,$AC67 - 1,0,1,1)<>0, IF(OR($AD67=\"LUMP\", $AD67=\"LS\"), \"LUMP\", OFFSET( Combine!BI$9,$AC67 - 1,0,1,1)),\"\"))","v":""},{"$f":"IF( $AC67 = 0, \"\", IF( OFFSET( Combine!BJ$9,$AC67 - 1,0,1,1)<>0, IF(OR($AD67=\"LUMP\", $AD67=\"LS\"), \"LUMP\", OFFSET( Combine!BJ$9,$AC67 - 1,0,1,1)),\"\"))","v":""},{"$f":"IF( $AC67 = 0, \"\", IF( OFFSET( Combine!AP$9,$AC67 - 1,0,1,1)<>0, LEFT(OFFSET( Combine!AP$9,$AC67 - 1,0,1,1),3),\"\"))","v":""},{"$f":"IF( $AC67 = 0, \"\", IF( OFFSET( Combine!AP$9,$AC67 - 1,0,1,1)<>0, IF(LEN(OFFSET( Combine!AP$9,$AC67 - 1,0,1,1))=9,   RIGHT(OFFSET( Combine!AP$9,$AC67 - 1,0,1,1),5),    LEFT(RIGHT(OFFSET( Combine!AP$9,$AC67 - 1,0,1,1),6), 5)      ),\"\"))","v":""},"",{"$f":"IF( $AC67 = 0, \"\", IF( OFFSET( Combine!$AP$9,$AC67 - 1,0,1,1)<>0,IF(OR(AD67=\"LUMP\", AD67=\"LS\"), \"\", AD67),\"\"))","v":""},{"$f":"IF( $AC67 = 0, \"\", IF( OFFSET( Combine!$AP$9,$AC67 - 1,0,1,1)<>0, VLOOKUP( OFFSET( Combine!$AP$9,$AC67 - 1,0,1,1),[1]Items!$A$2:$E$10001,4,0),\"\"))","v":""},null,65,{"$f":"INT(AA67/6)","v":10},{"$f":"IF(  (AA67 - 6*AB67) = 0, 0, AA67 - AB67 )","v":55},{"$f":"IF( $AC67 = 0, \"\", IF( OFFSET( Combine!$AP$9,$AC67 - 1,0,1,1)<>0, VLOOKUP( OFFSET( Combine!$AP$9,$AC67 - 1,0,1,1),[1]Items!$A$2:$E$10001,3,0),\"\"))","v":""}]
[{"$f":"IF( $AC68 = 0, \"\", IF( OFFSET( Combine!AQ$9,$AC68 - 1,0,1,1)<>0, IF(OR($AD68=\"LUMP\", $AD68=\"LS\"), \"LUMP\", OFFSET( Combine!AQ$9,$AC68 - 1,0,1,1)),\"\"))","v":""},{"$f":"IF( $AC68 = 0, \"\", IF( OFFSET( Combine!AR$9,$AC68 - 1,0,1,1)<>0, IF(OR($AD68=\"LUMP\", $AD68=\"LS\"), \"LUMP\", OFFSET( Combine!AR$9,$AC68 - 1,0,1,1)),\"\"))","v":""},{"$f":"IF( $AC68 = 0, \"\", IF( OFFSET( Combine!AS$9,$AC68 - 1,0,1,1)<>0, IF(OR($AD68=\"LUMP\", $AD68=\"LS\"), \"LUMP\", OFFSET( Combine!AS$9,$AC68 - 1,0,1,1)),\"\"))","v":""},{"$f":"IF( $AC68 = 0, \"\", IF( OFFSET( Combine!AT$9,$AC68 - 1,0,1,1)<>0, IF(OR($AD68=\"LUMP\", $AD68=\"LS\"), \"LUMP\", OFFSET( Combine!AT$9,$AC68 - 1,0,1,1)),\"\"))","v":""},{"$f":"IF( $AC68 = 0, \"\", IF( OFFSET( Combine!AU$9,$AC68 - 1,0,1,1)<>0, IF(OR($AD68=\"LUMP\", $AD68=\"LS\"), \"LUMP\", OFFSET( Combine!AU$9,$AC68 - 1,0,1,1)),\"\"))","v":""},{"$f":"IF( $AC68 = 0, \"\", IF( OFFSET( Combine!AV$9,$AC68 - 1,0,1,1)<>0, IF(OR($AD68=\"LUMP\", $AD68=\"LS\"), \"LUMP\", OFFSET( Combine!AV$9,$AC68 - 1,0,1,1)),\"\"))","v":""},{"$f":"IF( $AC68 = 0, \"\", IF( OFFSET( Combine!AW$9,$AC68 - 1,0,1,1)<>0, IF(OR($AD68=\"LUMP\", $AD68=\"LS\"), \"LUMP\", OFFSET( Combine!AW$9,$AC68 - 1,0,1,1)),\"\"))","v":""},{"$f":"IF( $AC68 = 0, \"\", IF( OFFSET( Combine!AX$9,$AC68 - 1,0,1,1)<>0, IF(OR($AD68=\"LUMP\", $AD68=\"LS\"), \"LUMP\", OFFSET( Combine!AX$9,$AC68 - 1,0,1,1)),\"\"))","v":""},{"$f":"IF( $AC68 = 0, \"\", IF( OFFSET( Combine!AY$9,$AC68 - 1,0,1,1)<>0, IF(OR($AD68=\"LUMP\", $AD68=\"LS\"), \"LUMP\", OFFSET( Combine!AY$9,$AC68 - 1,0,1,1)),\"\"))","v":""},{"$f":"IF( $AC68 = 0, \"\", IF( OFFSET( Combine!AZ$9,$AC68 - 1,0,1,1)<>0, IF(OR($AD68=\"LUMP\", $AD68=\"LS\"), \"LUMP\", OFFSET( Combine!AZ$9,$AC68 - 1,0,1,1)),\"\"))","v":""},{"$f":"IF( $AC68 = 0, \"\", IF( OFFSET( Combine!BA$9,$AC68 - 1,0,1,1)<>0, IF(OR($AD68=\"LUMP\", $AD68=\"LS\"), \"LUMP\", OFFSET( Combine!BA$9,$AC68 - 1,0,1,1)),\"\"))","v":""},{"$f":"IF( $AC68 = 0, \"\", IF( OFFSET( Combine!BB$9,$AC68 - 1,0,1,1)<>0, IF(OR($AD68=\"LUMP\", $AD68=\"LS\"), \"LUMP\", OFFSET( Combine!BB$9,$AC68 - 1,0,1,1)),\"\"))","v":""},{"$f":"IF( $AC68 = 0, \"\", IF( OFFSET( Combine!BC$9,$AC68 - 1,0,1,1)<>0, IF(OR($AD68=\"LUMP\", $AD68=\"LS\"), \"LUMP\", OFFSET( Combine!BC$9,$AC68 - 1,0,1,1)),\"\"))","v":""},{"$f":"IF( $AC68 = 0, \"\", IF( OFFSET( Combine!BD$9,$AC68 - 1,0,1,1)<>0, IF(OR($AD68=\"LUMP\", $AD68=\"LS\"), \"LUMP\", OFFSET( Combine!BD$9,$AC68 - 1,0,1,1)),\"\"))","v":""},{"$f":"IF( $AC68 = 0, \"\", IF( OFFSET( Combine!BE$9,$AC68 - 1,0,1,1)<>0, IF(OR($AD68=\"LUMP\", $AD68=\"LS\"), \"LUMP\", OFFSET( Combine!BE$9,$AC68 - 1,0,1,1)),\"\"))","v":""},{"$f":"IF( $AC68 = 0, \"\", IF( OFFSET( Combine!BF$9,$AC68 - 1,0,1,1)<>0, IF(OR($AD68=\"LUMP\", $AD68=\"LS\"), \"LUMP\", OFFSET( Combine!BF$9,$AC68 - 1,0,1,1)),\"\"))","v":""},{"$f":"IF( $AC68 = 0, \"\", IF( OFFSET( Combine!BG$9,$AC68 - 1,0,1,1)<>0, IF(OR($AD68=\"LUMP\", $AD68=\"LS\"), \"LUMP\", OFFSET( Combine!BG$9,$AC68 - 1,0,1,1)),\"\"))","v":""},{"$f":"IF( $AC68 = 0, \"\", IF( OFFSET( Combine!BH$9,$AC68 - 1,0,1,1)<>0, IF(OR($AD68=\"LUMP\", $AD68=\"LS\"), \"LUMP\", OFFSET( Combine!BH$9,$AC68 - 1,0,1,1)),\"\"))","v":""},{"$f":"IF( $AC68 = 0, \"\", IF( OFFSET( Combine!BI$9,$AC68 - 1,0,1,1)<>0, IF(OR($AD68=\"LUMP\", $AD68=\"LS\"), \"LUMP\", OFFSET( Combine!BI$9,$AC68 - 1,0,1,1)),\"\"))","v":""},{"$f":"IF( $AC68 = 0, \"\", IF( OFFSET( Combine!BJ$9,$AC68 - 1,0,1,1)<>0, IF(OR($AD68=\"LUMP\", $AD68=\"LS\"), \"LUMP\", OFFSET( Combine!BJ$9,$AC68 - 1,0,1,1)),\"\"))","v":""},{"$f":"IF( $AC68 = 0, \"\", IF( OFFSET( Combine!AP$9,$AC68 - 1,0,1,1)<>0, LEFT(OFFSET( Combine!AP$9,$AC68 - 1,0,1,1),3),\"\"))","v":""},{"$f":"IF( $AC68 = 0, \"\", IF( OFFSET( Combine!AP$9,$AC68 - 1,0,1,1)<>0, IF(LEN(OFFSET( Combine!AP$9,$AC68 - 1,0,1,1))=9,   RIGHT(OFFSET( Combine!AP$9,$AC68 - 1,0,1,1),5),    LEFT(RIGHT(OFFSET( Combine!AP$9,$AC68 - 1,0,1,1),6), 5)      ),\"\"))","v":""},"",{"$f":"IF( $AC68 = 0, \"\", IF( OFFSET( Combine!$AP$9,$AC68 - 1,0,1,1)<>0,IF(OR(AD68=\"LUMP\", AD68=\"LS\"), \"\", AD68),\"\"))","v":""},{"$f":"IF( $AC68 = 0, \"\", IF( OFFSET( Combine!$AP$9,$AC68 - 1,0,1,1)<>0, VLOOKUP( OFFSET( Combine!$AP$9,$AC68 - 1,0,1,1),[1]Items!$A$2:$E$10001,4,0),\"\"))","v":""},null,{"$f":"AA67+1","v":66},11,0,{"$f":"IF( $AC68 = 0, \"\", IF( OFFSET( Combine!$AP$9,$AC68 - 1,0,1,1)<>0, VLOOKUP( OFFSET( Combine!$AP$9,$AC68 - 1,0,1,1),[1]Items!$A$2:$E$10001,3,0),\"\"))","v":""}]
[{"$f":"IF( $AC69 = 0, \"\", IF( OFFSET( Combine!AQ$9,$AC69 - 1,0,1,1)<>0, IF(OR($AD69=\"LUMP\", $AD69=\"LS\"), \"LUMP\", OFFSET( Combine!AQ$9,$AC69 - 1,0,1,1)),\"\"))","v":""},{"$f":"IF( $AC69 = 0, \"\", IF( OFFSET( Combine!AR$9,$AC69 - 1,0,1,1)<>0, IF(OR($AD69=\"LUMP\", $AD69=\"LS\"), \"LUMP\", OFFSET( Combine!AR$9,$AC69 - 1,0,1,1)),\"\"))","v":""},{"$f":"IF( $AC69 = 0, \"\", IF( OFFSET( Combine!AS$9,$AC69 - 1,0,1,1)<>0, IF(OR($AD69=\"LUMP\", $AD69=\"LS\"), \"LUMP\", OFFSET( Combine!AS$9,$AC69 - 1,0,1,1)),\"\"))","v":""},{"$f":"IF( $AC69 = 0, \"\", IF( OFFSET( Combine!AT$9,$AC69 - 1,0,1,1)<>0, IF(OR($AD69=\"LUMP\", $AD69=\"LS\"), \"LUMP\", OFFSET( Combine!AT$9,$AC69 - 1,0,1,1)),\"\"))","v":""},{"$f":"IF( $AC69 = 0, \"\", IF( OFFSET( Combine!AU$9,$AC69 - 1,0,1,1)<>0, IF(OR($AD69=\"LUMP\", $AD69=\"LS\"), \"LUMP\", OFFSET( Combine!AU$9,$AC69 - 1,0,1,1)),\"\"))","v":""},{"$f":"IF( $AC69 = 0, \"\", IF( OFFSET( Combine!AV$9,$AC69 - 1,0,1,1)<>0, IF(OR($AD69=\"LUMP\", $AD69=\"LS\"), \"LUMP\", OFFSET( Combine!AV$9,$AC69 - 1,0,1,1)),\"\"))","v":""},{"$f":"IF( $AC69 = 0, \"\", IF( OFFSET( Combine!AW$9,$AC69 - 1,0,1,1)<>0, IF(OR($AD69=\"LUMP\", $AD69=\"LS\"), \"LUMP\", OFFSET( Combine!AW$9,$AC69 - 1,0,1,1)),\"\"))","v":""},{"$f":"IF( $AC69 = 0, \"\", IF( OFFSET( Combine!AX$9,$AC69 - 1,0,1,1)<>0, IF(OR($AD69=\"LUMP\", $AD69=\"LS\"), \"LUMP\", OFFSET( Combine!AX$9,$AC69 - 1,0,1,1)),\"\"))","v":""},{"$f":"IF( $AC69 = 0, \"\", IF( OFFSET( Combine!AY$9,$AC69 - 1,0,1,1)<>0, IF(OR($AD69=\"LUMP\", $AD69=\"LS\"), \"LUMP\", OFFSET( Combine!AY$9,$AC69 - 1,0,1,1)),\"\"))","v":""},{"$f":"IF( $AC69 = 0, \"\", IF( OFFSET( Combine!AZ$9,$AC69 - 1,0,1,1)<>0, IF(OR($AD69=\"LUMP\", $AD69=\"LS\"), \"LUMP\", OFFSET( Combine!AZ$9,$AC69 - 1,0,1,1)),\"\"))","v":""},{"$f":"IF( $AC69 = 0, \"\", IF( OFFSET( Combine!BA$9,$AC69 - 1,0,1,1)<>0, IF(OR($AD69=\"LUMP\", $AD69=\"LS\"), \"LUMP\", OFFSET( Combine!BA$9,$AC69 - 1,0,1,1)),\"\"))","v":""},{"$f":"IF( $AC69 = 0, \"\", IF( OFFSET( Combine!BB$9,$AC69 - 1,0,1,1)<>0, IF(OR($AD69=\"LUMP\", $AD69=\"LS\"), \"LUMP\", OFFSET( Combine!BB$9,$AC69 - 1,0,1,1)),\"\"))","v":""},{"$f":"IF( $AC69 = 0, \"\", IF( OFFSET( Combine!BC$9,$AC69 - 1,0,1,1)<>0, IF(OR($AD69=\"LUMP\", $AD69=\"LS\"), \"LUMP\", OFFSET( Combine!BC$9,$AC69 - 1,0,1,1)),\"\"))","v":""},{"$f":"IF( $AC69 = 0, \"\", IF( OFFSET( Combine!BD$9,$AC69 - 1,0,1,1)<>0, IF(OR($AD69=\"LUMP\", $AD69=\"LS\"), \"LUMP\", OFFSET( Combine!BD$9,$AC69 - 1,0,1,1)),\"\"))","v":""},{"$f":"IF( $AC69 = 0, \"\", IF( OFFSET( Combine!BE$9,$AC69 - 1,0,1,1)<>0, IF(OR($AD69=\"LUMP\", $AD69=\"LS\"), \"LUMP\", OFFSET( Combine!BE$9,$AC69 - 1,0,1,1)),\"\"))","v":""},{"$f":"IF( $AC69 = 0, \"\", IF( OFFSET( Combine!BF$9,$AC69 - 1,0,1,1)<>0, IF(OR($AD69=\"LUMP\", $AD69=\"LS\"), \"LUMP\", OFFSET( Combine!BF$9,$AC69 - 1,0,1,1)),\"\"))","v":""},{"$f":"IF( $AC69 = 0, \"\", IF( OFFSET( Combine!BG$9,$AC69 - 1,0,1,1)<>0, IF(OR($AD69=\"LUMP\", $AD69=\"LS\"), \"LUMP\", OFFSET( Combine!BG$9,$AC69 - 1,0,1,1)),\"\"))","v":""},{"$f":"IF( $AC69 = 0, \"\", IF( OFFSET( Combine!BH$9,$AC69 - 1,0,1,1)<>0, IF(OR($AD69=\"LUMP\", $AD69=\"LS\"), \"LUMP\", OFFSET( Combine!BH$9,$AC69 - 1,0,1,1)),\"\"))","v":""},{"$f":"IF( $AC69 = 0, \"\", IF( OFFSET( Combine!BI$9,$AC69 - 1,0,1,1)<>0, IF(OR($AD69=\"LUMP\", $AD69=\"LS\"), \"LUMP\", OFFSET( Combine!BI$9,$AC69 - 1,0,1,1)),\"\"))","v":""},{"$f":"IF( $AC69 = 0, \"\", IF( OFFSET( Combine!BJ$9,$AC69 - 1,0,1,1)<>0, IF(OR($AD69=\"LUMP\", $AD69=\"LS\"), \"LUMP\", OFFSET( Combine!BJ$9,$AC69 - 1,0,1,1)),\"\"))","v":""},{"$f":"IF( $AC69 = 0, \"\", IF( OFFSET( Combine!AP$9,$AC69 - 1,0,1,1)<>0, LEFT(OFFSET( Combine!AP$9,$AC69 - 1,0,1,1),3),\"\"))","v":""},{"$f":"IF( $AC69 = 0, \"\", IF( OFFSET( Combine!AP$9,$AC69 - 1,0,1,1)<>0, IF(LEN(OFFSET( Combine!AP$9,$AC69 - 1,0,1,1))=9,   RIGHT(OFFSET( Combine!AP$9,$AC69 - 1,0,1,1),5),    LEFT(RIGHT(OFFSET( Combine!AP$9,$AC69 - 1,0,1,1),6), 5)      ),\"\"))","v":""},"",{"$f":"IF( $AC69 = 0, \"\", IF( OFFSET( Combine!$AP$9,$AC69 - 1,0,1,1)<>0,IF(OR(AD69=\"LUMP\", AD69=\"LS\"), \"\", AD69),\"\"))","v":""},{"$f":"IF( $AC69 = 0, \"\", IF( OFFSET( Combine!$AP$9,$AC69 - 1,0,1,1)<>0, VLOOKUP( OFFSET( Combine!$AP$9,$AC69 - 1,0,1,1),[1]Items!$A$2:$E$10001,4,0),\"\"))","v":""},null,67,11,56,{"$f":"IF( $AC69 = 0, \"\", IF( OFFSET( Combine!$AP$9,$AC69 - 1,0,1,1)<>0, VLOOKUP( OFFSET( Combine!$AP$9,$AC69 - 1,0,1,1),[1]Items!$A$2:$E$10001,3,0),\"\"))","v":""}]
[{"$f":"IF( $AC70 = 0, \"\", IF( OFFSET( Combine!AQ$9,$AC70 - 1,0,1,1)<>0, IF(OR($AD70=\"LUMP\", $AD70=\"LS\"), \"LUMP\", OFFSET( Combine!AQ$9,$AC70 - 1,0,1,1)),\"\"))","v":""},{"$f":"IF( $AC70 = 0, \"\", IF( OFFSET( Combine!AR$9,$AC70 - 1,0,1,1)<>0, IF(OR($AD70=\"LUMP\", $AD70=\"LS\"), \"LUMP\", OFFSET( Combine!AR$9,$AC70 - 1,0,1,1)),\"\"))","v":""},{"$f":"IF( $AC70 = 0, \"\", IF( OFFSET( Combine!AS$9,$AC70 - 1,0,1,1)<>0, IF(OR($AD70=\"LUMP\", $AD70=\"LS\"), \"LUMP\", OFFSET( Combine!AS$9,$AC70 - 1,0,1,1)),\"\"))","v":""},{"$f":"IF( $AC70 = 0, \"\", IF( OFFSET( Combine!AT$9,$AC70 - 1,0,1,1)<>0, IF(OR($AD70=\"LUMP\", $AD70=\"LS\"), \"LUMP\", OFFSET( Combine!AT$9,$AC70 - 1,0,1,1)),\"\"))","v":""},{"$f":"IF( $AC70 = 0, \"\", IF( OFFSET( Combine!AU$9,$AC70 - 1,0,1,1)<>0, IF(OR($AD70=\"LUMP\", $AD70=\"LS\"), \"LUMP\", OFFSET( Combine!AU$9,$AC70 - 1,0,1,1)),\"\"))","v":""},{"$f":"IF( $AC70 = 0, \"\", IF( OFFSET( Combine!AV$9,$AC70 - 1,0,1,1)<>0, IF(OR($AD70=\"LUMP\", $AD70=\"LS\"), \"LUMP\", OFFSET( Combine!AV$9,$AC70 - 1,0,1,1)),\"\"))","v":""},{"$f":"IF( $AC70 = 0, \"\", IF( OFFSET( Combine!AW$9,$AC70 - 1,0,1,1)<>0, IF(OR($AD70=\"LUMP\", $AD70=\"LS\"), \"LUMP\", OFFSET( Combine!AW$9,$AC70 - 1,0,1,1)),\"\"))","v":""},{"$f":"IF( $AC70 = 0, \"\", IF( OFFSET( Combine!AX$9,$AC70 - 1,0,1,1)<>0, IF(OR($AD70=\"LUMP\", $AD70=\"LS\"), \"LUMP\", OFFSET( Combine!AX$9,$AC70 - 1,0,1,1)),\"\"))","v":""},{"$f":"IF( $AC70 = 0, \"\", IF( OFFSET( Combine!AY$9,$AC70 - 1,0,1,1)<>0, IF(OR($AD70=\"LUMP\", $AD70=\"LS\"), \"LUMP\", OFFSET( Combine!AY$9,$AC70 - 1,0,1,1)),\"\"))","v":""},{"$f":"IF( $AC70 = 0, \"\", IF( OFFSET( Combine!AZ$9,$AC70 - 1,0,1,1)<>0, IF(OR($AD70=\"LUMP\", $AD70=\"LS\"), \"LUMP\", OFFSET( Combine!AZ$9,$AC70 - 1,0,1,1)),\"\"))","v":""},{"$f":"IF( $AC70 = 0, \"\", IF( OFFSET( Combine!BA$9,$AC70 - 1,0,1,1)<>0, IF(OR($AD70=\"LUMP\", $AD70=\"LS\"), \"LUMP\", OFFSET( Combine!BA$9,$AC70 - 1,0,1,1)),\"\"))","v":""},{"$f":"IF( $AC70 = 0, \"\", IF( OFFSET( Combine!BB$9,$AC70 - 1,0,1,1)<>0, IF(OR($AD70=\"LUMP\", $AD70=\"LS\"), \"LUMP\", OFFSET( Combine!BB$9,$AC70 - 1,0,1,1)),\"\"))","v":""},{"$f":"IF( $AC70 = 0, \"\", IF( OFFSET( Combine!BC$9,$AC70 - 1,0,1,1)<>0, IF(OR($AD70=\"LUMP\", $AD70=\"LS\"), \"LUMP\", OFFSET( Combine!BC$9,$AC70 - 1,0,1,1)),\"\"))","v":""},{"$f":"IF( $AC70 = 0, \"\", IF( OFFSET( Combine!BD$9,$AC70 - 1,0,1,1)<>0, IF(OR($AD70=\"LUMP\", $AD70=\"LS\"), \"LUMP\", OFFSET( Combine!BD$9,$AC70 - 1,0,1,1)),\"\"))","v":""},{"$f":"IF( $AC70 = 0, \"\", IF( OFFSET( Combine!BE$9,$AC70 - 1,0,1,1)<>0, IF(OR($AD70=\"LUMP\", $AD70=\"LS\"), \"LUMP\", OFFSET( Combine!BE$9,$AC70 - 1,0,1,1)),\"\"))","v":""},{"$f":"IF( $AC70 = 0, \"\", IF( OFFSET( Combine!BF$9,$AC70 - 1,0,1,1)<>0, IF(OR($AD70=\"LUMP\", $AD70=\"LS\"), \"LUMP\", OFFSET( Combine!BF$9,$AC70 - 1,0,1,1)),\"\"))","v":""},{"$f":"IF( $AC70 = 0, \"\", IF( OFFSET( Combine!BG$9,$AC70 - 1,0,1,1)<>0, IF(OR($AD70=\"LUMP\", $AD70=\"LS\"), \"LUMP\", OFFSET( Combine!BG$9,$AC70 - 1,0,1,1)),\"\"))","v":""},{"$f":"IF( $AC70 = 0, \"\", IF( OFFSET( Combine!BH$9,$AC70 - 1,0,1,1)<>0, IF(OR($AD70=\"LUMP\", $AD70=\"LS\"), \"LUMP\", OFFSET( Combine!BH$9,$AC70 - 1,0,1,1)),\"\"))","v":""},{"$f":"IF( $AC70 = 0, \"\", IF( OFFSET( Combine!BI$9,$AC70 - 1,0,1,1)<>0, IF(OR($AD70=\"LUMP\", $AD70=\"LS\"), \"LUMP\", OFFSET( Combine!BI$9,$AC70 - 1,0,1,1)),\"\"))","v":""},{"$f":"IF( $AC70 = 0, \"\", IF( OFFSET( Combine!BJ$9,$AC70 - 1,0,1,1)<>0, IF(OR($AD70=\"LUMP\", $AD70=\"LS\"), \"LUMP\", OFFSET( Combine!BJ$9,$AC70 - 1,0,1,1)),\"\"))","v":""},{"$f":"IF( $AC70 = 0, \"\", IF( OFFSET( Combine!AP$9,$AC70 - 1,0,1,1)<>0, LEFT(OFFSET( Combine!AP$9,$AC70 - 1,0,1,1),3),\"\"))","v":""},{"$f":"IF( $AC70 = 0, \"\", IF( OFFSET( Combine!AP$9,$AC70 - 1,0,1,1)<>0, IF(LEN(OFFSET( Combine!AP$9,$AC70 - 1,0,1,1))=9,   RIGHT(OFFSET( Combine!AP$9,$AC70 - 1,0,1,1),5),    LEFT(RIGHT(OFFSET( Combine!AP$9,$AC70 - 1,0,1,1),6), 5)      ),\"\"))","v":""},{"$f":"IF(SUM(A70:T70)<>0,SUM(A70:T70),IF(OR(AD70=\"LUMP\", AD70=\"LS\"), \"LUMP\", \"\"))","v":""},{"$f":"IF( $AC70 = 0, \"\", IF( OFFSET( Combine!$AP$9,$AC70 - 1,0,1,1)<>0,IF(OR(AD70=\"LUMP\", AD70=\"LS\"), \"\", AD70),\"\"))","v":""},{"$f":"IF( $AC70 = 0, \"\", IF( OFFSET( Combine!$AP$9,$AC70 - 1,0,1,1)<>0, VLOOKUP( OFFSET( Combine!$AP$9,$AC70 - 1,0,1,1),[1]Items!$A$2:$E$10001,4,0),\"\"))","v":""},null,68,11,57,{"$f":"IF( $AC70 = 0, \"\", IF( OFFSET( Combine!$AP$9,$AC70 - 1,0,1,1)<>0, VLOOKUP( OFFSET( Combine!$AP$9,$AC70 - 1,0,1,1),[1]Items!$A$2:$E$10001,3,0),\"\"))","v":""}]
[{"$f":"IF( $AC71 = 0, \"\", IF( OFFSET( Combine!AQ$9,$AC71 - 1,0,1,1)<>0, IF(OR($AD71=\"LUMP\", $AD71=\"LS\"), \"LUMP\", OFFSET( Combine!AQ$9,$AC71 - 1,0,1,1)),\"\"))","v":""},{"$f":"IF( $AC71 = 0, \"\", IF( OFFSET( Combine!AR$9,$AC71 - 1,0,1,1)<>0, IF(OR($AD71=\"LUMP\", $AD71=\"LS\"), \"LUMP\", OFFSET( Combine!AR$9,$AC71 - 1,0,1,1)),\"\"))","v":""},{"$f":"IF( $AC71 = 0, \"\", IF( OFFSET( Combine!AS$9,$AC71 - 1,0,1,1)<>0, IF(OR($AD71=\"LUMP\", $AD71=\"LS\"), \"LUMP\", OFFSET( Combine!AS$9,$AC71 - 1,0,1,1)),\"\"))","v":""},{"$f":"IF( $AC71 = 0, \"\", IF( OFFSET( Combine!AT$9,$AC71 - 1,0,1,1)<>0, IF(OR($AD71=\"LUMP\", $AD71=\"LS\"), \"LUMP\", OFFSET( Combine!AT$9,$AC71 - 1,0,1,1)),\"\"))","v":""},{"$f":"IF( $AC71 = 0, \"\", IF( OFFSET( Combine!AU$9,$AC71 - 1,0,1,1)<>0, IF(OR($AD71=\"LUMP\", $AD71=\"LS\"), \"LUMP\", OFFSET( Combine!AU$9,$AC71 - 1,0,1,1)),\"\"))","v":""},{"$f":"IF( $AC71 = 0, \"\", IF( OFFSET( Combine!AV$9,$AC71 - 1,0,1,1)<>0, IF(OR($AD71=\"LUMP\", $AD71=\"LS\"), \"LUMP\", OFFSET( Combine!AV$9,$AC71 - 1,0,1,1)),\"\"))","v":""},{"$f":"IF( $AC71 = 0, \"\", IF( OFFSET( Combine!AW$9,$AC71 - 1,0,1,1)<>0, IF(OR($AD71=\"LUMP\", $AD71=\"LS\"), \"LUMP\", OFFSET( Combine!AW$9,$AC71 - 1,0,1,1)),\"\"))","v":""},{"$f":"IF( $AC71 = 0, \"\", IF( OFFSET( Combine!AX$9,$AC71 - 1,0,1,1)<>0, IF(OR($AD71=\"LUMP\", $AD71=\"LS\"), \"LUMP\", OFFSET( Combine!AX$9,$AC71 - 1,0,1,1)),\"\"))","v":""},{"$f":"IF( $AC71 = 0, \"\", IF( OFFSET( Combine!AY$9,$AC71 - 1,0,1,1)<>0, IF(OR($AD71=\"LUMP\", $AD71=\"LS\"), \"LUMP\", OFFSET( Combine!AY$9,$AC71 - 1,0,1,1)),\"\"))","v":""},{"$f":"IF( $AC71 = 0, \"\", IF( OFFSET( Combine!AZ$9,$AC71 - 1,0,1,1)<>0, IF(OR($AD71=\"LUMP\", $AD71=\"LS\"), \"LUMP\", OFFSET( Combine!AZ$9,$AC71 - 1,0,1,1)),\"\"))","v":""},{"$f":"IF( $AC71 = 0, \"\", IF( OFFSET( Combine!BA$9,$AC71 - 1,0,1,1)<>0, IF(OR($AD71=\"LUMP\", $AD71=\"LS\"), \"LUMP\", OFFSET( Combine!BA$9,$AC71 - 1,0,1,1)),\"\"))","v":""},{"$f":"IF( $AC71 = 0, \"\", IF( OFFSET( Combine!BB$9,$AC71 - 1,0,1,1)<>0, IF(OR($AD71=\"LUMP\", $AD71=\"LS\"), \"LUMP\", OFFSET( Combine!BB$9,$AC71 - 1,0,1,1)),\"\"))","v":""},{"$f":"IF( $AC71 = 0, \"\", IF( OFFSET( Combine!BC$9,$AC71 - 1,0,1,1)<>0, IF(OR($AD71=\"LUMP\", $AD71=\"LS\"), \"LUMP\", OFFSET( Combine!BC$9,$AC71 - 1,0,1,1)),\"\"))","v":""},{"$f":"IF( $AC71 = 0, \"\", IF( OFFSET( Combine!BD$9,$AC71 - 1,0,1,1)<>0, IF(OR($AD71=\"LUMP\", $AD71=\"LS\"), \"LUMP\", OFFSET( Combine!BD$9,$AC71 - 1,0,1,1)),\"\"))","v":""},{"$f":"IF( $AC71 = 0, \"\", IF( OFFSET( Combine!BE$9,$AC71 - 1,0,1,1)<>0, IF(OR($AD71=\"LUMP\", $AD71=\"LS\"), \"LUMP\", OFFSET( Combine!BE$9,$AC71 - 1,0,1,1)),\"\"))","v":""},{"$f":"IF( $AC71 = 0, \"\", IF( OFFSET( Combine!BF$9,$AC71 - 1,0,1,1)<>0, IF(OR($AD71=\"LUMP\", $AD71=\"LS\"), \"LUMP\", OFFSET( Combine!BF$9,$AC71 - 1,0,1,1)),\"\"))","v":""},{"$f":"IF( $AC71 = 0, \"\", IF( OFFSET( Combine!BG$9,$AC71 - 1,0,1,1)<>0, IF(OR($AD71=\"LUMP\", $AD71=\"LS\"), \"LUMP\", OFFSET( Combine!BG$9,$AC71 - 1,0,1,1)),\"\"))","v":""},{"$f":"IF( $AC71 = 0, \"\", IF( OFFSET( Combine!BH$9,$AC71 - 1,0,1,1)<>0, IF(OR($AD71=\"LUMP\", $AD71=\"LS\"), \"LUMP\", OFFSET( Combine!BH$9,$AC71 - 1,0,1,1)),\"\"))","v":""},{"$f":"IF( $AC71 = 0, \"\", IF( OFFSET( Combine!BI$9,$AC71 - 1,0,1,1)<>0, IF(OR($AD71=\"LUMP\", $AD71=\"LS\"), \"LUMP\", OFFSET( Combine!BI$9,$AC71 - 1,0,1,1)),\"\"))","v":""},{"$f":"IF( $AC71 = 0, \"\", IF( OFFSET( Combine!BJ$9,$AC71 - 1,0,1,1)<>0, IF(OR($AD71=\"LUMP\", $AD71=\"LS\"), \"LUMP\", OFFSET( Combine!BJ$9,$AC71 - 1,0,1,1)),\"\"))","v":""},{"$f":"IF( $AC71 = 0, \"\", IF( OFFSET( Combine!AP$9,$AC71 - 1,0,1,1)<>0, LEFT(OFFSET( Combine!AP$9,$AC71 - 1,0,1,1),3),\"\"))","v":""},{"$f":"IF( $AC71 = 0, \"\", IF( OFFSET( Combine!AP$9,$AC71 - 1,0,1,1)<>0, IF(LEN(OFFSET( Combine!AP$9,$AC71 - 1,0,1,1))=9,   RIGHT(OFFSET( Combine!AP$9,$AC71 - 1,0,1,1),5),    LEFT(RIGHT(OFFSET( Combine!AP$9,$AC71 - 1,0,1,1),6), 5)      ),\"\"))","v":""},{"$f":"IF(SUM(A71:T71)<>0,SUM(A71:T71),IF(OR(AD71=\"LUMP\", AD71=\"LS\"), \"LUMP\", \"\"))","v":""},{"$f":"IF( $AC71 = 0, \"\", IF( OFFSET( Combine!$AP$9,$AC71 - 1,0,1,1)<>0,IF(OR(AD71=\"LUMP\", AD71=\"LS\"), \"\", AD71),\"\"))","v":""},{"$f":"IF( $AC71 = 0, \"\", IF( OFFSET( Combine!$AP$9,$AC71 - 1,0,1,1)<>0, VLOOKUP( OFFSET( Combine!$AP$9,$AC71 - 1,0,1,1),[1]Items!$A$2:$E$10001,4,0),\"\"))","v":""},null,69,11,58,{"$f":"IF( $AC71 = 0, \"\", IF( OFFSET( Combine!$AP$9,$AC71 - 1,0,1,1)<>0, VLOOKUP( OFFSET( Combine!$AP$9,$AC71 - 1,0,1,1),[1]Items!$A$2:$E$10001,3,0),\"\"))","v":""}]
[{"$f":"IF( $AC72 = 0, \"\", IF( OFFSET( Combine!AQ$9,$AC72 - 1,0,1,1)<>0, IF(OR($AD72=\"LUMP\", $AD72=\"LS\"), \"LUMP\", OFFSET( Combine!AQ$9,$AC72 - 1,0,1,1)),\"\"))","v":""},{"$f":"IF( $AC72 = 0, \"\", IF( OFFSET( Combine!AR$9,$AC72 - 1,0,1,1)<>0, IF(OR($AD72=\"LUMP\", $AD72=\"LS\"), \"LUMP\", OFFSET( Combine!AR$9,$AC72 - 1,0,1,1)),\"\"))","v":""},{"$f":"IF( $AC72 = 0, \"\", IF( OFFSET( Combine!AS$9,$AC72 - 1,0,1,1)<>0, IF(OR($AD72=\"LUMP\", $AD72=\"LS\"), \"LUMP\", OFFSET( Combine!AS$9,$AC72 - 1,0,1,1)),\"\"))","v":""},{"$f":"IF( $AC72 = 0, \"\", IF( OFFSET( Combine!AT$9,$AC72 - 1,0,1,1)<>0, IF(OR($AD72=\"LUMP\", $AD72=\"LS\"), \"LUMP\", OFFSET( Combine!AT$9,$AC72 - 1,0,1,1)),\"\"))","v":""},{"$f":"IF( $AC72 = 0, \"\", IF( OFFSET( Combine!AU$9,$AC72 - 1,0,1,1)<>0, IF(OR($AD72=\"LUMP\", $AD72=\"LS\"), \"LUMP\", OFFSET( Combine!AU$9,$AC72 - 1,0,1,1)),\"\"))","v":""},{"$f":"IF( $AC72 = 0, \"\", IF( OFFSET( Combine!AV$9,$AC72 - 1,0,1,1)<>0, IF(OR($AD72=\"LUMP\", $AD72=\"LS\"), \"LUMP\", OFFSET( Combine!AV$9,$AC72 - 1,0,1,1)),\"\"))","v":""},{"$f":"IF( $AC72 = 0, \"\", IF( OFFSET( Combine!AW$9,$AC72 - 1,0,1,1)<>0, IF(OR($AD72=\"LUMP\", $AD72=\"LS\"), \"LUMP\", OFFSET( Combine!AW$9,$AC72 - 1,0,1,1)),\"\"))","v":""},{"$f":"IF( $AC72 = 0, \"\", IF( OFFSET( Combine!AX$9,$AC72 - 1,0,1,1)<>0, IF(OR($AD72=\"LUMP\", $AD72=\"LS\"), \"LUMP\", OFFSET( Combine!AX$9,$AC72 - 1,0,1,1)),\"\"))","v":""},{"$f":"IF( $AC72 = 0, \"\", IF( OFFSET( Combine!AY$9,$AC72 - 1,0,1,1)<>0, IF(OR($AD72=\"LUMP\", $AD72=\"LS\"), \"LUMP\", OFFSET( Combine!AY$9,$AC72 - 1,0,1,1)),\"\"))","v":""},{"$f":"IF( $AC72 = 0, \"\", IF( OFFSET( Combine!AZ$9,$AC72 - 1,0,1,1)<>0, IF(OR($AD72=\"LUMP\", $AD72=\"LS\"), \"LUMP\", OFFSET( Combine!AZ$9,$AC72 - 1,0,1,1)),\"\"))","v":""},{"$f":"IF( $AC72 = 0, \"\", IF( OFFSET( Combine!BA$9,$AC72 - 1,0,1,1)<>0, IF(OR($AD72=\"LUMP\", $AD72=\"LS\"), \"LUMP\", OFFSET( Combine!BA$9,$AC72 - 1,0,1,1)),\"\"))","v":""},{"$f":"IF( $AC72 = 0, \"\", IF( OFFSET( Combine!BB$9,$AC72 - 1,0,1,1)<>0, IF(OR($AD72=\"LUMP\", $AD72=\"LS\"), \"LUMP\", OFFSET( Combine!BB$9,$AC72 - 1,0,1,1)),\"\"))","v":""},{"$f":"IF( $AC72 = 0, \"\", IF( OFFSET( Combine!BC$9,$AC72 - 1,0,1,1)<>0, IF(OR($AD72=\"LUMP\", $AD72=\"LS\"), \"LUMP\", OFFSET( Combine!BC$9,$AC72 - 1,0,1,1)),\"\"))","v":""},{"$f":"IF( $AC72 = 0, \"\", IF( OFFSET( Combine!BD$9,$AC72 - 1,0,1,1)<>0, IF(OR($AD72=\"LUMP\", $AD72=\"LS\"), \"LUMP\", OFFSET( Combine!BD$9,$AC72 - 1,0,1,1)),\"\"))","v":""},{"$f":"IF( $AC72 = 0, \"\", IF( OFFSET( Combine!BE$9,$AC72 - 1,0,1,1)<>0, IF(OR($AD72=\"LUMP\", $AD72=\"LS\"), \"LUMP\", OFFSET( Combine!BE$9,$AC72 - 1,0,1,1)),\"\"))","v":""},{"$f":"IF( $AC72 = 0, \"\", IF( OFFSET( Combine!BF$9,$AC72 - 1,0,1,1)<>0, IF(OR($AD72=\"LUMP\", $AD72=\"LS\"), \"LUMP\", OFFSET( Combine!BF$9,$AC72 - 1,0,1,1)),\"\"))","v":""},{"$f":"IF( $AC72 = 0, \"\", IF( OFFSET( Combine!BG$9,$AC72 - 1,0,1,1)<>0, IF(OR($AD72=\"LUMP\", $AD72=\"LS\"), \"LUMP\", OFFSET( Combine!BG$9,$AC72 - 1,0,1,1)),\"\"))","v":""},{"$f":"IF( $AC72 = 0, \"\", IF( OFFSET( Combine!BH$9,$AC72 - 1,0,1,1)<>0, IF(OR($AD72=\"LUMP\", $AD72=\"LS\"), \"LUMP\", OFFSET( Combine!BH$9,$AC72 - 1,0,1,1)),\"\"))","v":""},{"$f":"IF( $AC72 = 0, \"\", IF( OFFSET( Combine!BI$9,$AC72 - 1,0,1,1)<>0, IF(OR($AD72=\"LUMP\", $AD72=\"LS\"), \"LUMP\", OFFSET( Combine!BI$9,$AC72 - 1,0,1,1)),\"\"))","v":""},{"$f":"IF( $AC72 = 0, \"\", IF( OFFSET( Combine!BJ$9,$AC72 - 1,0,1,1)<>0, IF(OR($AD72=\"LUMP\", $AD72=\"LS\"), \"LUMP\", OFFSET( Combine!BJ$9,$AC72 - 1,0,1,1)),\"\"))","v":""},{"$f":"IF( $AC72 = 0, \"\", IF( OFFSET( Combine!AP$9,$AC72 - 1,0,1,1)<>0, LEFT(OFFSET( Combine!AP$9,$AC72 - 1,0,1,1),3),\"\"))","v":""},{"$f":"IF( $AC72 = 0, \"\", IF( OFFSET( Combine!AP$9,$AC72 - 1,0,1,1)<>0, IF(LEN(OFFSET( Combine!AP$9,$AC72 - 1,0,1,1))=9,   RIGHT(OFFSET( Combine!AP$9,$AC72 - 1,0,1,1),5),    LEFT(RIGHT(OFFSET( Combine!AP$9,$AC72 - 1,0,1,1),6), 5)      ),\"\"))","v":""},{"$f":"IF(SUM(A72:T72)<>0,SUM(A72:T72),IF(OR(AD72=\"LUMP\", AD72=\"LS\"), \"LUMP\", \"\"))","v":""},{"$f":"IF( $AC72 = 0, \"\", IF( OFFSET( Combine!$AP$9,$AC72 - 1,0,1,1)<>0,IF(OR(AD72=\"LUMP\", AD72=\"LS\"), \"\", AD72),\"\"))","v":""},{"$f":"IF( $AC72 = 0, \"\", IF( OFFSET( Combine!$AP$9,$AC72 - 1,0,1,1)<>0, VLOOKUP( OFFSET( Combine!$AP$9,$AC72 - 1,0,1,1),[1]Items!$A$2:$E$10001,4,0),\"\"))","v":""},null,70,11,59,{"$f":"IF( $AC72 = 0, \"\", IF( OFFSET( Combine!$AP$9,$AC72 - 1,0,1,1)<>0, VLOOKUP( OFFSET( Combine!$AP$9,$AC72 - 1,0,1,1),[1]Items!$A$2:$E$10001,3,0),\"\"))","v":""}]
[{"$f":"IF( $AC73 = 0, \"\", IF( OFFSET( Combine!AQ$9,$AC73 - 1,0,1,1)<>0, IF(OR($AD73=\"LUMP\", $AD73=\"LS\"), \"LUMP\", OFFSET( Combine!AQ$9,$AC73 - 1,0,1,1)),\"\"))","v":""},{"$f":"IF( $AC73 = 0, \"\", IF( OFFSET( Combine!AR$9,$AC73 - 1,0,1,1)<>0, IF(OR($AD73=\"LUMP\", $AD73=\"LS\"), \"LUMP\", OFFSET( Combine!AR$9,$AC73 - 1,0,1,1)),\"\"))","v":""},{"$f":"IF( $AC73 = 0, \"\", IF( OFFSET( Combine!AS$9,$AC73 - 1,0,1,1)<>0, IF(OR($AD73=\"LUMP\", $AD73=\"LS\"), \"LUMP\", OFFSET( Combine!AS$9,$AC73 - 1,0,1,1)),\"\"))","v":""},{"$f":"IF( $AC73 = 0, \"\", IF( OFFSET( Combine!AT$9,$AC73 - 1,0,1,1)<>0, IF(OR($AD73=\"LUMP\", $AD73=\"LS\"), \"LUMP\", OFFSET( Combine!AT$9,$AC73 - 1,0,1,1)),\"\"))","v":""},{"$f":"IF( $AC73 = 0, \"\", IF( OFFSET( Combine!AU$9,$AC73 - 1,0,1,1)<>0, IF(OR($AD73=\"LUMP\", $AD73=\"LS\"), \"LUMP\", OFFSET( Combine!AU$9,$AC73 - 1,0,1,1)),\"\"))","v":""},{"$f":"IF( $AC73 = 0, \"\", IF( OFFSET( Combine!AV$9,$AC73 - 1,0,1,1)<>0, IF(OR($AD73=\"LUMP\", $AD73=\"LS\"), \"LUMP\", OFFSET( Combine!AV$9,$AC73 - 1,0,1,1)),\"\"))","v":""},{"$f":"IF( $AC73 = 0, \"\", IF( OFFSET( Combine!AW$9,$AC73 - 1,0,1,1)<>0, IF(OR($AD73=\"LUMP\", $AD73=\"LS\"), \"LUMP\", OFFSET( Combine!AW$9,$AC73 - 1,0,1,1)),\"\"))","v":""},{"$f":"IF( $AC73 = 0, \"\", IF( OFFSET( Combine!AX$9,$AC73 - 1,0,1,1)<>0, IF(OR($AD73=\"LUMP\", $AD73=\"LS\"), \"LUMP\", OFFSET( Combine!AX$9,$AC73 - 1,0,1,1)),\"\"))","v":""},{"$f":"IF( $AC73 = 0, \"\", IF( OFFSET( Combine!AY$9,$AC73 - 1,0,1,1)<>0, IF(OR($AD73=\"LUMP\", $AD73=\"LS\"), \"LUMP\", OFFSET( Combine!AY$9,$AC73 - 1,0,1,1)),\"\"))","v":""},{"$f":"IF( $AC73 = 0, \"\", IF( OFFSET( Combine!AZ$9,$AC73 - 1,0,1,1)<>0, IF(OR($AD73=\"LUMP\", $AD73=\"LS\"), \"LUMP\", OFFSET( Combine!AZ$9,$AC73 - 1,0,1,1)),\"\"))","v":""},{"$f":"IF( $AC73 = 0, \"\", IF( OFFSET( Combine!BA$9,$AC73 - 1,0,1,1)<>0, IF(OR($AD73=\"LUMP\", $AD73=\"LS\"), \"LUMP\", OFFSET( Combine!BA$9,$AC73 - 1,0,1,1)),\"\"))","v":""},{"$f":"IF( $AC73 = 0, \"\", IF( OFFSET( Combine!BB$9,$AC73 - 1,0,1,1)<>0, IF(OR($AD73=\"LUMP\", $AD73=\"LS\"), \"LUMP\", OFFSET( Combine!BB$9,$AC73 - 1,0,1,1)),\"\"))","v":""},{"$f":"IF( $AC73 = 0, \"\", IF( OFFSET( Combine!BC$9,$AC73 - 1,0,1,1)<>0, IF(OR($AD73=\"LUMP\", $AD73=\"LS\"), \"LUMP\", OFFSET( Combine!BC$9,$AC73 - 1,0,1,1)),\"\"))","v":""},{"$f":"IF( $AC73 = 0, \"\", IF( OFFSET( Combine!BD$9,$AC73 - 1,0,1,1)<>0, IF(OR($AD73=\"LUMP\", $AD73=\"LS\"), \"LUMP\", OFFSET( Combine!BD$9,$AC73 - 1,0,1,1)),\"\"))","v":""},{"$f":"IF( $AC73 = 0, \"\", IF( OFFSET( Combine!BE$9,$AC73 - 1,0,1,1)<>0, IF(OR($AD73=\"LUMP\", $AD73=\"LS\"), \"LUMP\", OFFSET( Combine!BE$9,$AC73 - 1,0,1,1)),\"\"))","v":""},{"$f":"IF( $AC73 = 0, \"\", IF( OFFSET( Combine!BF$9,$AC73 - 1,0,1,1)<>0, IF(OR($AD73=\"LUMP\", $AD73=\"LS\"), \"LUMP\", OFFSET( Combine!BF$9,$AC73 - 1,0,1,1)),\"\"))","v":""},{"$f":"IF( $AC73 = 0, \"\", IF( OFFSET( Combine!BG$9,$AC73 - 1,0,1,1)<>0, IF(OR($AD73=\"LUMP\", $AD73=\"LS\"), \"LUMP\", OFFSET( Combine!BG$9,$AC73 - 1,0,1,1)),\"\"))","v":""},{"$f":"IF( $AC73 = 0, \"\", IF( OFFSET( Combine!BH$9,$AC73 - 1,0,1,1)<>0, IF(OR($AD73=\"LUMP\", $AD73=\"LS\"), \"LUMP\", OFFSET( Combine!BH$9,$AC73 - 1,0,1,1)),\"\"))","v":""},{"$f":"IF( $AC73 = 0, \"\", IF( OFFSET( Combine!BI$9,$AC73 - 1,0,1,1)<>0, IF(OR($AD73=\"LUMP\", $AD73=\"LS\"), \"LUMP\", OFFSET( Combine!BI$9,$AC73 - 1,0,1,1)),\"\"))","v":""},{"$f":"IF( $AC73 = 0, \"\", IF( OFFSET( Combine!BJ$9,$AC73 - 1,0,1,1)<>0, IF(OR($AD73=\"LUMP\", $AD73=\"LS\"), \"LUMP\", OFFSET( Combine!BJ$9,$AC73 - 1,0,1,1)),\"\"))","v":""},{"$f":"IF( $AC73 = 0, \"\", IF( OFFSET( Combine!AP$9,$AC73 - 1,0,1,1)<>0, LEFT(OFFSET( Combine!AP$9,$AC73 - 1,0,1,1),3),\"\"))","v":""},{"$f":"IF( $AC73 = 0, \"\", IF( OFFSET( Combine!AP$9,$AC73 - 1,0,1,1)<>0, IF(LEN(OFFSET( Combine!AP$9,$AC73 - 1,0,1,1))=9,   RIGHT(OFFSET( Combine!AP$9,$AC73 - 1,0,1,1),5),    LEFT(RIGHT(OFFSET( Combine!AP$9,$AC73 - 1,0,1,1),6), 5)      ),\"\"))","v":""},{"$f":"IF(SUM(A73:T73)<>0,SUM(A73:T73),IF(OR(AD73=\"LUMP\", AD73=\"LS\"), \"LUMP\", \"\"))","v":""},{"$f":"IF( $AC73 = 0, \"\", IF( OFFSET( Combine!$AP$9,$AC73 - 1,0,1,1)<>0,IF(OR(AD73=\"LUMP\", AD73=\"LS\"), \"\", AD73),\"\"))","v":""},{"$f":"IF( $AC73 = 0, \"\", IF( OFFSET( Combine!$AP$9,$AC73 - 1,0,1,1)<>0, VLOOKUP( OFFSET( Combine!$AP$9,$AC73 - 1,0,1,1),[1]Items!$A$2:$E$10001,4,0),\"\"))","v":""},null,71,11,60,{"$f":"IF( $AC73 = 0, \"\", IF( OFFSET( Combine!$AP$9,$AC73 - 1,0,1,1)<>0, VLOOKUP( OFFSET( Combine!$AP$9,$AC73 - 1,0,1,1),[1]Items!$A$2:$E$10001,3,0),\"\"))","v":""}]
[{"$f":"IF( $AC74 = 0, \"\", IF( OFFSET( Combine!AQ$9,$AC74 - 1,0,1,1)<>0, IF(OR($AD74=\"LUMP\", $AD74=\"LS\"), \"LUMP\", OFFSET( Combine!AQ$9,$AC74 - 1,0,1,1)),\"\"))","v":""},{"$f":"IF( $AC74 = 0, \"\", IF( OFFSET( Combine!AR$9,$AC74 - 1,0,1,1)<>0, IF(OR($AD74=\"LUMP\", $AD74=\"LS\"), \"LUMP\", OFFSET( Combine!AR$9,$AC74 - 1,0,1,1)),\"\"))","v":""},{"$f":"IF( $AC74 = 0, \"\", IF( OFFSET( Combine!AS$9,$AC74 - 1,0,1,1)<>0, IF(OR($AD74=\"LUMP\", $AD74=\"LS\"), \"LUMP\", OFFSET( Combine!AS$9,$AC74 - 1,0,1,1)),\"\"))","v":""},{"$f":"IF( $AC74 = 0, \"\", IF( OFFSET( Combine!AT$9,$AC74 - 1,0,1,1)<>0, IF(OR($AD74=\"LUMP\", $AD74=\"LS\"), \"LUMP\", OFFSET( Combine!AT$9,$AC74 - 1,0,1,1)),\"\"))","v":""},{"$f":"IF( $AC74 = 0, \"\", IF( OFFSET( Combine!AU$9,$AC74 - 1,0,1,1)<>0, IF(OR($AD74=\"LUMP\", $AD74=\"LS\"), \"LUMP\", OFFSET( Combine!AU$9,$AC74 - 1,0,1,1)),\"\"))","v":""},{"$f":"IF( $AC74 = 0, \"\", IF( OFFSET( Combine!AV$9,$AC74 - 1,0,1,1)<>0, IF(OR($AD74=\"LUMP\", $AD74=\"LS\"), \"LUMP\", OFFSET( Combine!AV$9,$AC74 - 1,0,1,1)),\"\"))","v":""},{"$f":"IF( $AC74 = 0, \"\", IF( OFFSET( Combine!AW$9,$AC74 - 1,0,1,1)<>0, IF(OR($AD74=\"LUMP\", $AD74=\"LS\"), \"LUMP\", OFFSET( Combine!AW$9,$AC74 - 1,0,1,1)),\"\"))","v":""},{"$f":"IF( $AC74 = 0, \"\", IF( OFFSET( Combine!AX$9,$AC74 - 1,0,1,1)<>0, IF(OR($AD74=\"LUMP\", $AD74=\"LS\"), \"LUMP\", OFFSET( Combine!AX$9,$AC74 - 1,0,1,1)),\"\"))","v":""},{"$f":"IF( $AC74 = 0, \"\", IF( OFFSET( Combine!AY$9,$AC74 - 1,0,1,1)<>0, IF(OR($AD74=\"LUMP\", $AD74=\"LS\"), \"LUMP\", OFFSET( Combine!AY$9,$AC74 - 1,0,1,1)),\"\"))","v":""},{"$f":"IF( $AC74 = 0, \"\", IF( OFFSET( Combine!AZ$9,$AC74 - 1,0,1,1)<>0, IF(OR($AD74=\"LUMP\", $AD74=\"LS\"), \"LUMP\", OFFSET( Combine!AZ$9,$AC74 - 1,0,1,1)),\"\"))","v":""},{"$f":"IF( $AC74 = 0, \"\", IF( OFFSET( Combine!BA$9,$AC74 - 1,0,1,1)<>0, IF(OR($AD74=\"LUMP\", $AD74=\"LS\"), \"LUMP\", OFFSET( Combine!BA$9,$AC74 - 1,0,1,1)),\"\"))","v":""},{"$f":"IF( $AC74 = 0, \"\", IF( OFFSET( Combine!BB$9,$AC74 - 1,0,1,1)<>0, IF(OR($AD74=\"LUMP\", $AD74=\"LS\"), \"LUMP\", OFFSET( Combine!BB$9,$AC74 - 1,0,1,1)),\"\"))","v":""},{"$f":"IF( $AC74 = 0, \"\", IF( OFFSET( Combine!BC$9,$AC74 - 1,0,1,1)<>0, IF(OR($AD74=\"LUMP\", $AD74=\"LS\"), \"LUMP\", OFFSET( Combine!BC$9,$AC74 - 1,0,1,1)),\"\"))","v":""},{"$f":"IF( $AC74 = 0, \"\", IF( OFFSET( Combine!BD$9,$AC74 - 1,0,1,1)<>0, IF(OR($AD74=\"LUMP\", $AD74=\"LS\"), \"LUMP\", OFFSET( Combine!BD$9,$AC74 - 1,0,1,1)),\"\"))","v":""},{"$f":"IF( $AC74 = 0, \"\", IF( OFFSET( Combine!BE$9,$AC74 - 1,0,1,1)<>0, IF(OR($AD74=\"LUMP\", $AD74=\"LS\"), \"LUMP\", OFFSET( Combine!BE$9,$AC74 - 1,0,1,1)),\"\"))","v":""},{"$f":"IF( $AC74 = 0, \"\", IF( OFFSET( Combine!BF$9,$AC74 - 1,0,1,1)<>0, IF(OR($AD74=\"LUMP\", $AD74=\"LS\"), \"LUMP\", OFFSET( Combine!BF$9,$AC74 - 1,0,1,1)),\"\"))","v":""},{"$f":"IF( $AC74 = 0, \"\", IF( OFFSET( Combine!BG$9,$AC74 - 1,0,1,1)<>0, IF(OR($AD74=\"LUMP\", $AD74=\"LS\"), \"LUMP\", OFFSET( Combine!BG$9,$AC74 - 1,0,1,1)),\"\"))","v":""},{"$f":"IF( $AC74 = 0, \"\", IF( OFFSET( Combine!BH$9,$AC74 - 1,0,1,1)<>0, IF(OR($AD74=\"LUMP\", $AD74=\"LS\"), \"LUMP\", OFFSET( Combine!BH$9,$AC74 - 1,0,1,1)),\"\"))","v":""},{"$f":"IF( $AC74 = 0, \"\", IF( OFFSET( Combine!BI$9,$AC74 - 1,0,1,1)<>0, IF(OR($AD74=\"LUMP\", $AD74=\"LS\"), \"LUMP\", OFFSET( Combine!BI$9,$AC74 - 1,0,1,1)),\"\"))","v":""},{"$f":"IF( $AC74 = 0, \"\", IF( OFFSET( Combine!BJ$9,$AC74 - 1,0,1,1)<>0, IF(OR($AD74=\"LUMP\", $AD74=\"LS\"), \"LUMP\", OFFSET( Combine!BJ$9,$AC74 - 1,0,1,1)),\"\"))","v":""},{"$f":"IF( $AC74 = 0, \"\", IF( OFFSET( Combine!AP$9,$AC74 - 1,0,1,1)<>0, LEFT(OFFSET( Combine!AP$9,$AC74 - 1,0,1,1),3),\"\"))","v":""},{"$f":"IF( $AC74 = 0, \"\", IF( OFFSET( Combine!AP$9,$AC74 - 1,0,1,1)<>0, IF(LEN(OFFSET( Combine!AP$9,$AC74 - 1,0,1,1))=9,   RIGHT(OFFSET( Combine!AP$9,$AC74 - 1,0,1,1),5),    LEFT(RIGHT(OFFSET( Combine!AP$9,$AC74 - 1,0,1,1),6), 5)      ),\"\"))","v":""},{"$f":"IF(SUM(A74:T74)<>0,SUM(A74:T74),IF(OR(AD74=\"LUMP\", AD74=\"LS\"), \"LUMP\", \"\"))","v":""},{"$f":"IF( $AC74 = 0, \"\", IF( OFFSET( Combine!$AP$9,$AC74 - 1,0,1,1)<>0,IF(OR(AD74=\"LUMP\", AD74=\"LS\"), \"\", AD74),\"\"))","v":""},{"$f":"IF( $AC74 = 0, \"\", IF( OFFSET( Combine!$AP$9,$AC74 - 1,0,1,1)<>0, VLOOKUP( OFFSET( Combine!$AP$9,$AC74 - 1,0,1,1),[1]Items!$A$2:$E$10001,4,0),\"\"))","v":""},null,72,12,0,{"$f":"IF( $AC74 = 0, \"\", IF( OFFSET( Combine!$AP$9,$AC74 - 1,0,1,1)<>0, VLOOKUP( OFFSET( Combine!$AP$9,$AC74 - 1,0,1,1),[1]Items!$A$2:$E$10001,3,0),\"\"))","v":""}]
[{"$f":"IF(OFFSET(Combine!AQ$8,$AA75,0,1,1)<>\"\",OFFSET(Combine!AQ$8,$AA75,0,1,1),\"\")","v":""},null,null,null,null,null,null,null,null,null,null,null,null,null,null,null,null,null,null,null,{"$f":"IF( $AC75 = 0, \"\", IF( OFFSET( Combine!AP$9,$AC75 - 1,0,1,1)<>0, LEFT(OFFSET( Combine!AP$9,$AC75 - 1,0,1,1),3),\"\"))","v":""},{"$f":"IF( $AC75 = 0, \"\", IF( OFFSET( Combine!AP$9,$AC75 - 1,0,1,1)<>0, IF(LEN(OFFSET( Combine!AP$9,$AC75 - 1,0,1,1))=9,   RIGHT(OFFSET( Combine!AP$9,$AC75 - 1,0,1,1),5),    LEFT(RIGHT(OFFSET( Combine!AP$9,$AC75 - 1,0,1,1),6), 5)      ),\"\"))","v":""},null,null,null,null,73,12,61,{"$f":"IF( $AC75 = 0, \"\", IF( OFFSET( Combine!$AP$9,$AC75 - 1,0,1,1)<>0, VLOOKUP( OFFSET( Combine!$AP$9,$AC75 - 1,0,1,1),[1]Items!$A$2:$E$10001,3,0),\"\"))","v":""}]

{"sheet":"Combine","index":4,"n_rows":842,"n_cols":62,"rows_kept":842,"cut":false,"hidden":false,"merged":[[0,41,1,61],[86,10,127,10],[128,10,169,10],[170,10,211,10],[3,18,3,19],[4,18,4,19],[0,18,1,39],[380,10,421,10],[0,0,0,4],[0,6,0,10],[44,10,85,10],[2,10,43,10],[212,10,253,10],[254,10,295,10],[296,10,337,10],[338,10,379,10],[800,10,841,10],[632,10,673,10],[674,10,715,10],[716,10,757,10],[758,10,799,10],[590,10,631,10],[422,10,463,10],[464,10,505,10],[506,10,547,10],[548,10,589,10]]}
["Cell References - HIDE",null,null,null,null,null,"Values",null,null,null,null,null,null,null,null,null,null,null,"                       ONLY MODIFY THE YELLOW CELLS (PAGE NUMBERS)",null,null,null,null,null,null,null,null,null,null,null,null,null,null,null,null,null,null,null,null,null,null,"TABLE TO MAKE SUB-SUMMARY"]
["Lookup Value","Quantity","Code","Line","Sheet",null,"Lookup Value","Quantity","Code","Sheet","Sheet"]
[{"$f":"ADDRESS($D3,1,4,1,$E3)","v":"'Sub01'!A108"},{"$f":"ADDRESS($D3,2,4,1,$E3)","v":"'Sub01'!B108"},{"$f":"ADDRESS($D3,3,4,1,$E3)","v":"'Sub01'!C108"},108,{"$f":"K3","v":"Sub01"},null,{"$f":"IF(INDIRECT(A3,1)<>\"\",INDIRECT(A3,1),\"\")","v":""},{"$f":"IF(INDIRECT(B3,1)<>\"\",IF(INDIRECT(B3,1)=\"LUMP\", \"LUMP\", INDIRECT(B3,1)),\"\")","v":""},{"$f":"IF(INDIRECT(C3,1)<>\"\",INDIRECT(C3,1),\"\")","v":""},{"$f":"K3","v":"Sub01"},"Sub01"]
[{"$f":"ADDRESS(D4,1,4,1,E4)","v":"'Sub01'!A109"},{"$f":"ADDRESS($D4,2,4,1,$E4)","v":"'Sub01'!B109"},{"$f":"ADDRESS($D4,3,4,1,$E4)","v":"'Sub01'!C109"},{"$f":"D3+1","v":109},{"$f":"K3","v":"Sub01"},null,{"$f":"IF(INDIRECT(A4,1)<>\"\",INDIRECT(A4,1),\"\")","v":""},{"$f":"IF(INDIRECT(B4,1)<>\"\",IF(INDIRECT(B4,1)=\"LUMP\", \"LUMP\", INDIRECT(B4,1)),\"\")","v":""},{"$f":"IF(INDIRECT(C4,1)<>\"\",INDIRECT(C4,1),\"\")","v":""},{"$f":"K3","v":"Sub01"},null,null,null,null,null,null,null,null,"Sub Sheet",null,{"$f":"IF(SUM(U8:U106)<>0,U7,\"\")","v":"Sub01"},{"$f":"IF(SUM(V8:V106)<>0,V7,\"\")","v":""},"","","","","","","","","","","","","","","","","",""]
["'Sub01'!A110","'Sub01'!B110","'Sub01'!C110",{"$f":"D4+1","v":110},{"$f":"K3","v":"Sub01"},null,"","","",{"$f":"K3","v":"Sub01"},null,null,null,null,null,null,null,null,"Page No.",null,{"$f":"IF(SUM(U8:U106)<>0,\"####\",\"\")","v":"####"},{"$f":"IF(SUM(V8:V106)<>0,\"####\",\"\")","v":""},{"$f":"IF(SUM(W8:W106)<>0,\"####\",\"\")","v":""},{"$f":"IF(SUM(X8:X106)<>0,\"####\",\"\")","v":""},{"$f":"IF(SUM(Y8:Y106)<>0,\"####\",\"\")","v":""},"","","","","","","","","","","","","","","",null,null,{"$f":"IF(U5<>\"\",U5,\"\")","v":"####"},"","","","","","","","","","",{"$f":"IF(AF5<>\"\",AF5,\"\")","v":""},"","","","","","","",""]
["'Sub01'!A111","'Sub01'!B111","'Sub01'!C111",111,{"$f":"K3","v":"Sub01"},null,"204E10000",25735,"AA",{"$f":"K3","v":"Sub01"},null,null,null,null,null,null,null,null,"Sum of Quantity",null,"Sheet",null,null,null,null,null,null,null,null,null,null,null,null,null,null,null,null,null,null,null,null,"Sum of Quantity","Sheet"]
["'Sub01'!A112","'Sub01'!B112","'Sub01'!C112",112,{"$f":"K3","v":"Sub01"},null,"254E010001",1578,"DD",{"$f":"K3","v":"Sub01"},null,null,"MASTER CODE","Item No.","Item Ext.","Item Code","Total for Code","Count Blanks","Lookup Value","Code","Sub01","Sub02","Sub03","Sub04","Sub05","Sub06","Sub07","Sub08","Sub09","Sub10","Sub11","Sub12","Sub13","Sub14","Sub15","Sub16","Sub17","Sub18","Sub19","Sub20",null,"Lookup Value","Sub01","Sub02","Sub03","Sub04","Sub05","Sub06","Sub07","Sub08","Sub09","Sub10","Sub11","Sub12","Sub13","Sub14","Sub15","Sub16","Sub17","Sub18","Sub19","Sub20"]
["'Sub01'!A113","'Sub01'!B113","'Sub01'!C113",113,{"$f":"K3","v":"Sub01"},null,"","","",{"$f":"K3","v":"Sub01"},null,null,null,{"$f":"IF(S8<>\"\",LEFT(S8,3),\"\")","v":""},{"$f":"IF(T8<>\"\", IF(LEN(OFFSET(S8,-R8,0,1,1))=9, RIGHT(OFFSET(S8,-R8,0,1,1),5), RIGHT(OFFSET(S8,-R8,0,1,1),6)),\"\")","v":""},null,null,null,"",null,0,0,0,0,0,0,0,0,0,0,0,0,0,0,0,0,0,0,0,0,null,null,0,0,0,0,0,0,0,0,0,0,0,0,0,0,0,0,0,0,0,0]
["'Sub01'!A114","'Sub01'!B114","'Sub01'!C114",114,{"$f":"K3","v":"Sub01"},null,"301E56000",3607,"DD",{"$f":"K3","v":"Sub01"},null,null,{"$f":"CONCATENATE(P9,N9,O9)","v":"AA20410000"},{"$f":"IF(T9<>\"\",LEFT(OFFSET(S9,-R9,0,1,1),3),\"\")","v":"204"},{"$f":"IF(T9<>\"\", IF(LEN(OFFSET(S9,-R9,0,1,1))=9, RIGHT(OFFSET(S9,-R9,0,1,1),5), RIGHT(OFFSET(S9,-R9,0,1,1),6)),\"\")","v":"10000"},{"$f":"IF(T9<>\"\", T9,\"\")","v":"AA"},{"$f":"IF(SUM(U9:AN9)<>0,SUM(U9:AN9),\"\")","v":25735},{"$f":"IF(T9<>\"\",IF(S9<>\"\",0,1+R8),\"\")","v":0},"204E10000","AA",25735,null,null,null,null,null,null,null,null,null,null,null,null,null,null,null,null,null,null,null,null,"204E10000",25735]
["'Sub01'!A115","'Sub01'!B115","'Sub01'!C115",115,{"$f":"K3","v":"Sub01"},null,"304E20000",4654,"DD",{"$f":"K3","v":"Sub01"},null,null,{"$f":"CONCATENATE(P10,N10,O10)","v":"DD254010001"},{"$f":"IF(T10<>\"\",LEFT(OFFSET(S10,-R10,0,1,1),3),\"\")","v":"254"},"010001",{"$f":"IF(T10<>\"\", T10,\"\")","v":"DD"},{"$f":"IF(SUM(U10:AN10)<>0,SUM(U10:AN10),\"\")","v":1578},{"$f":"IF(T10<>\"\",IF(S10<>\"\",0,1+R9),\"\")","v":0},"254E010001","DD",1578,null,null,null,null,null,null,null,null,null,null,null,null,null,null,null,null,null,null,null,null,"254E010001",1578]
["'Sub01'!A116","'Sub01'!B116","'Sub01'!C116",116,{"$f":"K3","v":"Sub01"},null,"","","",{"$f":"K3","v":"Sub01"},null,null,"DD30156000",{"$f":"IF(T11<>\"\",LEFT(OFFSET(S11,-R11,0,1,1),3),\"\")","v":"301"},"56000","DD",3607,0,"301E56000","DD",3607,null,null,null,null,null,null,null,null,null,null,null,null,null,null,null,null,null,null,null,null,"301E56000",3607]
["'Sub01'!A117","'Sub01'!B117","'Sub01'!C117",117,{"$f":"K3","v":"Sub01"},null,"407E20000",135,"dd",{"$f":"K3","v":"Sub01"},null,null,"DD30420000",{"$f":"IF(T12<>\"\",LEFT(OFFSET(S12,-R12,0,1,1),3),\"\")","v":"304"},"20000","DD",4654,0,"304E20000","DD",4654,null,null,null,null,null,null,null,null,null,null,null,null,null,null,null,null,null,null,null,null,"304E20000",4654]
["'Sub01'!A118","'Sub01'!B118","'Sub01'!C118",118,{"$f":"K3","v":"Sub01"},null,"407E20000",3571,"DD",{"$f":"K3","v":"Sub01"},null,null,"DD40720000",{"$f":"IF(T13<>\"\",LEFT(OFFSET(S13,-R13,0,1,1),3),\"\")","v":"407"},"20000","DD",3706,0,"407E20000","DD",3706,null,null,null,null,null,null,null,null,null,null,null,null,null,null,null,null,null,null,null,null,"407E20000",3706]
["'Sub01'!A119","'Sub01'!B119","'Sub01'!C119",119,{"$f":"K3","v":"Sub01"},null,"441E501011",808,"DD",{"$f":"K3","v":"Sub01"},null,null,"DD40810001","408","10001","DD",12,0,"408E10001","DD",12,null,null,null,null,null,null,null,null,null,null,null,null,null,null,null,null,null,null,null,null,"408E10001",12]
["'Sub01'!A120","'Sub01'!B120","'Sub01'!C120",120,{"$f":"K3","v":"Sub01"},null,"441E50300",1053,"DD",{"$f":"K3","v":"Sub01"},null,null,"DD441501011","441","501011","DD",808,0,"441E501011","DD",808,null,null,null,null,null,null,null,null,null,null,null,null,null,null,null,null,null,null,null,null,"441E501011",808]
["'Sub01'!A121","'Sub01'!B121","'Sub01'!C121",121,{"$f":"K3","v":"Sub01"},null,"","","",{"$f":"K3","v":"Sub01"},null,null,"DD44150300","441","50300","DD",1053,0,"441E50300","DD",1053,null,null,null,null,null,null,null,null,null,null,null,null,null,null,null,null,null,null,null,null,"441E50300",1053]
["'Sub01'!A122","'Sub01'!B122","'Sub01'!C122",122,{"$f":"K3","v":"Sub01"},null,"617E10101",16,{"$f":"IF(INDIRECT(C17,1)<>\"\",INDIRECT(C17,1),\"\")","v":"dd"},{"$f":"K3","v":"Sub01"},null,null,"DD61710101","617","10101","DD",16,0,"617E10101","DD",16,null,null,null,null,null,null,null,null,null,null,null,null,null,null,null,null,null,null,null,null,"617E10101",16]
["'Sub01'!A123","'Sub01'!B123","'Sub01'!C123",123,{"$f":"K3","v":"Sub01"},null,"408E10001",12,"dd",{"$f":"K3","v":"Sub01"},null,null,"","","","","",""]
["'Sub01'!A124","'Sub01'!B124","'Sub01'!C124",124,{"$f":"K3","v":"Sub01"},null,"","","",{"$f":"K3","v":"Sub01"},null,null,"","","","","",""]
["'Sub01'!A125","'Sub01'!B125","'Sub01'!C125",125,{"$f":"K3","v":"Sub01"},null,"","","",{"$f":"K3","v":"Sub01"},null,null,"","","","","",""]
["'Sub01'!A126","'Sub01'!B126","'Sub01'!C126",126,{"$f":"K3","v":"Sub01"},null,"","","",{"$f":"K3","v":"Sub01"},null,null,"","","","","",""]
["'Sub01'!A127","'Sub01'!B127","'Sub01'!C127",127,{"$f":"K3","v":"Sub01"},null,"","","",{"$f":"K3","v":"Sub01"},null,null,"","","","","",""]
["'Sub01'!A128","'Sub01'!B128","'Sub01'!C128",128,{"$f":"K3","v":"Sub01"},null,"","","",{"$f":"K3","v":"Sub01"},null,null,"","","","","",""]
["'Sub01'!A129","'Sub01'!B129","'Sub01'!C129",129,{"$f":"K3","v":"Sub01"},null,"","","",{"$f":"K3","v":"Sub01"},null,null,"","","","","",""]
["'Sub01'!A130","'Sub01'!B130","'Sub01'!C130",130,{"$f":"K3","v":"Sub01"},null,"","","",{"$f":"K3","v":"Sub01"},null,null,"","","","","",""]
["'Sub01'!A131","'Sub01'!B131","'Sub01'!C131",131,{"$f":"K3","v":"Sub01"},null,"","","",{"$f":"K3","v":"Sub01"},null,null,"","","","","",""]
["'Sub01'!A132","'Sub01'!B132","'Sub01'!C132",132,{"$f":"K3","v":"Sub01"},null,"","","",{"$f":"K3","v":"Sub01"},null,null,"","","","","",""]
["'Sub01'!A133","'Sub01'!B133","'Sub01'!C133",133,{"$f":"K3","v":"Sub01"},null,"","","",{"$f":"K3","v":"Sub01"},null,null,"","","","","",""]
["'Sub01'!A134","'Sub01'!B134","'Sub01'!C134",134,{"$f":"K3","v":"Sub01"},null,"","","",{"$f":"K3","v":"Sub01"},null,null,"","","","","",""]
["'Sub01'!A135","'Sub01'!B135","'Sub01'!C135",135,{"$f":"K3","v":"Sub01"},null,"","","",{"$f":"K3","v":"Sub01"},null,null,"","","","","",""]
["'Sub01'!A136","'Sub01'!B136","'Sub01'!C136",136,{"$f":"K3","v":"Sub01"},null,"","","",{"$f":"K3","v":"Sub01"},null,null,"","","","","",""]
["'Sub01'!A137","'Sub01'!B137","'Sub01'!C137",137,{"$f":"K3","v":"Sub01"},null,"","","",{"$f":"K3","v":"Sub01"},null,null,"","","","","",""]
["'Sub01'!A138","'Sub01'!B138","'Sub01'!C138",138,{"$f":"K3","v":"Sub01"},null,"","","",{"$f":"K3","v":"Sub01"},null,null,"","","","","",""]
["'Sub01'!A139","'Sub01'!B139","'Sub01'!C139",139,{"$f":"K3","v":"Sub01"},null,"","","",{"$f":"K3","v":"Sub01"},null,null,"","","","","",""]
["'Sub01'!A140","'Sub01'!B140","'Sub01'!C140",140,{"$f":"K3","v":"Sub01"},null,"","","",{"$f":"K3","v":"Sub01"},null,null,"","","","","",""]
["'Sub01'!A141","'Sub01'!B141","'Sub01'!C141",141,{"$f":"K3","v":"Sub01"},null,"","","",{"$f":"K3","v":"Sub01"},null,null,"","","","","",""]
["'Sub01'!A142","'Sub01'!B142","'Sub01'!C142",142,{"$f":"K3","v":"Sub01"},null,"","","",{"$f":"K3","v":"Sub01"},null,null,"","","","","",""]
["'Sub01'!A143","'Sub01'!B143","'Sub01'!C143",143,{"$f":"K3","v":"Sub01"},null,"","","",{"$f":"K3","v":"Sub01"},null,null,"","","","","",""]
["'Sub01'!A144","'Sub01'!B144","'Sub01'!C144",144,{"$f":"K3","v":"Sub01"},null,"","","",{"$f":"K3","v":"Sub01"},null,null,"","","","","",""]
["'Sub01'!A145","'Sub01'!B145","'Sub01'!C145",145,{"$f":"K3","v":"Sub01"},null,"","","",{"$f":"K3","v":"Sub01"},null,null,"","","","","",""]
["'Sub01'!A146","'Sub01'!B146","'Sub01'!C146",146,{"$f":"K3","v":"Sub01"},null,"","","",{"$f":"K3","v":"Sub01"},null,null,"","","","","",""]
["'Sub01'!A147","'Sub01'!B147","'Sub01'!C147",147,{"$f":"K3","v":"Sub01"},null,"","","",{"$f":"K3","v":"Sub01"},null,null,"","","","","",""]
["'Sub01'!A148","'Sub01'!B148","'Sub01'!C148",148,{"$f":"K3","v":"Sub01"},null,"","","",{"$f":"K3","v":"Sub01"},null,null,"","","","","",""]
["'Sub01'!A149","'Sub01'!B149","'Sub01'!C149",149,{"$f":"K3","v":"Sub01"},null,"","","",{"$f":"K3","v":"Sub01"},null,null,"","","","","",""]
[{"$f":"ADDRESS($D45,1,4,1,$E45)","v":"'Sub02'!A108"},{"$f":"ADDRESS($D45,2,4,1,$E45)","v":"'Sub02'!B108"},"'Sub02'!C108",108,{"$f":"K45","v":"Sub02"},null,{"$f":"IF(INDIRECT(A45,1)<>\"\",INDIRECT(A45,1),\"\")","v":{"$error":"#REF!"}},{"$error":"#REF!"},{"$error":"#REF!"},{"$f":"K45","v":"Sub02"},"Sub02",null,"","","","","",""]
[{"$f":"ADDRESS(D46,1,4,1,E46)","v":"'Sub02'!A109"},"'Sub02'!B109","'Sub02'!C109",{"$f":"D45+1","v":109},{"$f":"K45","v":"Sub02"},null,{"$f":"IF(INDIRECT(A46,1)<>\"\",INDIRECT(A46,1),\"\")","v":{"$error":"#REF!"}},{"$error":"#REF!"},{"$error":"#REF!"},{"$f":"K45","v":"Sub02"},null,null,"","","","","",""]
["'Sub02'!A110","'Sub02'!B110","'Sub02'!C110",{"$f":"D46+1","v":110},{"$f":"K45","v":"Sub02"},null,{"$error":"#REF!"},{"$error":"#REF!"},{"$error":"#REF!"},{"$f":"K45","v":"Sub02"},null,null,"","","","","",""]
["'Sub02'!A111","'Sub02'!B111","'Sub02'!C111",111,{"$f":"K45","v":"Sub02"},null,{"$error":"#REF!"},{"$error":"#REF!"},{"$error":"#REF!"},{"$f":"K45","v":"Sub02"},null,null,"","","","","",""]
["'Sub02'!A112","'Sub02'!B112","'Sub02'!C112",112,{"$f":"K45","v":"Sub02"},null,{"$error":"#REF!"},{"$error":"#REF!"},{"$error":"#REF!"},{"$f":"K45","v":"Sub02"},null,null,"","","","","",""]
["'Sub02'!A113","'Sub02'!B113","'Sub02'!C113",113,{"$f":"K45","v":"Sub02"},null,{"$error":"#REF!"},{"$error":"#REF!"},{"$error":"#REF!"},{"$f":"K45","v":"Sub02"},null,null,"","","","","",""]
["'Sub02'!A114","'Sub02'!B114","'Sub02'!C114",114,{"$f":"K45","v":"Sub02"},null,{"$error":"#REF!"},{"$error":"#REF!"},{"$error":"#REF!"},{"$f":"K45","v":"Sub02"},null,null,"","","","","",""]
["'Sub02'!A115","'Sub02'!B115","'Sub02'!C115",115,{"$f":"K45","v":"Sub02"},null,{"$error":"#REF!"},{"$error":"#REF!"},{"$error":"#REF!"},{"$f":"K45","v":"Sub02"},null,null,"","","","","",""]
["'Sub02'!A116","'Sub02'!B116","'Sub02'!C116",116,{"$f":"K45","v":"Sub02"},null,{"$error":"#REF!"},{"$error":"#REF!"},{"$error":"#REF!"},{"$f":"K45","v":"Sub02"},null,null,"","","","","",""]
["'Sub02'!A117","'Sub02'!B117","'Sub02'!C117",117,{"$f":"K45","v":"Sub02"},null,{"$error":"#REF!"},{"$error":"#REF!"},{"$error":"#REF!"},{"$f":"K45","v":"Sub02"},null,null,"","","","","",""]
["'Sub02'!A118","'Sub02'!B118","'Sub02'!C118",118,{"$f":"K45","v":"Sub02"},null,{"$error":"#REF!"},{"$error":"#REF!"},{"$error":"#REF!"},{"$f":"K45","v":"Sub02"},null,null,"","","","","",""]
["'Sub02'!A119","'Sub02'!B119","'Sub02'!C119",119,{"$f":"K45","v":"Sub02"},null,{"$error":"#REF!"},{"$error":"#REF!"},{"$error":"#REF!"},{"$f":"K45","v":"Sub02"},null,null,"","","","","",""]
["'Sub02'!A120","'Sub02'!B120","'Sub02'!C120",120,{"$f":"K45","v":"Sub02"},null,{"$error":"#REF!"},{"$error":"#REF!"},{"$error":"#REF!"},{"$f":"K45","v":"Sub02"},null,null,"","","","","",""]
["'Sub02'!A121","'Sub02'!B121","'Sub02'!C121",121,{"$f":"K45","v":"Sub02"},null,{"$error":"#REF!"},{"$error":"#REF!"},{"$error":"#REF!"},{"$f":"K45","v":"Sub02"},null,null,"","","","","",""]
["'Sub02'!A122","'Sub02'!B122","'Sub02'!C122",122,{"$f":"K45","v":"Sub02"},null,{"$error":"#REF!"},{"$error":"#REF!"},{"$error":"#REF!"},{"$f":"K45","v":"Sub02"},null,null,"","","","","",""]
["'Sub02'!A123","'Sub02'!B123","'Sub02'!C123",123,{"$f":"K45","v":"Sub02"},null,{"$error":"#REF!"},{"$error":"#REF!"},{"$error":"#REF!"},{"$f":"K45","v":"Sub02"},null,null,"","","","","",""]
["'Sub02'!A124","'Sub02'!B124","'Sub02'!C124",124,{"$f":"K45","v":"Sub02"},null,{"$error":"#REF!"},{"$error":"#REF!"},{"$error":"#REF!"},{"$f":"K45","v":"Sub02"},null,null,"","","","","",""]
["'Sub02'!A125","'Sub02'!B125","'Sub02'!C125",125,{"$f":"K45","v":"Sub02"},null,{"$error":"#REF!"},{"$error":"#REF!"},{"$error":"#REF!"},{"$f":"K45","v":"Sub02"},null,null,"","","","","",""]
["'Sub02'!A126","'Sub02'!B126","'Sub02'!C126",126,{"$f":"K45","v":"Sub02"},null,{"$error":"#REF!"},{"$error":"#REF!"},{"$error":"#REF!"},{"$f":"K45","v":"Sub02"},null,null,"","","","","",""]
["'Sub02'!A127","'Sub02'!B127","'Sub02'!C127",127,{"$f":"K45","v":"Sub02"},null,{"$error":"#REF!"},{"$error":"#REF!"},{"$error":"#REF!"},{"$f":"K45","v":"Sub02"},null,null,"","","","","",""]
["'Sub02'!A128","'Sub02'!B128","'Sub02'!C128",128,{"$f":"K45","v":"Sub02"},null,{"$error":"#REF!"},{"$error":"#REF!"},{"$error":"#REF!"},{"$f":"K45","v":"Sub02"},null,null,"","","","","",""]
["'Sub02'!A129","'Sub02'!B129","'Sub02'!C129",129,{"$f":"K45","v":"Sub02"},null,{"$error":"#REF!"},{"$error":"#REF!"},{"$error":"#REF!"},{"$f":"K45","v":"Sub02"},null,null,"","","","","",""]
["'Sub02'!A130","'Sub02'!B130","'Sub02'!C130",130,{"$f":"K45","v":"Sub02"},null,{"$error":"#REF!"},{"$error":"#REF!"},{"$error":"#REF!"},{"$f":"K45","v":"Sub02"},null,null,"","","","","",""]
["'Sub02'!A131",{"$f":"ADDRESS($D68,2,4,1,$E68)","v":"'Sub02'!B131"},{"$f":"ADDRESS($D68,3,4,1,$E68)","v":"'Sub02'!C131"},131,{"$f":"K45","v":"Sub02"},null,{"$error":"#REF!"},{"$f":"IF(INDIRECT(B68,1)<>\"\",IF(INDIRECT(B68,1)=\"LUMP\", \"LUMP\", INDIRECT(B68,1)),\"\")","v":{"$error":"#REF!"}},{"$f":"IF(INDIRECT(C68,1)<>\"\",INDIRECT(C68,1),\"\")","v":{"$error":"#REF!"}},{"$f":"K45","v":"Sub02"},null,null,"","","","","",""]
["'Sub02'!A132","'Sub02'!B132","'Sub02'!C132",132,{"$f":"K45","v":"Sub02"},null,{"$error":"#REF!"},{"$error":"#REF!"},{"$error":"#REF!"},{"$f":"K45","v":"Sub02"},null,null,"","","","","",""]
["'Sub02'!A133","'Sub02'!B133","'Sub02'!C133",133,{"$f":"K45","v":"Sub02"},null,{"$error":"#REF!"},{"$error":"#REF!"},{"$error":"#REF!"},{"$f":"K45","v":"Sub02"},null,null,"","","","","",""]
["'Sub02'!A134","'Sub02'!B134","'Sub02'!C134",134,{"$f":"K45","v":"Sub02"},null,{"$error":"#REF!"},{"$error":"#REF!"},{"$error":"#REF!"},{"$f":"K45","v":"Sub02"},null,null,"","","","","",""]
["'Sub02'!A135","'Sub02'!B135","'Sub02'!C135",135,{"$f":"K45","v":"Sub02"},null,{"$error":"#REF!"},{"$error":"#REF!"},{"$error":"#REF!"},{"$f":"K45","v":"Sub02"},null,null,"","","","","",""]
["'Sub02'!A136","'Sub02'!B136","'Sub02'!C136",136,{"$f":"K45","v":"Sub02"},null,{"$error":"#REF!"},{"$error":"#REF!"},{"$error":"#REF!"},{"$f":"K45","v":"Sub02"},null,null,"","",{"$f":"IF(T73<>\"\", IF(LEN(OFFSET(S73,-R73,0,1,1))=9, RIGHT(OFFSET(S73,-R73,0,1,1),5), RIGHT(OFFSET(S73,-R73,0,1,1),6)),\"\")","v":""},"","",""]
["'Sub02'!A137","'Sub02'!B137","'Sub02'!C137",137,{"$f":"K45","v":"Sub02"},null,{"$error":"#REF!"},{"$error":"#REF!"},{"$error":"#REF!"},{"$f":"K45","v":"Sub02"},null,null,{"$f":"CONCATENATE(P74,N74,O74)","v":""},{"$f":"IF(T74<>\"\",LEFT(OFFSET(S74,-R74,0,1,1),3),\"\")","v":""},"",{"$f":"IF(T74<>\"\", T74,\"\")","v":""},{"$f":"IF(SUM(U74:AN74)<>0,SUM(U74:AN74),\"\")","v":""},{"$f":"IF(T74<>\"\",IF(S74<>\"\",0,1+R73),\"\")","v":""}]
["'Sub02'!A138","'Sub02'!B138","'Sub02'!C138",138,{"$f":"K45","v":"Sub02"},null,{"$error":"#REF!"},{"$error":"#REF!"},{"$error":"#REF!"},{"$f":"K45","v":"Sub02"},null,null,"","","","","",""]
["'Sub02'!A139","'Sub02'!B139","'Sub02'!C139",139,{"$f":"K45","v":"Sub02"},null,{"$error":"#REF!"},{"$error":"#REF!"},{"$error":"#REF!"},{"$f":"K45","v":"Sub02"},null,null,"","","","","",""]
["'Sub02'!A140","'Sub02'!B140","'Sub02'!C140",140,{"$f":"K45","v":"Sub02"},null,{"$error":"#REF!"},{"$error":"#REF!"},{"$error":"#REF!"},{"$f":"K45","v":"Sub02"},null,null,"","","","","",""]
["'Sub02'!A141","'Sub02'!B141","'Sub02'!C141",141,{"$f":"K45","v":"Sub02"},null,{"$error":"#REF!"},{"$error":"#REF!"},{"$error":"#REF!"},{"$f":"K45","v":"Sub02"},null,null,"","","","","",""]
["'Sub02'!A142","'Sub02'!B142","'Sub02'!C142",142,{"$f":"K45","v":"Sub02"},null,{"$error":"#REF!"},{"$error":"#REF!"},{"$error":"#REF!"},{"$f":"K45","v":"Sub02"},null,null,"","","","","",""]
["'Sub02'!A143","'Sub02'!B143","'Sub02'!C143",143,{"$f":"K45","v":"Sub02"},null,{"$error":"#REF!"},{"$error":"#REF!"},{"$error":"#REF!"},{"$f":"K45","v":"Sub02"},null,null,"","","","","",""]
["'Sub02'!A144","'Sub02'!B144","'Sub02'!C144",144,{"$f":"K45","v":"Sub02"},null,{"$error":"#REF!"},{"$error":"#REF!"},{"$error":"#REF!"},{"$f":"K45","v":"Sub02"},null,null,"","","","","",""]
["'Sub02'!A145","'Sub02'!B145","'Sub02'!C145",145,{"$f":"K45","v":"Sub02"},null,{"$error":"#REF!"},{"$error":"#REF!"},{"$error":"#REF!"},{"$f":"K45","v":"Sub02"},null,null,"","","","","",""]
["'Sub02'!A146","'Sub02'!B146","'Sub02'!C146",146,{"$f":"K45","v":"Sub02"},null,{"$error":"#REF!"},{"$error":"#REF!"},{"$error":"#REF!"},{"$f":"K45","v":"Sub02"},null,null,"","","","","",""]
["'Sub02'!A147","'Sub02'!B147","'Sub02'!C147",147,{"$f":"K45","v":"Sub02"},null,{"$error":"#REF!"},{"$error":"#REF!"},{"$error":"#REF!"},{"$f":"K45","v":"Sub02"},null,null,"","","","","",""]
["'Sub02'!A148","'Sub02'!B148","'Sub02'!C148",148,{"$f":"K45","v":"Sub02"},null,{"$error":"#REF!"},{"$error":"#REF!"},{"$error":"#REF!"},{"$f":"K45","v":"Sub02"},null,null,"","","","","",""]
["'Sub02'!A149","'Sub02'!B149","'Sub02'!C149",149,{"$f":"K45","v":"Sub02"},null,{"$error":"#REF!"},{"$error":"#REF!"},{"$error":"#REF!"},{"$f":"K45","v":"Sub02"},null,null,"","","","","",""]
[{"$f":"ADDRESS($D87,1,4,1,$E87)","v":"'Sub03'!A108"},"'Sub03'!B108","'Sub03'!C108",108,{"$f":"K87","v":"Sub03"},null,{"$error":"#REF!"},{"$error":"#REF!"},{"$error":"#REF!"},{"$f":"K87","v":"Sub03"},"Sub03",null,"","","","","",""]
[{"$f":"ADDRESS(D88,1,4,1,E88)","v":"'Sub03'!A109"},"'Sub03'!B109","'Sub03'!C109",{"$f":"D87+1","v":109},{"$f":"K87","v":"Sub03"},null,{"$f":"IF(INDIRECT(A88,1)<>\"\",INDIRECT(A88,1),\"\")","v":{"$error":"#REF!"}},{"$error":"#REF!"},{"$error":"#REF!"},{"$f":"K87","v":"Sub03"},null,null,"","","","","",""]
["'Sub03'!A110","'Sub03'!B110","'Sub03'!C110",110,{"$f":"K87","v":"Sub03"},null,{"$error":"#REF!"},{"$error":"#REF!"},{"$error":"#REF!"},{"$f":"K87","v":"Sub03"},null,null,"","","","","",""]
["'Sub03'!A111","'Sub03'!B111","'Sub03'!C111",111,{"$f":"K87","v":"Sub03"},null,{"$error":"#REF!"},{"$error":"#REF!"},{"$error":"#REF!"},{"$f":"K87","v":"Sub03"},null,null,"","","","","",""]
["'Sub03'!A112","'Sub03'!B112","'Sub03'!C112",112,{"$f":"K87","v":"Sub03"},null,{"$error":"#REF!"},{"$error":"#REF!"},{"$error":"#REF!"},{"$f":"K87","v":"Sub03"},null,null,"","","","","",""]
["'Sub03'!A113","'Sub03'!B113","'Sub03'!C113",113,{"$f":"K87","v":"Sub03"},null,{"$error":"#REF!"},{"$error":"#REF!"},{"$error":"#REF!"},{"$f":"K87","v":"Sub03"},null,null,"","","","","",""]
["'Sub03'!A114","'Sub03'!B114","'Sub03'!C114",114,{"$f":"K87","v":"Sub03"},null,{"$error":"#REF!"},{"$error":"#REF!"},{"$error":"#REF!"},{"$f":"K87","v":"Sub03"},null,null,"","","","","",""]
["'Sub03'!A115","'Sub03'!B115","'Sub03'!C115",115,{"$f":"K87","v":"Sub03"},null,{"$error":"#REF!"},{"$error":"#REF!"},{"$error":"#REF!"},{"$f":"K87","v":"Sub03"},null,null,"","","","","",""]
["'Sub03'!A116","'Sub03'!B116","'Sub03'!C116",116,{"$f":"K87","v":"Sub03"},null,{"$error":"#REF!"},{"$error":"#REF!"},{"$error":"#REF!"},{"$f":"K87","v":"Sub03"},null,null,"","","","","",""]
["'Sub03'!A117","'Sub03'!B117","'Sub03'!C117",117,{"$f":"K87","v":"Sub03"},null,{"$error":"#REF!"},{"$error":"#REF!"},{"$error":"#REF!"},{"$f":"K87","v":"Sub03"},null,null,"","","","","",""]
["'Sub03'!A118","'Sub03'!B118","'Sub03'!C118",118,{"$f":"K87","v":"Sub03"},null,{"$error":"#REF!"},{"$error":"#REF!"},{"$error":"#REF!"},{"$f":"K87","v":"Sub03"},null,null,"","","","","",""]
["'Sub03'!A119","'Sub03'!B119","'Sub03'!C119",119,{"$f":"K87","v":"Sub03"},null,{"$error":"#REF!"},{"$error":"#REF!"},{"$error":"#REF!"},{"$f":"K87","v":"Sub03"},null,null,"","","","","",""]
["'Sub03'!A120","'Sub03'!B120","'Sub03'!C120",120,{"$f":"K87","v":"Sub03"},null,{"$error":"#REF!"},{"$error":"#REF!"},{"$error":"#REF!"},{"$f":"K87","v":"Sub03"},null,null,"","","","","",""]
["'Sub03'!A121","'Sub03'!B121","'Sub03'!C121",121,{"$f":"K87","v":"Sub03"},null,{"$error":"#REF!"},{"$error":"#REF!"},{"$error":"#REF!"},{"$f":"K87","v":"Sub03"},null,null,"","","","","",""]
["'Sub03'!A122","'Sub03'!B122","'Sub03'!C122",122,{"$f":"K87","v":"Sub03"},null,{"$error":"#REF!"},{"$error":"#REF!"},{"$error":"#REF!"},{"$f":"K87","v":"Sub03"},null,null,"","","","","",""]
["'Sub03'!A123","'Sub03'!B123","'Sub03'!C123",123,{"$f":"K87","v":"Sub03"},null,{"$error":"#REF!"},{"$error":"#REF!"},{"$error":"#REF!"},{"$f":"K87","v":"Sub03"},null,null,"","","","","",""]
["'Sub03'!A124","'Sub03'!B124","'Sub03'!C124",124,{"$f":"K87","v":"Sub03"},null,{"$error":"#REF!"},{"$error":"#REF!"},{"$error":"#REF!"},{"$f":"K87","v":"Sub03"},null,null,"","","","","",""]
["'Sub03'!A125","'Sub03'!B125","'Sub03'!C125",125,{"$f":"K87","v":"Sub03"},null,{"$error":"#REF!"},{"$error":"#REF!"},{"$error":"#REF!"},{"$f":"K87","v":"Sub03"},null,null,"","","","","",""]
["'Sub03'!A126","'Sub03'!B126","'Sub03'!C126",126,{"$f":"K87","v":"Sub03"},null,{"$error":"#REF!"},{"$error":"#REF!"},{"$error":"#REF!"},{"$f":"K87","v":"Sub03"},null,null,"","","","","",""]
["'Sub03'!A127","'Sub03'!B127","'Sub03'!C127",127,{"$f":"K87","v":"Sub03"},null,{"$error":"#REF!"},{"$error":"#REF!"},{"$error":"#REF!"},{"$f":"K87","v":"Sub03"},null,null,"","","","",""]
["'Sub03'!A128","'Sub03'!B128","'Sub03'!C128",128,{"$f":"K87","v":"Sub03"},null,{"$error":"#REF!"},{"$error":"#REF!"},{"$error":"#REF!"},{"$f":"K87","v":"Sub03"}]
["'Sub03'!A129","'Sub03'!B129","'Sub03'!C129",129,{"$f":"K87","v":"Sub03"},null,{"$error":"#REF!"},{"$error":"#REF!"},{"$error":"#REF!"},{"$f":"K87","v":"Sub03"}]
["'Sub03'!A130","'Sub03'!B130","'Sub03'!C130",130,{"$f":"K87","v":"Sub03"},null,{"$error":"#REF!"},{"$error":"#REF!"},{"$error":"#REF!"},{"$f":"K87","v":"Sub03"}]
["'Sub03'!A131","'Sub03'!B131","'Sub03'!C131",131,{"$f":"K87","v":"Sub03"},null,{"$error":"#REF!"},{"$error":"#REF!"},{"$error":"#REF!"},{"$f":"K87","v":"Sub03"}]
["'Sub03'!A132","'Sub03'!B132","'Sub03'!C132",132,{"$f":"K87","v":"Sub03"},null,{"$error":"#REF!"},{"$error":"#REF!"},{"$error":"#REF!"},{"$f":"K87","v":"Sub03"}]
["'Sub03'!A133","'Sub03'!B133","'Sub03'!C133",133,{"$f":"K87","v":"Sub03"},null,{"$error":"#REF!"},{"$error":"#REF!"},{"$error":"#REF!"},{"$f":"K87","v":"Sub03"}]
["'Sub03'!A134","'Sub03'!B134","'Sub03'!C134",134,{"$f":"K87","v":"Sub03"},null,{"$error":"#REF!"},{"$error":"#REF!"},{"$error":"#REF!"},{"$f":"K87","v":"Sub03"}]
["'Sub03'!A135","'Sub03'!B135","'Sub03'!C135",135,{"$f":"K87","v":"Sub03"},null,{"$error":"#REF!"},{"$error":"#REF!"},{"$error":"#REF!"},{"$f":"K87","v":"Sub03"}]
["'Sub03'!A136","'Sub03'!B136","'Sub03'!C136",136,{"$f":"K87","v":"Sub03"},null,{"$error":"#REF!"},{"$error":"#REF!"},{"$error":"#REF!"},{"$f":"K87","v":"Sub03"}]
["'Sub03'!A137","'Sub03'!B137","'Sub03'!C137",137,{"$f":"K87","v":"Sub03"},null,{"$error":"#REF!"},{"$error":"#REF!"},{"$error":"#REF!"},{"$f":"K87","v":"Sub03"}]
["'Sub03'!A138","'Sub03'!B138","'Sub03'!C138",138,{"$f":"K87","v":"Sub03"},null,{"$error":"#REF!"},{"$error":"#REF!"},{"$error":"#REF!"},{"$f":"K87","v":"Sub03"}]
["'Sub03'!A139","'Sub03'!B139","'Sub03'!C139",139,{"$f":"K87","v":"Sub03"},null,{"$error":"#REF!"},{"$error":"#REF!"},{"$error":"#REF!"},{"$f":"K87","v":"Sub03"}]
["'Sub03'!A140","'Sub03'!B140","'Sub03'!C140",140,{"$f":"K87","v":"Sub03"},null,{"$error":"#REF!"},{"$error":"#REF!"},{"$error":"#REF!"},{"$f":"K87","v":"Sub03"}]
["'Sub03'!A141","'Sub03'!B141","'Sub03'!C141",141,{"$f":"K87","v":"Sub03"},null,{"$error":"#REF!"},{"$error":"#REF!"},{"$error":"#REF!"},{"$f":"K87","v":"Sub03"}]
["'Sub03'!A142","'Sub03'!B142","'Sub03'!C142",142,{"$f":"K87","v":"Sub03"},null,{"$error":"#REF!"},{"$error":"#REF!"},{"$error":"#REF!"},{"$f":"K87","v":"Sub03"}]
["'Sub03'!A143","'Sub03'!B143","'Sub03'!C143",143,{"$f":"K87","v":"Sub03"},null,{"$error":"#REF!"},{"$error":"#REF!"},{"$error":"#REF!"},{"$f":"K87","v":"Sub03"}]
["'Sub03'!A144","'Sub03'!B144","'Sub03'!C144",144,{"$f":"K87","v":"Sub03"},null,{"$error":"#REF!"},{"$error":"#REF!"},{"$error":"#REF!"},{"$f":"K87","v":"Sub03"}]
["'Sub03'!A145","'Sub03'!B145","'Sub03'!C145",145,{"$f":"K87","v":"Sub03"},null,{"$error":"#REF!"},{"$error":"#REF!"},{"$error":"#REF!"},{"$f":"K87","v":"Sub03"}]
["'Sub03'!A146","'Sub03'!B146","'Sub03'!C146",146,{"$f":"K87","v":"Sub03"},null,{"$error":"#REF!"},{"$error":"#REF!"},{"$error":"#REF!"},{"$f":"K87","v":"Sub03"}]
["'Sub03'!A147","'Sub03'!B147","'Sub03'!C147",147,{"$f":"K87","v":"Sub03"},null,{"$error":"#REF!"},{"$error":"#REF!"},{"$error":"#REF!"},{"$f":"K87","v":"Sub03"}]
["'Sub03'!A148","'Sub03'!B148","'Sub03'!C148",148,{"$f":"K87","v":"Sub03"},null,{"$error":"#REF!"},{"$error":"#REF!"},{"$error":"#REF!"},{"$f":"K87","v":"Sub03"}]
["'Sub03'!A149","'Sub03'!B149","'Sub03'!C149",149,{"$f":"K87","v":"Sub03"},null,{"$error":"#REF!"},{"$error":"#REF!"},{"$error":"#REF!"},{"$f":"K87","v":"Sub03"}]
[{"$f":"ADDRESS($D129,1,4,1,$E129)","v":"'Sub04'!A108"},"'Sub04'!B108","'Sub04'!C108",108,{"$f":"K129","v":"Sub04"},null,{"$error":"#REF!"},{"$error":"#REF!"},{"$error":"#REF!"},{"$f":"K129","v":"Sub04"},"Sub04"]
[{"$f":"ADDRESS(D130,1,4,1,E130)","v":"'Sub04'!A109"},"'Sub04'!B109","'Sub04'!C109",{"$f":"D129+1","v":109},{"$f":"K129","v":"Sub04"},null,{"$error":"#REF!"},{"$error":"#REF!"},{"$error":"#REF!"},{"$f":"K129","v":"Sub04"}]
["'Sub04'!A110","'Sub04'!B110","'Sub04'!C110",110,{"$f":"K129","v":"Sub04"},null,{"$error":"#REF!"},{"$error":"#REF!"},{"$error":"#REF!"},{"$f":"K129","v":"Sub04"}]
["'Sub04'!A111",{"$f":"ADDRESS($D132,2,4,1,$E132)","v":"'Sub04'!B111"},{"$f":"ADDRESS($D132,3,4,1,$E132)","v":"'Sub04'!C111"},111,{"$f":"K129","v":"Sub04"},null,{"$error":"#REF!"},{"$f":"IF(INDIRECT(B132,1)<>\"\",IF(INDIRECT(B132,1)=\"LUMP\", \"LUMP\", INDIRECT(B132,1)),\"\")","v":{"$error":"#REF!"}},{"$f":"IF(INDIRECT(C132,1)<>\"\",INDIRECT(C132,1),\"\")","v":{"$error":"#REF!"}},{"$f":"K129","v":"Sub04"}]
["'Sub04'!A112","'Sub04'!B112","'Sub04'!C112",112,{"$f":"K129","v":"Sub04"},null,{"$error":"#REF!"},{"$error":"#REF!"},{"$error":"#REF!"},{"$f":"K129","v":"Sub04"}]
["'Sub04'!A113","'Sub04'!B113","'Sub04'!C113",113,{"$f":"K129","v":"Sub04"},null,{"$error":"#REF!"},{"$error":"#REF!"},{"$error":"#REF!"},{"$f":"K129","v":"Sub04"}]
["'Sub04'!A114","'Sub04'!B114","'Sub04'!C114",114,{"$f":"K129","v":"Sub04"},null,{"$error":"#REF!"},{"$error":"#REF!"},{"$error":"#REF!"},{"$f":"K129","v":"Sub04"}]
["'Sub04'!A115","'Sub04'!B115","'Sub04'!C115",115,{"$f":"K129","v":"Sub04"},null,{"$error":"#REF!"},{"$error":"#REF!"},{"$error":"#REF!"},{"$f":"K129","v":"Sub04"}]
["'Sub04'!A116","'Sub04'!B116","'Sub04'!C116",116,{"$f":"K129","v":"Sub04"},null,{"$error":"#REF!"},{"$error":"#REF!"},{"$error":"#REF!"},{"$f":"K129","v":"Sub04"}]
["'Sub04'!A117","'Sub04'!B117","'Sub04'!C117",117,{"$f":"K129","v":"Sub04"},null,{"$error":"#REF!"},{"$error":"#REF!"},{"$error":"#REF!"},{"$f":"K129","v":"Sub04"}]
["'Sub04'!A118","'Sub04'!B118","'Sub04'!C118",118,{"$f":"K129","v":"Sub04"},null,{"$error":"#REF!"},{"$error":"#REF!"},{"$error":"#REF!"},{"$f":"K129","v":"Sub04"}]
["'Sub04'!A119","'Sub04'!B119","'Sub04'!C119",119,{"$f":"K129","v":"Sub04"},null,{"$error":"#REF!"},{"$error":"#REF!"},{"$error":"#REF!"},{"$f":"K129","v":"Sub04"}]
["'Sub04'!A120","'Sub04'!B120","'Sub04'!C120",120,{"$f":"K129","v":"Sub04"},null,{"$error":"#REF!"},{"$error":"#REF!"},{"$error":"#REF!"},{"$f":"K129","v":"Sub04"}]
["'Sub04'!A121","'Sub04'!B121","'Sub04'!C121",121,{"$f":"K129","v":"Sub04"},null,{"$error":"#REF!"},{"$error":"#REF!"},{"$error":"#REF!"},{"$f":"K129","v":"Sub04"}]
["'Sub04'!A122","'Sub04'!B122","'Sub04'!C122",122,{"$f":"K129","v":"Sub04"},null,{"$error":"#REF!"},{"$error":"#REF!"},{"$error":"#REF!"},{"$f":"K129","v":"Sub04"}]
["'Sub04'!A123","'Sub04'!B123","'Sub04'!C123",123,{"$f":"K129","v":"Sub04"},null,{"$error":"#REF!"},{"$error":"#REF!"},{"$error":"#REF!"},{"$f":"K129","v":"Sub04"}]
["'Sub04'!A124","'Sub04'!B124","'Sub04'!C124",124,{"$f":"K129","v":"Sub04"},null,{"$error":"#REF!"},{"$error":"#REF!"},{"$error":"#REF!"},{"$f":"K129","v":"Sub04"}]
["'Sub04'!A125","'Sub04'!B125","'Sub04'!C125",125,{"$f":"K129","v":"Sub04"},null,{"$error":"#REF!"},{"$error":"#REF!"},{"$error":"#REF!"},{"$f":"K129","v":"Sub04"}]
["'Sub04'!A126","'Sub04'!B126","'Sub04'!C126",126,{"$f":"K129","v":"Sub04"},null,{"$error":"#REF!"},{"$error":"#REF!"},{"$error":"#REF!"},{"$f":"K129","v":"Sub04"}]
["'Sub04'!A127","'Sub04'!B127","'Sub04'!C127",127,{"$f":"K129","v":"Sub04"},null,{"$error":"#REF!"},{"$error":"#REF!"},{"$error":"#REF!"},{"$f":"K129","v":"Sub04"}]
["'Sub04'!A128","'Sub04'!B128","'Sub04'!C128",128,{"$f":"K129","v":"Sub04"},null,{"$error":"#REF!"},{"$error":"#REF!"},{"$error":"#REF!"},{"$f":"K129","v":"Sub04"}]
["'Sub04'!A129","'Sub04'!B129","'Sub04'!C129",129,{"$f":"K129","v":"Sub04"},null,{"$error":"#REF!"},{"$error":"#REF!"},{"$error":"#REF!"},{"$f":"K129","v":"Sub04"}]
["'Sub04'!A130","'Sub04'!B130","'Sub04'!C130",130,{"$f":"K129","v":"Sub04"},null,{"$error":"#REF!"},{"$error":"#REF!"},{"$error":"#REF!"},{"$f":"K129","v":"Sub04"}]
["'Sub04'!A131","'Sub04'!B131","'Sub04'!C131",131,{"$f":"K129","v":"Sub04"},null,{"$f":"IF(INDIRECT(A152,1)<>\"\",INDIRECT(A152,1),\"\")","v":{"$error":"#REF!"}},{"$error":"#REF!"},{"$error":"#REF!"},{"$f":"K129","v":"Sub04"}]
["'Sub04'!A132","'Sub04'!B132","'Sub04'!C132",132,{"$f":"K129","v":"Sub04"},null,{"$error":"#REF!"},{"$error":"#REF!"},{"$error":"#REF!"},{"$f":"K129","v":"Sub04"}]
["'Sub04'!A133","'Sub04'!B133","'Sub04'!C133",133,{"$f":"K129","v":"Sub04"},null,{"$error":"#REF!"},{"$error":"#REF!"},{"$error":"#REF!"},{"$f":"K129","v":"Sub04"}]
["'Sub04'!A134","'Sub04'!B134","'Sub04'!C134",134,{"$f":"K129","v":"Sub04"},null,{"$error":"#REF!"},{"$error":"#REF!"},{"$error":"#REF!"},{"$f":"K129","v":"Sub04"}]
["'Sub04'!A135","'Sub04'!B135","'Sub04'!C135",135,{"$f":"K129","v":"Sub04"},null,{"$error":"#REF!"},{"$error":"#REF!"},{"$error":"#REF!"},{"$f":"K129","v":"Sub04"}]
["'Sub04'!A136","'Sub04'!B136","'Sub04'!C136",136,{"$f":"K129","v":"Sub04"},null,{"$error":"#REF!"},{"$error":"#REF!"},{"$error":"#REF!"},{"$f":"K129","v":"Sub04"}]
["'Sub04'!A137","'Sub04'!B137","'Sub04'!C137",137,{"$f":"K129","v":"Sub04"},null,{"$error":"#REF!"},{"$error":"#REF!"},{"$error":"#REF!"},{"$f":"K129","v":"Sub04"}]
["'Sub04'!A138","'Sub04'!B138","'Sub04'!C138",138,{"$f":"K129","v":"Sub04"},null,{"$error":"#REF!"},{"$error":"#REF!"},{"$error":"#REF!"},{"$f":"K129","v":"Sub04"}]
["'Sub04'!A139","'Sub04'!B139","'Sub04'!C139",139,{"$f":"K129","v":"Sub04"},null,{"$error":"#REF!"},{"$error":"#REF!"},{"$error":"#REF!"},{"$f":"K129","v":"Sub04"}]
["'Sub04'!A140","'Sub04'!B140","'Sub04'!C140",140,{"$f":"K129","v":"Sub04"},null,{"$error":"#REF!"},{"$error":"#REF!"},{"$error":"#REF!"},{"$f":"K129","v":"Sub04"}]
["'Sub04'!A141","'Sub04'!B141","'Sub04'!C141",141,{"$f":"K129","v":"Sub04"},null,{"$error":"#REF!"},{"$error":"#REF!"},{"$error":"#REF!"},{"$f":"K129","v":"Sub04"}]
["'Sub04'!A142","'Sub04'!B142","'Sub04'!C142",142,{"$f":"K129","v":"Sub04"},null,{"$error":"#REF!"},{"$error":"#REF!"},{"$error":"#REF!"},{"$f":"K129","v":"Sub04"}]
["'Sub04'!A143","'Sub04'!B143","'Sub04'!C143",143,{"$f":"K129","v":"Sub04"},null,{"$error":"#REF!"},{"$error":"#REF!"},{"$error":"#REF!"},{"$f":"K129","v":"Sub04"}]
["'Sub04'!A144","'Sub04'!B144","'Sub04'!C144",144,{"$f":"K129","v":"Sub04"},null,{"$error":"#REF!"},{"$error":"#REF!"},{"$error":"#REF!"},{"$f":"K129","v":"Sub04"}]
["'Sub04'!A145","'Sub04'!B145","'Sub04'!C145",145,{"$f":"K129","v":"Sub04"},null,{"$error":"#REF!"},{"$error":"#REF!"},{"$error":"#REF!"},{"$f":"K129","v":"Sub04"}]
["'Sub04'!A146","'Sub04'!B146","'Sub04'!C146",146,{"$f":"K129","v":"Sub04"},null,{"$error":"#REF!"},{"$error":"#REF!"},{"$error":"#REF!"},{"$f":"K129","v":"Sub04"}]
["'Sub04'!A147","'Sub04'!B147","'Sub04'!C147",147,{"$f":"K129","v":"Sub04"},null,{"$error":"#REF!"},{"$error":"#REF!"},{"$error":"#REF!"},{"$f":"K129","v":"Sub04"}]
["'Sub04'!A148","'Sub04'!B148","'Sub04'!C148",148,{"$f":"K129","v":"Sub04"},null,{"$error":"#REF!"},{"$error":"#REF!"},{"$error":"#REF!"},{"$f":"K129","v":"Sub04"}]
["'Sub04'!A149","'Sub04'!B149","'Sub04'!C149",149,{"$f":"K129","v":"Sub04"},null,{"$error":"#REF!"},{"$error":"#REF!"},{"$error":"#REF!"},{"$f":"K129","v":"Sub04"}]
[{"$f":"ADDRESS($D171,1,4,1,$E171)","v":"'Sub05'!A108"},"'Sub05'!B108","'Sub05'!C108",108,{"$f":"K171","v":"Sub05"},null,{"$error":"#REF!"},{"$error":"#REF!"},{"$error":"#REF!"},{"$f":"K171","v":"Sub05"},"Sub05"]
[{"$f":"ADDRESS(D172,1,4,1,E172)","v":"'Sub05'!A109"},"'Sub05'!B109","'Sub05'!C109",{"$f":"D171+1","v":109},{"$f":"K171","v":"Sub05"},null,{"$error":"#REF!"},{"$error":"#REF!"},{"$error":"#REF!"},{"$f":"K171","v":"Sub05"}]
["'Sub05'!A110","'Sub05'!B110","'Sub05'!C110",110,{"$f":"K171","v":"Sub05"},null,{"$error":"#REF!"},{"$error":"#REF!"},{"$error":"#REF!"},{"$f":"K171","v":"Sub05"}]
["'Sub05'!A111","'Sub05'!B111","'Sub05'!C111",111,{"$f":"K171","v":"Sub05"},null,{"$error":"#REF!"},{"$error":"#REF!"},{"$error":"#REF!"},{"$f":"K171","v":"Sub05"}]
["'Sub05'!A112","'Sub05'!B112","'Sub05'!C112",112,{"$f":"K171","v":"Sub05"},null,{"$error":"#REF!"},{"$error":"#REF!"},{"$error":"#REF!"},{"$f":"K171","v":"Sub05"}]
["'Sub05'!A113","'Sub05'!B113","'Sub05'!C113",113,{"$f":"K171","v":"Sub05"},null,{"$error":"#REF!"},{"$error":"#REF!"},{"$error":"#REF!"},{"$f":"K171","v":"Sub05"}]
["'Sub05'!A114","'Sub05'!B114","'Sub05'!C114",114,{"$f":"K171","v":"Sub05"},null,{"$error":"#REF!"},{"$error":"#REF!"},{"$error":"#REF!"},{"$f":"K171","v":"Sub05"}]
["'Sub05'!A115","'Sub05'!B115","'Sub05'!C115",115,{"$f":"K171","v":"Sub05"},null,{"$error":"#REF!"},{"$error":"#REF!"},{"$error":"#REF!"},{"$f":"K171","v":"Sub05"}]
["'Sub05'!A116","'Sub05'!B116","'Sub05'!C116",116,{"$f":"K171","v":"Sub05"},null,{"$error":"#REF!"},{"$error":"#REF!"},{"$error":"#REF!"},{"$f":"K171","v":"Sub05"}]
["'Sub05'!A117","'Sub05'!B117","'Sub05'!C117",117,{"$f":"K171","v":"Sub05"},null,{"$error":"#REF!"},{"$error":"#REF!"},{"$error":"#REF!"},{"$f":"K171","v":"Sub05"}]
["'Sub05'!A118","'Sub05'!B118","'Sub05'!C118",118,{"$f":"K171","v":"Sub05"},null,{"$error":"#REF!"},{"$error":"#REF!"},{"$error":"#REF!"},{"$f":"K171","v":"Sub05"}]
["'Sub05'!A119","'Sub05'!B119","'Sub05'!C119",119,{"$f":"K171","v":"Sub05"},null,{"$error":"#REF!"},{"$error":"#REF!"},{"$error":"#REF!"},{"$f":"K171","v":"Sub05"}]
["'Sub05'!A120","'Sub05'!B120","'Sub05'!C120",120,{"$f":"K171","v":"Sub05"},null,{"$error":"#REF!"},{"$error":"#REF!"},{"$error":"#REF!"},{"$f":"K171","v":"Sub05"}]
["'Sub05'!A121","'Sub05'!B121","'Sub05'!C121",121,{"$f":"K171","v":"Sub05"},null,{"$error":"#REF!"},{"$error":"#REF!"},{"$error":"#REF!"},{"$f":"K171","v":"Sub05"}]
["'Sub05'!A122","'Sub05'!B122","'Sub05'!C122",122,{"$f":"K171","v":"Sub05"},null,{"$error":"#REF!"},{"$error":"#REF!"},{"$error":"#REF!"},{"$f":"K171","v":"Sub05"}]
["'Sub05'!A123","'Sub05'!B123","'Sub05'!C123",123,{"$f":"K171","v":"Sub05"},null,{"$error":"#REF!"},{"$error":"#REF!"},{"$error":"#REF!"},{"$f":"K171","v":"Sub05"}]
["'Sub05'!A124","'Sub05'!B124","'Sub05'!C124",124,{"$f":"K171","v":"Sub05"},null,{"$error":"#REF!"},{"$error":"#REF!"},{"$error":"#REF!"},{"$f":"K171","v":"Sub05"}]
["'Sub05'!A125","'Sub05'!B125","'Sub05'!C125",125,{"$f":"K171","v":"Sub05"},null,{"$error":"#REF!"},{"$error":"#REF!"},{"$error":"#REF!"},{"$f":"K171","v":"Sub05"}]
["'Sub05'!A126","'Sub05'!B126","'Sub05'!C126",126,{"$f":"K171","v":"Sub05"},null,{"$error":"#REF!"},{"$error":"#REF!"},{"$error":"#REF!"},{"$f":"K171","v":"Sub05"}]
["'Sub05'!A127","'Sub05'!B127","'Sub05'!C127",127,{"$f":"K171","v":"Sub05"},null,{"$error":"#REF!"},{"$error":"#REF!"},{"$error":"#REF!"},{"$f":"K171","v":"Sub05"}]
["'Sub05'!A128","'Sub05'!B128","'Sub05'!C128",128,{"$f":"K171","v":"Sub05"},null,{"$error":"#REF!"},{"$error":"#REF!"},{"$error":"#REF!"},{"$f":"K171","v":"Sub05"}]
["'Sub05'!A129","'Sub05'!B129","'Sub05'!C129",129,{"$f":"K171","v":"Sub05"},null,{"$error":"#REF!"},{"$error":"#REF!"},{"$error":"#REF!"},{"$f":"K171","v":"Sub05"}]
["'Sub05'!A130","'Sub05'!B130","'Sub05'!C130",130,{"$f":"K171","v":"Sub05"},null,{"$error":"#REF!"},{"$error":"#REF!"},{"$error":"#REF!"},{"$f":"K171","v":"Sub05"}]
["'Sub05'!A131","'Sub05'!B131","'Sub05'!C131",131,{"$f":"K171","v":"Sub05"},null,{"$error":"#REF!"},{"$error":"#REF!"},{"$error":"#REF!"},{"$f":"K171","v":"Sub05"}]
["'Sub05'!A132","'Sub05'!B132","'Sub05'!C132",132,{"$f":"K171","v":"Sub05"},null,{"$error":"#REF!"},{"$error":"#REF!"},{"$error":"#REF!"},{"$f":"K171","v":"Sub05"}]
["'Sub05'!A133",{"$f":"ADDRESS($D196,2,4,1,$E196)","v":"'Sub05'!B133"},{"$f":"ADDRESS($D196,3,4,1,$E196)","v":"'Sub05'!C133"},133,{"$f":"K171","v":"Sub05"},null,{"$error":"#REF!"},{"$f":"IF(INDIRECT(B196,1)<>\"\",IF(INDIRECT(B196,1)=\"LUMP\", \"LUMP\", INDIRECT(B196,1)),\"\")","v":{"$error":"#REF!"}},{"$f":"IF(INDIRECT(C196,1)<>\"\",INDIRECT(C196,1),\"\")","v":{"$error":"#REF!"}},{"$f":"K171","v":"Sub05"}]
["'Sub05'!A134","'Sub05'!B134","'Sub05'!C134",134,{"$f":"K171","v":"Sub05"},null,{"$error":"#REF!"},{"$error":"#REF!"},{"$error":"#REF!"},{"$f":"K171","v":"Sub05"}]
["'Sub05'!A135","'Sub05'!B135","'Sub05'!C135",135,{"$f":"K171","v":"Sub05"},null,{"$error":"#REF!"},{"$error":"#REF!"},{"$error":"#REF!"},{"$f":"K171","v":"Sub05"}]
["'Sub05'!A136","'Sub05'!B136","'Sub05'!C136",136,{"$f":"K171","v":"Sub05"},null,{"$error":"#REF!"},{"$error":"#REF!"},{"$error":"#REF!"},{"$f":"K171","v":"Sub05"}]
["'Sub05'!A137","'Sub05'!B137","'Sub05'!C137",137,{"$f":"K171","v":"Sub05"},null,{"$error":"#REF!"},{"$error":"#REF!"},{"$error":"#REF!"},{"$f":"K171","v":"Sub05"}]
["'Sub05'!A138","'Sub05'!B138","'Sub05'!C138",138,{"$f":"K171","v":"Sub05"},null,{"$error":"#REF!"},{"$error":"#REF!"},{"$error":"#REF!"},{"$f":"K171","v":"Sub05"}]
["'Sub05'!A139","'Sub05'!B139","'Sub05'!C139",139,{"$f":"K171","v":"Sub05"},null,{"$error":"#REF!"},{"$error":"#REF!"},{"$error":"#REF!"},{"$f":"K171","v":"Sub05"}]
["'Sub05'!A140","'Sub05'!B140","'Sub05'!C140",140,{"$f":"K171","v":"Sub05"},null,{"$error":"#REF!"},{"$error":"#REF!"},{"$error":"#REF!"},{"$f":"K171","v":"Sub05"}]
["'Sub05'!A141","'Sub05'!B141","'Sub05'!C141",141,{"$f":"K171","v":"Sub05"},null,{"$error":"#REF!"},{"$error":"#REF!"},{"$error":"#REF!"},{"$f":"K171","v":"Sub05"}]
["'Sub05'!A142","'Sub05'!B142","'Sub05'!C142",142,{"$f":"K171","v":"Sub05"},null,{"$error":"#REF!"},{"$error":"#REF!"},{"$error":"#REF!"},{"$f":"K171","v":"Sub05"}]
["'Sub05'!A143","'Sub05'!B143","'Sub05'!C143",143,{"$f":"K171","v":"Sub05"},null,{"$error":"#REF!"},{"$error":"#REF!"},{"$error":"#REF!"},{"$f":"K171","v":"Sub05"}]
["'Sub05'!A144","'Sub05'!B144","'Sub05'!C144",144,{"$f":"K171","v":"Sub05"},null,{"$error":"#REF!"},{"$error":"#REF!"},{"$error":"#REF!"},{"$f":"K171","v":"Sub05"}]
["'Sub05'!A145","'Sub05'!B145","'Sub05'!C145",145,{"$f":"K171","v":"Sub05"},null,{"$error":"#REF!"},{"$error":"#REF!"},{"$error":"#REF!"},{"$f":"K171","v":"Sub05"}]
["'Sub05'!A146","'Sub05'!B146","'Sub05'!C146",146,{"$f":"K171","v":"Sub05"},null,{"$error":"#REF!"},{"$error":"#REF!"},{"$error":"#REF!"},{"$f":"K171","v":"Sub05"}]
["'Sub05'!A147","'Sub05'!B147","'Sub05'!C147",147,{"$f":"K171","v":"Sub05"},null,{"$error":"#REF!"},{"$error":"#REF!"},{"$error":"#REF!"},{"$f":"K171","v":"Sub05"}]
["'Sub05'!A148","'Sub05'!B148","'Sub05'!C148",148,{"$f":"K171","v":"Sub05"},null,{"$error":"#REF!"},{"$error":"#REF!"},{"$error":"#REF!"},{"$f":"K171","v":"Sub05"}]
["'Sub05'!A149","'Sub05'!B149","'Sub05'!C149",149,{"$f":"K171","v":"Sub05"},null,{"$error":"#REF!"},{"$error":"#REF!"},{"$error":"#REF!"},{"$f":"K171","v":"Sub05"}]
[{"$f":"ADDRESS($D213,1,4,1,$E213)","v":"'Sub06'!A108"},"'Sub06'!B108","'Sub06'!C108",108,{"$f":"K213","v":"Sub06"},null,{"$error":"#REF!"},{"$error":"#REF!"},{"$error":"#REF!"},{"$f":"K213","v":"Sub06"},"Sub06"]
[{"$f":"ADDRESS(D214,1,4,1,E214)","v":"'Sub06'!A109"},"'Sub06'!B109","'Sub06'!C109",{"$f":"D213+1","v":109},{"$f":"K213","v":"Sub06"},null,{"$error":"#REF!"},{"$error":"#REF!"},{"$error":"#REF!"},{"$f":"K213","v":"Sub06"}]
["'Sub06'!A110","'Sub06'!B110","'Sub06'!C110",110,{"$f":"K213","v":"Sub06"},null,{"$error":"#REF!"},{"$error":"#REF!"},{"$error":"#REF!"},{"$f":"K213","v":"Sub06"}]
["'Sub06'!A111","'Sub06'!B111","'Sub06'!C111",111,{"$f":"K213","v":"Sub06"},null,{"$f":"IF(INDIRECT(A216,1)<>\"\",INDIRECT(A216,1),\"\")","v":{"$error":"#REF!"}},{"$error":"#REF!"},{"$error":"#REF!"},{"$f":"K213","v":"Sub06"}]
["'Sub06'!A112","'Sub06'!B112","'Sub06'!C112",112,{"$f":"K213","v":"Sub06"},null,{"$error":"#REF!"},{"$error":"#REF!"},{"$error":"#REF!"},{"$f":"K213","v":"Sub06"}]
["'Sub06'!A113","'Sub06'!B113","'Sub06'!C113",113,{"$f":"K213","v":"Sub06"},null,{"$error":"#REF!"},{"$error":"#REF!"},{"$error":"#REF!"},{"$f":"K213","v":"Sub06"}]
["'Sub06'!A114","'Sub06'!B114","'Sub06'!C114",114,{"$f":"K213","v":"Sub06"},null,{"$error":"#REF!"},{"$error":"#REF!"},{"$error":"#REF!"},{"$f":"K213","v":"Sub06"}]
["'Sub06'!A115","'Sub06'!B115","'Sub06'!C115",115,{"$f":"K213","v":"Sub06"},null,{"$error":"#REF!"},{"$error":"#REF!"},{"$error":"#REF!"},{"$f":"K213","v":"Sub06"}]
["'Sub06'!A116","'Sub06'!B116","'Sub06'!C116",116,{"$f":"K213","v":"Sub06"},null,{"$error":"#REF!"},{"$error":"#REF!"},{"$error":"#REF!"},{"$f":"K213","v":"Sub06"}]
["'Sub06'!A117","'Sub06'!B117","'Sub06'!C117",117,{"$f":"K213","v":"Sub06"},null,{"$error":"#REF!"},{"$error":"#REF!"},{"$error":"#REF!"},{"$f":"K213","v":"Sub06"}]
["'Sub06'!A118","'Sub06'!B118","'Sub06'!C118",118,{"$f":"K213","v":"Sub06"},null,{"$error":"#REF!"},{"$error":"#REF!"},{"$error":"#REF!"},{"$f":"K213","v":"Sub06"}]
["'Sub06'!A119","'Sub06'!B119","'Sub06'!C119",119,{"$f":"K213","v":"Sub06"},null,{"$error":"#REF!"},{"$error":"#REF!"},{"$error":"#REF!"},{"$f":"K213","v":"Sub06"}]
["'Sub06'!A120","'Sub06'!B120","'Sub06'!C120",120,{"$f":"K213","v":"Sub06"},null,{"$error":"#REF!"},{"$error":"#REF!"},{"$error":"#REF!"},{"$f":"K213","v":"Sub06"}]
["'Sub06'!A121","'Sub06'!B121","'Sub06'!C121",121,{"$f":"K213","v":"Sub06"},null,{"$error":"#REF!"},{"$error":"#REF!"},{"$error":"#REF!"},{"$f":"K213","v":"Sub06"}]
["'Sub06'!A122","'Sub06'!B122","'Sub06'!C122",122,{"$f":"K213","v":"Sub06"},null,{"$error":"#REF!"},{"$error":"#REF!"},{"$error":"#REF!"},{"$f":"K213","v":"Sub06"}]
["'Sub06'!A123","'Sub06'!B123","'Sub06'!C123",123,{"$f":"K213","v":"Sub06"},null,{"$error":"#REF!"},{"$error":"#REF!"},{"$error":"#REF!"},{"$f":"K213","v":"Sub06"}]
["'Sub06'!A124","'Sub06'!B124","'Sub06'!C124",124,{"$f":"K213","v":"Sub06"},null,{"$error":"#REF!"},{"$error":"#REF!"},{"$error":"#REF!"},{"$f":"K213","v":"Sub06"}]
["'Sub06'!A125","'Sub06'!B125","'Sub06'!C125",125,{"$f":"K213","v":"Sub06"},null,{"$error":"#REF!"},{"$error":"#REF!"},{"$error":"#REF!"},{"$f":"K213","v":"Sub06"}]
["'Sub06'!A126","'Sub06'!B126","'Sub06'!C126",126,{"$f":"K213","v":"Sub06"},null,{"$error":"#REF!"},{"$error":"#REF!"},{"$error":"#REF!"},{"$f":"K213","v":"Sub06"}]
["'Sub06'!A127","'Sub06'!B127","'Sub06'!C127",127,{"$f":"K213","v":"Sub06"},null,{"$error":"#REF!"},{"$error":"#REF!"},{"$error":"#REF!"},{"$f":"K213","v":"Sub06"}]
["'Sub06'!A128","'Sub06'!B128","'Sub06'!C128",128,{"$f":"K213","v":"Sub06"},null,{"$error":"#REF!"},{"$error":"#REF!"},{"$error":"#REF!"},{"$f":"K213","v":"Sub06"}]
["'Sub06'!A129","'Sub06'!B129","'Sub06'!C129",129,{"$f":"K213","v":"Sub06"},null,{"$error":"#REF!"},{"$error":"#REF!"},{"$error":"#REF!"},{"$f":"K213","v":"Sub06"}]
["'Sub06'!A130","'Sub06'!B130","'Sub06'!C130",130,{"$f":"K213","v":"Sub06"},null,{"$error":"#REF!"},{"$error":"#REF!"},{"$error":"#REF!"},{"$f":"K213","v":"Sub06"}]
["'Sub06'!A131","'Sub06'!B131","'Sub06'!C131",131,{"$f":"K213","v":"Sub06"},null,{"$error":"#REF!"},{"$error":"#REF!"},{"$error":"#REF!"},{"$f":"K213","v":"Sub06"}]
["'Sub06'!A132","'Sub06'!B132","'Sub06'!C132",132,{"$f":"K213","v":"Sub06"},null,{"$error":"#REF!"},{"$error":"#REF!"},{"$error":"#REF!"},{"$f":"K213","v":"Sub06"}]
["'Sub06'!A133","'Sub06'!B133","'Sub06'!C133",133,{"$f":"K213","v":"Sub06"},null,{"$error":"#REF!"},{"$error":"#REF!"},{"$error":"#REF!"},{"$f":"K213","v":"Sub06"}]
["'Sub06'!A134","'Sub06'!B134","'Sub06'!C134",134,{"$f":"K213","v":"Sub06"},null,{"$error":"#REF!"},{"$error":"#REF!"},{"$error":"#REF!"},{"$f":"K213","v":"Sub06"}]
["'Sub06'!A135","'Sub06'!B135","'Sub06'!C135",135,{"$f":"K213","v":"Sub06"},null,{"$error":"#REF!"},{"$error":"#REF!"},{"$error":"#REF!"},{"$f":"K213","v":"Sub06"}]
["'Sub06'!A136","'Sub06'!B136","'Sub06'!C136",136,{"$f":"K213","v":"Sub06"},null,{"$error":"#REF!"},{"$error":"#REF!"},{"$error":"#REF!"},{"$f":"K213","v":"Sub06"}]
["'Sub06'!A137","'Sub06'!B137","'Sub06'!C137",137,{"$f":"K213","v":"Sub06"},null,{"$error":"#REF!"},{"$error":"#REF!"},{"$error":"#REF!"},{"$f":"K213","v":"Sub06"}]
["'Sub06'!A138","'Sub06'!B138","'Sub06'!C138",138,{"$f":"K213","v":"Sub06"},null,{"$error":"#REF!"},{"$error":"#REF!"},{"$error":"#REF!"},{"$f":"K213","v":"Sub06"}]
["'Sub06'!A139","'Sub06'!B139","'Sub06'!C139",139,{"$f":"K213","v":"Sub06"},null,{"$error":"#REF!"},{"$error":"#REF!"},{"$error":"#REF!"},{"$f":"K213","v":"Sub06"}]
["'Sub06'!A140","'Sub06'!B140","'Sub06'!C140",140,{"$f":"K213","v":"Sub06"},null,{"$error":"#REF!"},{"$error":"#REF!"},{"$error":"#REF!"},{"$f":"K213","v":"Sub06"}]
["'Sub06'!A141","'Sub06'!B141","'Sub06'!C141",141,{"$f":"K213","v":"Sub06"},null,{"$error":"#REF!"},{"$error":"#REF!"},{"$error":"#REF!"},{"$f":"K213","v":"Sub06"}]
["'Sub06'!A142","'Sub06'!B142","'Sub06'!C142",142,{"$f":"K213","v":"Sub06"},null,{"$error":"#REF!"},{"$error":"#REF!"},{"$error":"#REF!"},{"$f":"K213","v":"Sub06"}]
["'Sub06'!A143","'Sub06'!B143","'Sub06'!C143",143,{"$f":"K213","v":"Sub06"},null,{"$error":"#REF!"},{"$error":"#REF!"},{"$error":"#REF!"},{"$f":"K213","v":"Sub06"}]
["'Sub06'!A144","'Sub06'!B144","'Sub06'!C144",144,{"$f":"K213","v":"Sub06"},null,{"$error":"#REF!"},{"$error":"#REF!"},{"$error":"#REF!"},{"$f":"K213","v":"Sub06"}]
["'Sub06'!A145","'Sub06'!B145","'Sub06'!C145",145,{"$f":"K213","v":"Sub06"},null,{"$error":"#REF!"},{"$error":"#REF!"},{"$error":"#REF!"},{"$f":"K213","v":"Sub06"}]
["'Sub06'!A146","'Sub06'!B146","'Sub06'!C146",146,{"$f":"K213","v":"Sub06"},null,{"$error":"#REF!"},{"$error":"#REF!"},{"$error":"#REF!"},{"$f":"K213","v":"Sub06"}]
["'Sub06'!A147","'Sub06'!B147","'Sub06'!C147",147,{"$f":"K213","v":"Sub06"},null,{"$error":"#REF!"},{"$error":"#REF!"},{"$error":"#REF!"},{"$f":"K213","v":"Sub06"}]
["'Sub06'!A148","'Sub06'!B148","'Sub06'!C148",148,{"$f":"K213","v":"Sub06"},null,{"$error":"#REF!"},{"$error":"#REF!"},{"$error":"#REF!"},{"$f":"K213","v":"Sub06"}]
["'Sub06'!A149","'Sub06'!B149","'Sub06'!C149",149,{"$f":"K213","v":"Sub06"},null,{"$error":"#REF!"},{"$error":"#REF!"},{"$error":"#REF!"},{"$f":"K213","v":"Sub06"}]
[{"$f":"ADDRESS($D255,1,4,1,$E255)","v":"'Sub07'!A108"},"'Sub07'!B108","'Sub07'!C108",108,{"$f":"K255","v":"Sub07"},null,{"$error":"#REF!"},{"$error":"#REF!"},{"$error":"#REF!"},{"$f":"K255","v":"Sub07"},"Sub07"]
[{"$f":"ADDRESS(D256,1,4,1,E256)","v":"'Sub07'!A109"},"'Sub07'!B109","'Sub07'!C109",{"$f":"D255+1","v":109},{"$f":"K255","v":"Sub07"},null,{"$error":"#REF!"},{"$error":"#REF!"},{"$error":"#REF!"},{"$f":"K255","v":"Sub07"}]
["'Sub07'!A110","'Sub07'!B110","'Sub07'!C110",110,{"$f":"K255","v":"Sub07"},null,{"$error":"#REF!"},{"$error":"#REF!"},{"$error":"#REF!"},{"$f":"K255","v":"Sub07"}]
["'Sub07'!A111","'Sub07'!B111","'Sub07'!C111",111,{"$f":"K255","v":"Sub07"},null,{"$error":"#REF!"},{"$error":"#REF!"},{"$error":"#REF!"},{"$f":"K255","v":"Sub07"}]
["'Sub07'!A112","'Sub07'!B112","'Sub07'!C112",112,{"$f":"K255","v":"Sub07"},null,{"$error":"#REF!"},{"$error":"#REF!"},{"$error":"#REF!"},{"$f":"K255","v":"Sub07"}]
["'Sub07'!A113",{"$f":"ADDRESS($D260,2,4,1,$E260)","v":"'Sub07'!B113"},{"$f":"ADDRESS($D260,3,4,1,$E260)","v":"'Sub07'!C113"},113,{"$f":"K255","v":"Sub07"},null,{"$error":"#REF!"},{"$f":"IF(INDIRECT(B260,1)<>\"\",IF(INDIRECT(B260,1)=\"LUMP\", \"LUMP\", INDIRECT(B260,1)),\"\")","v":{"$error":"#REF!"}},{"$f":"IF(INDIRECT(C260,1)<>\"\",INDIRECT(C260,1),\"\")","v":{"$error":"#REF!"}},{"$f":"K255","v":"Sub07"}]
["'Sub07'!A114","'Sub07'!B114","'Sub07'!C114",114,{"$f":"K255","v":"Sub07"},null,{"$error":"#REF!"},{"$error":"#REF!"},{"$error":"#REF!"},{"$f":"K255","v":"Sub07"}]
["'Sub07'!A115","'Sub07'!B115","'Sub07'!C115",115,{"$f":"K255","v":"Sub07"},null,{"$error":"#REF!"},{"$error":"#REF!"},{"$error":"#REF!"},{"$f":"K255","v":"Sub07"}]
["'Sub07'!A116","'Sub07'!B116","'Sub07'!C116",116,{"$f":"K255","v":"Sub07"},null,{"$error":"#REF!"},{"$error":"#REF!"},{"$error":"#REF!"},{"$f":"K255","v":"Sub07"}]
["'Sub07'!A117","'Sub07'!B117","'Sub07'!C117",117,{"$f":"K255","v":"Sub07"},null,{"$error":"#REF!"},{"$error":"#REF!"},{"$error":"#REF!"},{"$f":"K255","v":"Sub07"}]
["'Sub07'!A118","'Sub07'!B118","'Sub07'!C118",118,{"$f":"K255","v":"Sub07"},null,{"$error":"#REF!"},{"$error":"#REF!"},{"$error":"#REF!"},{"$f":"K255","v":"Sub07"}]
["'Sub07'!A119","'Sub07'!B119","'Sub07'!C119",119,{"$f":"K255","v":"Sub07"},null,{"$error":"#REF!"},{"$error":"#REF!"},{"$error":"#REF!"},{"$f":"K255","v":"Sub07"}]
["'Sub07'!A120","'Sub07'!B120","'Sub07'!C120",120,{"$f":"K255","v":"Sub07"},null,{"$error":"#REF!"},{"$error":"#REF!"},{"$error":"#REF!"},{"$f":"K255","v":"Sub07"}]
["'Sub07'!A121","'Sub07'!B121","'Sub07'!C121",121,{"$f":"K255","v":"Sub07"},null,{"$error":"#REF!"},{"$error":"#REF!"},{"$error":"#REF!"},{"$f":"K255","v":"Sub07"}]
["'Sub07'!A122","'Sub07'!B122","'Sub07'!C122",122,{"$f":"K255","v":"Sub07"},null,{"$error":"#REF!"},{"$error":"#REF!"},{"$error":"#REF!"},{"$f":"K255","v":"Sub07"}]
["'Sub07'!A123","'Sub07'!B123","'Sub07'!C123",123,{"$f":"K255","v":"Sub07"},null,{"$error":"#REF!"},{"$error":"#REF!"},{"$error":"#REF!"},{"$f":"K255","v":"Sub07"}]
["'Sub07'!A124","'Sub07'!B124","'Sub07'!C124",124,{"$f":"K255","v":"Sub07"},null,{"$error":"#REF!"},{"$error":"#REF!"},{"$error":"#REF!"},{"$f":"K255","v":"Sub07"}]
["'Sub07'!A125","'Sub07'!B125","'Sub07'!C125",125,{"$f":"K255","v":"Sub07"},null,{"$error":"#REF!"},{"$error":"#REF!"},{"$error":"#REF!"},{"$f":"K255","v":"Sub07"}]
["'Sub07'!A126","'Sub07'!B126","'Sub07'!C126",126,{"$f":"K255","v":"Sub07"},null,{"$error":"#REF!"},{"$error":"#REF!"},{"$error":"#REF!"},{"$f":"K255","v":"Sub07"}]
["'Sub07'!A127","'Sub07'!B127","'Sub07'!C127",127,{"$f":"K255","v":"Sub07"},null,{"$error":"#REF!"},{"$error":"#REF!"},{"$error":"#REF!"},{"$f":"K255","v":"Sub07"}]
["'Sub07'!A128","'Sub07'!B128","'Sub07'!C128",128,{"$f":"K255","v":"Sub07"},null,{"$error":"#REF!"},{"$error":"#REF!"},{"$error":"#REF!"},{"$f":"K255","v":"Sub07"}]
["'Sub07'!A129","'Sub07'!B129","'Sub07'!C129",129,{"$f":"K255","v":"Sub07"},null,{"$error":"#REF!"},{"$error":"#REF!"},{"$error":"#REF!"},{"$f":"K255","v":"Sub07"}]
["'Sub07'!A130","'Sub07'!B130","'Sub07'!C130",130,{"$f":"K255","v":"Sub07"},null,{"$error":"#REF!"},{"$error":"#REF!"},{"$error":"#REF!"},{"$f":"K255","v":"Sub07"}]
["'Sub07'!A131","'Sub07'!B131","'Sub07'!C131",131,{"$f":"K255","v":"Sub07"},null,{"$error":"#REF!"},{"$error":"#REF!"},{"$error":"#REF!"},{"$f":"K255","v":"Sub07"}]
["'Sub07'!A132","'Sub07'!B132","'Sub07'!C132",132,{"$f":"K255","v":"Sub07"},null,{"$error":"#REF!"},{"$error":"#REF!"},{"$error":"#REF!"},{"$f":"K255","v":"Sub07"}]
["'Sub07'!A133","'Sub07'!B133","'Sub07'!C133",133,{"$f":"K255","v":"Sub07"},null,{"$f":"IF(INDIRECT(A280,1)<>\"\",INDIRECT(A280,1),\"\")","v":{"$error":"#REF!"}},{"$error":"#REF!"},{"$error":"#REF!"},{"$f":"K255","v":"Sub07"}]
["'Sub07'!A134","'Sub07'!B134","'Sub07'!C134",134,{"$f":"K255","v":"Sub07"},null,{"$error":"#REF!"},{"$error":"#REF!"},{"$error":"#REF!"},{"$f":"K255","v":"Sub07"}]
["'Sub07'!A135","'Sub07'!B135","'Sub07'!C135",135,{"$f":"K255","v":"Sub07"},null,{"$error":"#REF!"},{"$error":"#REF!"},{"$error":"#REF!"},{"$f":"K255","v":"Sub07"}]
["'Sub07'!A136","'Sub07'!B136","'Sub07'!C136",136,{"$f":"K255","v":"Sub07"},null,{"$error":"#REF!"},{"$error":"#REF!"},{"$error":"#REF!"},{"$f":"K255","v":"Sub07"}]
["'Sub07'!A137","'Sub07'!B137","'Sub07'!C137",137,{"$f":"K255","v":"Sub07"},null,{"$error":"#REF!"},{"$error":"#REF!"},{"$error":"#REF!"},{"$f":"K255","v":"Sub07"}]
["'Sub07'!A138","'Sub07'!B138","'Sub07'!C138",138,{"$f":"K255","v":"Sub07"},null,{"$error":"#REF!"},{"$error":"#REF!"},{"$error":"#REF!"},{"$f":"K255","v":"Sub07"}]
["'Sub07'!A139","'Sub07'!B139","'Sub07'!C139",139,{"$f":"K255","v":"Sub07"},null,{"$error":"#REF!"},{"$error":"#REF!"},{"$error":"#REF!"},{"$f":"K255","v":"Sub07"}]
["'Sub07'!A140","'Sub07'!B140","'Sub07'!C140",140,{"$f":"K255","v":"Sub07"},null,{"$error":"#REF!"},{"$error":"#REF!"},{"$error":"#REF!"},{"$f":"K255","v":"Sub07"}]
["'Sub07'!A141","'Sub07'!B141","'Sub07'!C141",141,{"$f":"K255","v":"Sub07"},null,{"$error":"#REF!"},{"$error":"#REF!"},{"$error":"#REF!"},{"$f":"K255","v":"Sub07"}]
["'Sub07'!A142","'Sub07'!B142","'Sub07'!C142",142,{"$f":"K255","v":"Sub07"},null,{"$error":"#REF!"},{"$error":"#REF!"},{"$error":"#REF!"},{"$f":"K255","v":"Sub07"}]
["'Sub07'!A143","'Sub07'!B143","'Sub07'!C143",143,{"$f":"K255","v":"Sub07"},null,{"$error":"#REF!"},{"$error":"#REF!"},{"$error":"#REF!"},{"$f":"K255","v":"Sub07"}]
["'Sub07'!A144","'Sub07'!B144","'Sub07'!C144",144,{"$f":"K255","v":"Sub07"},null,{"$error":"#REF!"},{"$error":"#REF!"},{"$error":"#REF!"},{"$f":"K255","v":"Sub07"}]
["'Sub07'!A145","'Sub07'!B145","'Sub07'!C145",145,{"$f":"K255","v":"Sub07"},null,{"$error":"#REF!"},{"$error":"#REF!"},{"$error":"#REF!"},{"$f":"K255","v":"Sub07"}]
["'Sub07'!A146","'Sub07'!B146","'Sub07'!C146",146,{"$f":"K255","v":"Sub07"},null,{"$error":"#REF!"},{"$error":"#REF!"},{"$error":"#REF!"},{"$f":"K255","v":"Sub07"}]
["'Sub07'!A147","'Sub07'!B147","'Sub07'!C147",147,{"$f":"K255","v":"Sub07"},null,{"$error":"#REF!"},{"$error":"#REF!"},{"$error":"#REF!"},{"$f":"K255","v":"Sub07"}]
["'Sub07'!A148","'Sub07'!B148","'Sub07'!C148",148,{"$f":"K255","v":"Sub07"},null,{"$error":"#REF!"},{"$error":"#REF!"},{"$error":"#REF!"},{"$f":"K255","v":"Sub07"}]
["'Sub07'!A149","'Sub07'!B149","'Sub07'!C149",149,{"$f":"K255","v":"Sub07"},null,{"$error":"#REF!"},{"$error":"#REF!"},{"$error":"#REF!"},{"$f":"K255","v":"Sub07"}]
[{"$f":"ADDRESS($D297,1,4,1,$E297)","v":"'Sub08'!A108"},"'Sub08'!B108","'Sub08'!C108",108,{"$f":"K297","v":"Sub08"},null,{"$error":"#REF!"},{"$error":"#REF!"},{"$error":"#REF!"},{"$f":"K297","v":"Sub08"},"Sub08"]
[{"$f":"ADDRESS(D298,1,4,1,E298)","v":"'Sub08'!A109"},"'Sub08'!B109","'Sub08'!C109",{"$f":"D297+1","v":109},{"$f":"K297","v":"Sub08"},null,{"$error":"#REF!"},{"$error":"#REF!"},{"$error":"#REF!"},{"$f":"K297","v":"Sub08"}]
["'Sub08'!A110","'Sub08'!B110","'Sub08'!C110",110,{"$f":"K297","v":"Sub08"},null,{"$error":"#REF!"},{"$error":"#REF!"},{"$error":"#REF!"},{"$f":"K297","v":"Sub08"}]
["'Sub08'!A111","'Sub08'!B111","'Sub08'!C111",111,{"$f":"K297","v":"Sub08"},null,{"$error":"#REF!"},{"$error":"#REF!"},{"$error":"#REF!"},{"$f":"K297","v":"Sub08"}]
["'Sub08'!A112","'Sub08'!B112","'Sub08'!C112",112,{"$f":"K297","v":"Sub08"},null,{"$error":"#REF!"},{"$error":"#REF!"},{"$error":"#REF!"},{"$f":"K297","v":"Sub08"}]
["'Sub08'!A113","'Sub08'!B113","'Sub08'!C113",113,{"$f":"K297","v":"Sub08"},null,{"$error":"#REF!"},{"$error":"#REF!"},{"$error":"#REF!"},{"$f":"K297","v":"Sub08"}]
["'Sub08'!A114","'Sub08'!B114","'Sub08'!C114",114,{"$f":"K297","v":"Sub08"},null,{"$error":"#REF!"},{"$error":"#REF!"},{"$error":"#REF!"},{"$f":"K297","v":"Sub08"}]
["'Sub08'!A115","'Sub08'!B115","'Sub08'!C115",115,{"$f":"K297","v":"Sub08"},null,{"$error":"#REF!"},{"$error":"#REF!"},{"$error":"#REF!"},{"$f":"K297","v":"Sub08"}]
["'Sub08'!A116","'Sub08'!B116","'Sub08'!C116",116,{"$f":"K297","v":"Sub08"},null,{"$error":"#REF!"},{"$error":"#REF!"},{"$error":"#REF!"},{"$f":"K297","v":"Sub08"}]
["'Sub08'!A117","'Sub08'!B117","'Sub08'!C117",117,{"$f":"K297","v":"Sub08"},null,{"$error":"#REF!"},{"$error":"#REF!"},{"$error":"#REF!"},{"$f":"K297","v":"Sub08"}]
["'Sub08'!A118","'Sub08'!B118","'Sub08'!C118",118,{"$f":"K297","v":"Sub08"},null,{"$error":"#REF!"},{"$error":"#REF!"},{"$error":"#REF!"},{"$f":"K297","v":"Sub08"}]
["'Sub08'!A119","'Sub08'!B119","'Sub08'!C119",119,{"$f":"K297","v":"Sub08"},null,{"$error":"#REF!"},{"$error":"#REF!"},{"$error":"#REF!"},{"$f":"K297","v":"Sub08"}]
["'Sub08'!A120","'Sub08'!B120","'Sub08'!C120",120,{"$f":"K297","v":"Sub08"},null,{"$error":"#REF!"},{"$error":"#REF!"},{"$error":"#REF!"},{"$f":"K297","v":"Sub08"}]
["'Sub08'!A121","'Sub08'!B121","'Sub08'!C121",121,{"$f":"K297","v":"Sub08"},null,{"$error":"#REF!"},{"$error":"#REF!"},{"$error":"#REF!"},{"$f":"K297","v":"Sub08"}]
["'Sub08'!A122","'Sub08'!B122","'Sub08'!C122",122,{"$f":"K297","v":"Sub08"},null,{"$error":"#REF!"},{"$error":"#REF!"},{"$error":"#REF!"},{"$f":"K297","v":"Sub08"}]
["'Sub08'!A123","'Sub08'!B123","'Sub08'!C123",123,{"$f":"K297","v":"Sub08"},null,{"$error":"#REF!"},{"$error":"#REF!"},{"$error":"#REF!"},{"$f":"K297","v":"Sub08"}]
["'Sub08'!A124","'Sub08'!B124","'Sub08'!C124",124,{"$f":"K297","v":"Sub08"},null,{"$error":"#REF!"},{"$error":"#REF!"},{"$error":"#REF!"},{"$f":"K297","v":"Sub08"}]
["'Sub08'!A125","'Sub08'!B125","'Sub08'!C125",125,{"$f":"K297","v":"Sub08"},null,{"$error":"#REF!"},{"$error":"#REF!"},{"$error":"#REF!"},{"$f":"K297","v":"Sub08"}]
["'Sub08'!A126","'Sub08'!B126","'Sub08'!C126",126,{"$f":"K297","v":"Sub08"},null,{"$error":"#REF!"},{"$error":"#REF!"},{"$error":"#REF!"},{"$f":"K297","v":"Sub08"}]
["'Sub08'!A127","'Sub08'!B127","'Sub08'!C127",127,{"$f":"K297","v":"Sub08"},null,{"$error":"#REF!"},{"$error":"#REF!"},{"$error":"#REF!"},{"$f":"K297","v":"Sub08"}]
["'Sub08'!A128","'Sub08'!B128","'Sub08'!C128",128,{"$f":"K297","v":"Sub08"},null,{"$error":"#REF!"},{"$error":"#REF!"},{"$error":"#REF!"},{"$f":"K297","v":"Sub08"}]
["'Sub08'!A129","'Sub08'!B129","'Sub08'!C129",129,{"$f":"K297","v":"Sub08"},null,{"$error":"#REF!"},{"$error":"#REF!"},{"$error":"#REF!"},{"$f":"K297","v":"Sub08"}]
["'Sub08'!A130","'Sub08'!B130","'Sub08'!C130",130,{"$f":"K297","v":"Sub08"},null,{"$error":"#REF!"},{"$error":"#REF!"},{"$error":"#REF!"},{"$f":"K297","v":"Sub08"}]
["'Sub08'!A131","'Sub08'!B131","'Sub08'!C131",131,{"$f":"K297","v":"Sub08"},null,{"$error":"#REF!"},{"$error":"#REF!"},{"$error":"#REF!"},{"$f":"K297","v":"Sub08"}]
["'Sub08'!A132","'Sub08'!B132","'Sub08'!C132",132,{"$f":"K297","v":"Sub08"},null,{"$error":"#REF!"},{"$error":"#REF!"},{"$error":"#REF!"},{"$f":"K297","v":"Sub08"}]
["'Sub08'!A133","'Sub08'!B133","'Sub08'!C133",133,{"$f":"K297","v":"Sub08"},null,{"$error":"#REF!"},{"$error":"#REF!"},{"$error":"#REF!"},{"$f":"K297","v":"Sub08"}]
["'Sub08'!A134","'Sub08'!B134","'Sub08'!C134",134,{"$f":"K297","v":"Sub08"},null,{"$error":"#REF!"},{"$error":"#REF!"},{"$error":"#REF!"},{"$f":"K297","v":"Sub08"}]
["'Sub08'!A135",{"$f":"ADDRESS($D324,2,4,1,$E324)","v":"'Sub08'!B135"},{"$f":"ADDRESS($D324,3,4,1,$E324)","v":"'Sub08'!C135"},135,{"$f":"K297","v":"Sub08"},null,{"$error":"#REF!"},{"$f":"IF(INDIRECT(B324,1)<>\"\",IF(INDIRECT(B324,1)=\"LUMP\", \"LUMP\", INDIRECT(B324,1)),\"\")","v":{"$error":"#REF!"}},{"$f":"IF(INDIRECT(C324,1)<>\"\",INDIRECT(C324,1),\"\")","v":{"$error":"#REF!"}},{"$f":"K297","v":"Sub08"}]
["'Sub08'!A136","'Sub08'!B136","'Sub08'!C136",136,{"$f":"K297","v":"Sub08"},null,{"$error":"#REF!"},{"$error":"#REF!"},{"$error":"#REF!"},{"$f":"K297","v":"Sub08"}]
["'Sub08'!A137","'Sub08'!B137","'Sub08'!C137",137,{"$f":"K297","v":"Sub08"},null,{"$error":"#REF!"},{"$error":"#REF!"},{"$error":"#REF!"},{"$f":"K297","v":"Sub08"}]
["'Sub08'!A138","'Sub08'!B138","'Sub08'!C138",138,{"$f":"K297","v":"Sub08"},null,{"$error":"#REF!"},{"$error":"#REF!"},{"$error":"#REF!"},{"$f":"K297","v":"Sub08"}]
["'Sub08'!A139","'Sub08'!B139","'Sub08'!C139",139,{"$f":"K297","v":"Sub08"},null,{"$error":"#REF!"},{"$error":"#REF!"},{"$error":"#REF!"},{"$f":"K297","v":"Sub08"}]
["'Sub08'!A140","'Sub08'!B140","'Sub08'!C140",140,{"$f":"K297","v":"Sub08"},null,{"$error":"#REF!"},{"$error":"#REF!"},{"$error":"#REF!"},{"$f":"K297","v":"Sub08"}]
["'Sub08'!A141","'Sub08'!B141","'Sub08'!C141",141,{"$f":"K297","v":"Sub08"},null,{"$error":"#REF!"},{"$error":"#REF!"},{"$error":"#REF!"},{"$f":"K297","v":"Sub08"}]
["'Sub08'!A142","'Sub08'!B142","'Sub08'!C142",142,{"$f":"K297","v":"Sub08"},null,{"$error":"#REF!"},{"$error":"#REF!"},{"$error":"#REF!"},{"$f":"K297","v":"Sub08"}]
["'Sub08'!A143","'Sub08'!B143","'Sub08'!C143",143,{"$f":"K297","v":"Sub08"},null,{"$error":"#REF!"},{"$error":"#REF!"},{"$error":"#REF!"},{"$f":"K297","v":"Sub08"}]
["'Sub08'!A144","'Sub08'!B144","'Sub08'!C144",144,{"$f":"K297","v":"Sub08"},null,{"$error":"#REF!"},{"$error":"#REF!"},{"$error":"#REF!"},{"$f":"K297","v":"Sub08"}]
["'Sub08'!A145","'Sub08'!B145","'Sub08'!C145",145,{"$f":"K297","v":"Sub08"},null,{"$error":"#REF!"},{"$error":"#REF!"},{"$error":"#REF!"},{"$f":"K297","v":"Sub08"}]
["'Sub08'!A146","'Sub08'!B146","'Sub08'!C146",146,{"$f":"K297","v":"Sub08"},null,{"$error":"#REF!"},{"$error":"#REF!"},{"$error":"#REF!"},{"$f":"K297","v":"Sub08"}]
["'Sub08'!A147","'Sub08'!B147","'Sub08'!C147",147,{"$f":"K297","v":"Sub08"},null,{"$error":"#REF!"},{"$error":"#REF!"},{"$error":"#REF!"},{"$f":"K297","v":"Sub08"}]
["'Sub08'!A148","'Sub08'!B148","'Sub08'!C148",148,{"$f":"K297","v":"Sub08"},null,{"$error":"#REF!"},{"$error":"#REF!"},{"$error":"#REF!"},{"$f":"K297","v":"Sub08"}]
["'Sub08'!A149","'Sub08'!B149","'Sub08'!C149",149,{"$f":"K297","v":"Sub08"},null,{"$error":"#REF!"},{"$error":"#REF!"},{"$error":"#REF!"},{"$f":"K297","v":"Sub08"}]
[{"$f":"ADDRESS($D339,1,4,1,$E339)","v":"'Sub09'!A108"},"'Sub09'!B108","'Sub09'!C108",108,{"$f":"K339","v":"Sub09"},null,{"$f":"IF(INDIRECT(A339,1)<>\"\",INDIRECT(A339,1),\"\")","v":{"$error":"#REF!"}},{"$error":"#REF!"},{"$error":"#REF!"},{"$f":"K339","v":"Sub09"},"Sub09"]
[{"$f":"ADDRESS(D340,1,4,1,E340)","v":"'Sub09'!A109"},"'Sub09'!B109","'Sub09'!C109",{"$f":"D339+1","v":109},{"$f":"K339","v":"Sub09"},null,{"$error":"#REF!"},{"$error":"#REF!"},{"$error":"#REF!"},{"$f":"K339","v":"Sub09"}]
["'Sub09'!A110","'Sub09'!B110","'Sub09'!C110",110,{"$f":"K339","v":"Sub09"},null,{"$error":"#REF!"},{"$error":"#REF!"},{"$error":"#REF!"},{"$f":"K339","v":"Sub09"}]
["'Sub09'!A111","'Sub09'!B111","'Sub09'!C111",111,{"$f":"K339","v":"Sub09"},null,{"$error":"#REF!"},{"$error":"#REF!"},{"$error":"#REF!"},{"$f":"K339","v":"Sub09"}]
["'Sub09'!A112","'Sub09'!B112","'Sub09'!C112",112,{"$f":"K339","v":"Sub09"},null,{"$error":"#REF!"},{"$error":"#REF!"},{"$error":"#REF!"},{"$f":"K339","v":"Sub09"}]
["'Sub09'!A113","'Sub09'!B113","'Sub09'!C113",113,{"$f":"K339","v":"Sub09"},null,{"$error":"#REF!"},{"$error":"#REF!"},{"$error":"#REF!"},{"$f":"K339","v":"Sub09"}]
["'Sub09'!A114","'Sub09'!B114","'Sub09'!C114",114,{"$f":"K339","v":"Sub09"},null,{"$error":"#REF!"},{"$error":"#REF!"},{"$error":"#REF!"},{"$f":"K339","v":"Sub09"}]
["'Sub09'!A115","'Sub09'!B115","'Sub09'!C115",115,{"$f":"K339","v":"Sub09"},null,{"$error":"#REF!"},{"$error":"#REF!"},{"$error":"#REF!"},{"$f":"K339","v":"Sub09"}]
["'Sub09'!A116","'Sub09'!B116","'Sub09'!C116",116,{"$f":"K339","v":"Sub09"},null,{"$error":"#REF!"},{"$error":"#REF!"},{"$error":"#REF!"},{"$f":"K339","v":"Sub09"}]
["'Sub09'!A117","'Sub09'!B117","'Sub09'!C117",117,{"$f":"K339","v":"Sub09"},null,{"$error":"#REF!"},{"$error":"#REF!"},{"$error":"#REF!"},{"$f":"K339","v":"Sub09"}]
["'Sub09'!A118","'Sub09'!B118","'Sub09'!C118",118,{"$f":"K339","v":"Sub09"},null,{"$error":"#REF!"},{"$error":"#REF!"},{"$error":"#REF!"},{"$f":"K339","v":"Sub09"}]
["'Sub09'!A119","'Sub09'!B119","'Sub09'!C119",119,{"$f":"K339","v":"Sub09"},null,{"$error":"#REF!"},{"$error":"#REF!"},{"$error":"#REF!"},{"$f":"K339","v":"Sub09"}]
["'Sub09'!A120","'Sub09'!B120","'Sub09'!C120",120,{"$f":"K339","v":"Sub09"},null,{"$error":"#REF!"},{"$error":"#REF!"},{"$error":"#REF!"},{"$f":"K339","v":"Sub09"}]
["'Sub09'!A121","'Sub09'!B121","'Sub09'!C121",121,{"$f":"K339","v":"Sub09"},null,{"$error":"#REF!"},{"$error":"#REF!"},{"$error":"#REF!"},{"$f":"K339","v":"Sub09"}]
["'Sub09'!A122","'Sub09'!B122","'Sub09'!C122",122,{"$f":"K339","v":"Sub09"},null,{"$error":"#REF!"},{"$error":"#REF!"},{"$error":"#REF!"},{"$f":"K339","v":"Sub09"}]
["'Sub09'!A123","'Sub09'!B123","'Sub09'!C123",123,{"$f":"K339","v":"Sub09"},null,{"$error":"#REF!"},{"$error":"#REF!"},{"$error":"#REF!"},{"$f":"K339","v":"Sub09"}]
["'Sub09'!A124","'Sub09'!B124","'Sub09'!C124",124,{"$f":"K339","v":"Sub09"},null,{"$error":"#REF!"},{"$error":"#REF!"},{"$error":"#REF!"},{"$f":"K339","v":"Sub09"}]
["'Sub09'!A125","'Sub09'!B125","'Sub09'!C125",125,{"$f":"K339","v":"Sub09"},null,{"$error":"#REF!"},{"$error":"#REF!"},{"$error":"#REF!"},{"$f":"K339","v":"Sub09"}]
["'Sub09'!A126","'Sub09'!B126","'Sub09'!C126",126,{"$f":"K339","v":"Sub09"},null,{"$error":"#REF!"},{"$error":"#REF!"},{"$error":"#REF!"},{"$f":"K339","v":"Sub09"}]
["'Sub09'!A127","'Sub09'!B127","'Sub09'!C127",127,{"$f":"K339","v":"Sub09"},null,{"$error":"#REF!"},{"$error":"#REF!"},{"$error":"#REF!"},{"$f":"K339","v":"Sub09"}]
["'Sub09'!A128","'Sub09'!B128","'Sub09'!C128",128,{"$f":"K339","v":"Sub09"},null,{"$error":"#REF!"},{"$error":"#REF!"},{"$error":"#REF!"},{"$f":"K339","v":"Sub09"}]
["'Sub09'!A129","'Sub09'!B129","'Sub09'!C129",129,{"$f":"K339","v":"Sub09"},null,{"$error":"#REF!"},{"$error":"#REF!"},{"$error":"#REF!"},{"$f":"K339","v":"Sub09"}]
["'Sub09'!A130","'Sub09'!B130","'Sub09'!C130",130,{"$f":"K339","v":"Sub09"},null,{"$error":"#REF!"},{"$error":"#REF!"},{"$error":"#REF!"},{"$f":"K339","v":"Sub09"}]
["'Sub09'!A131","'Sub09'!B131","'Sub09'!C131",131,{"$f":"K339","v":"Sub09"},null,{"$error":"#REF!"},{"$error":"#REF!"},{"$error":"#REF!"},{"$f":"K339","v":"Sub09"}]
["'Sub09'!A132","'Sub09'!B132","'Sub09'!C132",132,{"$f":"K339","v":"Sub09"},null,{"$error":"#REF!"},{"$error":"#REF!"},{"$error":"#REF!"},{"$f":"K339","v":"Sub09"}]
["'Sub09'!A133","'Sub09'!B133","'Sub09'!C133",133,{"$f":"K339","v":"Sub09"},null,{"$error":"#REF!"},{"$error":"#REF!"},{"$error":"#REF!"},{"$f":"K339","v":"Sub09"}]
["'Sub09'!A134","'Sub09'!B134","'Sub09'!C134",134,{"$f":"K339","v":"Sub09"},null,{"$error":"#REF!"},{"$error":"#REF!"},{"$error":"#REF!"},{"$f":"K339","v":"Sub09"}]
["'Sub09'!A135","'Sub09'!B135","'Sub09'!C135",135,{"$f":"K339","v":"Sub09"},null,{"$error":"#REF!"},{"$error":"#REF!"},{"$error":"#REF!"},{"$f":"K339","v":"Sub09"}]
["'Sub09'!A136","'Sub09'!B136","'Sub09'!C136",136,{"$f":"K339","v":"Sub09"},null,{"$error":"#REF!"},{"$error":"#REF!"},{"$error":"#REF!"},{"$f":"K339","v":"Sub09"}]
["'Sub09'!A137","'Sub09'!B137","'Sub09'!C137",137,{"$f":"K339","v":"Sub09"},null,{"$error":"#REF!"},{"$error":"#REF!"},{"$error":"#REF!"},{"$f":"K339","v":"Sub09"}]
["'Sub09'!A138","'Sub09'!B138","'Sub09'!C138",138,{"$f":"K339","v":"Sub09"},null,{"$error":"#REF!"},{"$error":"#REF!"},{"$error":"#REF!"},{"$f":"K339","v":"Sub09"}]
["'Sub09'!A139","'Sub09'!B139","'Sub09'!C139",139,{"$f":"K339","v":"Sub09"},null,{"$error":"#REF!"},{"$error":"#REF!"},{"$error":"#REF!"},{"$f":"K339","v":"Sub09"}]
["'Sub09'!A140","'Sub09'!B140","'Sub09'!C140",140,{"$f":"K339","v":"Sub09"},null,{"$error":"#REF!"},{"$error":"#REF!"},{"$error":"#REF!"},{"$f":"K339","v":"Sub09"}]
["'Sub09'!A141","'Sub09'!B141","'Sub09'!C141",141,{"$f":"K339","v":"Sub09"},null,{"$error":"#REF!"},{"$error":"#REF!"},{"$error":"#REF!"},{"$f":"K339","v":"Sub09"}]
["'Sub09'!A142","'Sub09'!B142","'Sub09'!C142",142,{"$f":"K339","v":"Sub09"},null,{"$error":"#REF!"},{"$error":"#REF!"},{"$error":"#REF!"},{"$f":"K339","v":"Sub09"}]
["'Sub09'!A143","'Sub09'!B143","'Sub09'!C143",143,{"$f":"K339","v":"Sub09"},null,{"$error":"#REF!"},{"$error":"#REF!"},{"$error":"#REF!"},{"$f":"K339","v":"Sub09"}]
["'Sub09'!A144","'Sub09'!B144","'Sub09'!C144",144,{"$f":"K339","v":"Sub09"},null,{"$error":"#REF!"},{"$error":"#REF!"},{"$error":"#REF!"},{"$f":"K339","v":"Sub09"}]
["'Sub09'!A145","'Sub09'!B145","'Sub09'!C145",145,{"$f":"K339","v":"Sub09"},null,{"$error":"#REF!"},{"$error":"#REF!"},{"$error":"#REF!"},{"$f":"K339","v":"Sub09"}]
["'Sub09'!A146","'Sub09'!B146","'Sub09'!C146",146,{"$f":"K339","v":"Sub09"},null,{"$error":"#REF!"},{"$error":"#REF!"},{"$error":"#REF!"},{"$f":"K339","v":"Sub09"}]
["'Sub09'!A147","'Sub09'!B147","'Sub09'!C147",147,{"$f":"K339","v":"Sub09"},null,{"$error":"#REF!"},{"$error":"#REF!"},{"$error":"#REF!"},{"$f":"K339","v":"Sub09"}]
["'Sub09'!A148","'Sub09'!B148","'Sub09'!C148",148,{"$f":"K339","v":"Sub09"},null,{"$error":"#REF!"},{"$error":"#REF!"},{"$error":"#REF!"},{"$f":"K339","v":"Sub09"}]
["'Sub09'!A149","'Sub09'!B149","'Sub09'!C149",149,{"$f":"K339","v":"Sub09"},null,{"$error":"#REF!"},{"$error":"#REF!"},{"$error":"#REF!"},{"$f":"K339","v":"Sub09"}]
[{"$f":"ADDRESS($D381,1,4,1,$E381)","v":"'Sub10'!A108"},"'Sub10'!B108","'Sub10'!C108",108,{"$f":"K381","v":"Sub10"},null,{"$error":"#REF!"},{"$error":"#REF!"},{"$error":"#REF!"},{"$f":"K381","v":"Sub10"},"Sub10"]
[{"$f":"ADDRESS(D382,1,4,1,E382)","v":"'Sub10'!A109"},"'Sub10'!B109","'Sub10'!C109",{"$f":"D381+1","v":109},{"$f":"K381","v":"Sub10"},null,{"$error":"#REF!"},{"$error":"#REF!"},{"$error":"#REF!"},{"$f":"K381","v":"Sub10"}]
["'Sub10'!A110","'Sub10'!B110","'Sub10'!C110",110,{"$f":"K381","v":"Sub10"},null,{"$error":"#REF!"},{"$error":"#REF!"},{"$error":"#REF!"},{"$f":"K381","v":"Sub10"}]
["'Sub10'!A111","'Sub10'!B111","'Sub10'!C111",111,{"$f":"K381","v":"Sub10"},null,{"$error":"#REF!"},{"$error":"#REF!"},{"$error":"#REF!"},{"$f":"K381","v":"Sub10"}]
["'Sub10'!A112","'Sub10'!B112","'Sub10'!C112",112,{"$f":"K381","v":"Sub10"},null,{"$error":"#REF!"},{"$error":"#REF!"},{"$error":"#REF!"},{"$f":"K381","v":"Sub10"}]
["'Sub10'!A113","'Sub10'!B113","'Sub10'!C113",113,{"$f":"K381","v":"Sub10"},null,{"$error":"#REF!"},{"$error":"#REF!"},{"$error":"#REF!"},{"$f":"K381","v":"Sub10"}]
["'Sub10'!A114","'Sub10'!B114","'Sub10'!C114",114,{"$f":"K381","v":"Sub10"},null,{"$error":"#REF!"},{"$error":"#REF!"},{"$error":"#REF!"},{"$f":"K381","v":"Sub10"}]
["'Sub10'!A115",{"$f":"ADDRESS($D388,2,4,1,$E388)","v":"'Sub10'!B115"},{"$f":"ADDRESS($D388,3,4,1,$E388)","v":"'Sub10'!C115"},115,{"$f":"K381","v":"Sub10"},null,{"$error":"#REF!"},{"$f":"IF(INDIRECT(B388,1)<>\"\",IF(INDIRECT(B388,1)=\"LUMP\", \"LUMP\", INDIRECT(B388,1)),\"\")","v":{"$error":"#REF!"}},{"$f":"IF(INDIRECT(C388,1)<>\"\",INDIRECT(C388,1),\"\")","v":{"$error":"#REF!"}},{"$f":"K381","v":"Sub10"}]
["'Sub10'!A116","'Sub10'!B116","'Sub10'!C116",116,{"$f":"K381","v":"Sub10"},null,{"$error":"#REF!"},{"$error":"#REF!"},{"$error":"#REF!"},{"$f":"K381","v":"Sub10"}]
["'Sub10'!A117","'Sub10'!B117","'Sub10'!C117",117,{"$f":"K381","v":"Sub10"},null,{"$error":"#REF!"},{"$error":"#REF!"},{"$error":"#REF!"},{"$f":"K381","v":"Sub10"}]
["'Sub10'!A118","'Sub10'!B118","'Sub10'!C118",118,{"$f":"K381","v":"Sub10"},null,{"$error":"#REF!"},{"$error":"#REF!"},{"$error":"#REF!"},{"$f":"K381","v":"Sub10"}]
["'Sub10'!A119","'Sub10'!B119","'Sub10'!C119",119,{"$f":"K381","v":"Sub10"},null,{"$error":"#REF!"},{"$error":"#REF!"},{"$error":"#REF!"},{"$f":"K381","v":"Sub10"}]
["'Sub10'!A120","'Sub10'!B120","'Sub10'!C120",120,{"$f":"K381","v":"Sub10"},null,{"$error":"#REF!"},{"$error":"#REF!"},{"$error":"#REF!"},{"$f":"K381","v":"Sub10"}]
["'Sub10'!A121","'Sub10'!B121","'Sub10'!C121",121,{"$f":"K381","v":"Sub10"},null,{"$error":"#REF!"},{"$error":"#REF!"},{"$error":"#REF!"},{"$f":"K381","v":"Sub10"}]
["'Sub10'!A122","'Sub10'!B122","'Sub10'!C122",122,{"$f":"K381","v":"Sub10"},null,{"$error":"#REF!"},{"$error":"#REF!"},{"$error":"#REF!"},{"$f":"K381","v":"Sub10"}]
["'Sub10'!A123","'Sub10'!B123","'Sub10'!C123",123,{"$f":"K381","v":"Sub10"},null,{"$error":"#REF!"},{"$error":"#REF!"},{"$error":"#REF!"},{"$f":"K381","v":"Sub10"}]
["'Sub10'!A124","'Sub10'!B124","'Sub10'!C124",124,{"$f":"K381","v":"Sub10"},null,{"$error":"#REF!"},{"$error":"#REF!"},{"$error":"#REF!"},{"$f":"K381","v":"Sub10"}]
["'Sub10'!A125","'Sub10'!B125","'Sub10'!C125",125,{"$f":"K381","v":"Sub10"},null,{"$error":"#REF!"},{"$error":"#REF!"},{"$error":"#REF!"},{"$f":"K381","v":"Sub10"}]
["'Sub10'!A126","'Sub10'!B126","'Sub10'!C126",126,{"$f":"K381","v":"Sub10"},null,{"$error":"#REF!"},{"$error":"#REF!"},{"$error":"#REF!"},{"$f":"K381","v":"Sub10"}]
["'Sub10'!A127","'Sub10'!B127","'Sub10'!C127",127,{"$f":"K381","v":"Sub10"},null,{"$error":"#REF!"},{"$error":"#REF!"},{"$error":"#REF!"},{"$f":"K381","v":"Sub10"}]
["'Sub10'!A128","'Sub10'!B128","'Sub10'!C128",128,{"$f":"K381","v":"Sub10"},null,{"$error":"#REF!"},{"$error":"#REF!"},{"$error":"#REF!"},{"$f":"K381","v":"Sub10"}]
["'Sub10'!A129","'Sub10'!B129","'Sub10'!C129",129,{"$f":"K381","v":"Sub10"},null,{"$error":"#REF!"},{"$error":"#REF!"},{"$error":"#REF!"},{"$f":"K381","v":"Sub10"}]
["'Sub10'!A130","'Sub10'!B130","'Sub10'!C130",130,{"$f":"K381","v":"Sub10"},null,{"$f":"IF(INDIRECT(A403,1)<>\"\",INDIRECT(A403,1),\"\")","v":{"$error":"#REF!"}},{"$error":"#REF!"},{"$error":"#REF!"},{"$f":"K381","v":"Sub10"}]
["'Sub10'!A131","'Sub10'!B131","'Sub10'!C131",131,{"$f":"K381","v":"Sub10"},null,{"$error":"#REF!"},{"$error":"#REF!"},{"$error":"#REF!"},{"$f":"K381","v":"Sub10"}]
["'Sub10'!A132","'Sub10'!B132","'Sub10'!C132",132,{"$f":"K381","v":"Sub10"},null,{"$error":"#REF!"},{"$error":"#REF!"},{"$error":"#REF!"},{"$f":"K381","v":"Sub10"}]
["'Sub10'!A133","'Sub10'!B133","'Sub10'!C133",133,{"$f":"K381","v":"Sub10"},null,{"$error":"#REF!"},{"$error":"#REF!"},{"$error":"#REF!"},{"$f":"K381","v":"Sub10"}]
["'Sub10'!A134","'Sub10'!B134","'Sub10'!C134",134,{"$f":"K381","v":"Sub10"},null,{"$error":"#REF!"},{"$error":"#REF!"},{"$error":"#REF!"},{"$f":"K381","v":"Sub10"}]
["'Sub10'!A135","'Sub10'!B135","'Sub10'!C135",135,{"$f":"K381","v":"Sub10"},null,{"$error":"#REF!"},{"$error":"#REF!"},{"$error":"#REF!"},{"$f":"K381","v":"Sub10"}]
["'Sub10'!A136","'Sub10'!B136","'Sub10'!C136",136,{"$f":"K381","v":"Sub10"},null,{"$error":"#REF!"},{"$error":"#REF!"},{"$error":"#REF!"},{"$f":"K381","v":"Sub10"}]
["'Sub10'!A137","'Sub10'!B137","'Sub10'!C137",137,{"$f":"K381","v":"Sub10"},null,{"$error":"#REF!"},{"$error":"#REF!"},{"$error":"#REF!"},{"$f":"K381","v":"Sub10"}]
["'Sub10'!A138","'Sub10'!B138","'Sub10'!C138",138,{"$f":"K381","v":"Sub10"},null,{"$error":"#REF!"},{"$error":"#REF!"},{"$error":"#REF!"},{"$f":"K381","v":"Sub10"}]
["'Sub10'!A139","'Sub10'!B139","'Sub10'!C139",139,{"$f":"K381","v":"Sub10"},null,{"$error":"#REF!"},{"$error":"#REF!"},{"$error":"#REF!"},{"$f":"K381","v":"Sub10"}]
["'Sub10'!A140","'Sub10'!B140","'Sub10'!C140",140,{"$f":"K381","v":"Sub10"},null,{"$error":"#REF!"},{"$error":"#REF!"},{"$error":"#REF!"},{"$f":"K381","v":"Sub10"}]
["'Sub10'!A141","'Sub10'!B141","'Sub10'!C141",141,{"$f":"K381","v":"Sub10"},null,{"$error":"#REF!"},{"$error":"#REF!"},{"$error":"#REF!"},{"$f":"K381","v":"Sub10"}]
["'Sub10'!A142","'Sub10'!B142","'Sub10'!C142",142,{"$f":"K381","v":"Sub10"},null,{"$error":"#REF!"},{"$error":"#REF!"},{"$error":"#REF!"},{"$f":"K381","v":"Sub10"}]
["'Sub10'!A143","'Sub10'!B143","'Sub10'!C143",143,{"$f":"K381","v":"Sub10"},null,{"$error":"#REF!"},{"$error":"#REF!"},{"$error":"#REF!"},{"$f":"K381","v":"Sub10"}]
["'Sub10'!A144","'Sub10'!B144","'Sub10'!C144",144,{"$f":"K381","v":"Sub10"},null,{"$error":"#REF!"},{"$error":"#REF!"},{"$error":"#REF!"},{"$f":"K381","v":"Sub10"}]
["'Sub10'!A145","'Sub10'!B145","'Sub10'!C145",145,{"$f":"K381","v":"Sub10"},null,{"$error":"#REF!"},{"$error":"#REF!"},{"$error":"#REF!"},{"$f":"K381","v":"Sub10"}]
["'Sub10'!A146","'Sub10'!B146","'Sub10'!C146",146,{"$f":"K381","v":"Sub10"},null,{"$error":"#REF!"},{"$error":"#REF!"},{"$error":"#REF!"},{"$f":"K381","v":"Sub10"}]
["'Sub10'!A147","'Sub10'!B147","'Sub10'!C147",147,{"$f":"K381","v":"Sub10"},null,{"$error":"#REF!"},{"$error":"#REF!"},{"$error":"#REF!"},{"$f":"K381","v":"Sub10"}]
["'Sub10'!A148","'Sub10'!B148","'Sub10'!C148",148,{"$f":"K381","v":"Sub10"},null,{"$error":"#REF!"},{"$error":"#REF!"},{"$error":"#REF!"},{"$f":"K381","v":"Sub10"}]
["'Sub10'!A149","'Sub10'!B149","'Sub10'!C149",149,{"$f":"K381","v":"Sub10"},null,{"$error":"#REF!"},{"$error":"#REF!"},{"$error":"#REF!"},{"$f":"K381","v":"Sub10"}]
[{"$f":"ADDRESS($D423,1,4,1,$E423)","v":"'Sub11'!A108"},"'Sub11'!B108","'Sub11'!C108",108,{"$f":"K423","v":"Sub11"},null,{"$error":"#REF!"},{"$error":"#REF!"},{"$error":"#REF!"},{"$f":"K423","v":"Sub11"},"Sub11"]
[{"$f":"ADDRESS(D424,1,4,1,E424)","v":"'Sub11'!A109"},"'Sub11'!B109","'Sub11'!C109",{"$f":"D423+1","v":109},{"$f":"K423","v":"Sub11"},null,{"$error":"#REF!"},{"$error":"#REF!"},{"$error":"#REF!"},{"$f":"K423","v":"Sub11"}]
["'Sub11'!A110","'Sub11'!B110","'Sub11'!C110",110,{"$f":"K423","v":"Sub11"},null,{"$error":"#REF!"},{"$error":"#REF!"},{"$error":"#REF!"},{"$f":"K423","v":"Sub11"}]
["'Sub11'!A111","'Sub11'!B111","'Sub11'!C111",111,{"$f":"K423","v":"Sub11"},null,{"$error":"#REF!"},{"$error":"#REF!"},{"$error":"#REF!"},{"$f":"K423","v":"Sub11"}]
["'Sub11'!A112","'Sub11'!B112","'Sub11'!C112",112,{"$f":"K423","v":"Sub11"},null,{"$error":"#REF!"},{"$error":"#REF!"},{"$error":"#REF!"},{"$f":"K423","v":"Sub11"}]
["'Sub11'!A113","'Sub11'!B113","'Sub11'!C113",113,{"$f":"K423","v":"Sub11"},null,{"$error":"#REF!"},{"$error":"#REF!"},{"$error":"#REF!"},{"$f":"K423","v":"Sub11"}]
["'Sub11'!A114","'Sub11'!B114","'Sub11'!C114",114,{"$f":"K423","v":"Sub11"},null,{"$error":"#REF!"},{"$error":"#REF!"},{"$error":"#REF!"},{"$f":"K423","v":"Sub11"}]
["'Sub11'!A115","'Sub11'!B115","'Sub11'!C115",115,{"$f":"K423","v":"Sub11"},null,{"$error":"#REF!"},{"$error":"#REF!"},{"$f":"IF(INDIRECT(C430,1)<>\"\",INDIRECT(C430,1),\"\")","v":{"$error":"#REF!"}},{"$f":"K423","v":"Sub11"}]
["'Sub11'!A116","'Sub11'!B116","'Sub11'!C116",116,{"$f":"K423","v":"Sub11"},null,{"$error":"#REF!"},{"$error":"#REF!"},{"$error":"#REF!"},{"$f":"K423","v":"Sub11"}]
["'Sub11'!A117","'Sub11'!B117","'Sub11'!C117",117,{"$f":"K423","v":"Sub11"},null,{"$error":"#REF!"},{"$error":"#REF!"},{"$error":"#REF!"},{"$f":"K423","v":"Sub11"}]
["'Sub11'!A118","'Sub11'!B118","'Sub11'!C118",118,{"$f":"K423","v":"Sub11"},null,{"$error":"#REF!"},{"$error":"#REF!"},{"$error":"#REF!"},{"$f":"K423","v":"Sub11"}]
["'Sub11'!A119","'Sub11'!B119","'Sub11'!C119",119,{"$f":"K423","v":"Sub11"},null,{"$error":"#REF!"},{"$error":"#REF!"},{"$error":"#REF!"},{"$f":"K423","v":"Sub11"}]
["'Sub11'!A120","'Sub11'!B120","'Sub11'!C120",120,{"$f":"K423","v":"Sub11"},null,{"$error":"#REF!"},{"$error":"#REF!"},{"$error":"#REF!"},{"$f":"K423","v":"Sub11"}]
["'Sub11'!A121","'Sub11'!B121","'Sub11'!C121",121,{"$f":"K423","v":"Sub11"},null,{"$error":"#REF!"},{"$error":"#REF!"},{"$error":"#REF!"},{"$f":"K423","v":"Sub11"}]
["'Sub11'!A122","'Sub11'!B122","'Sub11'!C122",122,{"$f":"K423","v":"Sub11"},null,{"$error":"#REF!"},{"$error":"#REF!"},{"$error":"#REF!"},{"$f":"K423","v":"Sub11"}]
["'Sub11'!A123","'Sub11'!B123","'Sub11'!C123",123,{"$f":"K423","v":"Sub11"},null,{"$error":"#REF!"},{"$error":"#REF!"},{"$error":"#REF!"},{"$f":"K423","v":"Sub11"}]
["'Sub11'!A124","'Sub11'!B124","'Sub11'!C124",124,{"$f":"K423","v":"Sub11"},null,{"$error":"#REF!"},{"$error":"#REF!"},{"$error":"#REF!"},{"$f":"K423","v":"Sub11"}]
["'Sub11'!A125","'Sub11'!B125","'Sub11'!C125",125,{"$f":"K423","v":"Sub11"},null,{"$error":"#REF!"},{"$error":"#REF!"},{"$error":"#REF!"},{"$f":"K423","v":"Sub11"}]
["'Sub11'!A126","'Sub11'!B126","'Sub11'!C126",126,{"$f":"K423","v":"Sub11"},null,{"$error":"#REF!"},{"$error":"#REF!"},{"$error":"#REF!"},{"$f":"K423","v":"Sub11"}]
["'Sub11'!A127","'Sub11'!B127","'Sub11'!C127",127,{"$f":"K423","v":"Sub11"},null,{"$error":"#REF!"},{"$error":"#REF!"},{"$error":"#REF!"},{"$f":"K423","v":"Sub11"}]
["'Sub11'!A128","'Sub11'!B128","'Sub11'!C128",128,{"$f":"K423","v":"Sub11"},null,{"$error":"#REF!"},{"$error":"#REF!"},{"$error":"#REF!"},{"$f":"K423","v":"Sub11"}]
["'Sub11'!A129","'Sub11'!B129","'Sub11'!C129",129,{"$f":"K423","v":"Sub11"},null,{"$error":"#REF!"},{"$error":"#REF!"},{"$error":"#REF!"},{"$f":"K423","v":"Sub11"}]
["'Sub11'!A130","'Sub11'!B130","'Sub11'!C130",130,{"$f":"K423","v":"Sub11"},null,{"$f":"IF(INDIRECT(A445,1)<>\"\",INDIRECT(A445,1),\"\")","v":{"$error":"#REF!"}},{"$error":"#REF!"},{"$error":"#REF!"},{"$f":"K423","v":"Sub11"}]
["'Sub11'!A131","'Sub11'!B131","'Sub11'!C131",131,{"$f":"K423","v":"Sub11"},null,{"$error":"#REF!"},{"$error":"#REF!"},{"$error":"#REF!"},{"$f":"K423","v":"Sub11"}]
["'Sub11'!A132","'Sub11'!B132","'Sub11'!C132",132,{"$f":"K423","v":"Sub11"},null,{"$error":"#REF!"},{"$error":"#REF!"},{"$error":"#REF!"},{"$f":"K423","v":"Sub11"}]
["'Sub11'!A133","'Sub11'!B133","'Sub11'!C133",133,{"$f":"K423","v":"Sub11"},null,{"$error":"#REF!"},{"$error":"#REF!"},{"$error":"#REF!"},{"$f":"K423","v":"Sub11"}]
["'Sub11'!A134","'Sub11'!B134","'Sub11'!C134",134,{"$f":"K423","v":"Sub11"},null,{"$error":"#REF!"},{"$error":"#REF!"},{"$error":"#REF!"},{"$f":"K423","v":"Sub11"}]
["'Sub11'!A135","'Sub11'!B135","'Sub11'!C135",135,{"$f":"K423","v":"Sub11"},null,{"$error":"#REF!"},{"$error":"#REF!"},{"$error":"#REF!"},{"$f":"K423","v":"Sub11"}]
["'Sub11'!A136","'Sub11'!B136","'Sub11'!C136",136,{"$f":"K423","v":"Sub11"},null,{"$error":"#REF!"},{"$error":"#REF!"},{"$error":"#REF!"},{"$f":"K423","v":"Sub11"}]
["'Sub11'!A137",{"$f":"ADDRESS($D452,2,4,1,$E452)","v":"'Sub11'!B137"},{"$f":"ADDRESS($D452,3,4,1,$E452)","v":"'Sub11'!C137"},137,{"$f":"K423","v":"Sub11"},null,{"$error":"#REF!"},{"$f":"IF(INDIRECT(B452,1)<>\"\",IF(INDIRECT(B452,1)=\"LUMP\", \"LUMP\", INDIRECT(B452,1)),\"\")","v":{"$error":"#REF!"}},{"$error":"#REF!"},{"$f":"K423","v":"Sub11"}]
["'Sub11'!A138","'Sub11'!B138","'Sub11'!C138",138,{"$f":"K423","v":"Sub11"},null,{"$error":"#REF!"},{"$error":"#REF!"},{"$error":"#REF!"},{"$f":"K423","v":"Sub11"}]
["'Sub11'!A139","'Sub11'!B139","'Sub11'!C139",139,{"$f":"K423","v":"Sub11"},null,{"$error":"#REF!"},{"$error":"#REF!"},{"$error":"#REF!"},{"$f":"K423","v":"Sub11"}]
["'Sub11'!A140","'Sub11'!B140","'Sub11'!C140",140,{"$f":"K423","v":"Sub11"},null,{"$error":"#REF!"},{"$error":"#REF!"},{"$error":"#REF!"},{"$f":"K423","v":"Sub11"}]
["'Sub11'!A141","'Sub11'!B141","'Sub11'!C141",141,{"$f":"K423","v":"Sub11"},null,{"$error":"#REF!"},{"$error":"#REF!"},{"$error":"#REF!"},{"$f":"K423","v":"Sub11"}]
["'Sub11'!A142","'Sub11'!B142","'Sub11'!C142",142,{"$f":"K423","v":"Sub11"},null,{"$error":"#REF!"},{"$error":"#REF!"},{"$error":"#REF!"},{"$f":"K423","v":"Sub11"}]
["'Sub11'!A143","'Sub11'!B143","'Sub11'!C143",143,{"$f":"K423","v":"Sub11"},null,{"$error":"#REF!"},{"$error":"#REF!"},{"$error":"#REF!"},{"$f":"K423","v":"Sub11"}]
["'Sub11'!A144","'Sub11'!B144","'Sub11'!C144",144,{"$f":"K423","v":"Sub11"},null,{"$error":"#REF!"},{"$error":"#REF!"},{"$error":"#REF!"},{"$f":"K423","v":"Sub11"}]
["'Sub11'!A145","'Sub11'!B145","'Sub11'!C145",145,{"$f":"K423","v":"Sub11"},null,{"$error":"#REF!"},{"$error":"#REF!"},{"$error":"#REF!"},{"$f":"K423","v":"Sub11"}]
["'Sub11'!A146","'Sub11'!B146","'Sub11'!C146",146,{"$f":"K423","v":"Sub11"},null,{"$error":"#REF!"},{"$error":"#REF!"},{"$error":"#REF!"},{"$f":"K423","v":"Sub11"}]
["'Sub11'!A147","'Sub11'!B147","'Sub11'!C147",147,{"$f":"K423","v":"Sub11"},null,{"$error":"#REF!"},{"$error":"#REF!"},{"$error":"#REF!"},{"$f":"K423","v":"Sub11"}]
["'Sub11'!A148","'Sub11'!B148","'Sub11'!C148",148,{"$f":"K423","v":"Sub11"},null,{"$error":"#REF!"},{"$error":"#REF!"},{"$error":"#REF!"},{"$f":"K423","v":"Sub11"}]
["'Sub11'!A149","'Sub11'!B149","'Sub11'!C149",149,{"$f":"K423","v":"Sub11"},null,{"$error":"#REF!"},{"$error":"#REF!"},{"$error":"#REF!"},{"$f":"K423","v":"Sub11"}]
[{"$f":"ADDRESS($D465,1,4,1,$E465)","v":"'Sub12'!A108"},"'Sub12'!B108","'Sub12'!C108",108,{"$f":"K465","v":"Sub12"},null,{"$error":"#REF!"},{"$error":"#REF!"},{"$error":"#REF!"},{"$f":"K465","v":"Sub12"},"Sub12"]
[{"$f":"ADDRESS(D466,1,4,1,E466)","v":"'Sub12'!A109"},"'Sub12'!B109","'Sub12'!C109",{"$f":"D465+1","v":109},{"$f":"K465","v":"Sub12"},null,{"$error":"#REF!"},{"$error":"#REF!"},{"$error":"#REF!"},{"$f":"K465","v":"Sub12"}]
["'Sub12'!A110","'Sub12'!B110","'Sub12'!C110",110,{"$f":"K465","v":"Sub12"},null,{"$error":"#REF!"},{"$error":"#REF!"},{"$error":"#REF!"},{"$f":"K465","v":"Sub12"}]
["'Sub12'!A111","'Sub12'!B111","'Sub12'!C111",111,{"$f":"K465","v":"Sub12"},null,{"$error":"#REF!"},{"$error":"#REF!"},{"$error":"#REF!"},{"$f":"K465","v":"Sub12"}]
["'Sub12'!A112","'Sub12'!B112","'Sub12'!C112",112,{"$f":"K465","v":"Sub12"},null,{"$error":"#REF!"},{"$error":"#REF!"},{"$error":"#REF!"},{"$f":"K465","v":"Sub12"}]
["'Sub12'!A113","'Sub12'!B113","'Sub12'!C113",113,{"$f":"K465","v":"Sub12"},null,{"$error":"#REF!"},{"$error":"#REF!"},{"$error":"#REF!"},{"$f":"K465","v":"Sub12"}]
["'Sub12'!A114","'Sub12'!B114","'Sub12'!C114",114,{"$f":"K465","v":"Sub12"},null,{"$error":"#REF!"},{"$error":"#REF!"},{"$error":"#REF!"},{"$f":"K465","v":"Sub12"}]
["'Sub12'!A115","'Sub12'!B115","'Sub12'!C115",115,{"$f":"K465","v":"Sub12"},null,{"$error":"#REF!"},{"$error":"#REF!"},{"$error":"#REF!"},{"$f":"K465","v":"Sub12"}]
["'Sub12'!A116","'Sub12'!B116","'Sub12'!C116",116,{"$f":"K465","v":"Sub12"},null,{"$error":"#REF!"},{"$error":"#REF!"},{"$error":"#REF!"},{"$f":"K465","v":"Sub12"}]
["'Sub12'!A117","'Sub12'!B117","'Sub12'!C117",117,{"$f":"K465","v":"Sub12"},null,{"$error":"#REF!"},{"$error":"#REF!"},{"$error":"#REF!"},{"$f":"K465","v":"Sub12"}]
["'Sub12'!A118","'Sub12'!B118","'Sub12'!C118",118,{"$f":"K465","v":"Sub12"},null,{"$error":"#REF!"},{"$error":"#REF!"},{"$error":"#REF!"},{"$f":"K465","v":"Sub12"}]
["'Sub12'!A119","'Sub12'!B119","'Sub12'!C119",119,{"$f":"K465","v":"Sub12"},null,{"$error":"#REF!"},{"$error":"#REF!"},{"$error":"#REF!"},{"$f":"K465","v":"Sub12"}]
["'Sub12'!A120","'Sub12'!B120","'Sub12'!C120",120,{"$f":"K465","v":"Sub12"},null,{"$error":"#REF!"},{"$error":"#REF!"},{"$error":"#REF!"},{"$f":"K465","v":"Sub12"}]
["'Sub12'!A121","'Sub12'!B121","'Sub12'!C121",121,{"$f":"K465","v":"Sub12"},null,{"$error":"#REF!"},{"$error":"#REF!"},{"$error":"#REF!"},{"$f":"K465","v":"Sub12"}]
["'Sub12'!A122","'Sub12'!B122","'Sub12'!C122",122,{"$f":"K465","v":"Sub12"},null,{"$error":"#REF!"},{"$error":"#REF!"},{"$error":"#REF!"},{"$f":"K465","v":"Sub12"}]
["'Sub12'!A123","'Sub12'!B123","'Sub12'!C123",123,{"$f":"K465","v":"Sub12"},null,{"$error":"#REF!"},{"$error":"#REF!"},{"$error":"#REF!"},{"$f":"K465","v":"Sub12"}]
["'Sub12'!A124","'Sub12'!B124","'Sub12'!C124",124,{"$f":"K465","v":"Sub12"},null,{"$error":"#REF!"},{"$error":"#REF!"},{"$error":"#REF!"},{"$f":"K465","v":"Sub12"}]
["'Sub12'!A125","'Sub12'!B125","'Sub12'!C125",125,{"$f":"K465","v":"Sub12"},null,{"$error":"#REF!"},{"$error":"#REF!"},{"$error":"#REF!"},{"$f":"K465","v":"Sub12"}]
["'Sub12'!A126","'Sub12'!B126","'Sub12'!C126",126,{"$f":"K465","v":"Sub12"},null,{"$error":"#REF!"},{"$error":"#REF!"},{"$error":"#REF!"},{"$f":"K465","v":"Sub12"}]
["'Sub12'!A127","'Sub12'!B127","'Sub12'!C127",127,{"$f":"K465","v":"Sub12"},null,{"$error":"#REF!"},{"$error":"#REF!"},{"$error":"#REF!"},{"$f":"K465","v":"Sub12"}]
["'Sub12'!A128","'Sub12'!B128","'Sub12'!C128",128,{"$f":"K465","v":"Sub12"},null,{"$error":"#REF!"},{"$error":"#REF!"},{"$error":"#REF!"},{"$f":"K465","v":"Sub12"}]
["'Sub12'!A129","'Sub12'!B129","'Sub12'!C129",129,{"$f":"K465","v":"Sub12"},null,{"$error":"#REF!"},{"$error":"#REF!"},{"$error":"#REF!"},{"$f":"K465","v":"Sub12"}]
["'Sub12'!A130","'Sub12'!B130","'Sub12'!C130",130,{"$f":"K465","v":"Sub12"},null,{"$error":"#REF!"},{"$error":"#REF!"},{"$error":"#REF!"},{"$f":"K465","v":"Sub12"}]
["'Sub12'!A131","'Sub12'!B131","'Sub12'!C131",131,{"$f":"K465","v":"Sub12"},null,{"$error":"#REF!"},{"$error":"#REF!"},{"$error":"#REF!"},{"$f":"K465","v":"Sub12"}]
["'Sub12'!A132","'Sub12'!B132","'Sub12'!C132",132,{"$f":"K465","v":"Sub12"},null,{"$error":"#REF!"},{"$error":"#REF!"},{"$error":"#REF!"},{"$f":"K465","v":"Sub12"}]
["'Sub12'!A133","'Sub12'!B133","'Sub12'!C133",133,{"$f":"K465","v":"Sub12"},null,{"$error":"#REF!"},{"$error":"#REF!"},{"$error":"#REF!"},{"$f":"K465","v":"Sub12"}]
["'Sub12'!A134","'Sub12'!B134","'Sub12'!C134",134,{"$f":"K465","v":"Sub12"},null,{"$error":"#REF!"},{"$error":"#REF!"},{"$error":"#REF!"},{"$f":"K465","v":"Sub12"}]
["'Sub12'!A135","'Sub12'!B135","'Sub12'!C135",135,{"$f":"K465","v":"Sub12"},null,{"$error":"#REF!"},{"$error":"#REF!"},{"$error":"#REF!"},{"$f":"K465","v":"Sub12"}]
["'Sub12'!A136","'Sub12'!B136","'Sub12'!C136",136,{"$f":"K465","v":"Sub12"},null,{"$error":"#REF!"},{"$error":"#REF!"},{"$error":"#REF!"},{"$f":"K465","v":"Sub12"}]
["'Sub12'!A137","'Sub12'!B137","'Sub12'!C137",137,{"$f":"K465","v":"Sub12"},null,{"$error":"#REF!"},{"$error":"#REF!"},{"$f":"IF(INDIRECT(C494,1)<>\"\",INDIRECT(C494,1),\"\")","v":{"$error":"#REF!"}},{"$f":"K465","v":"Sub12"}]
["'Sub12'!A138","'Sub12'!B138","'Sub12'!C138",138,{"$f":"K465","v":"Sub12"},null,{"$error":"#REF!"},{"$error":"#REF!"},{"$error":"#REF!"},{"$f":"K465","v":"Sub12"}]
["'Sub12'!A139","'Sub12'!B139","'Sub12'!C139",139,{"$f":"K465","v":"Sub12"},null,{"$error":"#REF!"},{"$error":"#REF!"},{"$error":"#REF!"},{"$f":"K465","v":"Sub12"}]
["'Sub12'!A140","'Sub12'!B140","'Sub12'!C140",140,{"$f":"K465","v":"Sub12"},null,{"$error":"#REF!"},{"$error":"#REF!"},{"$error":"#REF!"},{"$f":"K465","v":"Sub12"}]
["'Sub12'!A141","'Sub12'!B141","'Sub12'!C141",141,{"$f":"K465","v":"Sub12"},null,{"$error":"#REF!"},{"$error":"#REF!"},{"$error":"#REF!"},{"$f":"K465","v":"Sub12"}]
["'Sub12'!A142","'Sub12'!B142","'Sub12'!C142",142,{"$f":"K465","v":"Sub12"},null,{"$error":"#REF!"},{"$error":"#REF!"},{"$error":"#REF!"},{"$f":"K465","v":"Sub12"}]
["'Sub12'!A143","'Sub12'!B143","'Sub12'!C143",143,{"$f":"K465","v":"Sub12"},null,{"$error":"#REF!"},{"$error":"#REF!"},{"$error":"#REF!"},{"$f":"K465","v":"Sub12"}]
["'Sub12'!A144","'Sub12'!B144","'Sub12'!C144",144,{"$f":"K465","v":"Sub12"},null,{"$error":"#REF!"},{"$error":"#REF!"},{"$error":"#REF!"},{"$f":"K465","v":"Sub12"}]
["'Sub12'!A145","'Sub12'!B145","'Sub12'!C145",145,{"$f":"K465","v":"Sub12"},null,{"$error":"#REF!"},{"$error":"#REF!"},{"$error":"#REF!"},{"$f":"K465","v":"Sub12"}]
["'Sub12'!A146","'Sub12'!B146","'Sub12'!C146",146,{"$f":"K465","v":"Sub12"},null,{"$error":"#REF!"},{"$error":"#REF!"},{"$error":"#REF!"},{"$f":"K465","v":"Sub12"}]
["'Sub12'!A147","'Sub12'!B147","'Sub12'!C147",147,{"$f":"K465","v":"Sub12"},null,{"$error":"#REF!"},{"$error":"#REF!"},{"$error":"#REF!"},{"$f":"K465","v":"Sub12"}]
["'Sub12'!A148","'Sub12'!B148","'Sub12'!C148",148,{"$f":"K465","v":"Sub12"},null,{"$error":"#REF!"},{"$error":"#REF!"},{"$error":"#REF!"},{"$f":"K465","v":"Sub12"}]
["'Sub12'!A149","'Sub12'!B149","'Sub12'!C149",149,{"$f":"K465","v":"Sub12"},null,{"$error":"#REF!"},{"$error":"#REF!"},{"$error":"#REF!"},{"$f":"K465","v":"Sub12"}]
[{"$f":"ADDRESS($D507,1,4,1,$E507)","v":"'Sub13'!A108"},"'Sub13'!B108","'Sub13'!C108",108,{"$f":"K507","v":"Sub13"},null,{"$error":"#REF!"},{"$error":"#REF!"},{"$error":"#REF!"},{"$f":"K507","v":"Sub13"},"Sub13"]
[{"$f":"ADDRESS(D508,1,4,1,E508)","v":"'Sub13'!A109"},"'Sub13'!B109","'Sub13'!C109",{"$f":"D507+1","v":109},{"$f":"K507","v":"Sub13"},null,{"$error":"#REF!"},{"$error":"#REF!"},{"$error":"#REF!"},{"$f":"K507","v":"Sub13"}]
["'Sub13'!A110","'Sub13'!B110","'Sub13'!C110",110,{"$f":"K507","v":"Sub13"},null,{"$f":"IF(INDIRECT(A509,1)<>\"\",INDIRECT(A509,1),\"\")","v":{"$error":"#REF!"}},{"$error":"#REF!"},{"$error":"#REF!"},{"$f":"K507","v":"Sub13"}]
["'Sub13'!A111","'Sub13'!B111","'Sub13'!C111",111,{"$f":"K507","v":"Sub13"},null,{"$error":"#REF!"},{"$error":"#REF!"},{"$error":"#REF!"},{"$f":"K507","v":"Sub13"}]
["'Sub13'!A112","'Sub13'!B112","'Sub13'!C112",112,{"$f":"K507","v":"Sub13"},null,{"$error":"#REF!"},{"$error":"#REF!"},{"$error":"#REF!"},{"$f":"K507","v":"Sub13"}]
["'Sub13'!A113","'Sub13'!B113","'Sub13'!C113",113,{"$f":"K507","v":"Sub13"},null,{"$error":"#REF!"},{"$error":"#REF!"},{"$error":"#REF!"},{"$f":"K507","v":"Sub13"}]
["'Sub13'!A114","'Sub13'!B114","'Sub13'!C114",114,{"$f":"K507","v":"Sub13"},null,{"$error":"#REF!"},{"$error":"#REF!"},{"$error":"#REF!"},{"$f":"K507","v":"Sub13"}]
["'Sub13'!A115","'Sub13'!B115","'Sub13'!C115",115,{"$f":"K507","v":"Sub13"},null,{"$error":"#REF!"},{"$error":"#REF!"},{"$error":"#REF!"},{"$f":"K507","v":"Sub13"}]
["'Sub13'!A116","'Sub13'!B116","'Sub13'!C116",116,{"$f":"K507","v":"Sub13"},null,{"$error":"#REF!"},{"$error":"#REF!"},{"$error":"#REF!"},{"$f":"K507","v":"Sub13"}]
["'Sub13'!A117",{"$f":"ADDRESS($D516,2,4,1,$E516)","v":"'Sub13'!B117"},{"$f":"ADDRESS($D516,3,4,1,$E516)","v":"'Sub13'!C117"},117,{"$f":"K507","v":"Sub13"},null,{"$error":"#REF!"},{"$f":"IF(INDIRECT(B516,1)<>\"\",IF(INDIRECT(B516,1)=\"LUMP\", \"LUMP\", INDIRECT(B516,1)),\"\")","v":{"$error":"#REF!"}},{"$error":"#REF!"},{"$f":"K507","v":"Sub13"}]
["'Sub13'!A118","'Sub13'!B118","'Sub13'!C118",118,{"$f":"K507","v":"Sub13"},null,{"$error":"#REF!"},{"$error":"#REF!"},{"$error":"#REF!"},{"$f":"K507","v":"Sub13"}]
["'Sub13'!A119","'Sub13'!B119","'Sub13'!C119",119,{"$f":"K507","v":"Sub13"},null,{"$error":"#REF!"},{"$error":"#REF!"},{"$error":"#REF!"},{"$f":"K507","v":"Sub13"}]
["'Sub13'!A120","'Sub13'!B120","'Sub13'!C120",120,{"$f":"K507","v":"Sub13"},null,{"$error":"#REF!"},{"$error":"#REF!"},{"$error":"#REF!"},{"$f":"K507","v":"Sub13"}]
["'Sub13'!A121","'Sub13'!B121","'Sub13'!C121",121,{"$f":"K507","v":"Sub13"},null,{"$error":"#REF!"},{"$error":"#REF!"},{"$error":"#REF!"},{"$f":"K507","v":"Sub13"}]
["'Sub13'!A122","'Sub13'!B122","'Sub13'!C122",122,{"$f":"K507","v":"Sub13"},null,{"$error":"#REF!"},{"$error":"#REF!"},{"$error":"#REF!"},{"$f":"K507","v":"Sub13"}]
["'Sub13'!A123","'Sub13'!B123","'Sub13'!C123",123,{"$f":"K507","v":"Sub13"},null,{"$error":"#REF!"},{"$error":"#REF!"},{"$error":"#REF!"},{"$f":"K507","v":"Sub13"}]
["'Sub13'!A124","'Sub13'!B124","'Sub13'!C124",124,{"$f":"K507","v":"Sub13"},null,{"$error":"#REF!"},{"$error":"#REF!"},{"$error":"#REF!"},{"$f":"K507","v":"Sub13"}]
["'Sub13'!A125","'Sub13'!B125","'Sub13'!C125",125,{"$f":"K507","v":"Sub13"},null,{"$error":"#REF!"},{"$error":"#REF!"},{"$error":"#REF!"},{"$f":"K507","v":"Sub13"}]
["'Sub13'!A126","'Sub13'!B126","'Sub13'!C126",126,{"$f":"K507","v":"Sub13"},null,{"$error":"#REF!"},{"$error":"#REF!"},{"$error":"#REF!"},{"$f":"K507","v":"Sub13"}]
["'Sub13'!A127","'Sub13'!B127","'Sub13'!C127",127,{"$f":"K507","v":"Sub13"},null,{"$error":"#REF!"},{"$error":"#REF!"},{"$error":"#REF!"},{"$f":"K507","v":"Sub13"}]
["'Sub13'!A128","'Sub13'!B128","'Sub13'!C128",128,{"$f":"K507","v":"Sub13"},null,{"$error":"#REF!"},{"$error":"#REF!"},{"$error":"#REF!"},{"$f":"K507","v":"Sub13"}]
["'Sub13'!A129","'Sub13'!B129","'Sub13'!C129",129,{"$f":"K507","v":"Sub13"},null,{"$error":"#REF!"},{"$error":"#REF!"},{"$error":"#REF!"},{"$f":"K507","v":"Sub13"}]
["'Sub13'!A130","'Sub13'!B130","'Sub13'!C130",130,{"$f":"K507","v":"Sub13"},null,{"$error":"#REF!"},{"$error":"#REF!"},{"$error":"#REF!"},{"$f":"K507","v":"Sub13"}]
["'Sub13'!A131","'Sub13'!B131","'Sub13'!C131",131,{"$f":"K507","v":"Sub13"},null,{"$error":"#REF!"},{"$error":"#REF!"},{"$error":"#REF!"},{"$f":"K507","v":"Sub13"}]
["'Sub13'!A132","'Sub13'!B132","'Sub13'!C132",132,{"$f":"K507","v":"Sub13"},null,{"$error":"#REF!"},{"$error":"#REF!"},{"$error":"#REF!"},{"$f":"K507","v":"Sub13"}]
["'Sub13'!A133","'Sub13'!B133","'Sub13'!C133",133,{"$f":"K507","v":"Sub13"},null,{"$error":"#REF!"},{"$error":"#REF!"},{"$error":"#REF!"},{"$f":"K507","v":"Sub13"}]
["'Sub13'!A134","'Sub13'!B134","'Sub13'!C134",134,{"$f":"K507","v":"Sub13"},null,{"$error":"#REF!"},{"$error":"#REF!"},{"$error":"#REF!"},{"$f":"K507","v":"Sub13"}]
["'Sub13'!A135","'Sub13'!B135","'Sub13'!C135",135,{"$f":"K507","v":"Sub13"},null,{"$error":"#REF!"},{"$error":"#REF!"},{"$error":"#REF!"},{"$f":"K507","v":"Sub13"}]
["'Sub13'!A136","'Sub13'!B136","'Sub13'!C136",136,{"$f":"K507","v":"Sub13"},null,{"$error":"#REF!"},{"$error":"#REF!"},{"$error":"#REF!"},{"$f":"K507","v":"Sub13"}]
["'Sub13'!A137","'Sub13'!B137","'Sub13'!C137",137,{"$f":"K507","v":"Sub13"},null,{"$error":"#REF!"},{"$error":"#REF!"},{"$error":"#REF!"},{"$f":"K507","v":"Sub13"}]
["'Sub13'!A138","'Sub13'!B138","'Sub13'!C138",138,{"$f":"K507","v":"Sub13"},null,{"$error":"#REF!"},{"$error":"#REF!"},{"$error":"#REF!"},{"$f":"K507","v":"Sub13"}]
["'Sub13'!A139","'Sub13'!B139","'Sub13'!C139",139,{"$f":"K507","v":"Sub13"},null,{"$error":"#REF!"},{"$error":"#REF!"},{"$error":"#REF!"},{"$f":"K507","v":"Sub13"}]
["'Sub13'!A140","'Sub13'!B140","'Sub13'!C140",140,{"$f":"K507","v":"Sub13"},null,{"$error":"#REF!"},{"$error":"#REF!"},{"$error":"#REF!"},{"$f":"K507","v":"Sub13"}]
["'Sub13'!A141","'Sub13'!B141","'Sub13'!C141",141,{"$f":"K507","v":"Sub13"},null,{"$error":"#REF!"},{"$error":"#REF!"},{"$error":"#REF!"},{"$f":"K507","v":"Sub13"}]
["'Sub13'!A142","'Sub13'!B142","'Sub13'!C142",142,{"$f":"K507","v":"Sub13"},null,{"$error":"#REF!"},{"$error":"#REF!"},{"$error":"#REF!"},{"$f":"K507","v":"Sub13"}]
["'Sub13'!A143","'Sub13'!B143","'Sub13'!C143",143,{"$f":"K507","v":"Sub13"},null,{"$error":"#REF!"},{"$error":"#REF!"},{"$error":"#REF!"},{"$f":"K507","v":"Sub13"}]
["'Sub13'!A144","'Sub13'!B144","'Sub13'!C144",144,{"$f":"K507","v":"Sub13"},null,{"$error":"#REF!"},{"$error":"#REF!"},{"$error":"#REF!"},{"$f":"K507","v":"Sub13"}]
["'Sub13'!A145","'Sub13'!B145","'Sub13'!C145",145,{"$f":"K507","v":"Sub13"},null,{"$error":"#REF!"},{"$error":"#REF!"},{"$error":"#REF!"},{"$f":"K507","v":"Sub13"}]
["'Sub13'!A146","'Sub13'!B146","'Sub13'!C146",146,{"$f":"K507","v":"Sub13"},null,{"$error":"#REF!"},{"$error":"#REF!"},{"$error":"#REF!"},{"$f":"K507","v":"Sub13"}]
["'Sub13'!A147","'Sub13'!B147","'Sub13'!C147",147,{"$f":"K507","v":"Sub13"},null,{"$error":"#REF!"},{"$error":"#REF!"},{"$error":"#REF!"},{"$f":"K507","v":"Sub13"}]
["'Sub13'!A148","'Sub13'!B148","'Sub13'!C148",148,{"$f":"K507","v":"Sub13"},null,{"$error":"#REF!"},{"$error":"#REF!"},{"$error":"#REF!"},{"$f":"K507","v":"Sub13"}]
["'Sub13'!A149","'Sub13'!B149","'Sub13'!C149",149,{"$f":"K507","v":"Sub13"},null,{"$error":"#REF!"},{"$error":"#REF!"},{"$error":"#REF!"},{"$f":"K507","v":"Sub13"}]
[{"$f":"ADDRESS($D549,1,4,1,$E549)","v":"'Sub14'!A108"},"'Sub14'!B108","'Sub14'!C108",108,{"$f":"K549","v":"Sub14"},null,{"$error":"#REF!"},{"$error":"#REF!"},{"$error":"#REF!"},{"$f":"K549","v":"Sub14"},"Sub14"]
[{"$f":"ADDRESS(D550,1,4,1,E550)","v":"'Sub14'!A109"},"'Sub14'!B109","'Sub14'!C109",{"$f":"D549+1","v":109},{"$f":"K549","v":"Sub14"},null,{"$error":"#REF!"},{"$error":"#REF!"},{"$error":"#REF!"},{"$f":"K549","v":"Sub14"}]
["'Sub14'!A110","'Sub14'!B110","'Sub14'!C110",110,{"$f":"K549","v":"Sub14"},null,{"$error":"#REF!"},{"$error":"#REF!"},{"$error":"#REF!"},{"$f":"K549","v":"Sub14"}]
["'Sub14'!A111","'Sub14'!B111","'Sub14'!C111",111,{"$f":"K549","v":"Sub14"},null,{"$error":"#REF!"},{"$error":"#REF!"},{"$error":"#REF!"},{"$f":"K549","v":"Sub14"}]
["'Sub14'!A112","'Sub14'!B112","'Sub14'!C112",112,{"$f":"K549","v":"Sub14"},null,{"$error":"#REF!"},{"$error":"#REF!"},{"$error":"#REF!"},{"$f":"K549","v":"Sub14"}]
["'Sub14'!A113","'Sub14'!B113","'Sub14'!C113",113,{"$f":"K549","v":"Sub14"},null,{"$error":"#REF!"},{"$error":"#REF!"},{"$error":"#REF!"},{"$f":"K549","v":"Sub14"}]
["'Sub14'!A114","'Sub14'!B114","'Sub14'!C114",114,{"$f":"K549","v":"Sub14"},null,{"$error":"#REF!"},{"$error":"#REF!"},{"$error":"#REF!"},{"$f":"K549","v":"Sub14"}]
["'Sub14'!A115","'Sub14'!B115","'Sub14'!C115",115,{"$f":"K549","v":"Sub14"},null,{"$error":"#REF!"},{"$error":"#REF!"},{"$error":"#REF!"},{"$f":"K549","v":"Sub14"}]
["'Sub14'!A116","'Sub14'!B116","'Sub14'!C116",116,{"$f":"K549","v":"Sub14"},null,{"$error":"#REF!"},{"$error":"#REF!"},{"$error":"#REF!"},{"$f":"K549","v":"Sub14"}]
["'Sub14'!A117","'Sub14'!B117","'Sub14'!C117",117,{"$f":"K549","v":"Sub14"},null,{"$error":"#REF!"},{"$error":"#REF!"},{"$f":"IF(INDIRECT(C558,1)<>\"\",INDIRECT(C558,1),\"\")","v":{"$error":"#REF!"}},{"$f":"K549","v":"Sub14"}]
["'Sub14'!A118","'Sub14'!B118","'Sub14'!C118",118,{"$f":"K549","v":"Sub14"},null,{"$error":"#REF!"},{"$error":"#REF!"},{"$error":"#REF!"},{"$f":"K549","v":"Sub14"}]
["'Sub14'!A119","'Sub14'!B119","'Sub14'!C119",119,{"$f":"K549","v":"Sub14"},null,{"$error":"#REF!"},{"$error":"#REF!"},{"$error":"#REF!"},{"$f":"K549","v":"Sub14"}]
["'Sub14'!A120","'Sub14'!B120","'Sub14'!C120",120,{"$f":"K549","v":"Sub14"},null,{"$error":"#REF!"},{"$error":"#REF!"},{"$error":"#REF!"},{"$f":"K549","v":"Sub14"}]
["'Sub14'!A121","'Sub14'!B121","'Sub14'!C121",121,{"$f":"K549","v":"Sub14"},null,{"$error":"#REF!"},{"$error":"#REF!"},{"$error":"#REF!"},{"$f":"K549","v":"Sub14"}]
["'Sub14'!A122","'Sub14'!B122","'Sub14'!C122",122,{"$f":"K549","v":"Sub14"},null,{"$error":"#REF!"},{"$error":"#REF!"},{"$error":"#REF!"},{"$f":"K549","v":"Sub14"}]
["'Sub14'!A123","'Sub14'!B123","'Sub14'!C123",123,{"$f":"K549","v":"Sub14"},null,{"$error":"#REF!"},{"$error":"#REF!"},{"$error":"#REF!"},{"$f":"K549","v":"Sub14"}]
["'Sub14'!A124","'Sub14'!B124","'Sub14'!C124",124,{"$f":"K549","v":"Sub14"},null,{"$error":"#REF!"},{"$error":"#REF!"},{"$error":"#REF!"},{"$f":"K549","v":"Sub14"}]
["'Sub14'!A125","'Sub14'!B125","'Sub14'!C125",125,{"$f":"K549","v":"Sub14"},null,{"$error":"#REF!"},{"$error":"#REF!"},{"$error":"#REF!"},{"$f":"K549","v":"Sub14"}]
["'Sub14'!A126","'Sub14'!B126","'Sub14'!C126",126,{"$f":"K549","v":"Sub14"},null,{"$error":"#REF!"},{"$error":"#REF!"},{"$error":"#REF!"},{"$f":"K549","v":"Sub14"}]
["'Sub14'!A127","'Sub14'!B127","'Sub14'!C127",127,{"$f":"K549","v":"Sub14"},null,{"$error":"#REF!"},{"$error":"#REF!"},{"$error":"#REF!"},{"$f":"K549","v":"Sub14"}]
["'Sub14'!A128","'Sub14'!B128","'Sub14'!C128",128,{"$f":"K549","v":"Sub14"},null,{"$error":"#REF!"},{"$error":"#REF!"},{"$error":"#REF!"},{"$f":"K549","v":"Sub14"}]
["'Sub14'!A129","'Sub14'!B129","'Sub14'!C129",129,{"$f":"K549","v":"Sub14"},null,{"$error":"#REF!"},{"$error":"#REF!"},{"$error":"#REF!"},{"$f":"K549","v":"Sub14"}]
["'Sub14'!A130","'Sub14'!B130","'Sub14'!C130",130,{"$f":"K549","v":"Sub14"},null,{"$error":"#REF!"},{"$error":"#REF!"},{"$error":"#REF!"},{"$f":"K549","v":"Sub14"}]
["'Sub14'!A131","'Sub14'!B131","'Sub14'!C131",131,{"$f":"K549","v":"Sub14"},null,{"$error":"#REF!"},{"$error":"#REF!"},{"$error":"#REF!"},{"$f":"K549","v":"Sub14"}]
["'Sub14'!A132","'Sub14'!B132","'Sub14'!C132",132,{"$f":"K549","v":"Sub14"},null,{"$f":"IF(INDIRECT(A573,1)<>\"\",INDIRECT(A573,1),\"\")","v":{"$error":"#REF!"}},{"$error":"#REF!"},{"$error":"#REF!"},{"$f":"K549","v":"Sub14"}]
["'Sub14'!A133","'Sub14'!B133","'Sub14'!C133",133,{"$f":"K549","v":"Sub14"},null,{"$error":"#REF!"},{"$error":"#REF!"},{"$error":"#REF!"},{"$f":"K549","v":"Sub14"}]
["'Sub14'!A134","'Sub14'!B134","'Sub14'!C134",134,{"$f":"K549","v":"Sub14"},null,{"$error":"#REF!"},{"$error":"#REF!"},{"$error":"#REF!"},{"$f":"K549","v":"Sub14"}]
["'Sub14'!A135","'Sub14'!B135","'Sub14'!C135",135,{"$f":"K549","v":"Sub14"},null,{"$error":"#REF!"},{"$error":"#REF!"},{"$error":"#REF!"},{"$f":"K549","v":"Sub14"}]
["'Sub14'!A136","'Sub14'!B136","'Sub14'!C136",136,{"$f":"K549","v":"Sub14"},null,{"$error":"#REF!"},{"$error":"#REF!"},{"$error":"#REF!"},{"$f":"K549","v":"Sub14"}]
["'Sub14'!A137","'Sub14'!B137","'Sub14'!C137",137,{"$f":"K549","v":"Sub14"},null,{"$error":"#REF!"},{"$error":"#REF!"},{"$error":"#REF!"},{"$f":"K549","v":"Sub14"}]
["'Sub14'!A138","'Sub14'!B138","'Sub14'!C138",138,{"$f":"K549","v":"Sub14"},null,{"$error":"#REF!"},{"$error":"#REF!"},{"$error":"#REF!"},{"$f":"K549","v":"Sub14"}]
["'Sub14'!A139",{"$f":"ADDRESS($D580,2,4,1,$E580)","v":"'Sub14'!B139"},{"$f":"ADDRESS($D580,3,4,1,$E580)","v":"'Sub14'!C139"},139,{"$f":"K549","v":"Sub14"},null,{"$error":"#REF!"},{"$f":"IF(INDIRECT(B580,1)<>\"\",IF(INDIRECT(B580,1)=\"LUMP\", \"LUMP\", INDIRECT(B580,1)),\"\")","v":{"$error":"#REF!"}},{"$error":"#REF!"},{"$f":"K549","v":"Sub14"}]
["'Sub14'!A140","'Sub14'!B140","'Sub14'!C140",140,{"$f":"K549","v":"Sub14"},null,{"$error":"#REF!"},{"$error":"#REF!"},{"$error":"#REF!"},{"$f":"K549","v":"Sub14"}]
["'Sub14'!A141","'Sub14'!B141","'Sub14'!C141",141,{"$f":"K549","v":"Sub14"},null,{"$error":"#REF!"},{"$error":"#REF!"},{"$error":"#REF!"},{"$f":"K549","v":"Sub14"}]
["'Sub14'!A142","'Sub14'!B142","'Sub14'!C142",142,{"$f":"K549","v":"Sub14"},null,{"$error":"#REF!"},{"$error":"#REF!"},{"$error":"#REF!"},{"$f":"K549","v":"Sub14"}]
["'Sub14'!A143","'Sub14'!B143","'Sub14'!C143",143,{"$f":"K549","v":"Sub14"},null,{"$error":"#REF!"},{"$error":"#REF!"},{"$error":"#REF!"},{"$f":"K549","v":"Sub14"}]
["'Sub14'!A144","'Sub14'!B144","'Sub14'!C144",144,{"$f":"K549","v":"Sub14"},null,{"$error":"#REF!"},{"$error":"#REF!"},{"$error":"#REF!"},{"$f":"K549","v":"Sub14"}]
["'Sub14'!A145","'Sub14'!B145","'Sub14'!C145",145,{"$f":"K549","v":"Sub14"},null,{"$error":"#REF!"},{"$error":"#REF!"},{"$error":"#REF!"},{"$f":"K549","v":"Sub14"}]
["'Sub14'!A146","'Sub14'!B146","'Sub14'!C146",146,{"$f":"K549","v":"Sub14"},null,{"$error":"#REF!"},{"$error":"#REF!"},{"$error":"#REF!"},{"$f":"K549","v":"Sub14"}]
["'Sub14'!A147","'Sub14'!B147","'Sub14'!C147",147,{"$f":"K549","v":"Sub14"},null,{"$error":"#REF!"},{"$error":"#REF!"},{"$error":"#REF!"},{"$f":"K549","v":"Sub14"}]
["'Sub14'!A148","'Sub14'!B148","'Sub14'!C148",148,{"$f":"K549","v":"Sub14"},null,{"$error":"#REF!"},{"$error":"#REF!"},{"$error":"#REF!"},{"$f":"K549","v":"Sub14"}]
["'Sub14'!A149","'Sub14'!B149","'Sub14'!C149",149,{"$f":"K549","v":"Sub14"},null,{"$error":"#REF!"},{"$error":"#REF!"},{"$error":"#REF!"},{"$f":"K549","v":"Sub14"}]
[{"$f":"ADDRESS($D591,1,4,1,$E591)","v":"'Sub15'!A108"},"'Sub15'!B108","'Sub15'!C108",108,{"$f":"K591","v":"Sub15"},null,{"$error":"#REF!"},{"$error":"#REF!"},{"$error":"#REF!"},{"$f":"K591","v":"Sub15"},"Sub15"]
[{"$f":"ADDRESS(D592,1,4,1,E592)","v":"'Sub15'!A109"},"'Sub15'!B109","'Sub15'!C109",{"$f":"D591+1","v":109},{"$f":"K591","v":"Sub15"},null,{"$error":"#REF!"},{"$error":"#REF!"},{"$error":"#REF!"},{"$f":"K591","v":"Sub15"}]
["'Sub15'!A110","'Sub15'!B110","'Sub15'!C110",110,{"$f":"K591","v":"Sub15"},null,{"$error":"#REF!"},{"$error":"#REF!"},{"$error":"#REF!"},{"$f":"K591","v":"Sub15"}]
["'Sub15'!A111","'Sub15'!B111","'Sub15'!C111",111,{"$f":"K591","v":"Sub15"},null,{"$error":"#REF!"},{"$error":"#REF!"},{"$error":"#REF!"},{"$f":"K591","v":"Sub15"}]
["'Sub15'!A112","'Sub15'!B112","'Sub15'!C112",112,{"$f":"K591","v":"Sub15"},null,{"$error":"#REF!"},{"$error":"#REF!"},{"$error":"#REF!"},{"$f":"K591","v":"Sub15"}]
["'Sub15'!A113","'Sub15'!B113","'Sub15'!C113",113,{"$f":"K591","v":"Sub15"},null,{"$error":"#REF!"},{"$error":"#REF!"},{"$error":"#REF!"},{"$f":"K591","v":"Sub15"}]
["'Sub15'!A114","'Sub15'!B114","'Sub15'!C114",114,{"$f":"K591","v":"Sub15"},null,{"$error":"#REF!"},{"$error":"#REF!"},{"$error":"#REF!"},{"$f":"K591","v":"Sub15"}]
["'Sub15'!A115","'Sub15'!B115","'Sub15'!C115",115,{"$f":"K591","v":"Sub15"},null,{"$error":"#REF!"},{"$error":"#REF!"},{"$error":"#REF!"},{"$f":"K591","v":"Sub15"}]
["'Sub15'!A116","'Sub15'!B116","'Sub15'!C116",116,{"$f":"K591","v":"Sub15"},null,{"$error":"#REF!"},{"$error":"#REF!"},{"$error":"#REF!"},{"$f":"K591","v":"Sub15"}]
["'Sub15'!A117","'Sub15'!B117","'Sub15'!C117",117,{"$f":"K591","v":"Sub15"},null,{"$error":"#REF!"},{"$error":"#REF!"},{"$error":"#REF!"},{"$f":"K591","v":"Sub15"}]
["'Sub15'!A118","'Sub15'!B118","'Sub15'!C118",118,{"$f":"K591","v":"Sub15"},null,{"$error":"#REF!"},{"$error":"#REF!"},{"$error":"#REF!"},{"$f":"K591","v":"Sub15"}]
["'Sub15'!A119","'Sub15'!B119","'Sub15'!C119",119,{"$f":"K591","v":"Sub15"},null,{"$error":"#REF!"},{"$error":"#REF!"},{"$error":"#REF!"},{"$f":"K591","v":"Sub15"}]
["'Sub15'!A120","'Sub15'!B120","'Sub15'!C120",120,{"$f":"K591","v":"Sub15"},null,{"$error":"#REF!"},{"$error":"#REF!"},{"$error":"#REF!"},{"$f":"K591","v":"Sub15"}]
["'Sub15'!A121","'Sub15'!B121","'Sub15'!C121",121,{"$f":"K591","v":"Sub15"},null,{"$error":"#REF!"},{"$error":"#REF!"},{"$error":"#REF!"},{"$f":"K591","v":"Sub15"}]
["'Sub15'!A122","'Sub15'!B122","'Sub15'!C122",122,{"$f":"K591","v":"Sub15"},null,{"$error":"#REF!"},{"$error":"#REF!"},{"$error":"#REF!"},{"$f":"K591","v":"Sub15"}]
["'Sub15'!A123","'Sub15'!B123","'Sub15'!C123",123,{"$f":"K591","v":"Sub15"},null,{"$error":"#REF!"},{"$error":"#REF!"},{"$error":"#REF!"},{"$f":"K591","v":"Sub15"}]
["'Sub15'!A124","'Sub15'!B124","'Sub15'!C124",124,{"$f":"K591","v":"Sub15"},null,{"$error":"#REF!"},{"$error":"#REF!"},{"$error":"#REF!"},{"$f":"K591","v":"Sub15"}]
["'Sub15'!A125","'Sub15'!B125","'Sub15'!C125",125,{"$f":"K591","v":"Sub15"},null,{"$error":"#REF!"},{"$error":"#REF!"},{"$error":"#REF!"},{"$f":"K591","v":"Sub15"}]
["'Sub15'!A126","'Sub15'!B126","'Sub15'!C126",126,{"$f":"K591","v":"Sub15"},null,{"$error":"#REF!"},{"$error":"#REF!"},{"$error":"#REF!"},{"$f":"K591","v":"Sub15"}]
["'Sub15'!A127","'Sub15'!B127","'Sub15'!C127",127,{"$f":"K591","v":"Sub15"},null,{"$error":"#REF!"},{"$error":"#REF!"},{"$error":"#REF!"},{"$f":"K591","v":"Sub15"}]
["'Sub15'!A128","'Sub15'!B128","'Sub15'!C128",128,{"$f":"K591","v":"Sub15"},null,{"$error":"#REF!"},{"$error":"#REF!"},{"$error":"#REF!"},{"$f":"K591","v":"Sub15"}]
["'Sub15'!A129","'Sub15'!B129","'Sub15'!C129",129,{"$f":"K591","v":"Sub15"},null,{"$error":"#REF!"},{"$error":"#REF!"},{"$error":"#REF!"},{"$f":"K591","v":"Sub15"}]
["'Sub15'!A130","'Sub15'!B130","'Sub15'!C130",130,{"$f":"K591","v":"Sub15"},null,{"$error":"#REF!"},{"$error":"#REF!"},{"$error":"#REF!"},{"$f":"K591","v":"Sub15"}]
["'Sub15'!A131","'Sub15'!B131","'Sub15'!C131",131,{"$f":"K591","v":"Sub15"},null,{"$error":"#REF!"},{"$error":"#REF!"},{"$error":"#REF!"},{"$f":"K591","v":"Sub15"}]
["'Sub15'!A132","'Sub15'!B132","'Sub15'!C132",132,{"$f":"K591","v":"Sub15"},null,{"$error":"#REF!"},{"$error":"#REF!"},{"$error":"#REF!"},{"$f":"K591","v":"Sub15"}]
["'Sub15'!A133","'Sub15'!B133","'Sub15'!C133",133,{"$f":"K591","v":"Sub15"},null,{"$error":"#REF!"},{"$error":"#REF!"},{"$error":"#REF!"},{"$f":"K591","v":"Sub15"}]
["'Sub15'!A134","'Sub15'!B134","'Sub15'!C134",134,{"$f":"K591","v":"Sub15"},null,{"$error":"#REF!"},{"$error":"#REF!"},{"$error":"#REF!"},{"$f":"K591","v":"Sub15"}]
["'Sub15'!A135","'Sub15'!B135","'Sub15'!C135",135,{"$f":"K591","v":"Sub15"},null,{"$error":"#REF!"},{"$error":"#REF!"},{"$error":"#REF!"},{"$f":"K591","v":"Sub15"}]
["'Sub15'!A136","'Sub15'!B136","'Sub15'!C136",136,{"$f":"K591","v":"Sub15"},null,{"$error":"#REF!"},{"$error":"#REF!"},{"$error":"#REF!"},{"$f":"K591","v":"Sub15"}]
["'Sub15'!A137","'Sub15'!B137","'Sub15'!C137",137,{"$f":"K591","v":"Sub15"},null,{"$error":"#REF!"},{"$error":"#REF!"},{"$error":"#REF!"},{"$f":"K591","v":"Sub15"}]
["'Sub15'!A138","'Sub15'!B138","'Sub15'!C138",138,{"$f":"K591","v":"Sub15"},null,{"$error":"#REF!"},{"$error":"#REF!"},{"$error":"#REF!"},{"$f":"K591","v":"Sub15"}]
["'Sub15'!A139","'Sub15'!B139","'Sub15'!C139",139,{"$f":"K591","v":"Sub15"},null,{"$error":"#REF!"},{"$error":"#REF!"},{"$f":"IF(INDIRECT(C622,1)<>\"\",INDIRECT(C622,1),\"\")","v":{"$error":"#REF!"}},{"$f":"K591","v":"Sub15"}]
["'Sub15'!A140","'Sub15'!B140","'Sub15'!C140",140,{"$f":"K591","v":"Sub15"},null,{"$error":"#REF!"},{"$error":"#REF!"},{"$error":"#REF!"},{"$f":"K591","v":"Sub15"}]
["'Sub15'!A141","'Sub15'!B141","'Sub15'!C141",141,{"$f":"K591","v":"Sub15"},null,{"$error":"#REF!"},{"$error":"#REF!"},{"$error":"#REF!"},{"$f":"K591","v":"Sub15"}]
["'Sub15'!A142","'Sub15'!B142","'Sub15'!C142",142,{"$f":"K591","v":"Sub15"},null,{"$error":"#REF!"},{"$error":"#REF!"},{"$error":"#REF!"},{"$f":"K591","v":"Sub15"}]
["'Sub15'!A143","'Sub15'!B143","'Sub15'!C143",143,{"$f":"K591","v":"Sub15"},null,{"$error":"#REF!"},{"$error":"#REF!"},{"$error":"#REF!"},{"$f":"K591","v":"Sub15"}]
["'Sub15'!A144","'Sub15'!B144","'Sub15'!C144",144,{"$f":"K591","v":"Sub15"},null,{"$error":"#REF!"},{"$error":"#REF!"},{"$error":"#REF!"},{"$f":"K591","v":"Sub15"}]
["'Sub15'!A145","'Sub15'!B145","'Sub15'!C145",145,{"$f":"K591","v":"Sub15"},null,{"$error":"#REF!"},{"$error":"#REF!"},{"$error":"#REF!"},{"$f":"K591","v":"Sub15"}]
["'Sub15'!A146","'Sub15'!B146","'Sub15'!C146",146,{"$f":"K591","v":"Sub15"},null,{"$error":"#REF!"},{"$error":"#REF!"},{"$error":"#REF!"},{"$f":"K591","v":"Sub15"}]
["'Sub15'!A147","'Sub15'!B147","'Sub15'!C147",147,{"$f":"K591","v":"Sub15"},null,{"$error":"#REF!"},{"$error":"#REF!"},{"$error":"#REF!"},{"$f":"K591","v":"Sub15"}]
["'Sub15'!A148","'Sub15'!B148","'Sub15'!C148",148,{"$f":"K591","v":"Sub15"},null,{"$error":"#REF!"},{"$error":"#REF!"},{"$error":"#REF!"},{"$f":"K591","v":"Sub15"}]
["'Sub15'!A149","'Sub15'!B149","'Sub15'!C149",149,{"$f":"K591","v":"Sub15"},null,{"$error":"#REF!"},{"$error":"#REF!"},{"$error":"#REF!"},{"$f":"K591","v":"Sub15"}]
[{"$f":"ADDRESS($D633,1,4,1,$E633)","v":"'Sub16'!A108"},"'Sub16'!B108","'Sub16'!C108",108,{"$f":"K633","v":"Sub16"},null,{"$f":"IF(INDIRECT(A633,1)<>\"\",INDIRECT(A633,1),\"\")","v":{"$error":"#REF!"}},{"$error":"#REF!"},{"$error":"#REF!"},{"$f":"K633","v":"Sub16"},"Sub16"]
[{"$f":"ADDRESS(D634,1,4,1,E634)","v":"'Sub16'!A109"},"'Sub16'!B109","'Sub16'!C109",{"$f":"D633+1","v":109},{"$f":"K633","v":"Sub16"},null,{"$error":"#REF!"},{"$error":"#REF!"},{"$error":"#REF!"},{"$f":"K633","v":"Sub16"}]
["'Sub16'!A110","'Sub16'!B110","'Sub16'!C110",110,{"$f":"K633","v":"Sub16"},null,{"$error":"#REF!"},{"$error":"#REF!"},{"$error":"#REF!"},{"$f":"K633","v":"Sub16"}]
["'Sub16'!A111","'Sub16'!B111","'Sub16'!C111",111,{"$f":"K633","v":"Sub16"},null,{"$error":"#REF!"},{"$error":"#REF!"},{"$error":"#REF!"},{"$f":"K633","v":"Sub16"}]
["'Sub16'!A112","'Sub16'!B112","'Sub16'!C112",112,{"$f":"K633","v":"Sub16"},null,{"$error":"#REF!"},{"$error":"#REF!"},{"$error":"#REF!"},{"$f":"K633","v":"Sub16"}]
["'Sub16'!A113","'Sub16'!B113","'Sub16'!C113",113,{"$f":"K633","v":"Sub16"},null,{"$error":"#REF!"},{"$error":"#REF!"},{"$error":"#REF!"},{"$f":"K633","v":"Sub16"}]
["'Sub16'!A114","'Sub16'!B114","'Sub16'!C114",114,{"$f":"K633","v":"Sub16"},null,{"$error":"#REF!"},{"$error":"#REF!"},{"$error":"#REF!"},{"$f":"K633","v":"Sub16"}]
["'Sub16'!A115","'Sub16'!B115","'Sub16'!C115",115,{"$f":"K633","v":"Sub16"},null,{"$error":"#REF!"},{"$error":"#REF!"},{"$error":"#REF!"},{"$f":"K633","v":"Sub16"}]
["'Sub16'!A116","'Sub16'!B116","'Sub16'!C116",116,{"$f":"K633","v":"Sub16"},null,{"$error":"#REF!"},{"$error":"#REF!"},{"$error":"#REF!"},{"$f":"K633","v":"Sub16"}]
["'Sub16'!A117","'Sub16'!B117","'Sub16'!C117",117,{"$f":"K633","v":"Sub16"},null,{"$error":"#REF!"},{"$error":"#REF!"},{"$error":"#REF!"},{"$f":"K633","v":"Sub16"}]
["'Sub16'!A118","'Sub16'!B118","'Sub16'!C118",118,{"$f":"K633","v":"Sub16"},null,{"$error":"#REF!"},{"$error":"#REF!"},{"$error":"#REF!"},{"$f":"K633","v":"Sub16"}]
["'Sub16'!A119",{"$f":"ADDRESS($D644,2,4,1,$E644)","v":"'Sub16'!B119"},{"$f":"ADDRESS($D644,3,4,1,$E644)","v":"'Sub16'!C119"},119,{"$f":"K633","v":"Sub16"},null,{"$error":"#REF!"},{"$f":"IF(INDIRECT(B644,1)<>\"\",IF(INDIRECT(B644,1)=\"LUMP\", \"LUMP\", INDIRECT(B644,1)),\"\")","v":{"$error":"#REF!"}},{"$error":"#REF!"},{"$f":"K633","v":"Sub16"}]
["'Sub16'!A120","'Sub16'!B120","'Sub16'!C120",120,{"$f":"K633","v":"Sub16"},null,{"$error":"#REF!"},{"$error":"#REF!"},{"$error":"#REF!"},{"$f":"K633","v":"Sub16"}]
["'Sub16'!A121","'Sub16'!B121","'Sub16'!C121",121,{"$f":"K633","v":"Sub16"},null,{"$error":"#REF!"},{"$error":"#REF!"},{"$error":"#REF!"},{"$f":"K633","v":"Sub16"}]
["'Sub16'!A122","'Sub16'!B122","'Sub16'!C122",122,{"$f":"K633","v":"Sub16"},null,{"$error":"#REF!"},{"$error":"#REF!"},{"$error":"#REF!"},{"$f":"K633","v":"Sub16"}]
["'Sub16'!A123","'Sub16'!B123","'Sub16'!C123",123,{"$f":"K633","v":"Sub16"},null,{"$error":"#REF!"},{"$error":"#REF!"},{"$error":"#REF!"},{"$f":"K633","v":"Sub16"}]
["'Sub16'!A124","'Sub16'!B124","'Sub16'!C124",124,{"$f":"K633","v":"Sub16"},null,{"$error":"#REF!"},{"$error":"#REF!"},{"$error":"#REF!"},{"$f":"K633","v":"Sub16"}]
["'Sub16'!A125","'Sub16'!B125","'Sub16'!C125",125,{"$f":"K633","v":"Sub16"},null,{"$error":"#REF!"},{"$error":"#REF!"},{"$error":"#REF!"},{"$f":"K633","v":"Sub16"}]
["'Sub16'!A126","'Sub16'!B126","'Sub16'!C126",126,{"$f":"K633","v":"Sub16"},null,{"$error":"#REF!"},{"$error":"#REF!"},{"$error":"#REF!"},{"$f":"K633","v":"Sub16"}]
["'Sub16'!A127","'Sub16'!B127","'Sub16'!C127",127,{"$f":"K633","v":"Sub16"},null,{"$error":"#REF!"},{"$error":"#REF!"},{"$error":"#REF!"},{"$f":"K633","v":"Sub16"}]
["'Sub16'!A128","'Sub16'!B128","'Sub16'!C128",128,{"$f":"K633","v":"Sub16"},null,{"$error":"#REF!"},{"$error":"#REF!"},{"$error":"#REF!"},{"$f":"K633","v":"Sub16"}]
["'Sub16'!A129","'Sub16'!B129","'Sub16'!C129",129,{"$f":"K633","v":"Sub16"},null,{"$error":"#REF!"},{"$error":"#REF!"},{"$error":"#REF!"},{"$f":"K633","v":"Sub16"}]
["'Sub16'!A130","'Sub16'!B130","'Sub16'!C130",130,{"$f":"K633","v":"Sub16"},null,{"$error":"#REF!"},{"$error":"#REF!"},{"$error":"#REF!"},{"$f":"K633","v":"Sub16"}]
["'Sub16'!A131","'Sub16'!B131","'Sub16'!C131",131,{"$f":"K633","v":"Sub16"},null,{"$error":"#REF!"},{"$error":"#REF!"},{"$error":"#REF!"},{"$f":"K633","v":"Sub16"}]
["'Sub16'!A132","'Sub16'!B132","'Sub16'!C132",132,{"$f":"K633","v":"Sub16"},null,{"$error":"#REF!"},{"$error":"#REF!"},{"$error":"#REF!"},{"$f":"K633","v":"Sub16"}]
["'Sub16'!A133","'Sub16'!B133","'Sub16'!C133",133,{"$f":"K633","v":"Sub16"},null,{"$error":"#REF!"},{"$error":"#REF!"},{"$error":"#REF!"},{"$f":"K633","v":"Sub16"}]
["'Sub16'!A134","'Sub16'!B134","'Sub16'!C134",134,{"$f":"K633","v":"Sub16"},null,{"$error":"#REF!"},{"$error":"#REF!"},{"$error":"#REF!"},{"$f":"K633","v":"Sub16"}]
["'Sub16'!A135","'Sub16'!B135","'Sub16'!C135",135,{"$f":"K633","v":"Sub16"},null,{"$error":"#REF!"},{"$error":"#REF!"},{"$error":"#REF!"},{"$f":"K633","v":"Sub16"}]
["'Sub16'!A136","'Sub16'!B136","'Sub16'!C136",136,{"$f":"K633","v":"Sub16"},null,{"$error":"#REF!"},{"$error":"#REF!"},{"$error":"#REF!"},{"$f":"K633","v":"Sub16"}]
["'Sub16'!A137","'Sub16'!B137","'Sub16'!C137",137,{"$f":"K633","v":"Sub16"},null,{"$error":"#REF!"},{"$error":"#REF!"},{"$error":"#REF!"},{"$f":"K633","v":"Sub16"}]
["'Sub16'!A138","'Sub16'!B138","'Sub16'!C138",138,{"$f":"K633","v":"Sub16"},null,{"$error":"#REF!"},{"$error":"#REF!"},{"$error":"#REF!"},{"$f":"K633","v":"Sub16"}]
["'Sub16'!A139","'Sub16'!B139","'Sub16'!C139",139,{"$f":"K633","v":"Sub16"},null,{"$error":"#REF!"},{"$error":"#REF!"},{"$f":"IF(INDIRECT(C664,1)<>\"\",INDIRECT(C664,1),\"\")","v":{"$error":"#REF!"}},{"$f":"K633","v":"Sub16"}]
["'Sub16'!A140","'Sub16'!B140","'Sub16'!C140",140,{"$f":"K633","v":"Sub16"},null,{"$error":"#REF!"},{"$error":"#REF!"},{"$error":"#REF!"},{"$f":"K633","v":"Sub16"}]
["'Sub16'!A141","'Sub16'!B141","'Sub16'!C141",141,{"$f":"K633","v":"Sub16"},null,{"$error":"#REF!"},{"$error":"#REF!"},{"$error":"#REF!"},{"$f":"K633","v":"Sub16"}]
["'Sub16'!A142","'Sub16'!B142","'Sub16'!C142",142,{"$f":"K633","v":"Sub16"},null,{"$error":"#REF!"},{"$error":"#REF!"},{"$error":"#REF!"},{"$f":"K633","v":"Sub16"}]
["'Sub16'!A143","'Sub16'!B143","'Sub16'!C143",143,{"$f":"K633","v":"Sub16"},null,{"$error":"#REF!"},{"$error":"#REF!"},{"$error":"#REF!"},{"$f":"K633","v":"Sub16"}]
["'Sub16'!A144","'Sub16'!B144","'Sub16'!C144",144,{"$f":"K633","v":"Sub16"},null,{"$error":"#REF!"},{"$error":"#REF!"},{"$error":"#REF!"},{"$f":"K633","v":"Sub16"}]
["'Sub16'!A145","'Sub16'!B145","'Sub16'!C145",145,{"$f":"K633","v":"Sub16"},null,{"$error":"#REF!"},{"$error":"#REF!"},{"$error":"#REF!"},{"$f":"K633","v":"Sub16"}]
["'Sub16'!A146","'Sub16'!B146","'Sub16'!C146",146,{"$f":"K633","v":"Sub16"},null,{"$error":"#REF!"},{"$error":"#REF!"},{"$error":"#REF!"},{"$f":"K633","v":"Sub16"}]
["'Sub16'!A147","'Sub16'!B147","'Sub16'!C147",147,{"$f":"K633","v":"Sub16"},null,{"$error":"#REF!"},{"$error":"#REF!"},{"$error":"#REF!"},{"$f":"K633","v":"Sub16"}]
["'Sub16'!A148","'Sub16'!B148","'Sub16'!C148",148,{"$f":"K633","v":"Sub16"},null,{"$error":"#REF!"},{"$error":"#REF!"},{"$error":"#REF!"},{"$f":"K633","v":"Sub16"}]
["'Sub16'!A149","'Sub16'!B149","'Sub16'!C149",149,{"$f":"K633","v":"Sub16"},null,{"$error":"#REF!"},{"$error":"#REF!"},{"$error":"#REF!"},{"$f":"K633","v":"Sub16"}]
[{"$f":"ADDRESS($D675,1,4,1,$E675)","v":"'Sub17'!A108"},"'Sub17'!B108","'Sub17'!C108",108,{"$f":"K675","v":"Sub17"},null,{"$error":"#REF!"},{"$error":"#REF!"},{"$error":"#REF!"},{"$f":"K675","v":"Sub17"},"Sub17"]
[{"$f":"ADDRESS(D676,1,4,1,E676)","v":"'Sub17'!A109"},"'Sub17'!B109","'Sub17'!C109",{"$f":"D675+1","v":109},{"$f":"K675","v":"Sub17"},null,{"$error":"#REF!"},{"$error":"#REF!"},{"$error":"#REF!"},{"$f":"K675","v":"Sub17"}]
["'Sub17'!A110","'Sub17'!B110","'Sub17'!C110",110,{"$f":"K675","v":"Sub17"},null,{"$error":"#REF!"},{"$error":"#REF!"},{"$error":"#REF!"},{"$f":"K675","v":"Sub17"}]
["'Sub17'!A111","'Sub17'!B111","'Sub17'!C111",111,{"$f":"K675","v":"Sub17"},null,{"$error":"#REF!"},{"$error":"#REF!"},{"$error":"#REF!"},{"$f":"K675","v":"Sub17"}]
["'Sub17'!A112","'Sub17'!B112","'Sub17'!C112",112,{"$f":"K675","v":"Sub17"},null,{"$error":"#REF!"},{"$error":"#REF!"},{"$error":"#REF!"},{"$f":"K675","v":"Sub17"}]
["'Sub17'!A113","'Sub17'!B113","'Sub17'!C113",113,{"$f":"K675","v":"Sub17"},null,{"$error":"#REF!"},{"$error":"#REF!"},{"$error":"#REF!"},{"$f":"K675","v":"Sub17"}]
["'Sub17'!A114","'Sub17'!B114","'Sub17'!C114",114,{"$f":"K675","v":"Sub17"},null,{"$error":"#REF!"},{"$error":"#REF!"},{"$error":"#REF!"},{"$f":"K675","v":"Sub17"}]
["'Sub17'!A115","'Sub17'!B115","'Sub17'!C115",115,{"$f":"K675","v":"Sub17"},null,{"$error":"#REF!"},{"$error":"#REF!"},{"$error":"#REF!"},{"$f":"K675","v":"Sub17"}]
["'Sub17'!A116","'Sub17'!B116","'Sub17'!C116",116,{"$f":"K675","v":"Sub17"},null,{"$error":"#REF!"},{"$error":"#REF!"},{"$error":"#REF!"},{"$f":"K675","v":"Sub17"}]
["'Sub17'!A117","'Sub17'!B117","'Sub17'!C117",117,{"$f":"K675","v":"Sub17"},null,{"$error":"#REF!"},{"$error":"#REF!"},{"$error":"#REF!"},{"$f":"K675","v":"Sub17"}]
["'Sub17'!A118","'Sub17'!B118","'Sub17'!C118",118,{"$f":"K675","v":"Sub17"},null,{"$error":"#REF!"},{"$error":"#REF!"},{"$error":"#REF!"},{"$f":"K675","v":"Sub17"}]
["'Sub17'!A119","'Sub17'!B119","'Sub17'!C119",119,{"$f":"K675","v":"Sub17"},null,{"$error":"#REF!"},{"$error":"#REF!"},{"$error":"#REF!"},{"$f":"K675","v":"Sub17"}]
["'Sub17'!A120","'Sub17'!B120","'Sub17'!C120",120,{"$f":"K675","v":"Sub17"},null,{"$error":"#REF!"},{"$error":"#REF!"},{"$error":"#REF!"},{"$f":"K675","v":"Sub17"}]
["'Sub17'!A121","'Sub17'!B121","'Sub17'!C121",121,{"$f":"K675","v":"Sub17"},null,{"$error":"#REF!"},{"$error":"#REF!"},{"$error":"#REF!"},{"$f":"K675","v":"Sub17"}]
["'Sub17'!A122","'Sub17'!B122","'Sub17'!C122",122,{"$f":"K675","v":"Sub17"},null,{"$error":"#REF!"},{"$error":"#REF!"},{"$error":"#REF!"},{"$f":"K675","v":"Sub17"}]
["'Sub17'!A123","'Sub17'!B123","'Sub17'!C123",123,{"$f":"K675","v":"Sub17"},null,{"$error":"#REF!"},{"$error":"#REF!"},{"$error":"#REF!"},{"$f":"K675","v":"Sub17"}]
["'Sub17'!A124","'Sub17'!B124","'Sub17'!C124",124,{"$f":"K675","v":"Sub17"},null,{"$error":"#REF!"},{"$error":"#REF!"},{"$error":"#REF!"},{"$f":"K675","v":"Sub17"}]
["'Sub17'!A125","'Sub17'!B125","'Sub17'!C125",125,{"$f":"K675","v":"Sub17"},null,{"$error":"#REF!"},{"$error":"#REF!"},{"$error":"#REF!"},{"$f":"K675","v":"Sub17"}]
["'Sub17'!A126","'Sub17'!B126","'Sub17'!C126",126,{"$f":"K675","v":"Sub17"},null,{"$error":"#REF!"},{"$error":"#REF!"},{"$error":"#REF!"},{"$f":"K675","v":"Sub17"}]
["'Sub17'!A127","'Sub17'!B127","'Sub17'!C127",127,{"$f":"K675","v":"Sub17"},null,{"$error":"#REF!"},{"$error":"#REF!"},{"$error":"#REF!"},{"$f":"K675","v":"Sub17"}]
["'Sub17'!A128","'Sub17'!B128","'Sub17'!C128",128,{"$f":"K675","v":"Sub17"},null,{"$error":"#REF!"},{"$error":"#REF!"},{"$error":"#REF!"},{"$f":"K675","v":"Sub17"}]
["'Sub17'!A129","'Sub17'!B129","'Sub17'!C129",129,{"$f":"K675","v":"Sub17"},null,{"$error":"#REF!"},{"$error":"#REF!"},{"$error":"#REF!"},{"$f":"K675","v":"Sub17"}]
["'Sub17'!A130","'Sub17'!B130","'Sub17'!C130",130,{"$f":"K675","v":"Sub17"},null,{"$f":"IF(INDIRECT(A697,1)<>\"\",INDIRECT(A697,1),\"\")","v":{"$error":"#REF!"}},{"$error":"#REF!"},{"$error":"#REF!"},{"$f":"K675","v":"Sub17"}]
["'Sub17'!A131","'Sub17'!B131","'Sub17'!C131",131,{"$f":"K675","v":"Sub17"},null,{"$error":"#REF!"},{"$error":"#REF!"},{"$error":"#REF!"},{"$f":"K675","v":"Sub17"}]
["'Sub17'!A132","'Sub17'!B132","'Sub17'!C132",132,{"$f":"K675","v":"Sub17"},null,{"$error":"#REF!"},{"$error":"#REF!"},{"$error":"#REF!"},{"$f":"K675","v":"Sub17"}]
["'Sub17'!A133","'Sub17'!B133","'Sub17'!C133",133,{"$f":"K675","v":"Sub17"},null,{"$error":"#REF!"},{"$error":"#REF!"},{"$error":"#REF!"},{"$f":"K675","v":"Sub17"}]
["'Sub17'!A134","'Sub17'!B134","'Sub17'!C134",134,{"$f":"K675","v":"Sub17"},null,{"$error":"#REF!"},{"$error":"#REF!"},{"$error":"#REF!"},{"$f":"K675","v":"Sub17"}]
["'Sub17'!A135","'Sub17'!B135","'Sub17'!C135",135,{"$f":"K675","v":"Sub17"},null,{"$error":"#REF!"},{"$error":"#REF!"},{"$error":"#REF!"},{"$f":"K675","v":"Sub17"}]
["'Sub17'!A136","'Sub17'!B136","'Sub17'!C136",136,{"$f":"K675","v":"Sub17"},null,{"$error":"#REF!"},{"$error":"#REF!"},{"$error":"#REF!"},{"$f":"K675","v":"Sub17"}]
["'Sub17'!A137","'Sub17'!B137","'Sub17'!C137",137,{"$f":"K675","v":"Sub17"},null,{"$error":"#REF!"},{"$error":"#REF!"},{"$error":"#REF!"},{"$f":"K675","v":"Sub17"}]
["'Sub17'!A138","'Sub17'!B138","'Sub17'!C138",138,{"$f":"K675","v":"Sub17"},null,{"$error":"#REF!"},{"$error":"#REF!"},{"$error":"#REF!"},{"$f":"K675","v":"Sub17"}]
["'Sub17'!A139","'Sub17'!B139","'Sub17'!C139",139,{"$f":"K675","v":"Sub17"},null,{"$error":"#REF!"},{"$error":"#REF!"},{"$error":"#REF!"},{"$f":"K675","v":"Sub17"}]
["'Sub17'!A140","'Sub17'!B140","'Sub17'!C140",140,{"$f":"K675","v":"Sub17"},null,{"$error":"#REF!"},{"$error":"#REF!"},{"$error":"#REF!"},{"$f":"K675","v":"Sub17"}]
["'Sub17'!A141",{"$f":"ADDRESS($D708,2,4,1,$E708)","v":"'Sub17'!B141"},{"$f":"ADDRESS($D708,3,4,1,$E708)","v":"'Sub17'!C141"},141,{"$f":"K675","v":"Sub17"},null,{"$error":"#REF!"},{"$f":"IF(INDIRECT(B708,1)<>\"\",IF(INDIRECT(B708,1)=\"LUMP\", \"LUMP\", INDIRECT(B708,1)),\"\")","v":{"$error":"#REF!"}},{"$error":"#REF!"},{"$f":"K675","v":"Sub17"}]
["'Sub17'!A142","'Sub17'!B142","'Sub17'!C142",142,{"$f":"K675","v":"Sub17"},null,{"$error":"#REF!"},{"$error":"#REF!"},{"$error":"#REF!"},{"$f":"K675","v":"Sub17"}]
["'Sub17'!A143","'Sub17'!B143","'Sub17'!C143",143,{"$f":"K675","v":"Sub17"},null,{"$error":"#REF!"},{"$error":"#REF!"},{"$error":"#REF!"},{"$f":"K675","v":"Sub17"}]
["'Sub17'!A144","'Sub17'!B144","'Sub17'!C144",144,{"$f":"K675","v":"Sub17"},null,{"$error":"#REF!"},{"$error":"#REF!"},{"$error":"#REF!"},{"$f":"K675","v":"Sub17"}]
["'Sub17'!A145","'Sub17'!B145","'Sub17'!C145",145,{"$f":"K675","v":"Sub17"},null,{"$error":"#REF!"},{"$error":"#REF!"},{"$error":"#REF!"},{"$f":"K675","v":"Sub17"}]
["'Sub17'!A146","'Sub17'!B146","'Sub17'!C146",146,{"$f":"K675","v":"Sub17"},null,{"$error":"#REF!"},{"$error":"#REF!"},{"$error":"#REF!"},{"$f":"K675","v":"Sub17"}]
["'Sub17'!A147","'Sub17'!B147","'Sub17'!C147",147,{"$f":"K675","v":"Sub17"},null,{"$error":"#REF!"},{"$error":"#REF!"},{"$error":"#REF!"},{"$f":"K675","v":"Sub17"}]
["'Sub17'!A148","'Sub17'!B148","'Sub17'!C148",148,{"$f":"K675","v":"Sub17"},null,{"$error":"#REF!"},{"$error":"#REF!"},{"$error":"#REF!"},{"$f":"K675","v":"Sub17"}]
["'Sub17'!A149","'Sub17'!B149","'Sub17'!C149",149,{"$f":"K675","v":"Sub17"},null,{"$error":"#REF!"},{"$error":"#REF!"},{"$error":"#REF!"},{"$f":"K675","v":"Sub17"}]
[{"$f":"ADDRESS($D717,1,4,1,$E717)","v":"'Sub18'!A108"},"'Sub18'!B108","'Sub18'!C108",108,{"$f":"K717","v":"Sub18"},null,{"$error":"#REF!"},{"$error":"#REF!"},{"$error":"#REF!"},{"$f":"K717","v":"Sub18"},"Sub18"]
[{"$f":"ADDRESS(D718,1,4,1,E718)","v":"'Sub18'!A109"},"'Sub18'!B109","'Sub18'!C109",{"$f":"D717+1","v":109},{"$f":"K717","v":"Sub18"},null,{"$error":"#REF!"},{"$error":"#REF!"},{"$error":"#REF!"},{"$f":"K717","v":"Sub18"}]
["'Sub18'!A110","'Sub18'!B110","'Sub18'!C110",110,{"$f":"K717","v":"Sub18"},null,{"$error":"#REF!"},{"$error":"#REF!"},{"$error":"#REF!"},{"$f":"K717","v":"Sub18"}]
["'Sub18'!A111","'Sub18'!B111","'Sub18'!C111",111,{"$f":"K717","v":"Sub18"},null,{"$error":"#REF!"},{"$error":"#REF!"},{"$error":"#REF!"},{"$f":"K717","v":"Sub18"}]
["'Sub18'!A112","'Sub18'!B112","'Sub18'!C112",112,{"$f":"K717","v":"Sub18"},null,{"$error":"#REF!"},{"$error":"#REF!"},{"$error":"#REF!"},{"$f":"K717","v":"Sub18"}]
["'Sub18'!A113","'Sub18'!B113","'Sub18'!C113",113,{"$f":"K717","v":"Sub18"},null,{"$error":"#REF!"},{"$error":"#REF!"},{"$error":"#REF!"},{"$f":"K717","v":"Sub18"}]
["'Sub18'!A114","'Sub18'!B114","'Sub18'!C114",114,{"$f":"K717","v":"Sub18"},null,{"$error":"#REF!"},{"$error":"#REF!"},{"$error":"#REF!"},{"$f":"K717","v":"Sub18"}]
["'Sub18'!A115","'Sub18'!B115","'Sub18'!C115",115,{"$f":"K717","v":"Sub18"},null,{"$error":"#REF!"},{"$error":"#REF!"},{"$error":"#REF!"},{"$f":"K717","v":"Sub18"}]
["'Sub18'!A116","'Sub18'!B116","'Sub18'!C116",116,{"$f":"K717","v":"Sub18"},null,{"$error":"#REF!"},{"$error":"#REF!"},{"$error":"#REF!"},{"$f":"K717","v":"Sub18"}]
["'Sub18'!A117","'Sub18'!B117","'Sub18'!C117",117,{"$f":"K717","v":"Sub18"},null,{"$error":"#REF!"},{"$error":"#REF!"},{"$error":"#REF!"},{"$f":"K717","v":"Sub18"}]
["'Sub18'!A118","'Sub18'!B118","'Sub18'!C118",118,{"$f":"K717","v":"Sub18"},null,{"$error":"#REF!"},{"$error":"#REF!"},{"$error":"#REF!"},{"$f":"K717","v":"Sub18"}]
["'Sub18'!A119","'Sub18'!B119","'Sub18'!C119",119,{"$f":"K717","v":"Sub18"},null,{"$error":"#REF!"},{"$error":"#REF!"},{"$f":"IF(INDIRECT(C728,1)<>\"\",INDIRECT(C728,1),\"\")","v":{"$error":"#REF!"}},{"$f":"K717","v":"Sub18"}]
["'Sub18'!A120","'Sub18'!B120","'Sub18'!C120",120,{"$f":"K717","v":"Sub18"},null,{"$error":"#REF!"},{"$error":"#REF!"},{"$error":"#REF!"},{"$f":"K717","v":"Sub18"}]
["'Sub18'!A121","'Sub18'!B121","'Sub18'!C121",121,{"$f":"K717","v":"Sub18"},null,{"$error":"#REF!"},{"$error":"#REF!"},{"$error":"#REF!"},{"$f":"K717","v":"Sub18"}]
["'Sub18'!A122","'Sub18'!B122","'Sub18'!C122",122,{"$f":"K717","v":"Sub18"},null,{"$error":"#REF!"},{"$error":"#REF!"},{"$error":"#REF!"},{"$f":"K717","v":"Sub18"}]
["'Sub18'!A123","'Sub18'!B123","'Sub18'!C123",123,{"$f":"K717","v":"Sub18"},null,{"$error":"#REF!"},{"$error":"#REF!"},{"$error":"#REF!"},{"$f":"K717","v":"Sub18"}]
["'Sub18'!A124","'Sub18'!B124","'Sub18'!C124",124,{"$f":"K717","v":"Sub18"},null,{"$error":"#REF!"},{"$error":"#REF!"},{"$error":"#REF!"},{"$f":"K717","v":"Sub18"}]
["'Sub18'!A125","'Sub18'!B125","'Sub18'!C125",125,{"$f":"K717","v":"Sub18"},null,{"$error":"#REF!"},{"$error":"#REF!"},{"$error":"#REF!"},{"$f":"K717","v":"Sub18"}]
["'Sub18'!A126","'Sub18'!B126","'Sub18'!C126",126,{"$f":"K717","v":"Sub18"},null,{"$error":"#REF!"},{"$error":"#REF!"},{"$error":"#REF!"},{"$f":"K717","v":"Sub18"}]
["'Sub18'!A127","'Sub18'!B127","'Sub18'!C127",127,{"$f":"K717","v":"Sub18"},null,{"$error":"#REF!"},{"$error":"#REF!"},{"$error":"#REF!"},{"$f":"K717","v":"Sub18"}]
["'Sub18'!A128","'Sub18'!B128","'Sub18'!C128",128,{"$f":"K717","v":"Sub18"},null,{"$error":"#REF!"},{"$error":"#REF!"},{"$error":"#REF!"},{"$f":"K717","v":"Sub18"}]
["'Sub18'!A129","'Sub18'!B129","'Sub18'!C129",129,{"$f":"K717","v":"Sub18"},null,{"$error":"#REF!"},{"$error":"#REF!"},{"$error":"#REF!"},{"$f":"K717","v":"Sub18"}]
["'Sub18'!A130","'Sub18'!B130","'Sub18'!C130",130,{"$f":"K717","v":"Sub18"},null,{"$error":"#REF!"},{"$error":"#REF!"},{"$error":"#REF!"},{"$f":"K717","v":"Sub18"}]
["'Sub18'!A131","'Sub18'!B131","'Sub18'!C131",131,{"$f":"K717","v":"Sub18"},null,{"$error":"#REF!"},{"$error":"#REF!"},{"$error":"#REF!"},{"$f":"K717","v":"Sub18"}]
["'Sub18'!A132","'Sub18'!B132","'Sub18'!C132",132,{"$f":"K717","v":"Sub18"},null,{"$error":"#REF!"},{"$error":"#REF!"},{"$error":"#REF!"},{"$f":"K717","v":"Sub18"}]
["'Sub18'!A133","'Sub18'!B133","'Sub18'!C133",133,{"$f":"K717","v":"Sub18"},null,{"$error":"#REF!"},{"$error":"#REF!"},{"$error":"#REF!"},{"$f":"K717","v":"Sub18"}]
["'Sub18'!A134","'Sub18'!B134","'Sub18'!C134",134,{"$f":"K717","v":"Sub18"},null,{"$error":"#REF!"},{"$error":"#REF!"},{"$error":"#REF!"},{"$f":"K717","v":"Sub18"}]
["'Sub18'!A135","'Sub18'!B135","'Sub18'!C135",135,{"$f":"K717","v":"Sub18"},null,{"$error":"#REF!"},{"$error":"#REF!"},{"$error":"#REF!"},{"$f":"K717","v":"Sub18"}]
["'Sub18'!A136","'Sub18'!B136","'Sub18'!C136",136,{"$f":"K717","v":"Sub18"},null,{"$error":"#REF!"},{"$error":"#REF!"},{"$error":"#REF!"},{"$f":"K717","v":"Sub18"}]
["'Sub18'!A137","'Sub18'!B137","'Sub18'!C137",137,{"$f":"K717","v":"Sub18"},null,{"$error":"#REF!"},{"$error":"#REF!"},{"$error":"#REF!"},{"$f":"K717","v":"Sub18"}]
["'Sub18'!A138","'Sub18'!B138","'Sub18'!C138",138,{"$f":"K717","v":"Sub18"},null,{"$error":"#REF!"},{"$error":"#REF!"},{"$error":"#REF!"},{"$f":"K717","v":"Sub18"}]
["'Sub18'!A139","'Sub18'!B139","'Sub18'!C139",139,{"$f":"K717","v":"Sub18"},null,{"$error":"#REF!"},{"$error":"#REF!"},{"$error":"#REF!"},{"$f":"K717","v":"Sub18"}]
["'Sub18'!A140","'Sub18'!B140","'Sub18'!C140",140,{"$f":"K717","v":"Sub18"},null,{"$error":"#REF!"},{"$error":"#REF!"},{"$error":"#REF!"},{"$f":"K717","v":"Sub18"}]
["'Sub18'!A141","'Sub18'!B141","'Sub18'!C141",141,{"$f":"K717","v":"Sub18"},null,{"$error":"#REF!"},{"$error":"#REF!"},{"$error":"#REF!"},{"$f":"K717","v":"Sub18"}]
["'Sub18'!A142","'Sub18'!B142","'Sub18'!C142",142,{"$f":"K717","v":"Sub18"},null,{"$error":"#REF!"},{"$error":"#REF!"},{"$error":"#REF!"},{"$f":"K717","v":"Sub18"}]
["'Sub18'!A143","'Sub18'!B143","'Sub18'!C143",143,{"$f":"K717","v":"Sub18"},null,{"$error":"#REF!"},{"$error":"#REF!"},{"$error":"#REF!"},{"$f":"K717","v":"Sub18"}]
["'Sub18'!A144","'Sub18'!B144","'Sub18'!C144",144,{"$f":"K717","v":"Sub18"},null,{"$error":"#REF!"},{"$error":"#REF!"},{"$error":"#REF!"},{"$f":"K717","v":"Sub18"}]
["'Sub18'!A145","'Sub18'!B145","'Sub18'!C145",145,{"$f":"K717","v":"Sub18"},null,{"$error":"#REF!"},{"$error":"#REF!"},{"$error":"#REF!"},{"$f":"K717","v":"Sub18"}]
["'Sub18'!A146","'Sub18'!B146","'Sub18'!C146",146,{"$f":"K717","v":"Sub18"},null,{"$error":"#REF!"},{"$error":"#REF!"},{"$error":"#REF!"},{"$f":"K717","v":"Sub18"}]
["'Sub18'!A147","'Sub18'!B147","'Sub18'!C147",147,{"$f":"K717","v":"Sub18"},null,{"$error":"#REF!"},{"$error":"#REF!"},{"$error":"#REF!"},{"$f":"K717","v":"Sub18"}]
["'Sub18'!A148","'Sub18'!B148","'Sub18'!C148",148,{"$f":"K717","v":"Sub18"},null,{"$error":"#REF!"},{"$error":"#REF!"},{"$error":"#REF!"},{"$f":"K717","v":"Sub18"}]
["'Sub18'!A149","'Sub18'!B149","'Sub18'!C149",149,{"$f":"K717","v":"Sub18"},null,{"$error":"#REF!"},{"$error":"#REF!"},{"$error":"#REF!"},{"$f":"K717","v":"Sub18"}]
[{"$f":"ADDRESS($D759,1,4,1,$E759)","v":"'Sub19'!A108"},"'Sub19'!B108","'Sub19'!C108",108,{"$f":"K759","v":"Sub19"},null,{"$error":"#REF!"},{"$error":"#REF!"},{"$error":"#REF!"},{"$f":"K759","v":"Sub19"},"Sub19"]
[{"$f":"ADDRESS(D760,1,4,1,E760)","v":"'Sub19'!A109"},"'Sub19'!B109","'Sub19'!C109",{"$f":"D759+1","v":109},{"$f":"K759","v":"Sub19"},null,{"$error":"#REF!"},{"$error":"#REF!"},{"$error":"#REF!"},{"$f":"K759","v":"Sub19"}]
["'Sub19'!A110","'Sub19'!B110","'Sub19'!C110",110,{"$f":"K759","v":"Sub19"},null,{"$f":"IF(INDIRECT(A761,1)<>\"\",INDIRECT(A761,1),\"\")","v":{"$error":"#REF!"}},{"$error":"#REF!"},{"$error":"#REF!"},{"$f":"K759","v":"Sub19"}]
["'Sub19'!A111","'Sub19'!B111","'Sub19'!C111",111,{"$f":"K759","v":"Sub19"},null,{"$error":"#REF!"},{"$error":"#REF!"},{"$error":"#REF!"},{"$f":"K759","v":"Sub19"}]
["'Sub19'!A112","'Sub19'!B112","'Sub19'!C112",112,{"$f":"K759","v":"Sub19"},null,{"$error":"#REF!"},{"$error":"#REF!"},{"$error":"#REF!"},{"$f":"K759","v":"Sub19"}]
["'Sub19'!A113","'Sub19'!B113","'Sub19'!C113",113,{"$f":"K759","v":"Sub19"},null,{"$error":"#REF!"},{"$error":"#REF!"},{"$error":"#REF!"},{"$f":"K759","v":"Sub19"}]
["'Sub19'!A114","'Sub19'!B114","'Sub19'!C114",114,{"$f":"K759","v":"Sub19"},null,{"$error":"#REF!"},{"$error":"#REF!"},{"$error":"#REF!"},{"$f":"K759","v":"Sub19"}]
["'Sub19'!A115","'Sub19'!B115","'Sub19'!C115",115,{"$f":"K759","v":"Sub19"},null,{"$error":"#REF!"},{"$error":"#REF!"},{"$error":"#REF!"},{"$f":"K759","v":"Sub19"}]
["'Sub19'!A116","'Sub19'!B116","'Sub19'!C116",116,{"$f":"K759","v":"Sub19"},null,{"$error":"#REF!"},{"$error":"#REF!"},{"$error":"#REF!"},{"$f":"K759","v":"Sub19"}]
["'Sub19'!A117","'Sub19'!B117","'Sub19'!C117",117,{"$f":"K759","v":"Sub19"},null,{"$error":"#REF!"},{"$error":"#REF!"},{"$error":"#REF!"},{"$f":"K759","v":"Sub19"}]
["'Sub19'!A118","'Sub19'!B118","'Sub19'!C118",118,{"$f":"K759","v":"Sub19"},null,{"$error":"#REF!"},{"$error":"#REF!"},{"$error":"#REF!"},{"$f":"K759","v":"Sub19"}]
["'Sub19'!A119","'Sub19'!B119","'Sub19'!C119",119,{"$f":"K759","v":"Sub19"},null,{"$error":"#REF!"},{"$error":"#REF!"},{"$error":"#REF!"},{"$f":"K759","v":"Sub19"}]
["'Sub19'!A120","'Sub19'!B120","'Sub19'!C120",120,{"$f":"K759","v":"Sub19"},null,{"$error":"#REF!"},{"$error":"#REF!"},{"$error":"#REF!"},{"$f":"K759","v":"Sub19"}]
["'Sub19'!A121",{"$f":"ADDRESS($D772,2,4,1,$E772)","v":"'Sub19'!B121"},{"$f":"ADDRESS($D772,3,4,1,$E772)","v":"'Sub19'!C121"},121,{"$f":"K759","v":"Sub19"},null,{"$error":"#REF!"},{"$f":"IF(INDIRECT(B772,1)<>\"\",IF(INDIRECT(B772,1)=\"LUMP\", \"LUMP\", INDIRECT(B772,1)),\"\")","v":{"$error":"#REF!"}},{"$error":"#REF!"},{"$f":"K759","v":"Sub19"}]
["'Sub19'!A122","'Sub19'!B122","'Sub19'!C122",122,{"$f":"K759","v":"Sub19"},null,{"$error":"#REF!"},{"$error":"#REF!"},{"$error":"#REF!"},{"$f":"K759","v":"Sub19"}]
["'Sub19'!A123","'Sub19'!B123","'Sub19'!C123",123,{"$f":"K759","v":"Sub19"},null,{"$error":"#REF!"},{"$error":"#REF!"},{"$error":"#REF!"},{"$f":"K759","v":"Sub19"}]
["'Sub19'!A124","'Sub19'!B124","'Sub19'!C124",124,{"$f":"K759","v":"Sub19"},null,{"$error":"#REF!"},{"$error":"#REF!"},{"$error":"#REF!"},{"$f":"K759","v":"Sub19"}]
["'Sub19'!A125","'Sub19'!B125","'Sub19'!C125",125,{"$f":"K759","v":"Sub19"},null,{"$error":"#REF!"},{"$error":"#REF!"},{"$error":"#REF!"},{"$f":"K759","v":"Sub19"}]
["'Sub19'!A126","'Sub19'!B126","'Sub19'!C126",126,{"$f":"K759","v":"Sub19"},null,{"$error":"#REF!"},{"$error":"#REF!"},{"$error":"#REF!"},{"$f":"K759","v":"Sub19"}]
["'Sub19'!A127","'Sub19'!B127","'Sub19'!C127",127,{"$f":"K759","v":"Sub19"},null,{"$error":"#REF!"},{"$error":"#REF!"},{"$error":"#REF!"},{"$f":"K759","v":"Sub19"}]
["'Sub19'!A128","'Sub19'!B128","'Sub19'!C128",128,{"$f":"K759","v":"Sub19"},null,{"$error":"#REF!"},{"$error":"#REF!"},{"$error":"#REF!"},{"$f":"K759","v":"Sub19"}]
["'Sub19'!A129","'Sub19'!B129","'Sub19'!C129",129,{"$f":"K759","v":"Sub19"},null,{"$error":"#REF!"},{"$error":"#REF!"},{"$error":"#REF!"},{"$f":"K759","v":"Sub19"}]
["'Sub19'!A130","'Sub19'!B130","'Sub19'!C130",130,{"$f":"K759","v":"Sub19"},null,{"$error":"#REF!"},{"$error":"#REF!"},{"$error":"#REF!"},{"$f":"K759","v":"Sub19"}]
["'Sub19'!A131","'Sub19'!B131","'Sub19'!C131",131,{"$f":"K759","v":"Sub19"},null,{"$error":"#REF!"},{"$error":"#REF!"},{"$error":"#REF!"},{"$f":"K759","v":"Sub19"}]
["'Sub19'!A132","'Sub19'!B132","'Sub19'!C132",132,{"$f":"K759","v":"Sub19"},null,{"$error":"#REF!"},{"$error":"#REF!"},{"$error":"#REF!"},{"$f":"K759","v":"Sub19"}]
["'Sub19'!A133","'Sub19'!B133","'Sub19'!C133",133,{"$f":"K759","v":"Sub19"},null,{"$error":"#REF!"},{"$error":"#REF!"},{"$error":"#REF!"},{"$f":"K759","v":"Sub19"}]
["'Sub19'!A134","'Sub19'!B134","'Sub19'!C134",134,{"$f":"K759","v":"Sub19"},null,{"$error":"#REF!"},{"$error":"#REF!"},{"$error":"#REF!"},{"$f":"K759","v":"Sub19"}]
["'Sub19'!A135","'Sub19'!B135","'Sub19'!C135",135,{"$f":"K759","v":"Sub19"},null,{"$error":"#REF!"},{"$error":"#REF!"},{"$error":"#REF!"},{"$f":"K759","v":"Sub19"}]
["'Sub19'!A136","'Sub19'!B136","'Sub19'!C136",136,{"$f":"K759","v":"Sub19"},null,{"$error":"#REF!"},{"$error":"#REF!"},{"$error":"#REF!"},{"$f":"K759","v":"Sub19"}]
["'Sub19'!A137","'Sub19'!B137","'Sub19'!C137",137,{"$f":"K759","v":"Sub19"},null,{"$error":"#REF!"},{"$error":"#REF!"},{"$error":"#REF!"},{"$f":"K759","v":"Sub19"}]
["'Sub19'!A138","'Sub19'!B138","'Sub19'!C138",138,{"$f":"K759","v":"Sub19"},null,{"$error":"#REF!"},{"$error":"#REF!"},{"$error":"#REF!"},{"$f":"K759","v":"Sub19"}]
["'Sub19'!A139","'Sub19'!B139","'Sub19'!C139",139,{"$f":"K759","v":"Sub19"},null,{"$error":"#REF!"},{"$error":"#REF!"},{"$error":"#REF!"},{"$f":"K759","v":"Sub19"}]
["'Sub19'!A140","'Sub19'!B140","'Sub19'!C140",140,{"$f":"K759","v":"Sub19"},null,{"$error":"#REF!"},{"$error":"#REF!"},{"$error":"#REF!"},{"$f":"K759","v":"Sub19"}]
["'Sub19'!A141","'Sub19'!B141","'Sub19'!C141",141,{"$f":"K759","v":"Sub19"},null,{"$error":"#REF!"},{"$error":"#REF!"},{"$f":"IF(INDIRECT(C792,1)<>\"\",INDIRECT(C792,1),\"\")","v":{"$error":"#REF!"}},{"$f":"K759","v":"Sub19"}]
["'Sub19'!A142","'Sub19'!B142","'Sub19'!C142",142,{"$f":"K759","v":"Sub19"},null,{"$error":"#REF!"},{"$error":"#REF!"},{"$error":"#REF!"},{"$f":"K759","v":"Sub19"}]
["'Sub19'!A143","'Sub19'!B143","'Sub19'!C143",143,{"$f":"K759","v":"Sub19"},null,{"$error":"#REF!"},{"$error":"#REF!"},{"$error":"#REF!"},{"$f":"K759","v":"Sub19"}]
["'Sub19'!A144","'Sub19'!B144","'Sub19'!C144",144,{"$f":"K759","v":"Sub19"},null,{"$error":"#REF!"},{"$error":"#REF!"},{"$error":"#REF!"},{"$f":"K759","v":"Sub19"}]
["'Sub19'!A145","'Sub19'!B145","'Sub19'!C145",145,{"$f":"K759","v":"Sub19"},null,{"$error":"#REF!"},{"$error":"#REF!"},{"$error":"#REF!"},{"$f":"K759","v":"Sub19"}]
["'Sub19'!A146","'Sub19'!B146","'Sub19'!C146",146,{"$f":"K759","v":"Sub19"},null,{"$error":"#REF!"},{"$error":"#REF!"},{"$error":"#REF!"},{"$f":"K759","v":"Sub19"}]
["'Sub19'!A147","'Sub19'!B147","'Sub19'!C147",147,{"$f":"K759","v":"Sub19"},null,{"$error":"#REF!"},{"$error":"#REF!"},{"$error":"#REF!"},{"$f":"K759","v":"Sub19"}]
["'Sub19'!A148","'Sub19'!B148","'Sub19'!C148",148,{"$f":"K759","v":"Sub19"},null,{"$error":"#REF!"},{"$error":"#REF!"},{"$error":"#REF!"},{"$f":"K759","v":"Sub19"}]
["'Sub19'!A149","'Sub19'!B149","'Sub19'!C149",149,{"$f":"K759","v":"Sub19"},null,{"$error":"#REF!"},{"$error":"#REF!"},{"$error":"#REF!"},{"$f":"K759","v":"Sub19"}]
[{"$f":"ADDRESS($D801,1,4,1,$E801)","v":"'Sub20'!A108"},"'Sub20'!B108","'Sub20'!C108",108,{"$f":"K801","v":"Sub20"},null,{"$error":"#REF!"},{"$error":"#REF!"},{"$error":"#REF!"},{"$f":"K801","v":"Sub20"},"Sub20"]
[{"$f":"ADDRESS(D802,1,4,1,E802)","v":"'Sub20'!A109"},"'Sub20'!B109","'Sub20'!C109",{"$f":"D801+1","v":109},{"$f":"K801","v":"Sub20"},null,{"$error":"#REF!"},{"$error":"#REF!"},{"$error":"#REF!"},{"$f":"K801","v":"Sub20"}]
["'Sub20'!A110","'Sub20'!B110","'Sub20'!C110",110,{"$f":"K801","v":"Sub20"},null,{"$error":"#REF!"},{"$error":"#REF!"},{"$error":"#REF!"},{"$f":"K801","v":"Sub20"}]
["'Sub20'!A111","'Sub20'!B111","'Sub20'!C111",111,{"$f":"K801","v":"Sub20"},null,{"$error":"#REF!"},{"$error":"#REF!"},{"$error":"#REF!"},{"$f":"K801","v":"Sub20"}]
["'Sub20'!A112","'Sub20'!B112","'Sub20'!C112",112,{"$f":"K801","v":"Sub20"},null,{"$error":"#REF!"},{"$error":"#REF!"},{"$error":"#REF!"},{"$f":"K801","v":"Sub20"}]
["'Sub20'!A113","'Sub20'!B113","'Sub20'!C113",113,{"$f":"K801","v":"Sub20"},null,{"$error":"#REF!"},{"$error":"#REF!"},{"$error":"#REF!"},{"$f":"K801","v":"Sub20"}]
["'Sub20'!A114","'Sub20'!B114","'Sub20'!C114",114,{"$f":"K801","v":"Sub20"},null,{"$error":"#REF!"},{"$error":"#REF!"},{"$error":"#REF!"},{"$f":"K801","v":"Sub20"}]
["'Sub20'!A115","'Sub20'!B115","'Sub20'!C115",115,{"$f":"K801","v":"Sub20"},null,{"$error":"#REF!"},{"$error":"#REF!"},{"$error":"#REF!"},{"$f":"K801","v":"Sub20"}]
["'Sub20'!A116","'Sub20'!B116","'Sub20'!C116",116,{"$f":"K801","v":"Sub20"},null,{"$error":"#REF!"},{"$error":"#REF!"},{"$error":"#REF!"},{"$f":"K801","v":"Sub20"}]
["'Sub20'!A117","'Sub20'!B117","'Sub20'!C117",117,{"$f":"K801","v":"Sub20"},null,{"$error":"#REF!"},{"$error":"#REF!"},{"$error":"#REF!"},{"$f":"K801","v":"Sub20"}]
["'Sub20'!A118","'Sub20'!B118","'Sub20'!C118",118,{"$f":"K801","v":"Sub20"},null,{"$error":"#REF!"},{"$error":"#REF!"},{"$error":"#REF!"},{"$f":"K801","v":"Sub20"}]
["'Sub20'!A119","'Sub20'!B119","'Sub20'!C119",119,{"$f":"K801","v":"Sub20"},null,{"$error":"#REF!"},{"$error":"#REF!"},{"$error":"#REF!"},{"$f":"K801","v":"Sub20"}]
["'Sub20'!A120","'Sub20'!B120","'Sub20'!C120",120,{"$f":"K801","v":"Sub20"},null,{"$error":"#REF!"},{"$error":"#REF!"},{"$error":"#REF!"},{"$f":"K801","v":"Sub20"}]
["'Sub20'!A121","'Sub20'!B121","'Sub20'!C121",121,{"$f":"K801","v":"Sub20"},null,{"$error":"#REF!"},{"$error":"#REF!"},{"$error":"#REF!"},{"$f":"K801","v":"Sub20"}]
["'Sub20'!A122","'Sub20'!B122","'Sub20'!C122",122,{"$f":"K801","v":"Sub20"},null,{"$error":"#REF!"},{"$error":"#REF!"},{"$error":"#REF!"},{"$f":"K801","v":"Sub20"}]
["'Sub20'!A123","'Sub20'!B123","'Sub20'!C123",123,{"$f":"K801","v":"Sub20"},null,{"$error":"#REF!"},{"$error":"#REF!"},{"$error":"#REF!"},{"$f":"K801","v":"Sub20"}]
["'Sub20'!A124","'Sub20'!B124","'Sub20'!C124",124,{"$f":"K801","v":"Sub20"},null,{"$error":"#REF!"},{"$error":"#REF!"},{"$error":"#REF!"},{"$f":"K801","v":"Sub20"}]
["'Sub20'!A125","'Sub20'!B125","'Sub20'!C125",125,{"$f":"K801","v":"Sub20"},null,{"$error":"#REF!"},{"$error":"#REF!"},{"$error":"#REF!"},{"$f":"K801","v":"Sub20"}]
["'Sub20'!A126","'Sub20'!B126","'Sub20'!C126",126,{"$f":"K801","v":"Sub20"},null,{"$error":"#REF!"},{"$error":"#REF!"},{"$error":"#REF!"},{"$f":"K801","v":"Sub20"}]
["'Sub20'!A127","'Sub20'!B127","'Sub20'!C127",127,{"$f":"K801","v":"Sub20"},null,{"$error":"#REF!"},{"$error":"#REF!"},{"$error":"#REF!"},{"$f":"K801","v":"Sub20"}]
["'Sub20'!A128","'Sub20'!B128","'Sub20'!C128",128,{"$f":"K801","v":"Sub20"},null,{"$error":"#REF!"},{"$error":"#REF!"},{"$error":"#REF!"},{"$f":"K801","v":"Sub20"}]
["'Sub20'!A129","'Sub20'!B129","'Sub20'!C129",129,{"$f":"K801","v":"Sub20"},null,{"$error":"#REF!"},{"$error":"#REF!"},{"$error":"#REF!"},{"$f":"K801","v":"Sub20"}]
["'Sub20'!A130","'Sub20'!B130","'Sub20'!C130",130,{"$f":"K801","v":"Sub20"},null,{"$error":"#REF!"},{"$error":"#REF!"},{"$error":"#REF!"},{"$f":"K801","v":"Sub20"}]
["'Sub20'!A131","'Sub20'!B131","'Sub20'!C131",131,{"$f":"K801","v":"Sub20"},null,{"$error":"#REF!"},{"$error":"#REF!"},{"$error":"#REF!"},{"$f":"K801","v":"Sub20"}]
["'Sub20'!A132","'Sub20'!B132","'Sub20'!C132",132,{"$f":"K801","v":"Sub20"},null,{"$f":"IF(INDIRECT(A825,1)<>\"\",INDIRECT(A825,1),\"\")","v":{"$error":"#REF!"}},{"$error":"#REF!"},{"$error":"#REF!"},{"$f":"K801","v":"Sub20"}]
["'Sub20'!A133","'Sub20'!B133","'Sub20'!C133",133,{"$f":"K801","v":"Sub20"},null,{"$error":"#REF!"},{"$error":"#REF!"},{"$error":"#REF!"},{"$f":"K801","v":"Sub20"}]
["'Sub20'!A134","'Sub20'!B134","'Sub20'!C134",134,{"$f":"K801","v":"Sub20"},null,{"$error":"#REF!"},{"$error":"#REF!"},{"$error":"#REF!"},{"$f":"K801","v":"Sub20"}]
["'Sub20'!A135","'Sub20'!B135","'Sub20'!C135",135,{"$f":"K801","v":"Sub20"},null,{"$error":"#REF!"},{"$error":"#REF!"},{"$error":"#REF!"},{"$f":"K801","v":"Sub20"}]
["'Sub20'!A136","'Sub20'!B136","'Sub20'!C136",136,{"$f":"K801","v":"Sub20"},null,{"$error":"#REF!"},{"$error":"#REF!"},{"$error":"#REF!"},{"$f":"K801","v":"Sub20"}]
["'Sub20'!A137","'Sub20'!B137","'Sub20'!C137",137,{"$f":"K801","v":"Sub20"},null,{"$error":"#REF!"},{"$error":"#REF!"},{"$error":"#REF!"},{"$f":"K801","v":"Sub20"}]
["'Sub20'!A138","'Sub20'!B138","'Sub20'!C138",138,{"$f":"K801","v":"Sub20"},null,{"$error":"#REF!"},{"$error":"#REF!"},{"$error":"#REF!"},{"$f":"K801","v":"Sub20"}]
["'Sub20'!A139","'Sub20'!B139","'Sub20'!C139",139,{"$f":"K801","v":"Sub20"},null,{"$error":"#REF!"},{"$error":"#REF!"},{"$error":"#REF!"},{"$f":"K801","v":"Sub20"}]
["'Sub20'!A140","'Sub20'!B140","'Sub20'!C140",140,{"$f":"K801","v":"Sub20"},null,{"$error":"#REF!"},{"$error":"#REF!"},{"$error":"#REF!"},{"$f":"K801","v":"Sub20"}]
["'Sub20'!A141","'Sub20'!B141","'Sub20'!C141",141,{"$f":"K801","v":"Sub20"},null,{"$error":"#REF!"},{"$error":"#REF!"},{"$error":"#REF!"},{"$f":"K801","v":"Sub20"}]
["'Sub20'!A142","'Sub20'!B142","'Sub20'!C142",142,{"$f":"K801","v":"Sub20"},null,{"$error":"#REF!"},{"$error":"#REF!"},{"$error":"#REF!"},{"$f":"K801","v":"Sub20"}]
["'Sub20'!A143",{"$f":"ADDRESS($D836,2,4,1,$E836)","v":"'Sub20'!B143"},{"$f":"ADDRESS($D836,3,4,1,$E836)","v":"'Sub20'!C143"},143,{"$f":"K801","v":"Sub20"},null,{"$error":"#REF!"},{"$f":"IF(INDIRECT(B836,1)<>\"\",IF(INDIRECT(B836,1)=\"LUMP\", \"LUMP\", INDIRECT(B836,1)),\"\")","v":{"$error":"#REF!"}},{"$error":"#REF!"},{"$f":"K801","v":"Sub20"}]
["'Sub20'!A144","'Sub20'!B144","'Sub20'!C144",144,{"$f":"K801","v":"Sub20"},null,{"$error":"#REF!"},{"$error":"#REF!"},{"$error":"#REF!"},{"$f":"K801","v":"Sub20"}]
["'Sub20'!A145","'Sub20'!B145","'Sub20'!C145",145,{"$f":"K801","v":"Sub20"},null,{"$error":"#REF!"},{"$error":"#REF!"},{"$error":"#REF!"},{"$f":"K801","v":"Sub20"}]
["'Sub20'!A146","'Sub20'!B146","'Sub20'!C146",146,{"$f":"K801","v":"Sub20"},null,{"$error":"#REF!"},{"$error":"#REF!"},{"$error":"#REF!"},{"$f":"K801","v":"Sub20"}]
["'Sub20'!A147","'Sub20'!B147","'Sub20'!C147",147,{"$f":"K801","v":"Sub20"},null,{"$error":"#REF!"},{"$error":"#REF!"},{"$error":"#REF!"},{"$f":"K801","v":"Sub20"}]
["'Sub20'!A148","'Sub20'!B148","'Sub20'!C148",148,{"$f":"K801","v":"Sub20"},null,{"$error":"#REF!"},{"$error":"#REF!"},{"$error":"#REF!"},{"$f":"K801","v":"Sub20"}]
["'Sub20'!A149","'Sub20'!B149","'Sub20'!C149",149,{"$f":"K801","v":"Sub20"},null,{"$error":"#REF!"},{"$error":"#REF!"},{"$error":"#REF!"},{"$f":"K801","v":"Sub20"}]

{"sheet":"Sub01","index":5,"n_rows":156,"n_cols":42,"rows_kept":156,"cut":false,"hidden":false,"merged":[[79,0,79,11],[6,41,7,41],[6,34,7,34],[6,40,7,40],[6,35,7,35],[6,32,7,32],[6,33,7,33],[6,36,7,36],[6,37,7,37],[6,38,7,38],[6,28,7,28],[6,31,7,31],[6,30,7,30],[6,39,7,39],[6,29,7,29]]}
[]
[]
[]
[]
["ROUTE","SHEET\nNO.","STATION",null,null,null,"WIDTH",null,"SIDE","LENGTH","AVERAGE WIDTH","SURFACE \nAREA\n(CA = CADD GENERATED AREA)","","","","204","254","","301","304","","407","407","441","441","","617","408","","","","","","","","","","","","","",""]
[null,null,null,null,null,null,null,null,null,null,null,null,null,"","",null,null,"",6,6,null,"Rate - 0.085","Rate - 0.055",1.25,1.75,"","T=2.00\"","Rate - 0.04","","","","","","","","","","","","","",""]
[null,null,null,null,null,null,null,null,null,null,null,null,"","","","SUBGRADE COMPACTION ","PAVEMENT PLANING, ASPHALT CONCRETE (1 1/4\") ","","ASPHALT CONCRETE BASE, PG64-22, (449) ","AGGREGATE BASE ","","NON-TRACKING TACK COAT ","NON-TRACKING TACK COAT ","ASPHALT CONCRETE SURFACE COURSE, TYPE 1, (448), PG70-22M, AS PER PLAN  ","ASPHALT CONCRETE INTERMEDIATE COURSE, TYPE 2, (448) ","","COMPACTED AGGREGATE, AS PER PLAN ","PRIME COAT, AS PER PLAN ","","","","","","","","","","","","","",""]
[]
[null,null,"FROM",null,"TO",null,"FROM","FT",null,"FT","FT","SF","","","","SY","SY","","CY","CY","","GAL","GAL","CY","CY","","CY","GAL","","","","","","","","","","","","","",""]
["SR-170",null,null,21097,null,21584.42,null,null,"LT/RT",487.5,null,13497.800000000001,null,null,null,null,1499.8000000000002,null,null,null,null,127.5,null,52.1,null,null,12.100000000000001,9]
[]
["SR-170",null,null,21584.42,null,28615,null,24,"LT/RT",7030.6,null,168734,null,null,null,22654.100000000002,null,null,3127.5,4038.9,null,null,3096.3,651.6,912.2]
[]
["MIDDLETOWN RD",null,null,39906.730000000003,null,39984.28,null,20,"LT/RT",77.600000000000009,null,1551,null,null,null,172.4,null,null,28.8,28.8,null,null,28.5,6,8.4]
["MIDDLETOWN RD",null,null,39906.730000000003,null,39975.81,null,null,"LT",69.100000000000009,null,1069,null,null,null,138,null,null,19.8,24.200000000000003,null,null,19.600000000000001,4.2,5.8000000000000007]
["MIDDLETOWN RD",null,null,39906.730000000003,null,39992.74,null,null,"RT",86.100000000000009,null,334,null,null,null,61.1,null,null,6.2,14,null,null,6.2,1.3,1.9000000000000001]
[]
["MIDDLETOWN RD",null,null,40015.72,null,40163.5,null,24,"LT/RT",147.80000000000001,null,3546.8,null,null,null,394.1,null,null,65.7,78.900000000000006,null,null,65.100000000000009,13.700000000000001,19.200000000000003]
["MIDDLETOWN RD",null,null,39987.589999999997,null,40033.39,null,null,"LT",45.900000000000006,null,106,null,null,null,24.6,null,null,2,5.3000000000000007,null,null,2,0.5,0.60000000000000009]
["MIDDLETOWN RD",null,null,40060.49,null,40077.51,null,null,"RT",17.100000000000001,null,574.30000000000007,null,null,null,68.600000000000009,null,null,10.700000000000001,13.700000000000001,null,null,10.600000000000001,2.3000000000000003,3.2]
["MIDDLETOWN RD",null,null,40163.5,null,40200,null,null,"LT",36.5,null,90.4,null,null,null,20.200000000000003,null,null,1.7000000000000002,2.6,null,null,1.7000000000000002,0.4,0.5]
[]
["MIDDLETOWN RD",null,null,40163.5,null,40200,null,null,"LT/RT",36.5,null,695.7,null,null,null,null,77.300000000000011,null,null,null,null,6.6000000000000005,null,2.7,null,null,1,1]
[]
["STRUTHERS RD",null,null,50013.47,null,50095,null,22,"LT/RT",81.600000000000009,null,1793.7,null,null,null,199.3,null,null,33.300000000000004,38.300000000000004,null,null,32.9,7,9.7000000000000011]
["STRUTHERS RD",null,null,50042.87,null,50071.32,null,null,"LT",28.5,null,626.5,null,null,null,77.600000000000009,null,null,11.700000000000001,15.5,null,null,11.5,2.5,3.4000000000000004]
["STRUTHERS RD",null,null,50000,null,50033.599999999999,null,null,"RT",33.6,null,111.2,null,null,null,21.700000000000003,null,null,2.1,4.9000000000000004,null,null,2.1,0.5,0.70000000000000007]
[]
["SYCAMORE DR",null,null,60012,null,60085,null,20,"LT/RT",73,null,1460,null,null,null,162.30000000000001,null,null,27.1,34.300000000000004,null,null,26.8,5.7,7.9]
["SYCAMORE DR",null,null,60012,null,60032,null,null,"LT",20,null,85.800000000000011,null,null,null,15.100000000000001,null,null,1.6,29.400000000000002,null,null,1.6,0.4,0.5]
["SYCAMORE DR",null,null,60012,null,60027,null,null,"RT",15,null,48.300000000000004,null,null,null,9.6000000000000014,null,null,0.9,2.2000000000000002,null,null,0.9,0.2,0.30000000000000004]
[]
["WOODLAND DR",null,null,89940,null,89987.87,null,22,"LT/RT",47.900000000000006,null,1053.2,null,null,null,117.10000000000001,null,null,19.600000000000001,21,null,null,19.400000000000002,4.1000000000000005,5.7]
["WOODLAND DR",null,null,89949.11,null,89980.74,null,null,"LT",31.700000000000003,null,310.60000000000002,null,null,null,43.300000000000004,null,null,5.8000000000000007,9.1,null,null,5.7,1.2000000000000002,1.7000000000000002]
["WOODLAND DR",null,null,89959.49,null,89994.1,null,null,"RT",34.700000000000003,null,184.5,null,null,null,30.200000000000003,null,null,3.5,6.4,null,null,3.4000000000000004,0.8,1]
[]
["OHLIN DR",null,null,70012,null,70135,null,21,"LT/RT",123,null,2583,null,null,null,287,null,null,47.900000000000006,51.300000000000004,null,null,47.400000000000006,10,14,null,1.4000000000000001,1]
["OHLIN DR",null,null,70012,null,70043.990000000005,null,null,"LT",32,null,241.70000000000002,null,null,null,35.800000000000004,null,null,4.5,7.7,null,null,4.5,1,1.4000000000000001]
["OHLIN DR",null,null,70012,null,70050.59,null,null,"RT",38.6,null,292,null,null,null,43.2,null,null,5.5,8.9,null,null,5.4,1.2000000000000002,1.6]
[]
["FOSTER DR",null,null,80012,null,80090,null,23,"LT/RT",78,null,1794,null,null,null,199.4,null,null,33.300000000000004,36.6,null,null,32.9,7,9.7000000000000011,null,1.1000000000000001,1]
["FOSTER DR",null,null,80012,null,80047,null,null,"LT",35,null,263,null,null,null,39,null,null,4.9000000000000004,8.2000000000000011,null,null,4.9000000000000004,1.1000000000000001,1.5]
["FOSTER DR",null,null,80012,null,80046.929999999993,null,null,"RT",35,null,261.2,null,null,null,38.800000000000004,null,null,4.9000000000000004,8.2000000000000011,null,null,4.8000000000000007,1.1000000000000001,1.5]
[]
["E CALLA RD",null,null,1000,null,1065.17,null,23,"LT/RT",65.2,null,1499,null,null,null,166.60000000000002,null,null,27.8,30.400000000000002,null,null,27.5,5.8000000000000007,8.1]
["E CALLA RD",null,null,1017.42,null,1057.96,null,null,"LT",40.6,null,372,null,null,null,52.6,null,null,6.9,9.7000000000000011,null,null,6.9,1.5,2.1]
["E CALLA RD",null,null,1043.42,null,1073.03,null,null,"RT",29.700000000000003,null,134,null,null,null,23.200000000000003,null,null,2.5,5.9,null,null,2.5,0.60000000000000009,0.8]
[]
["E CALLA RD",null,null,1093.8800000000001,null,1225,null,25,"LT/RT",131.20000000000002,null,3278,null,null,null,364.3,null,null,60.800000000000004,66.7,null,null,60.1,12.700000000000001,17.8]
["E CALLA RD",null,null,1064.8499999999999,null,1123.58,null,null,"LT",58.800000000000004,null,222.20000000000002,null,null,null,41.1,null,null,4.2,8.5,null,null,4.1000000000000005,0.9,1.3]
["E CALLA RD",null,null,1148.55,null,1220.55,null,null,"RT",72,null,1924,null,null,null,233.8,null,null,35.700000000000003,43.5,null,null,35.300000000000004,7.5,10.4]
[]
[]
[]
[]
[]
[]
[]
[]
[]
[]
[]
[]
[]
[]
[]
[]
[]
[]
["SUBTOTAL",null,null,null,null,null,null,null,null,null,null,null,null,null,null,25734.100000000002,1577.1000000000001,null,3606.9,4653.1000000000004,null,134.1,3570.6000000000004,807.6,1052.9000000000001,null,15.600000000000001,12]
["TOTALS CARRIED TO SUBSUMMARY",null,null,null,null,null,null,null,null,null,null,null,null,null,null,25735,1578,null,3607,4654,null,135,3571,808,1053,null,16,12]
["TOTALS CARRIED TO GENERAL SUMMARY",null,null,null,null,null,null,null,null,null,null,null,{"$f":"IF(M9<>\"\", IF(   ISERROR(VLOOKUP(M156,Combine!$M$8:$Q$203,5,0))=TRUE,\"\",IF(M9=\"LUMP\", \"LUMP\", VLOOKUP(M156,Combine!$M$8:$Q$203,5,0) ) ), \"\")","v":""},{"$f":"IF(N9<>\"\", IF(   ISERROR(VLOOKUP(N156,Combine!$M$8:$Q$203,5,0))=TRUE,\"\",IF(N9=\"LUMP\", \"LUMP\", VLOOKUP(N156,Combine!$M$8:$Q$203,5,0) ) ), \"\")","v":""},{"$f":"IF(O9<>\"\", IF(   ISERROR(VLOOKUP(O156,Combine!$M$8:$Q$203,5,0))=TRUE,\"\",IF(O9=\"LUMP\", \"LUMP\", VLOOKUP(O156,Combine!$M$8:$Q$203,5,0) ) ), \"\")","v":""},{"$f":"IF(P9<>\"\", IF(   ISERROR(VLOOKUP(P156,Combine!$M$8:$Q$203,5,0))=TRUE,\"\",IF(P9=\"LUMP\", \"LUMP\", VLOOKUP(P156,Combine!$M$8:$Q$203,5,0) ) ), \"\")","v":25735},{"$f":"IF(Q9<>\"\", IF(   ISERROR(VLOOKUP(Q156,Combine!$M$8:$Q$203,5,0))=TRUE,\"\",IF(Q9=\"LUMP\", \"LUMP\", VLOOKUP(Q156,Combine!$M$8:$Q$203,5,0) ) ), \"\")","v":1578},{"$f":"IF(R9<>\"\", IF(   ISERROR(VLOOKUP(R156,Combine!$M$8:$Q$203,5,0))=TRUE,\"\",IF(R9=\"LUMP\", \"LUMP\", VLOOKUP(R156,Combine!$M$8:$Q$203,5,0) ) ), \"\")","v":""},{"$f":"IF(S9<>\"\", IF(   ISERROR(VLOOKUP(S156,Combine!$M$8:$Q$203,5,0))=TRUE,\"\",IF(S9=\"LUMP\", \"LUMP\", VLOOKUP(S156,Combine!$M$8:$Q$203,5,0) ) ), \"\")","v":3607},{"$f":"IF(T9<>\"\", IF(   ISERROR(VLOOKUP(T156,Combine!$M$8:$Q$203,5,0))=TRUE,\"\",IF(T9=\"LUMP\", \"LUMP\", VLOOKUP(T156,Combine!$M$8:$Q$203,5,0) ) ), \"\")","v":4654},{"$f":"IF(U9<>\"\", IF(   ISERROR(VLOOKUP(U156,Combine!$M$8:$Q$203,5,0))=TRUE,\"\",IF(U9=\"LUMP\", \"LUMP\", VLOOKUP(U156,Combine!$M$8:$Q$203,5,0) ) ), \"\")","v":""},{"$f":"V70+W70","v":3704.7000000000003},null,{"$f":"IF(X9<>\"\", IF(   ISERROR(VLOOKUP(X156,Combine!$M$8:$Q$203,5,0))=TRUE,\"\",IF(X9=\"LUMP\", \"LUMP\", VLOOKUP(X156,Combine!$M$8:$Q$203,5,0) ) ), \"\")","v":808},{"$f":"IF(Y9<>\"\", IF(   ISERROR(VLOOKUP(Y156,Combine!$M$8:$Q$203,5,0))=TRUE,\"\",IF(Y9=\"LUMP\", \"LUMP\", VLOOKUP(Y156,Combine!$M$8:$Q$203,5,0) ) ), \"\")","v":1053},{"$f":"IF(Z9<>\"\", IF(   ISERROR(VLOOKUP(Z156,Combine!$M$8:$Q$203,5,0))=TRUE,\"\",IF(Z9=\"LUMP\", \"LUMP\", VLOOKUP(Z156,Combine!$M$8:$Q$203,5,0) ) ), \"\")","v":""},{"$f":"IF(AA9<>\"\", IF(   ISERROR(VLOOKUP(AA156,Combine!$M$8:$Q$203,5,0))=TRUE,\"\",IF(AA9=\"LUMP\", \"LUMP\", VLOOKUP(AA156,Combine!$M$8:$Q$203,5,0) ) ), \"\")","v":16},{"$f":"IF(AB9<>\"\", IF(   ISERROR(VLOOKUP(AB156,Combine!$M$8:$Q$203,5,0))=TRUE,\"\",IF(AB9=\"LUMP\", \"LUMP\", VLOOKUP(AB156,Combine!$M$8:$Q$203,5,0) ) ), \"\")","v":12},{"$f":"IF(AC9<>\"\", IF(   ISERROR(VLOOKUP(AC156,Combine!$M$8:$Q$203,5,0))=TRUE,\"\",IF(AC9=\"LUMP\", \"LUMP\", VLOOKUP(AC156,Combine!$M$8:$Q$203,5,0) ) ), \"\")","v":""},{"$f":"IF(AD9<>\"\", IF(   ISERROR(VLOOKUP(AD156,Combine!$M$8:$Q$203,5,0))=TRUE,\"\",IF(AD9=\"LUMP\", \"LUMP\", VLOOKUP(AD156,Combine!$M$8:$Q$203,5,0) ) ), \"\")","v":""},{"$f":"IF(AE9<>\"\", IF(   ISERROR(VLOOKUP(AE156,Combine!$M$8:$Q$203,5,0))=TRUE,\"\",IF(AE9=\"LUMP\", \"LUMP\", VLOOKUP(AE156,Combine!$M$8:$Q$203,5,0) ) ), \"\")","v":""},{"$f":"IF(AF9<>\"\", IF(   ISERROR(VLOOKUP(AF156,Combine!$M$8:$Q$203,5,0))=TRUE,\"\",IF(AF9=\"LUMP\", \"LUMP\", VLOOKUP(AF156,Combine!$M$8:$Q$203,5,0) ) ), \"\")","v":""},{"$f":"IF(AG9<>\"\", IF(   ISERROR(VLOOKUP(AG156,Combine!$M$8:$Q$203,5,0))=TRUE,\"\",IF(AG9=\"LUMP\", \"LUMP\", VLOOKUP(AG156,Combine!$M$8:$Q$203,5,0) ) ), \"\")","v":""},{"$f":"IF(AH9<>\"\", IF(   ISERROR(VLOOKUP(AH156,Combine!$M$8:$Q$203,5,0))=TRUE,\"\",IF(AH9=\"LUMP\", \"LUMP\", VLOOKUP(AH156,Combine!$M$8:$Q$203,5,0) ) ), \"\")","v":""},{"$f":"IF(AI9<>\"\", IF(   ISERROR(VLOOKUP(AI156,Combine!$M$8:$Q$203,5,0))=TRUE,\"\",IF(AI9=\"LUMP\", \"LUMP\", VLOOKUP(AI156,Combine!$M$8:$Q$203,5,0) ) ), \"\")","v":""},{"$f":"IF(AJ9<>\"\", IF(   ISERROR(VLOOKUP(AJ156,Combine!$M$8:$Q$203,5,0))=TRUE,\"\",IF(AJ9=\"LUMP\", \"LUMP\", VLOOKUP(AJ156,Combine!$M$8:$Q$203,5,0) ) ), \"\")","v":""},{"$f":"IF(AK9<>\"\", IF(   ISERROR(VLOOKUP(AK156,Combine!$M$8:$Q$203,5,0))=TRUE,\"\",IF(AK9=\"LUMP\", \"LUMP\", VLOOKUP(AK156,Combine!$M$8:$Q$203,5,0) ) ), \"\")","v":""},{"$f":"IF(AL9<>\"\", IF(   ISERROR(VLOOKUP(AL156,Combine!$M$8:$Q$203,5,0))=TRUE,\"\",IF(AL9=\"LUMP\", \"LUMP\", VLOOKUP(AL156,Combine!$M$8:$Q$203,5,0) ) ), \"\")","v":""},{"$f":"IF(AM9<>\"\", IF(   ISERROR(VLOOKUP(AM156,Combine!$M$8:$Q$203,5,0))=TRUE,\"\",IF(AM9=\"LUMP\", \"LUMP\", VLOOKUP(AM156,Combine!$M$8:$Q$203,5,0) ) ), \"\")","v":""},{"$f":"IF(AN9<>\"\", IF(   ISERROR(VLOOKUP(AN156,Combine!$M$8:$Q$203,5,0))=TRUE,\"\",IF(AN9=\"LUMP\", \"LUMP\", VLOOKUP(AN156,Combine!$M$8:$Q$203,5,0) ) ), \"\")","v":""},{"$f":"IF(AO9<>\"\", IF(   ISERROR(VLOOKUP(AO156,Combine!$M$8:$Q$203,5,0))=TRUE,\"\",IF(AO9=\"LUMP\", \"LUMP\", VLOOKUP(AO156,Combine!$M$8:$Q$203,5,0) ) ), \"\")","v":""},{"$f":"IF(AP9<>\"\", IF(   ISERROR(VLOOKUP(AP156,Combine!$M$8:$Q$203,5,0))=TRUE,\"\",IF(AP9=\"LUMP\", \"LUMP\", VLOOKUP(AP156,Combine!$M$8:$Q$203,5,0) ) ), \"\")","v":""}]
[]
[]
[]
[]
[]
[]
[null,null,null,null,null,null,null,null,null,null,null,null,null,null,"Merge cells in the row below if neccesary to total adjacent columns of the same item.  Hide rows 72-79."]
[{"$f":"A72","v":"TOTALS CARRIED TO GENERAL SUMMARY"},null,null,null,null,null,null,null,null,null,null,null,{"$f":"IF(M71<>\"\", M71, \"\")","v":""},{"$f":"IF(N71<>\"\", N71, \"\")","v":""},"",25735,1578,"",3607,4654,"",135,3571,808,1053,"",16,12,"","","","","","","","","","","","","",""]
[]
[]
[]
[]
[]
[]
[]
[]
[]
[]
[]
[]
[]
[]
[]
[]
[]
[]
[]
[]
[]
[]
[]
[]
[]
[]
[]
[""]
[""]
[""]
["204E10000",25735,"AA"]
["254E010001",1578,"DD"]
[""]
["301E56000",3607,"DD"]
["304E20000",4654,"DD"]
[""]
["407E20000",135,"dd"]
["407E20000",3571,"DD"]
["441E501011",808,"DD"]
["441E50300",1053,"DD"]
[""]
["617E10101",16,"dd"]
["408E10001",12,"dd"]
[""]
[""]
[""]
[""]
[""]
[""]
[""]
[""]
[""]
[""]
[""]
[""]
[""]
[""]
[]
[]
[]
[]
[]
[]
[]
[]
[]
[]
[]
[]
[]
[]
[]
[]
[]
[]
[null,null,null,null,null,null,null,null,null,null,null,null,"","","","AA20410000","DD254010001","","DD30156000","DD30420000","","dd40720000","DD40720000","DD441501011","DD44150300","","dd61710101","dd40810001","","","",null,null,null,null,null,null,null,null,null,null,""]