{"text_format":"1","workbook":"xlsx","n_sheets":20,"sheets":["REPORT","CSF","GRID>GRND","OWNERS","OSIP","MON TABLE","GPS_IMPORT","SV1","SV2","SV3","SV4","SV5","CNTL1","CNTL2","CNTL3","LEVEL RUN","TIN","DATABASE","FINAL GRID COORDINATES PENZC","FINAL GROUND COORDINATES PENZC"],"not_rendered":{"charts":0,"images":1,"macros":1,"external_links":1,"defined_names":62,"comments":0,"pivot_tables":0},"unopened":[],"bounds":{"document_bytes":16777216,"sheet_cells":100000,"rows_first":2000,"rows_last":500,"rows_between":2000,"halvings":0,"cell_chars":16384,"cell_head_chars":4096},"cells_cut":0,"cells_raw":0,"read":"whole","date_system":"1900"}

{"sheet":"REPORT","index":0,"n_rows":56,"n_cols":7,"rows_kept":56,"cut":false,"hidden":false,"merged":[[55,0,55,4],[52,0,52,1],[10,0,10,1],[10,2,10,4],[11,0,11,1],[11,2,11,4],[12,0,12,1],[13,0,13,1],[13,2,13,4],[14,0,14,1],[14,2,14,4],[15,0,15,1],[15,2,15,4],[16,0,16,1],[16,2,16,4],[53,0,53,1],[29,8,29,9],[27,8,27,9],[29,0,29,1],[29,2,29,3],[54,0,54,4],[53,2,53,4],[52,2,52,4],[51,2,51,4],[50,2,50,4],[51,0,51,1],[48,2,48,4],[37,0,37,4],[31,2,31,4],[50,0,50,1],[48,0,48,1],[49,0,49,1],[0,0,0,4],[3,1,3,4],[7,0,7,4],[8,0,8,4],[9,0,9,1],[9,2,9,4],[5,0,5,4],[6,0,6,2],[1,1,1,2],[4,1,4,4],[26,2,26,3],[30,0,30,4],[47,2,47,4],[31,0,31,1],[32,0,32,4],[46,0,46,4],[38,0,38,4],[36,0,36,4],[27,0,27,1],[27,2,27,3],[28,2,28,3],[28,0,28,1],[47,0,47,1],[39,0,39,4],[43,1,43,2],[42,0,42,4],[25,0,25,3],[20,1,20,3],[23,0,23,3],[17,2,17,4],[19,2,19,4],[21,0,21,3],[24,0,24,3],[22,0,22,3],[18,2,18,4],[49,2,49,4],[41,0,41,4],[40,0,40,4],[44,0,44,4],[45,0,45,1],[45,3,45,4]]}
["Surveyor’s Report"]
["Project: ","FRA-71-29.4",null,"PID:",106471]
[]
["Scope: ","Aerial Mapping"]
["Type:"]
[]
["Gray boxes denote INPUT",null,null,null,"Tan boxes denote OUTPUT (check)"]
[]
["Datum and Coordinate System",null,null,null,null,null,"Type:"]
["Coordinate System: ",null,"Ohio State Plane, South Zone",null,null,null,"(Select from List)"]
["Horizontal Reference Datum: ",null,"NAD83 (2011)",null,null,null,"Bridge Monitoring"]
["Ellipsoid: ",null,"GRS80",null,null,null,"Bridge Rehab"]
["Grid to Ground Multiplier (1/CSF):",null,1.0000901799999999,"Factor is 8 decimal places per Survey & Mapping Specifications.",null,null,"Bridge Replacement"]
["Origin of Combined Scale Factor: ",null,"(0,0)",null,null,null,"Culvert Rehab"]
["Vertical Reference Datum: ",null,"NAVD88",null,null,null,"Highway Widening"]
["Geoid Model: ",null,"Geoid 12B",null,null,null,"Slope Repair"]
["Units: ",null,"US Survey Feet (sft)",null,null,null,"Stream Maintenance"]
["Original Survey Subdivision:"]
["Township:"]
["Quarter Section/Section/Lot:"]
["Files",null,null,null,"Description"]
[]
[]
[]
[]
[]
[]
[]
[]
[]
["References"]
["Alignment based on the following plan:"]
["Other references used:"]
[]
[]
[]
["Equipment Maintenance"]
["Equipment maintenance logs are on file at the Ohio Department of Transportation, Central Office"]
["Methodology and Equipment Used"]
[]
[]
[]
[]
[]
[]
[]
[]
["Report Submitted/Prepared by: ",null,"Kolton Wilson"]
["Date Submitted:",null,"2019-04-25"]
["Surveying Performed by: ",null,"Matthew O'Bryan"]
["Surveying Performed by: ",null,"David Ogden"]
["Checked By:",null,"David Ogden"]
[]
[]
["DGN Overview Map"]
["Insert close-up screen shot of combined DGN here"]

{"sheet":"CSF","index":1,"n_rows":311,"n_cols":17,"rows_kept":311,"cut":false,"hidden":false,"merged":[[47,0,47,6],[48,0,49,4],[48,5,48,6],[42,3,42,4],[42,5,42,6],[43,3,43,4],[44,0,44,6],[45,0,46,4],[45,5,45,6],[41,3,41,4],[34,0,34,6],[35,0,35,1],[35,3,35,4],[35,5,35,6],[36,3,36,4],[37,3,37,4],[37,5,37,6],[38,3,38,4],[39,0,39,6],[40,0,40,1],[40,3,40,4],[40,5,40,6],[31,0,31,6],[32,0,32,1],[33,0,33,1],[33,2,33,6],[29,0,29,6],[30,0,30,6],[26,0,26,6],[27,0,27,1],[27,2,27,6],[28,0,28,1],[28,2,28,6],[25,0,25,1],[25,2,25,6],[18,0,18,1],[19,0,19,1],[19,2,19,6],[20,0,20,6],[21,0,21,1],[22,0,22,1],[22,2,22,6],[23,0,23,6],[24,0,24,1],[24,2,24,6],[17,0,17,1],[11,0,11,1],[11,2,11,4],[11,5,11,6],[12,0,12,6],[13,0,13,1],[14,0,14,1],[14,2,14,6],[15,0,15,6],[16,0,16,1],[8,0,8,1],[8,5,8,6],[10,0,10,1],[10,2,10,4],[10,5,10,6],[4,0,4,5],[5,0,5,2],[5,3,5,6],[6,0,6,5],[7,0,7,1],[7,5,7,6],[3,0,3,1],[3,2,3,6],[0,0,0,6],[0,10,0,11],[1,1,1,2],[1,4,1,6],[2,0,2,6]]}
["Combined Scale Factor Calculations",null,null,null,null,null,null,null,"Zone","Index Value","Project Latitude",null,"Radius of the Earth (meters)","Tabular Difference","Scale Factor (k)","Differences","Coordinate System List"]
["Project: ",{"$f":"REPORT!B2","v":"FRA-71-29.4"},null,"PID:",{"$f":"REPORT!E2","v":106471},null,null,null,"NZ",3940,39,40,7485451.5980000002,30.84836,1.0002349100000001]
[null,null,null,null,null,null,null,null,"NZ",3941,39,41,7483600.6969999997,30.848230000000001,1.0002279300000001,{"$f":"O2-O3","v":6.9799999999897722E-6},"State Plane Coordinate System: Ohio North (3401)"]
["Horizontal Datum: NAD83",null,"State Plane Coordinate System: Ohio South (3402)",null,null,null,null,null,"NZ",3942,39,42,7481749.8030000003,30.848109999999998,1.00022104,6.8900000000926553E-6,"State Plane Coordinate System: Ohio South (3402)"]
[null,null,null,null,null,null,null,null,"NZ",3943,39,43,7479898.9160000002,30.847989999999999,1.00021424,6.7999999999734939E-6]
["Gray boxes denote INPUT",null,null,"Tan boxes denote OUTPUT (check)",null,null,null,null,"NZ",3944,39,44,7478048.0369999995,30.84787,1.0002075100000001,6.7299999999548277E-6]
[null,null,null,null,null,null,null,null,"NZ",3945,39,45,7476197.165,30.847760000000001,1.00020087,6.6400000000577108E-6]
[null,null,"Input Deg.","Min.","Sec.","Zone Parameters:",null,null,"NZ",3946,39,46,7474346.2989999996,30.847650000000002,1.0001943099999999,6.5600000000998193E-6]
["Project Mean Latitude (DMS):",null,39,25,41,{"$f":"IF(C4=\"State Plane Coordinate System: Ohio North (3401)\",\n\"k = 1 at lats. 40⁰ 26' and 41⁰ 42'\",\n\"k = 1 at lats. 38⁰ 44' and 40⁰ 20'\")","v":"k = 1 at lats. 38⁰ 44' and 40⁰ 20'"},null,null,"NZ",3947,39,47,7472495.4400000004,30.847539999999999,1.00018783,6.4799999999198832E-6]
[{"$f":"ISBLANK(D9)","v":false},{"$f":"ISBLANK(E9)","v":false},null,{"$f":"IF(OR(A10,B10)=TRUE,\"Minute and second fields must be populated\",\"\")","v":""},null,null,null,null,"NZ",3948,39,48,7470644.5880000005,30.847429999999999,1.00018144,6.3900000000227664E-6]
[null,null,"Input Ellipsoid Height:",null,null,{"$f":"IF(C4=\"State Plane Coordinate System: Ohio North (3401)\",\n\"Origin at 82⁰ 30' long., 39⁰ 40' lat.\",\n\"Origin at 82⁰ 30' long., 38⁰ 00' lat.\")","v":"Origin at 82⁰ 30' long., 38⁰ 00' lat."},null,null,"NZ",3949,39,49,7468793.7419999996,30.84732,1.0001751299999999,6.3100000000648748E-6]
["Project Mean Height (ft):",null,550,null,null,"Origin coords: x=600,000m, y=0m",null,null,"NZ",3950,39,50,7466942.9029999999,30.84722,1.0001689,6.2299999998849387E-6]
[null,null,null,null,null,null,null,null,"NZ",3951,39,51,7465092.0690000001,30.84712,1.00016276,6.1399999999878219E-6]
[null,null,"Radius of the Earth * (Radius of the Earth + Proj. Mean Elev.) =",null,null,null,null,null,"NZ",3952,39,52,7463241.2419999996,30.84703,1.0001567,6.0600000000299303E-6]
["Sea Level Factor:",null,{"$f":"TRUNC(20906000/(20906000+C12),9)","v":0.99997369199999997},null,null,null,null,null,"NZ",3953,39,53,7461390.4199999999,30.84693,1.0001507199999999,5.9800000000720388E-6]
[null,null,null,null,null,null,null,null,"NZ",3954,39,54,7459539.6040000003,30.84684,1.00014482,5.8999999998921027E-6]
[null,null,"Tabular data proportioned according to the number of seconds:",null,null,null,null,null,"NZ",3955,39,55,7457688.7939999998,30.84675,1.0001390100000001,5.8099999999949858E-6]
[null,null,{"$f":"IF($C$4=\"State Plane Coordinate System: Ohio North (3401)\",VLOOKUP(D18,J1:O150,6),VLOOKUP(D18,J151:O310,6))","v":0.99993606999999995},{"$f":"VALUE(IF(D9>9,CONCATENATE(C9,D9),CONCATENATE(C9*10,D9)))","v":3925},{"$f":"IF(C18>C19,1-E9/60,E9/60)","v":0.68333333333333335},{"$f":"\"Scale factor at \"&LEFT($D18,2)&\"⁰ \"&RIGHT($D18,2)&\"' latitude\"","v":"Scale factor at 39⁰ 25' latitude"},null,null,"NZ",3956,39,56,7455837.9890000001,30.84667,1.00013328,5.7300000000370943E-6]
[null,null,{"$f":"IF($C$4=\"State Plane Coordinate System: Ohio North (3401)\",VLOOKUP(D19,J2:O151,6),VLOOKUP(D19,J152:O311,6))","v":0.99993626999999996},{"$f":"IF(D9=59,(VALUE(IF(D9>9,CONCATENATE(C9,D9),CONCATENATE(C9*10,D9)))+41),(VALUE(IF(D9>9,CONCATENATE(C9,D9),CONCATENATE(C9*10,D9)))+1))","v":3926},{"$f":"IF(C18<C19,1-E9/60,E9/60)","v":0.31666666666666665},{"$f":"\"Scale factor at \"&LEFT($D19,2)&\"⁰ \"&RIGHT($D19,2)&\"' latitude\"","v":"Scale factor at 39⁰ 26' latitude"},null,null,"NZ",3957,39,57,7453987.1890000002,30.846579999999999,1.0001276299999999,5.6500000000792028E-6]
["Scale Factor (k):",null,{"$f":"C18*E18+C19*E19","v":0.99993613333333331},null,null,null,null,null,"NZ",3958,39,58,7452136.3940000003,30.846499999999999,1.00012206,5.5699999998992666E-6]
[null,null,null,null,null,null,null,null,"NZ",3959,39,59,7450285.6040000003,30.846419999999998,1.00011658,5.4800000000021498E-6]
[null,null,{"$f":"LEFT(A15,16)&\" * \"&LEFT(A20,12)&\" =\"","v":"Sea Level Factor * Scale Factor ="},null,null,null,null,null,"NZ",4000,40,0,7448434.8190000001,30.846340000000001,1.00011118,5.4000000000442583E-6]
["Combined Scale Factor (CSF):",null,{"$f":"C15*C20","v":0.99990982701353759},null,null,null,null,null,"NZ",4001,40,1,7446584.0379999997,30.846270000000001,1.0001058700000001,5.3099999999250969E-6]
[null,null,null,null,null,null,null,null,"NZ",4002,40,2,7444733.2620000001,30.8462,1.0001006299999999,5.2400000001284752E-6]
[null,null,"Unitless Grid to Ground Multiplier:",null,null,null,null,null,"NZ",4003,40,3,7442882.4900000002,30.846129999999999,1.0000954799999999,5.1500000000093138E-6]
["Grid to Ground Multiplier (1/CSF):",null,{"$f":"1/C23","v":1.0000901811183631},null,null,null,null,null,"NZ",4004,40,4,7441031.7220000001,30.846070000000001,1.00009042,5.0599999998901524E-6]
[null,null,null,null,null,null,null,null,"NZ",4005,40,5,7439180.9579999996,30.846,1.0000854299999999,4.9900000000935307E-6]
[null,null,"Converts Grid Meters to Ground Feet:",null,null,null,null,null,"NZ",4006,40,6,7437330.1979999999,30.845939999999999,1.00008053,4.8999999999743693E-6]
["Project Adjustment Factor (PAF):",null,{"$f":"C26*3.28083333","v":3.2811291992188627},null,null,null,null,null,"NZ",4007,40,7,7435479.4409999996,30.845880000000001,1.00007571,4.8200000000164778E-6]
[null,null,null,null,null,null,null,null,"NZ",4011,40,11,7428076.449,30.845680000000002,1.00005728,{"$f":"O34-O30","v":4.4799999998623719E-6}]
["Check spreadsheet-generated (XLS) CSF against Trimble Business Center-generated (TBC) CSF below.",null,null,null,null,null,null,null,"NZ",4012,40,12,7426225.7079999996,30.84563,1.00005287,{"$f":"O30-O31","v":4.4100000000657502E-6}]
[null,null,null,null,null,null,null,null,"NZ",4008,40,8,7433628.6880000001,30.845829999999999,1.0000709800000001,{"$f":"O29-O32","v":4.7299999998973163E-6}]
[null,null,"Compare to Unitless Grid to Ground Multiplier:",null,null,null,null,null,"NZ",4009,40,9,7431777.9390000002,30.845770000000002,1.0000663299999999,{"$f":"O32-O33","v":4.6500000001614694E-6}]
["Input TBC-generated 1/CSF:",null,null,null,null,null,null,null,"NZ",4010,40,10,7429927.1919999998,30.84572,1.0000617599999999,{"$f":"O33-O34","v":4.5699999999815333E-6}]
[null,null,null,null,null,null,null,null,"NZ",4013,40,13,7424374.9699999997,30.845590000000001,1.00004856,{"$f":"O31-O35","v":4.3100000000073635E-6}]
["Test point at one end of project:",null,"Northing (ft)","Easting (ft)",null,"Grid - Ground (XLS)",null,null,"NZ",4014,40,14,7422524.2350000003,30.845549999999999,1.00004432,{"$f":"O35-O36","v":4.2399999999886973E-6}]
[null,"Input Grid Coordinates:",null,null,null,{"$f":"IF(C37-C38>0,ABS(ROUND(C37-C38,3))&\"' shift N\",ABS(ROUND(C37-C38,3))&\"' shift S\")","v":"0' shift S"},{"$f":"IF(D37-D38>0,ABS(ROUND(D37-D38,3))&\"' shift E\",ABS(ROUND(D37-D38,3))&\"' shift W\")","v":"0' shift W"},null,"NZ",4015,40,15,7420673.5020000003,30.845510000000001,1.0000401699999999,4.1500000000915804E-6]
[{"$f":"$A37","v":0},"Ground (XLS):",{"$f":"$C37*$C$26","v":0},{"$f":"$D37*$C$26","v":0},null,"Ground (XLS) - Ground (TBC)",null,null,"NZ",4016,40,16,7418822.7719999999,30.845469999999999,1.0000361,4.0699999999116443E-6]
[{"$f":"$A37","v":0},"Ground (TBC):",{"$f":"$C37*$C$34","v":0},{"$f":"$D37*$C$34","v":0},null,{"$f":"IF(C38-C39>0,ABS(ROUND(C38-C39,3))&\"' shift N\",ABS(ROUND(C38-C39,3))&\"' shift S\")","v":"0' shift S"},{"$f":"IF(D38-D39>0,ABS(ROUND(D38-D39,3))&\"' shift E\",ABS(ROUND(D38-D39,3))&\"' shift W\")","v":"0' shift W"},null,"NZ",4017,40,17,7416972.0429999996,30.84544,1.00003212,3.9800000000145275E-6]
[null,null,null,null,null,null,null,null,"NZ",4018,40,18,7415121.3169999998,30.845410000000001,1.00002821,3.9099999999958612E-6]
["Test point at other end of project:",null,"Northing (ft)","Easting (ft)",null,"Grid - Ground (XLS)",null,null,"NZ",4019,40,19,7413270.5920000002,30.845379999999999,1.0000244,3.8099999999374745E-6]
[null,"Input Grid Coordinates:",null,null,null,{"$f":"IF(C42-C43>0,ABS(ROUND(C42-C43,3))&\"' shift N\",ABS(ROUND(C42-C43,3))&\"' shift S\")","v":"0' shift S"},{"$f":"IF(D42-D43>0,ABS(ROUND(D42-D43,3))&\"' shift E\",ABS(ROUND(D42-D43,3))&\"' shift W\")","v":"0' shift W"},null,"NZ",4020,40,20,7411419.8689999999,30.845359999999999,1.0000206599999999,3.7400000001408529E-6]
[{"$f":"$A42","v":0},"Ground (XLS):",{"$f":"$C42*$C$26","v":0},{"$f":"$D42*$C$26","v":0},null,"Ground XLS - Ground TBC",null,null,"NZ",4021,40,21,7409569.1469999999,30.84534,1.0000170100000001,3.6499999997996468E-6]
[{"$f":"$A42","v":0},"Ground (TBC):",{"$f":"$C42*$C$34","v":0},{"$f":"$D42*$C$34","v":0},null,{"$f":"IF(C43-C44>0,ABS(ROUND(C43-C44,3))&\"' shift N\",ABS(ROUND(C43-C44,3))&\"' shift S\")","v":"0' shift S"},{"$f":"IF(D43-D44>0,ABS(ROUND(D43-D44,3))&\"' shift E\",ABS(ROUND(D43-D44,3))&\"' shift W\")","v":"0' shift W"},null,"NZ",4022,40,22,7407718.4270000001,30.845320000000001,1.00001344,3.5700000000637999E-6]
[null,null,null,null,null,null,null,null,"NZ",4023,40,23,7405867.7079999996,30.845300000000002,1.0000099499999999,3.4900000001059084E-6]
[{"$f":"\"Change in computed horizontal distance between \"&A$37&\" and \"&A$42&\" due to CSF used (an approximate \"&ROUND(SQRT((C38-C43)^2+(D38-D43)^2),0)&\" foot distance):\"","v":"Change in computed horizontal distance between  and  due to CSF used (an approximate 0 foot distance):"},null,null,null,null,"Ground (XLS) vs. Ground (TBC)",null,null,"NZ",4024,40,24,7404016.9900000002,30.845289999999999,1.0000065499999999,3.399999999986747E-6]
[null,null,null,null,null,{"$f":"IF(ABS(C38-C43)>ABS(C39-C44),ABS(ROUND((C38-C39)-(C43-C44),3))&\"' further N-S\",ABS(ROUND((C38-C39)-(C43-C44),3))&\"' nearer N-S\")","v":"0' nearer N-S"},{"$f":"IF(ABS(D38-D43)>ABS(D39-D44),ABS(ROUND((D38-D39)-(D43-D44),3))&\"' further E-W\",ABS(ROUND((D38-D39)-(D43-D44),3))&\"' nearer E-W\")","v":"0' nearer E-W"},null,"NZ",4025,40,25,7402166.273,30.845269999999999,1.0000032299999999,3.3200000000288554E-6]
[null,null,null,null,null,null,null,null,"NZ",4027,40,27,7398464.8399999999,30.84526,0.99999685000000005,6.3799999998614965E-6]
[{"$f":"\"Change in computed horizontal distance between \"&A$37&\" and \"&A$42&\" by adjusting from grid to ground (approx. \"&ROUND(SQRT((C38-C43)^2+(D38-D43)^2),0)&\" ft dist.):\"","v":"Change in computed horizontal distance between  and  by adjusting from grid to ground (approx. 0 ft dist.):"},null,null,null,null,"Grid vs. Ground (XLS)",null,null,"NZ",4028,40,28,7396614.125,30.84525,0.99999378000000005,3.0699999999939109E-6]
[null,null,null,null,null,{"$f":"IF(ABS(C38-C43)>ABS(C37-C42),ABS(ROUND((C37-C38)-(C42-C43),3))&\"' further N-S\",ABS(ROUND((C37-C38)-(C42-C43),3))&\"' nearer N-S\")","v":"0' nearer N-S"},{"$f":"IF(ABS(D38-D43)>ABS(D37-D42),ABS(ROUND((D37-D38)-(D42-D43),3))&\"' further E-W\",ABS(ROUND((D37-D38)-(D42-D43),3))&\"' nearer E-W\")","v":"0' nearer E-W"},null,"NZ",4029,40,29,7394763.409,30.84525,0.99999079999999996,2.9800000000967941E-6]
[null,null,null,null,null,null,null,null,"NZ",4030,40,30,7392912.6940000001,30.84525,0.99998790000000004,2.899999999916858E-6]
[null,null,null,null,null,null,null,null,"NZ",4031,40,31,7391061.9790000003,30.84526,0.99998507999999997,2.8200000000699887E-6]
[null,null,null,null,null,null,null,null,"NZ",4032,40,32,7389211.2630000003,30.84526,0.99998235000000002,2.7299999999508273E-6]
[null,null,null,null,null,null,null,null,"NZ",4033,40,33,7387360.5480000004,30.845269999999999,0.99997970000000003,2.6499999999929358E-6]
[null,null,null,null,null,null,null,null,"NZ",4034,40,34,7385509.8310000002,30.845279999999999,0.99997712999999999,2.5700000000350443E-6]
[null,null,null,null,null,null,null,null,"NZ",4035,40,35,7383659.1140000001,30.845300000000002,0.99997464999999996,2.4800000000269051E-6]
[null,null,null,null,null,null,null,null,"NZ",4036,40,36,7381808.3959999997,30.845320000000001,0.99997225000000001,2.3999999999579913E-6]
[null,null,null,null,null,null,null,null,"NZ",4037,40,37,7379957.6770000001,30.845330000000001,0.99996993000000001,2.3200000000000998E-6]
[null,null,null,null,null,null,null,null,"NZ",4038,40,38,7378106.9570000004,30.845359999999999,0.99996770000000001,2.2299999999919606E-6]
[null,null,null,null,null,null,null,null,"NZ",4039,40,39,7376256.2359999996,30.845379999999999,0.99996556000000003,2.1399999999838215E-6]
[null,null,null,null,null,null,null,null,"NZ",4040,40,40,7374405.5130000003,30.845410000000001,0.99996348999999995,2.0700000000761776E-6]
[null,null,null,null,null,null,null,null,"NZ",4041,40,41,7372554.7889999999,30.84544,0.99996151,1.9799999999570161E-6]
[null,null,null,null,null,null,null,null,"NZ",4042,40,42,7370704.0619999999,30.845469999999999,0.99995961,1.8999999999991246E-6]
[null,null,null,null,null,null,null,null,"NZ",4043,40,43,7368853.3339999998,30.845500000000001,0.99995780000000001,1.8099999999909855E-6]
[null,null,null,null,null,null,null,null,"NZ",4044,40,44,7367002.6040000003,30.84554,0.99995606999999997,1.730000000033094E-6]
[null,null,null,null,null,null,null,null,"NZ",4045,40,45,7365151.8720000004,30.845580000000002,0.99995442999999995,1.6400000000249548E-6]
[null,null,null,null,null,null,null,null,"NZ",4046,40,46,7363301.1370000001,30.84562,0.99995286999999999,1.559999999956041E-6]
[null,null,null,null,null,null,null,null,"NZ",4047,40,47,7361450.3990000002,30.845669999999998,0.99995139,{"$f":"O67-O68","v":1.4799999999981495E-6}]
[null,null,null,null,null,null,null,null,"NZ",4048,40,48,7359599.659,30.84572,0.99995000000000001,1.3899999999900103E-6]
[null,null,null,null,null,null,null,null,"NZ",4049,40,49,7357748.9160000002,30.845770000000002,0.99994868999999997,1.3100000000321188E-6]
[null,null,null,null,null,null,null,null,"NZ",4050,40,50,7355898.1699999999,30.84582,0.99994746000000001,1.229999999963205E-6]
[null,null,null,null,null,null,null,null,"NZ",4051,40,51,7354047.4210000001,30.845880000000001,0.99994632000000006,1.1399999999550658E-6]
[null,null,null,null,null,null,null,null,"NZ",4052,40,52,7352196.6689999998,30.845929999999999,0.99994527,1.050000000057949E-6]
[null,null,null,null,null,null,null,null,"NZ",4053,40,53,7350345.9129999997,30.84599,0.99994428999999996,9.8000000003928278E-7]
[null,null,null,null,null,null,null,null,"NZ",4054,40,54,7348495.1529999999,30.846060000000001,0.99994340000000004,8.8999999992012135E-7]
[null,null,null,null,null,null,null,null,"NZ",4055,40,55,7346644.3899999997,30.846119999999999,0.99994260000000001,8.0000000002300453E-7]
[null,null,null,null,null,null,null,null,"NZ",4056,40,56,7344793.6220000004,30.84619,0.99994187999999995,7.20000000065113E-7]
[null,null,null,null,null,null,null,null,"NZ",4057,40,57,7342942.8509999998,30.846260000000001,0.99994123999999995,6.3999999999619916E-7]
[null,null,null,null,null,null,null,null,"NZ",4058,40,58,7341092.0750000002,30.846340000000001,0.99994068999999997,5.4999999998806004E-7]
[null,null,null,null,null,null,null,null,"NZ",4059,40,59,7339241.2949999999,30.846409999999999,0.99994022000000005,4.6999999991914621E-7]
[null,null,null,null,null,null,null,null,"NZ",4100,41,0,7337390.5099999998,30.846489999999999,0.99993984000000002,3.8000000002202938E-7]
[null,null,null,null,null,null,null,null,"NZ",4101,41,1,7335539.7199999997,30.84657,0.99993953999999996,3.0000000006413785E-7]
[null,null,null,null,null,null,null,null,"NZ",4102,41,2,7333688.926,30.84666,0.99993931999999996,2.1999999999522402E-7]
[null,null,null,null,null,null,null,null,"NZ",4103,41,3,7331838.1270000003,30.84674,0.99993918999999998,1.2999999998708489E-7]
[null,null,null,null,null,null,null,null,"NZ",4104,41,4,7329987.3219999997,30.846830000000001,0.99993913999999995,5.0000000029193359E-8]
[null,null,null,null,null,null,null,null,"NZ",4105,41,5,7328136.5120000001,30.84693,0.99993918000000004,-4.0000000089968069E-8]
[null,null,null,null,null,null,null,null,"NZ",4106,41,6,7326285.6960000005,30.847020000000001,0.99993929999999998,-1.199999999368373E-7]
[null,null,null,null,null,null,null,null,"NZ",4107,41,7,7324434.875,30.84712,0.99993949999999998,-2.0000000000575113E-7]
[null,null,null,null,null,null,null,null,"NZ",4108,41,8,7322584.0480000004,30.84722,0.99993979,-2.9000000001389026E-7]
[null,null,null,null,null,null,null,null,"NZ",4109,41,9,7320733.2149999999,30.84732,0.99994017000000002,-3.8000000002202938E-7]
[null,null,null,null,null,null,null,null,"NZ",4110,41,10,7318882.3760000002,30.84742,0.99994063,-4.5999999997992091E-7]
[null,null,null,null,null,null,null,null,"NZ",4111,41,11,7317031.5310000004,30.847529999999999,0.99994117000000005,-5.4000000004883475E-7]
[null,null,null,null,null,null,null,null,"NZ",4112,41,12,7315180.6789999995,30.847639999999998,0.99994179999999999,-6.2999999994595157E-7]
[null,null,null,null,null,null,null,null,"NZ",4113,41,13,7313329.8200000003,30.847760000000001,0.99994251000000001,-7.1000000001486541E-7]
[null,null,null,null,null,null,null,null,"NZ",4114,41,14,7311478.9550000001,30.84787,0.99994331000000003,-8.0000000002300453E-7]
[null,null,null,null,null,null,null,null,"NZ",4115,41,15,7309628.0829999996,30.847989999999999,0.99994419000000001,-8.7999999998089606E-7]
[null,null,null,null,null,null,null,null,"NZ",4116,41,16,7307777.2029999997,30.848109999999998,0.99994514999999995,-9.599999999387876E-7]
[null,null,null,null,null,null,null,null,"NZ",4117,41,17,7305926.3169999998,30.848230000000001,0.99994620000000001,-1.050000000057949E-6]
[null,null,null,null,null,null,null,null,"NZ",4118,41,18,7304075.4230000004,30.84836,0.99994733999999996,-1.1399999999550658E-6]
[null,null,null,null,null,null,null,null,"NZ",4119,41,19,7302224.5209999997,30.848490000000002,0.99994855999999999,{"$f":"O99-O100","v":-1.2200000000239797E-6}]
[null,null,null,null,null,null,null,null,"NZ",4120,41,20,7300373.6119999997,30.84862,0.99994985999999997,-1.2999999999818712E-6]
[null,null,null,null,null,null,null,null,"NZ",4121,41,21,7298522.6950000003,30.848749999999999,0.99995124999999996,-1.3899999999900103E-6]
[null,null,null,null,null,null,null,null,"NZ",4122,41,22,7296671.7699999996,30.848890000000001,0.99995272000000002,-1.4700000000589242E-6]
[null,null,null,null,null,null,null,null,"NZ",4123,41,23,7294820.8370000003,30.849029999999999,0.99995427999999997,-1.559999999956041E-6]
[null,null,null,null,null,null,null,null,"NZ",4124,41,24,7292969.8949999996,30.849170000000001,0.99995592,-1.6400000000249548E-6]
[null,null,null,null,null,null,null,null,"NZ",4125,41,25,7291118.9450000003,30.849309999999999,0.99995765000000003,-1.730000000033094E-6]
[null,null,null,null,null,null,null,null,"NZ",4126,41,26,7289267.9859999996,30.849460000000001,0.99995946000000002,-1.8099999999909855E-6]
[null,null,null,null,null,null,null,null,"NZ",4127,41,27,7287417.0180000002,30.849609999999998,0.99996136000000002,-1.8999999999991246E-6]
[null,null,null,null,null,null,null,null,"NZ",4128,41,28,7285566.0420000004,30.84976,0.99996333999999998,-1.9799999999570161E-6]
[null,null,null,null,null,null,null,null,"NZ",4129,41,29,7283715.0559999999,30.849920000000001,0.99996541000000005,-2.0700000000761776E-6]
[null,null,null,null,null,null,null,null,"NZ",4130,41,30,7281864.0609999998,30.850069999999999,0.99996755999999998,-2.1499999999230468E-6]
[null,null,null,null,null,null,null,null,"NZ",4131,41,31,7280013.057,30.85023,0.99996978999999997,-2.2299999999919606E-6]
[null,null,null,null,null,null,null,null,"NZ",4132,41,32,7278162.0429999996,30.8504,0.99997212000000002,-2.3300000000503474E-6]
[null,null,null,null,null,null,null,null,"NZ",4133,41,33,7276311.0190000003,30.850560000000002,0.99997451999999998,-2.3999999999579913E-6]
[null,null,null,null,null,null,null,null,"NZ",4134,41,34,7274459.9850000003,30.850729999999999,0.99997701000000006,-2.4900000000771527E-6]
[null,null,null,null,null,null,null,null,"NZ",4135,41,35,7272608.9409999996,30.850899999999999,0.99997959000000003,-2.5799999999742695E-6]
[null,null,null,null,null,null,null,null,"NZ",4136,41,36,7270757.8870000001,30.85107,0.99998224999999996,-2.6599999999321611E-6]
[null,null,null,null,null,null,null,null,"NZ",4137,41,37,7268906.8229999999,30.85125,0.99998498999999996,-2.7400000000010749E-6]
[null,null,null,null,null,null,null,null,"NZ",4138,41,38,7267055.7479999997,30.851430000000001,0.99998783000000002,-2.8400000000594616E-6]
[null,null,null,null,null,null,null,null,"NZ",4139,41,39,7265204.6619999995,30.851610000000001,0.99999073999999999,-2.9099999999671056E-6]
[null,null,null,null,null,null,null,null,"NZ",4140,41,40,7263353.5659999996,30.851790000000001,0.99999373999999996,-2.9999999999752447E-6]
[null,null,null,null,null,null,null,null,"NZ",4141,41,41,7261502.4579999996,30.851980000000001,0.99999682999999995,-3.0899999999833838E-6]
[null,null,null,null,null,null,null,null,"NZ",4142,41,42,7259651.3389999997,30.852170000000001,1,-3.1700000000522977E-6]
[null,null,null,null,null,null,null,null,"NZ",4143,41,43,7257800.2089999998,30.852360000000001,1.0000032599999999,-3.2599999999494145E-6]
[null,null,null,null,null,null,null,null,"NZ",4144,41,44,7255949.068,30.852550000000001,1.0000066000000001,-3.3400000001293506E-6]
[null,null,null,null,null,null,null,null,"NZ",4145,41,45,7254097.915,30.85275,1.0000100199999999,-3.4199999998651975E-6]
[null,null,null,null,null,null,null,null,"NZ",4146,41,46,7252246.75,30.85295,1.0000135400000001,-3.5200000001456289E-6]
[null,null,null,null,null,null,null,null,"NZ",4147,41,47,7250395.5729999999,30.853149999999999,1.00001713,-3.5899999999422505E-6]
[null,null,null,null,null,null,null,null,"NZ",4148,41,48,7248544.3839999996,30.853359999999999,1.00002082,-3.6900000000006372E-6]
[null,null,null,null,null,null,null,null,"NZ",4149,41,49,7246693.182,30.853560000000002,1.0000245800000001,-3.7600000000193035E-6]
[null,null,null,null,null,null,null,null,"NZ",4150,41,50,7244841.9680000003,30.853770000000001,1.0000284399999999,-3.8599999998556456E-6]
[null,null,null,null,null,null,null,null,"NZ",4151,41,51,7242990.7419999996,30.85399,1.0000323799999999,{"$f":"O131-O132","v":-3.9400000000355817E-6}]
[null,null,null,null,null,null,null,null,"NZ",4152,41,52,7241139.5029999996,30.854199999999999,1.0000363999999999,-4.0199999999934732E-6]
[null,null,null,null,null,null,null,null,"NZ",4153,41,53,7239288.2510000002,30.854420000000001,1.00004051,-4.1100000001126347E-6]
[null,null,null,null,null,null,null,null,"NZ",4154,41,54,7237436.9850000003,30.85464,1.0000446999999999,-4.1899999998484816E-6]
[null,null,null,null,null,null,null,null,"NZ",4155,41,55,7235585.7070000004,30.854859999999999,1.0000489800000001,-4.2800000001896876E-6]
[null,null,null,null,null,null,null,null,"NZ",4156,41,56,7233734.415,30.855090000000001,1.00005335,-4.3699999998647598E-6]
[null,null,null,null,null,null,null,null,"NZ",4157,41,57,7231883.1100000003,30.855319999999999,1.0000578,-4.450000000044696E-6]
[null,null,null,null,null,null,null,null,"NZ",4158,41,58,7230031.7910000002,30.855550000000001,1.0000623399999999,-4.5399999999418128E-6]
[null,null,null,null,null,null,null,null,"NZ",4159,41,59,7228180.4579999996,30.855779999999999,1.0000669600000001,-4.6200000001217489E-6]
[null,null,null,null,null,null,null,null,"NZ",4200,42,0,7226329.1109999996,30.856020000000001,1.0000716700000001,-4.7100000000188658E-6]
[null,null,null,null,null,null,null,null,"NZ",4201,42,1,7224477.7489999998,30.856259999999999,1.0000764600000001,-4.7899999999767573E-6]
[null,null,null,null,null,null,null,null,"NZ",4202,42,2,7222626.3739999998,30.8565,1.0000813399999999,-4.8799999998738741E-6]
[null,null,null,null,null,null,null,null,"NZ",4203,42,3,7220774.9840000002,30.856750000000002,1.0000863,-4.9600000000538103E-6]
[null,null,null,null,null,null,null,null,"NZ",4204,42,4,7218923.5789999999,30.85699,1.0000913499999999,-5.0499999999509271E-6]
[null,null,null,null,null,null,null,null,"NZ",4205,42,5,7217072.1600000001,30.857240000000001,1.00009649,-5.1400000000700885E-6]
[null,null,null,null,null,null,null,null,"NZ",4206,42,6,7215220.7249999996,30.857489999999999,1.00010171,-5.22000000002798E-6]
[null,null,null,null,null,null,null,null,"NZ",4207,42,7,7213369.2750000004,30.857749999999999,1.00010702,-5.3099999999250969E-6]
[null,null,null,null,null,null,null,null,"NZ",4208,42,8,7211517.8109999998,30.85801,1.0001124100000001,-5.390000000105033E-6]
[null,null,null,null,null,null,null,null,"NZ",4209,42,9,7209666.3300000001,30.858270000000001,1.0001178900000001,-5.4800000000021498E-6]
[null,null,null,null,null,null,null,null,"NZ",4210,42,10,7207814.8339999998,30.858529999999998,1.00012345,-5.5599999999600414E-6]
[null,null,null,null,null,null,null,null,"SZ",3800,38,0,7932869.0369999995,30.839220000000001,1.00022476]
[null,null,null,null,null,null,null,null,"SZ",3801,38,1,7931018.6840000004,30.839099999999998,1.00021786,{"$f":"O152-O153","v":6.9000000000318806E-6}]
[null,null,null,null,null,null,null,null,"SZ",3802,38,2,7929168.3380000005,30.838979999999999,1.0002110500000001,6.8099999999127192E-6]
[null,null,null,null,null,null,null,null,"SZ",3803,38,3,7927318,30.83886,1.0002043300000001,6.7200000000156024E-6]
[null,null,null,null,null,null,null,null,"SZ",3804,38,4,7925467.6679999996,30.838740000000001,1.0001976800000001,6.6499999999969361E-6]
[null,null,null,null,null,null,null,null,"SZ",3805,38,5,7923617.3430000003,30.838629999999998,1.00019112,6.5600000000998193E-6]
[null,null,null,null,null,null,null,null,"SZ",3806,38,6,7921767.0259999996,30.838519999999999,1.0001846400000001,6.4799999999198832E-6]
[null,null,null,null,null,null,null,null,"SZ",3807,38,7,7919916.7149999999,30.83841,1.00017825,6.3900000000227664E-6]
[null,null,null,null,null,null,null,null,"SZ",3808,38,8,7918066.4100000001,30.8383,1.00017193,6.3200000000041001E-6]
[null,null,null,null,null,null,null,null,"SZ",3809,38,9,7916216.1119999997,30.838200000000001,1.0001656999999999,6.2300000001069833E-6]
[null,null,null,null,null,null,null,null,"SZ",3810,38,10,7914365.8200000003,30.838100000000001,1.0001595599999999,6.1399999999878219E-6]
[null,null,null,null,null,null,null,null,"SZ",3811,38,11,7912515.534,30.838100000000001,1.00015349,6.0699999999691556E-6]
[null,null,null,null,null,null,null,null,"SZ",3812,38,12,7910665.2529999996,30.837910000000001,1.0001475099999999,5.9800000000720388E-6]
[null,null,null,null,null,null,null,null,"SZ",3813,38,13,7908814.9790000003,30.837820000000001,1.00014161,5.8999999998921027E-6]
[null,null,null,null,null,null,null,null,"SZ",3814,38,14,7906964.71,30.837720000000001,1.0001358,5.8099999999949858E-6]
[null,null,null,null,null,null,null,null,"SZ",3815,38,15,7905114.4460000005,30.83764,1.00013007,5.7300000000370943E-6]
[null,null,null,null,null,null,null,null,"SZ",3816,38,16,7903264.1880000001,30.83755,1.0001244199999999,5.6500000000792028E-6]
[null,null,null,null,null,null,null,null,"SZ",3817,38,17,7901413.9349999996,30.83747,1.00011885,5.5699999998992666E-6]
[null,null,null,null,null,null,null,null,"SZ",3818,38,18,7899563.6869999999,30.837389999999999,1.00011337,5.4800000000021498E-6]
[null,null,null,null,null,null,null,null,"SZ",3819,38,19,7897713.4440000001,30.837309999999999,1.00010797,5.4000000000442583E-6]
[null,null,null,null,null,null,null,null,"SZ",3820,38,20,7895863.2050000001,30.837240000000001,1.0001026500000001,5.3199999998643221E-6]
[null,null,null,null,null,null,null,null,"SZ",3821,38,21,7894012.9709999999,30.83717,1.00009741,5.2400000001284752E-6]
[null,null,null,null,null,null,null,null,"SZ",3822,38,22,7892162.7410000004,30.8371,1.00009226,5.1500000000093138E-6]
[null,null,null,null,null,null,null,null,"SZ",3823,38,23,7890312.5149999997,30.837029999999999,1.0000872000000001,5.0599999998901524E-6]
[null,null,null,null,null,null,null,null,"SZ",3824,38,24,7888462.2929999996,30.836960000000001,1.00008221,4.9900000000935307E-6]
[null,null,null,null,null,null,null,null,"SZ",3825,38,25,7886612.0750000002,30.8369,1.00007731,4.8999999999743693E-6]
[null,null,null,null,null,null,null,null,"SZ",3826,38,26,7884761.8609999996,30.836839999999999,1.00007249,4.8200000000164778E-6]
[null,null,null,null,null,null,null,null,"SZ",3827,38,27,7882911.6509999996,30.836790000000001,1.0000677600000001,4.7299999998973163E-6]
[null,null,null,null,null,null,null,null,"SZ",3828,38,28,7881061.4440000001,30.836729999999999,1.0000631,4.6600000001006947E-6]
[null,null,null,null,null,null,null,null,"SZ",3829,38,29,7879211.2400000002,30.836680000000001,1.00005853,4.5699999999815333E-6]
[null,null,null,null,null,null,null,null,"SZ",3830,38,30,7877361.0389999999,30.83663,1.0000540499999999,4.4800000000844165E-6]
[null,null,null,null,null,null,null,null,"SZ",3831,38,31,7875510.841,30.836580000000001,1.00004965,4.3999999999044803E-6]
[null,null,null,null,null,null,null,null,"SZ",3832,38,32,7873660.6459999997,30.836539999999999,1.0000453300000001,4.3199999999465888E-6]
[null,null,null,null,null,null,null,null,"SZ",3833,38,33,7871810.4529999997,30.836500000000001,1.0000410900000001,{"$f":"O184-O185","v":4.2399999999886973E-6}]
[null,null,null,null,null,null,null,null,"SZ",3834,38,34,7869960.2630000003,30.836459999999999,1.00003694,4.1500000000915804E-6]
[null,null,null,null,null,null,null,null,"SZ",3835,38,35,7868110.0760000004,30.83642,1.0000328700000001,4.0699999999116443E-6]
[null,null,null,null,null,null,null,null,"SZ",3836,38,36,7866259.8899999997,30.836390000000002,1.0000288799999999,3.9900000001757974E-6]
[null,null,null,null,null,null,null,null,"SZ",3837,38,37,7864409.7070000004,30.836359999999999,1.0000249800000001,3.8999999998345913E-6]
[null,null,null,null,null,null,null,null,"SZ",3838,38,38,7862559.5250000004,30.83633,1.00002116,3.8200000000987444E-6]
[null,null,null,null,null,null,null,null,"SZ",3839,38,39,7860709.3449999997,30.836310000000001,1.00001743,3.729999999979583E-6]
[null,null,null,null,null,null,null,null,"SZ",3840,38,40,7858859.1670000004,30.836279999999999,1.00001377,3.6599999999609167E-6]
[null,null,null,null,null,null,null,null,"SZ",3841,38,41,7857008.9900000002,30.836259999999999,1.0000102099999999,3.5600000001245746E-6]
[null,null,null,null,null,null,null,null,"SZ",3842,38,42,7855158.8140000002,30.83624,1.00000672,3.4899999998838638E-6]
[null,null,null,null,null,null,null,null,"SZ",3843,38,43,7853308.6399999997,30.83623,1.00000332,3.399999999986747E-6]
[null,null,null,null,null,null,null,null,"SZ",3844,38,44,7851458.466,30.836220000000001,1,3.3200000000288554E-6]
[null,null,null,null,null,null,null,null,"SZ",3845,38,45,7849608.2929999996,30.836210000000001,0.99999676999999998,3.2300000000207163E-6]
[null,null,null,null,null,null,null,null,"SZ",3846,38,46,7847758.1210000003,30.836200000000002,0.99999360999999998,3.1600000000020501E-6]
[null,null,null,null,null,null,null,null,"SZ",3847,38,47,7845907.949,30.836189999999998,0.99999055000000003,3.0599999999436633E-6]
[null,null,null,null,null,null,null,null,"SZ",3848,38,48,7844057.7769999998,30.836189999999998,0.99998756,2.9900000000360194E-6]
[null,null,null,null,null,null,null,null,"SZ",3849,38,49,7842207.6059999997,30.836189999999998,0.99998465999999997,2.9000000000278803E-6]
[null,null,null,null,null,null,null,null,"SZ",3850,38,50,7840357.4340000004,30.836189999999998,0.99998184000000001,2.8199999999589664E-6]
[null,null,null,null,null,null,null,null,"SZ",3851,38,51,7838507.2630000003,30.836200000000002,0.99997910999999995,2.7300000000618496E-6]
[null,null,null,null,null,null,null,null,"SZ",3852,38,52,7836657.091,30.836210000000001,0.99997645999999996,2.6499999999929358E-6]
[null,null,null,null,null,null,null,null,"SZ",3853,38,53,7834806.9189999998,30.836220000000001,0.99997389000000003,2.5699999999240219E-6]
[null,null,null,null,null,null,null,null,"SZ",3854,38,54,7832956.7460000003,30.83623,0.99997141,2.4800000000269051E-6]
[null,null,null,null,null,null,null,null,"SZ",3855,38,55,7831106.5719999997,30.83624,0.99996901000000005,2.3999999999579913E-6]
[null,null,null,null,null,null,null,null,"SZ",3856,38,56,7829256.3969999999,30.836259999999999,0.99996669999999999,2.3100000000608745E-6]
[null,null,null,null,null,null,null,null,"SZ",3857,38,57,7827406.2220000001,30.836279999999999,0.99996446999999999,2.2299999999919606E-6]
[null,null,null,null,null,null,null,null,"SZ",3858,38,58,7825556.0449999999,30.836310000000001,0.99996231999999996,2.1500000000340691E-6]
[null,null,null,null,null,null,null,null,"SZ",3859,38,59,7823705.8660000004,30.83633,0.99996026000000005,2.0599999999149077E-6]
[null,null,null,null,null,null,null,null,"SZ",3900,39,0,7821855.6859999998,30.836359999999999,0.99995827999999998,1.9800000000680384E-6]
[null,null,null,null,null,null,null,null,"SZ",3901,39,1,7820005.5039999997,30.836390000000002,0.99995637999999998,1.8999999999991246E-6]
[null,null,null,null,null,null,null,null,"SZ",3902,39,2,7818155.3210000005,30.83643,0.99995456999999999,1.8099999999909855E-6]
[null,null,null,null,null,null,null,null,"SZ",3903,39,3,7816305.1349999998,30.836459999999999,0.99995283999999995,1.730000000033094E-6]
[null,null,null,null,null,null,null,null,"SZ",3904,39,4,7814454.9469999997,30.836500000000001,0.99995118999999999,1.6499999999641801E-6]
[null,null,null,null,null,null,null,null,"SZ",3905,39,5,7812604.7570000002,30.836539999999999,0.99994963000000003,{"$f":"O216-O217","v":1.559999999956041E-6}]
[null,null,null,null,null,null,null,null,"SZ",3906,39,6,7810754.5650000004,30.836590000000001,0.99994815999999997,1.4700000000589242E-6]
[null,null,null,null,null,null,null,null,"SZ",3907,39,7,7808904.3689999999,30.83663,0.99994676000000005,1.3999999999292356E-6]
[null,null,null,null,null,null,null,null,"SZ",3908,39,8,7807054.1710000001,30.836680000000001,0.99994545000000001,1.3100000000321188E-6]
[null,null,null,null,null,null,null,null,"SZ",3909,39,9,7805203.9699999997,30.836739999999999,0.99994422999999999,1.2200000000239797E-6]
[null,null,null,null,null,null,null,null,"SZ",3910,39,10,7803353.7659999998,30.836790000000001,0.99994309000000003,1.1399999999550658E-6]
[null,null,null,null,null,null,null,null,"SZ",3911,39,11,7801503.5590000004,30.836849999999998,0.99994203000000004,1.0599999999971743E-6]
[null,null,null,null,null,null,null,null,"SZ",3912,39,12,7799653.3480000002,30.83691,0.99994106000000005,9.6999999998903519E-7]
[null,null,null,null,null,null,null,null,"SZ",3913,39,13,7797803.1339999996,30.836970000000001,0.99994017000000002,8.9000000003114366E-7]
[null,null,null,null,null,null,null,null,"SZ",3914,39,14,7795952.915,30.837029999999999,0.99993936000000005,8.0999999996222982E-7]
[null,null,null,null,null,null,null,null,"SZ",3915,39,15,7794102.693,30.8371,0.99993863999999999,7.20000000065113E-7]
[null,null,null,null,null,null,null,null,"SZ",3916,39,16,7792252.4670000002,30.83717,0.99993801000000004,6.2999999994595157E-7]
[null,null,null,null,null,null,null,null,"SZ",3917,39,17,7790402.2369999997,30.837250000000001,0.99993745999999994,5.5000000009908234E-7]
[null,null,null,null,null,null,null,null,"SZ",3918,39,18,7788552.0020000003,30.837319999999998,0.99993699000000003,4.6999999991914621E-7]
[null,null,null,null,null,null,null,null,"SZ",3919,39,19,7786701.7630000003,30.837399999999999,0.99993659999999995,3.9000000007227698E-7]
[null,null,null,null,null,null,null,null,"SZ",3920,39,20,7784851.5190000003,30.837479999999999,0.9999363,2.9999999995311555E-7]
[null,null,null,null,null,null,null,null,"SZ",3921,39,21,7783001.2699999996,30.83756,0.99993609000000006,2.0999999994497642E-7]
[null,null,null,null,null,null,null,null,"SZ",3922,39,22,7781151.017,30.83765,0.99993595999999996,1.3000000009810719E-7]
[null,null,null,null,null,null,null,null,"SZ",3923,39,23,7779300.7580000004,30.83774,0.99993591000000004,4.9999999918171056E-8]
[null,null,null,null,null,null,null,null,"SZ",3924,39,24,7777450.4929999998,30.83783,0.99993593999999997,-2.9999999928698173E-8]
[null,null,null,null,null,null,null,null,"SZ",3925,39,25,7775600.2240000004,30.83792,0.99993606999999995,-1.2999999998708489E-7]
[null,null,null,null,null,null,null,null,"SZ",3926,39,26,7773749.949,30.83802,0.99993626999999996,-2.0000000000575113E-7]
[null,null,null,null,null,null,null,null,"SZ",3927,39,27,7771899.6670000004,30.83812,0.99993655999999997,-2.9000000001389026E-7]
[null,null,null,null,null,null,null,null,"SZ",3928,39,28,7770049.3799999999,30.83822,0.99993694,-3.8000000002202938E-7]
[null,null,null,null,null,null,null,null,"SZ",3929,39,29,7768199.0870000003,30.83832,0.99993739000000004,-4.5000000004069562E-7]
[null,null,null,null,null,null,null,null,"SZ",3930,39,30,7766348.7879999997,30.838429999999999,0.99993794000000003,-5.4999999998806004E-7]
[null,null,null,null,null,null,null,null,"SZ",3931,39,31,7764498.4819999998,30.838539999999998,0.99993856000000003,-6.2000000000672628E-7]
[null,null,null,null,null,null,null,null,"SZ",3932,39,32,7762648.1699999999,30.838650000000001,0.99993927999999999,-7.199999999540907E-7]
[null,null,null,null,null,null,null,null,"SZ",3933,39,33,7760797.8509999998,30.838760000000001,0.99994006999999996,-7.8999999997275694E-7]
[null,null,null,null,null,null,null,null,"SZ",3934,39,34,7758947.5250000004,30.83888,0.99994095000000005,-8.8000000009191837E-7]
[null,null,null,null,null,null,null,null,"SZ",3935,39,35,7757097.1919999998,30.838999999999999,0.99994192000000004,-9.6999999998903519E-7]
[null,null,null,null,null,null,null,null,"SZ",3936,39,36,7755246.852,30.839120000000001,0.99994296999999999,-1.0499999999469267E-6]
[null,null,null,null,null,null,null,null,"SZ",3937,39,37,7753396.5049999999,30.83925,0.9999441,{"$f":"O248-O249","v":-1.1300000000158406E-6}]
[null,null,null,null,null,null,null,null,"SZ",3938,39,38,7751546.1500000004,30.839379999999998,0.99994532000000003,-1.2200000000239797E-6]
[null,null,null,null,null,null,null,null,"SZ",3939,39,39,7749695.7869999995,30.839510000000001,0.99994662999999995,-1.3099999999210965E-6]
[null,null,null,null,null,null,null,null,"SZ",3940,39,40,7747845.4170000004,30.839639999999999,0.99994801,-1.380000000050785E-6]
[null,null,null,null,null,null,null,null,"SZ",3941,39,41,7745995.0389999999,30.839780000000001,0.99994949,-1.4799999999981495E-6]
[null,null,null,null,null,null,null,null,"SZ",3942,39,42,7744144.6519999998,30.83991,0.99995104000000001,-1.5500000000168157E-6]
[null,null,null,null,null,null,null,null,"SZ",3943,39,43,7742294.2570000002,30.840050000000002,0.99995268999999998,-1.6499999999641801E-6]
[null,null,null,null,null,null,null,null,"SZ",3944,39,44,7740443.8540000003,30.840199999999999,0.99995440999999996,-1.7199999999828464E-6]
[null,null,null,null,null,null,null,null,"SZ",3945,39,45,7738593.4419999998,30.840340000000001,0.99995621999999995,-1.8099999999909855E-6]
[null,null,null,null,null,null,null,null,"SZ",3946,39,46,7736743.0219999999,30.840489999999999,0.99995811999999995,-1.8999999999991246E-6]
[null,null,null,null,null,null,null,null,"SZ",3947,39,47,7734892.5920000002,30.84064,0.99996010000000002,-1.9800000000680384E-6]
[null,null,null,null,null,null,null,null,"SZ",3948,39,48,7733042.1529999999,30.840800000000002,0.99996216999999998,-2.0699999999651553E-6]
[null,null,null,null,null,null,null,null,"SZ",3949,39,49,7731191.7060000002,30.840949999999999,0.99996432000000002,-2.1500000000340691E-6]
[null,null,null,null,null,null,null,null,"SZ",3950,39,50,7729341.2479999997,30.84111,0.99996655000000001,-2.2299999999919606E-6]
[null,null,null,null,null,null,null,null,"SZ",3951,39,51,7727490.7819999997,30.841270000000002,0.99996887000000001,-2.3200000000000998E-6]
[null,null,null,null,null,null,null,null,"SZ",3952,39,52,7725640.3049999997,30.841439999999999,0.99997128000000002,-2.4100000000082389E-6]
[null,null,null,null,null,null,null,null,"SZ",3953,39,53,7723789.8190000001,30.841609999999999,0.99997376999999998,-2.4899999999661304E-6]
[null,null,null,null,null,null,null,null,"SZ",3954,39,54,7721939.3229999999,30.84178,0.99997634000000002,-2.5700000000350443E-6]
[null,null,null,null,null,null,null,null,"SZ",3955,39,55,7720088.8159999996,30.841950000000001,0.99997899999999995,-2.6599999999321611E-6]
[null,null,null,null,null,null,null,null,"SZ",3956,39,56,7718238.2989999996,30.842120000000001,0.99998175,-2.7500000000513225E-6]
[null,null,null,null,null,null,null,null,"SZ",3957,39,57,7716387.7719999999,30.842300000000002,0.99998458000000001,-2.830000000009214E-6]
[null,null,null,null,null,null,null,null,"SZ",3958,39,58,7714537.2340000002,30.842479999999998,0.99998748999999998,-2.9099999999671056E-6]
[null,null,null,null,null,null,null,null,"SZ",3959,39,59,7712686.6849999996,30.842659999999999,0.99999048999999995,-2.9999999999752447E-6]
[null,null,null,null,null,null,null,null,"SZ",4000,40,0,7710836.125,30.842849999999999,0.99999358000000005,-3.0900000000944061E-6]
[null,null,null,null,null,null,null,null,"SZ",4001,40,1,7708985.5539999995,30.843039999999998,0.99999674999999999,-3.1699999999412753E-6]
[null,null,null,null,null,null,null,null,"SZ",4002,40,2,7707134.9720000001,30.843229999999998,1,-3.2500000000101892E-6]
[null,null,null,null,null,null,null,null,"SZ",4003,40,3,7705284.3779999996,30.843419999999998,1.0000033399999999,-3.339999999907306E-6]
[null,null,null,null,null,null,null,null,"SZ",4004,40,4,7703433.773,30.843620000000001,1.0000067699999999,-3.4300000000264674E-6]
[null,null,null,null,null,null,null,null,"SZ",4005,40,5,7701583.1560000004,30.843820000000001,1.0000102799999999,-3.509999999984359E-6]
[null,null,null,null,null,null,null,null,"SZ",4006,40,6,7699732.5269999998,30.84402,1.0000138700000001,-3.5900000001642951E-6]
[null,null,null,null,null,null,null,null,"SZ",4007,40,7,7697881.8859999999,30.84422,1.0000175499999999,-3.6799999998393673E-6]
[null,null,null,null,null,null,null,null,"SZ",4008,40,8,7696031.233,30.844429999999999,1.0000213200000001,-3.7700000001805734E-6]
[null,null,null,null,null,null,null,null,"SZ",4009,40,9,7694180.5669999998,30.844639999999998,1.00002517,{"$f":"O280-O281","v":-3.8499999999164203E-6}]
[null,null,null,null,null,null,null,null,"SZ",4010,40,10,7692329.8890000004,30.844850000000001,1.0000290999999999,-3.9299999998743118E-6]
[null,null,null,null,null,null,null,null,"SZ",4011,40,11,7690479.1979999999,30.84506,1.00003313,-4.0300000001547431E-6]
[null,null,null,null,null,null,null,null,"SZ",4012,40,12,7688628.4950000001,30.845279999999999,1.00003723,-4.0999999999513648E-6]
[null,null,null,null,null,null,null,null,"SZ",4013,40,13,7686777.7779999999,30.845500000000001,1.00004143,-4.2000000000097515E-6]
[null,null,null,null,null,null,null,null,"SZ",4014,40,14,7684927.0480000004,30.84572,1.0000457,-4.2700000000284177E-6]
[null,null,null,null,null,null,null,null,"SZ",4015,40,15,7683076.3049999997,30.845949999999998,1.0000500699999999,-4.3699999998647598E-6]
[null,null,null,null,null,null,null,null,"SZ",4016,40,16,7681225.5480000004,30.846170000000001,1.00005451,-4.4400000001054707E-6]
[null,null,null,null,null,null,null,null,"SZ",4017,40,17,7679374.7779999999,30.846399999999999,1.0000590499999999,-4.5399999999418128E-6]
[null,null,null,null,null,null,null,null,"SZ",4018,40,18,7677523.9929999998,30.846640000000001,1.0000636700000001,-4.6200000001217489E-6]
[null,null,null,null,null,null,null,null,"SZ",4019,40,19,7675673.1950000003,30.846869999999999,1.0000683699999999,-4.6999999998575959E-6]
[null,null,null,null,null,null,null,null,"SZ",4020,40,20,7673822.3830000004,30.847110000000001,1.0000731599999999,-4.7899999999767573E-6]
[null,null,null,null,null,null,null,null,"SZ",4021,40,21,7671971.5559999999,30.847349999999999,1.00007804,-4.8800000000959187E-6]
[null,null,null,null,null,null,null,null,"SZ",4022,40,22,7670120.7149999999,30.8476,1.000073,5.0400000000117018E-6]
[null,null,null,null,null,null,null,null,"SZ",4023,40,23,7668269.8590000002,30.847840000000001,1.00008805,-1.5050000000016439E-5]
[null,null,null,null,null,null,null,null,"SZ",4024,40,24,7666418.9890000001,30.848089999999999,1.0000931799999999,-5.1299999999088186E-6]
[null,null,null,null,null,null,null,null,"SZ",4025,40,25,7664568.1030000001,30.84834,1.0000983999999999,-5.22000000002798E-6]
[null,null,null,null,null,null,null,null,"SZ",4026,40,26,7662717.2029999997,30.848600000000001,1.0001036999999999,-5.2999999999858716E-6]
[null,null,null,null,null,null,null,null,"SZ",4027,40,27,7660866.2869999995,30.848849999999999,1.00010909,-5.390000000105033E-6]
[null,null,null,null,null,null,null,null,"SZ",4028,40,28,7659015.3559999997,30.84911,1.0001145600000001,-5.4700000000629245E-6]
[null,null,null,null,null,null,null,null,"SZ",4029,40,29,7657164.409,30.84937,1.00012013,-5.5699999998992666E-6]
[null,null,null,null,null,null,null,null,"SZ",4030,40,30,7655313.4469999997,30.849640000000001,1.0001257699999999,-5.6399999999179329E-6]
[null,null,null,null,null,null,null,null,"SZ",4031,40,31,7653462.4680000003,30.849910000000001,1.0001315,-5.7300000000370943E-6]
[null,null,null,null,null,null,null,null,"SZ",4032,40,32,7651611.4740000004,30.850180000000002,1.0001373200000001,-5.8200000001562557E-6]
[null,null,null,null,null,null,null,null,"SZ",4033,40,33,7649760.4630000005,30.850449999999999,1.0001432299999999,-5.909999999831328E-6]
[null,null,null,null,null,null,null,null,"SZ",4034,40,34,7647909.4359999998,30.850719999999999,1.0001492199999999,-5.9900000000112641E-6]
[null,null,null,null,null,null,null,null,"SZ",4035,40,35,7646058.3930000002,30.850999999999999,1.0001552899999999,-6.0699999999691556E-6]
[null,null,null,null,null,null,null,null,"SZ",4036,40,36,7644207.3329999996,30.851279999999999,1.0001644999999999,-9.2099999999817328E-6]
[null,null,null,null,null,null,null,null,"SZ",4037,40,37,7642356.2560000001,30.851569999999999,1.0001677,-3.2000000000920181E-6]
[null,null,null,null,null,null,null,null,"SZ",4038,40,38,7640505.1619999995,30.851849999999999,1.0001740299999999,-6.3299999999433254E-6]
[null,null,null,null,null,null,null,null,"SZ",4039,40,39,7638654.051,30.852139999999999,1.00018045,-6.4200000000624868E-6]

{"sheet":"GRID>GRND","index":2,"n_rows":95,"n_cols":14,"rows_kept":95,"cut":false,"hidden":false,"merged":[[0,6,0,7],[1,6,1,7],[0,1,0,2],[1,1,1,2],[5,0,5,4],[5,6,5,10],[4,0,4,4],[4,6,4,10]]}
["Project:",{"$f":"REPORT!B2","v":"FRA-71-29.4"},null,null,null,"Input Units (please select):","State Plane Grid - US Survey Feet",null,null,"Unitless Grid to Ground Factor:",{"$f":"REPORT!C13","v":1.0000901799999999}]
["Pid:",{"$f":"REPORT!E2","v":106471},null,null,null,"Output Units (please select):","Ground - US Survey Feet",null,null,"Project Adjustment Factor:",{"$f":"K1*K3","v":3.2811291988833329}]
[null,null,null,null,null,null,null,null,null,"Metric to US Survey Feet Factor:",{"$f":"3937/1200","v":3.2808333333333333}]
[]
["INPUT",null,null,null,null,null,"OUTPUT"]
[{"$f":"G1","v":"State Plane Grid - US Survey Feet"},null,null,null,null,null,{"$f":"G2","v":"Ground - US Survey Feet"},null,null,null,null,null,null,"INPUT UNITS"]
["NAME","NORTH","EAST","ORTHO HT","FEATURE",null,"NAME","NORTH","EAST","ORTHO HT","FEATURE",null,null,"State Plane Grid - Meters"]
[null,null,null,null,null,null,{"$f":"A8","v":0},{"$f":"IF(AND($G$1=\"STATE PLANE GRID - METERS\",$G$2=\"STATE PLANE GRID - US SURVEY FEET\"),B8*$K$3,IF(AND($G$1=\"STATE PLANE GRID - METERS\",$G$2=\"GROUND - METERS\"),B8*$K$1,IF(AND($G$1=\"STATE PLANE GRID - METERS\",$G$2=\"GROUND - US SURVEY FEET\"),B8*$K$2,IF(AND($G$1=\"STATE PLANE GRID - US SURVEY FEET\",$G$2=\"STATE PLANE GRID - METERS\"),B8/$K$3,IF(AND($G$1=\"STATE PLANE GRID - US SURVEY FEET\",$G$2=\"GROUND - METERS\"),B8/$K$2,IF(AND($G$1=\"STATE PLANE GRID - US SURVEY FEET\",$G$2=\"GROUND - US SURVEY FEET\"),B8*$K$1,IF(AND($G$1=\"GROUND - METERS\",$G$2=\"STATE PLANE GRID - US SURVEY FEET\"),B8*$K$3/$K$1,IF(AND($G$1=\"GROUND - METERS\",$G$2=\"STATE PLANE GRID - METERS\"),B8/$K$1,IF(AND($G$1=\"GROUND - METERS\",$G$2=\"GROUND - US SURVEY FEET\"),B8*$K$3,IF(AND($G$1=\"GROUND - US SURVEY FEET\",$G$2=\"STATE PLANE GRID - US SURVEY FEET\"),B8/$K$1,IF(AND($G$1=\"GROUND - US SURVEY FEET\",$G$2=\"STATE PLANE GRID - METERS\"),B8/$K$2,IF(AND($G$1=\"GROUND - US SURVEY FEET\",$G$2=\"GROUND - METERS\"),B8/$K$3))))))))))))","v":0},{"$f":"IF(AND($G$1=\"STATE PLANE GRID - METERS\",$G$2=\"STATE PLANE GRID - US SURVEY FEET\"),C8*$K$3,IF(AND($G$1=\"STATE PLANE GRID - METERS\",$G$2=\"GROUND - METERS\"),C8*$K$1,IF(AND($G$1=\"STATE PLANE GRID - METERS\",$G$2=\"GROUND - US SURVEY FEET\"),C8*$K$2,IF(AND($G$1=\"STATE PLANE GRID - US SURVEY FEET\",$G$2=\"STATE PLANE GRID - METERS\"),C8/$K$3,IF(AND($G$1=\"STATE PLANE GRID - US SURVEY FEET\",$G$2=\"GROUND - METERS\"),C8/$K$2,IF(AND($G$1=\"STATE PLANE GRID - US SURVEY FEET\",$G$2=\"GROUND - US SURVEY FEET\"),C8*$K$1,IF(AND($G$1=\"GROUND - METERS\",$G$2=\"STATE PLANE GRID - US SURVEY FEET\"),C8*$K$3/$K$1,IF(AND($G$1=\"GROUND - METERS\",$G$2=\"STATE PLANE GRID - METERS\"),C8/$K$1,IF(AND($G$1=\"GROUND - METERS\",$G$2=\"GROUND - US SURVEY FEET\"),C8*$K$3,IF(AND($G$1=\"GROUND - US SURVEY FEET\",$G$2=\"STATE PLANE GRID - US SURVEY FEET\"),C8/$K$1,IF(AND($G$1=\"GROUND - US SURVEY FEET\",$G$2=\"STATE PLANE GRID - METERS\"),C8/$K$2,IF(AND($G$1=\"GROUND - US SURVEY FEET\",$G$2=\"GROUND - METERS\"),C8/$K$3))))))))))))","v":0},{"$f":"IF(AND($G$1=\"STATE PLANE GRID - METERS\",$G$2=\"STATE PLANE GRID - US SURVEY FEET\"),D8*$K$3,IF(AND($G$1=\"STATE PLANE GRID - METERS\",$G$2=\"GROUND - METERS\"),B8,IF(AND($G$1=\"STATE PLANE GRID - METERS\",$G$2=\"GROUND - US SURVEY FEET\"),D8*$K$3,IF(AND($G$1=\"STATE PLANE GRID - US SURVEY FEET\",$G$2=\"STATE PLANE GRID - METERS\"),D8/$K$3,IF(AND($G$1=\"STATE PLANE GRID - US SURVEY FEET\",$G$2=\"GROUND - METERS\"),D8/$K$3,IF(AND($G$1=\"STATE PLANE GRID - US SURVEY FEET\",$G$2=\"GROUND - US SURVEY FEET\"),D8,IF(AND($G$1=\"GROUND - METERS\",$G$2=\"STATE PLANE GRID - US SURVEY FEET\"),D8*$K$3,IF(AND($G$1=\"GROUND - METERS\",$G$2=\"STATE PLANE GRID - METERS\"),D8,IF(AND($G$1=\"GROUND - METERS\",$G$2=\"GROUND - US SURVEY FEET\"),D8*$K$3,IF(AND($G$1=\"GROUND - US SURVEY FEET\",$G$2=\"STATE PLANE GRID - US SURVEY FEET\"),D8,IF(AND($G$1=\"GROUND - US SURVEY FEET\",$G$2=\"STATE PLANE GRID - METERS\"),D8/$K$3,IF(AND($G$1=\"GROUND - US SURVEY FEET\",$G$2=\"GROUND - METERS\"),D8/$K$3))))))))))))","v":0},{"$f":"E8","v":0},null,null,"State Plane Grid - US Survey Feet"]
[null,null,null,null,null,null,0,0,0,0,0,null,null,"Ground - Meters"]
[null,null,null,null,null,null,0,0,0,0,0,null,null,"Ground - US Survey Feet"]
[null,null,null,null,null,null,0,0,0,0,0]
[null,null,null,null,null,null,0,0,0,0,0]
[null,null,null,null,null,null,0,0,0,0,0]
[null,null,null,null,null,null,0,0,0,0,0]
[null,null,null,null,null,null,0,0,0,0,0]
[null,null,null,null,null,null,0,0,0,0,0]
[null,null,null,null,null,null,0,0,0,0,0]
[null,null,null,null,null,null,0,0,0,0,0]
[null,null,null,null,null,null,0,0,0,0,0]
[null,null,null,null,null,null,0,0,0,0,0]
[null,null,null,null,null,null,0,0,0,0,0]
[null,null,null,null,null,null,0,0,0,0,0]
[null,null,null,null,null,null,0,0,0,0,0]
[null,null,null,null,null,null,0,0,0,0,0]
[null,null,null,null,null,null,0,0,0,0,0]
[null,null,null,null,null,null,0,0,0,0,0]
[null,null,null,null,null,null,0,0,0,0,0]
[null,null,null,null,null,null,0,0,0,0,0]
[null,null,null,null,null,null,0,0,0,0,0]
[null,null,null,null,null,null,0,0,0,0,0]
[null,null,null,null,null,null,0,0,0,0,0]
[null,null,null,null,null,null,0,0,0,0,0]
[null,null,null,null,null,null,0,0,0,0,0]
[null,null,null,null,null,null,0,0,0,0,0]
[null,null,null,null,null,null,0,0,0,0,0]
[null,null,null,null,null,null,0,0,0,0,0]
[null,null,null,null,null,null,0,0,0,0,0]
[null,null,null,null,null,null,0,0,0,0,0]
[null,null,null,null,null,null,0,0,0,0,0]
[null,null,null,null,null,null,0,{"$f":"IF(AND($G$1=\"STATE PLANE GRID - METERS\",$G$2=\"STATE PLANE GRID - US SURVEY FEET\"),B40*$K$3,IF(AND($G$1=\"STATE PLANE GRID - METERS\",$G$2=\"GROUND - METERS\"),B40*$K$1,IF(AND($G$1=\"STATE PLANE GRID - METERS\",$G$2=\"GROUND - US SURVEY FEET\"),B40*$K$2,IF(AND($G$1=\"STATE PLANE GRID - US SURVEY FEET\",$G$2=\"STATE PLANE GRID - METERS\"),B40/$K$3,IF(AND($G$1=\"STATE PLANE GRID - US SURVEY FEET\",$G$2=\"GROUND - METERS\"),B40/$K$2,IF(AND($G$1=\"STATE PLANE GRID - US SURVEY FEET\",$G$2=\"GROUND - US SURVEY FEET\"),B40*$K$1,IF(AND($G$1=\"GROUND - METERS\",$G$2=\"STATE PLANE GRID - US SURVEY FEET\"),B40*$K$3/$K$1,IF(AND($G$1=\"GROUND - METERS\",$G$2=\"STATE PLANE GRID - METERS\"),B40/$K$1,IF(AND($G$1=\"GROUND - METERS\",$G$2=\"GROUND - US SURVEY FEET\"),B40*$K$3,IF(AND($G$1=\"GROUND - US SURVEY FEET\",$G$2=\"STATE PLANE GRID - US SURVEY FEET\"),B40/$K$1,IF(AND($G$1=\"GROUND - US SURVEY FEET\",$G$2=\"STATE PLANE GRID - METERS\"),B40/$K$2,IF(AND($G$1=\"GROUND - US SURVEY FEET\",$G$2=\"GROUND - METERS\"),B40/$K$3))))))))))))","v":0},{"$f":"IF(AND($G$1=\"STATE PLANE GRID - METERS\",$G$2=\"STATE PLANE GRID - US SURVEY FEET\"),C40*$K$3,IF(AND($G$1=\"STATE PLANE GRID - METERS\",$G$2=\"GROUND - METERS\"),C40*$K$1,IF(AND($G$1=\"STATE PLANE GRID - METERS\",$G$2=\"GROUND - US SURVEY FEET\"),C40*$K$2,IF(AND($G$1=\"STATE PLANE GRID - US SURVEY FEET\",$G$2=\"STATE PLANE GRID - METERS\"),C40/$K$3,IF(AND($G$1=\"STATE PLANE GRID - US SURVEY FEET\",$G$2=\"GROUND - METERS\"),C40/$K$2,IF(AND($G$1=\"STATE PLANE GRID - US SURVEY FEET\",$G$2=\"GROUND - US SURVEY FEET\"),C40*$K$1,IF(AND($G$1=\"GROUND - METERS\",$G$2=\"STATE PLANE GRID - US SURVEY FEET\"),C40*$K$3/$K$1,IF(AND($G$1=\"GROUND - METERS\",$G$2=\"STATE PLANE GRID - METERS\"),C40/$K$1,IF(AND($G$1=\"GROUND - METERS\",$G$2=\"GROUND - US SURVEY FEET\"),C40*$K$3,IF(AND($G$1=\"GROUND - US SURVEY FEET\",$G$2=\"STATE PLANE GRID - US SURVEY FEET\"),C40/$K$1,IF(AND($G$1=\"GROUND - US SURVEY FEET\",$G$2=\"STATE PLANE GRID - METERS\"),C40/$K$2,IF(AND($G$1=\"GROUND - US SURVEY FEET\",$G$2=\"GROUND - METERS\"),C40/$K$3))))))))))))","v":0},{"$f":"IF(AND($G$1=\"STATE PLANE GRID - METERS\",$G$2=\"STATE PLANE GRID - US SURVEY FEET\"),D40*$K$3,IF(AND($G$1=\"STATE PLANE GRID - METERS\",$G$2=\"GROUND - METERS\"),B40,IF(AND($G$1=\"STATE PLANE GRID - METERS\",$G$2=\"GROUND - US SURVEY FEET\"),D40*$K$3,IF(AND($G$1=\"STATE PLANE GRID - US SURVEY FEET\",$G$2=\"STATE PLANE GRID - METERS\"),D40/$K$3,IF(AND($G$1=\"STATE PLANE GRID - US SURVEY FEET\",$G$2=\"GROUND - METERS\"),D40/$K$3,IF(AND($G$1=\"STATE PLANE GRID - US SURVEY FEET\",$G$2=\"GROUND - US SURVEY FEET\"),D40,IF(AND($G$1=\"GROUND - METERS\",$G$2=\"STATE PLANE GRID - US SURVEY FEET\"),D40*$K$3,IF(AND($G$1=\"GROUND - METERS\",$G$2=\"STATE PLANE GRID - METERS\"),D40,IF(AND($G$1=\"GROUND - METERS\",$G$2=\"GROUND - US SURVEY FEET\"),D40*$K$3,IF(AND($G$1=\"GROUND - US SURVEY FEET\",$G$2=\"STATE PLANE GRID - US SURVEY FEET\"),D40,IF(AND($G$1=\"GROUND - US SURVEY FEET\",$G$2=\"STATE PLANE GRID - METERS\"),D40/$K$3,IF(AND($G$1=\"GROUND - US SURVEY FEET\",$G$2=\"GROUND - METERS\"),D40/$K$3))))))))))))","v":0},0]
[null,null,null,null,null,null,0,0,0,0,0]
[null,null,null,null,null,null,0,0,0,0,0]
[null,null,null,null,null,null,0,0,0,0,0]
[null,null,null,null,null,null,0,0,0,0,0]
[null,null,null,null,null,null,0,0,0,0,0]
[null,null,null,null,null,null,0,0,0,0,0]
[null,null,null,null,null,null,0,0,0,0,0]
[null,null,null,null,null,null,0,0,0,0,0]
[null,null,null,null,null,null,0,0,0,0,0]
[null,null,null,null,null,null,0,0,0,0,0]
[null,null,null,null,null,null,0,0,0,0,0]
[null,null,null,null,null,null,0,0,0,0,0]
[null,null,null,null,null,null,0,0,0,0,0]
[null,null,null,null,null,null,0,0,0,0,0]
[null,null,null,null,null,null,0,0,0,0,0]
[null,null,null,null,null,null,0,0,0,0,0]
[null,null,null,null,null,null,0,0,0,0,0]
[null,null,null,null,null,null,0,0,0,0,0]
[null,null,null,null,null,null,0,0,0,0,0]
[null,null,null,null,null,null,0,0,0,0,0]
[null,null,null,null,null,null,0,0,0,0,0]
[null,null,null,null,null,null,0,0,0,0,0]
[null,null,null,null,null,null,0,0,0,0,0]
[null,null,null,null,null,null,0,0,0,0,0]
[null,null,null,null,null,null,0,0,0,0,0]
[null,null,null,null,null,null,0,0,0,0,0]
[null,null,null,null,null,null,0,0,0,0,0]
[null,null,null,null,null,null,0,0,0,0,0]
[null,null,null,null,null,null,0,0,0,0,0]
[null,null,null,null,null,null,0,0,0,0,0]
[null,null,null,null,null,null,0,0,0,0,0]
[null,null,null,null,null,null,{"$f":"A72","v":0},{"$f":"IF(AND($G$1=\"STATE PLANE GRID - METERS\",$G$2=\"STATE PLANE GRID - US SURVEY FEET\"),B72*$K$3,IF(AND($G$1=\"STATE PLANE GRID - METERS\",$G$2=\"GROUND - METERS\"),B72*$K$1,IF(AND($G$1=\"STATE PLANE GRID - METERS\",$G$2=\"GROUND - US SURVEY FEET\"),B72*$K$2,IF(AND($G$1=\"STATE PLANE GRID - US SURVEY FEET\",$G$2=\"STATE PLANE GRID - METERS\"),B72/$K$3,IF(AND($G$1=\"STATE PLANE GRID - US SURVEY FEET\",$G$2=\"GROUND - METERS\"),B72/$K$2,IF(AND($G$1=\"STATE PLANE GRID - US SURVEY FEET\",$G$2=\"GROUND - US SURVEY FEET\"),B72*$K$1,IF(AND($G$1=\"GROUND - METERS\",$G$2=\"STATE PLANE GRID - US SURVEY FEET\"),B72*$K$3/$K$1,IF(AND($G$1=\"GROUND - METERS\",$G$2=\"STATE PLANE GRID - METERS\"),B72/$K$1,IF(AND($G$1=\"GROUND - METERS\",$G$2=\"GROUND - US SURVEY FEET\"),B72*$K$3,IF(AND($G$1=\"GROUND - US SURVEY FEET\",$G$2=\"STATE PLANE GRID - US SURVEY FEET\"),B72/$K$1,IF(AND($G$1=\"GROUND - US SURVEY FEET\",$G$2=\"STATE PLANE GRID - METERS\"),B72/$K$2,IF(AND($G$1=\"GROUND - US SURVEY FEET\",$G$2=\"GROUND - METERS\"),B72/$K$3))))))))))))","v":0},{"$f":"IF(AND($G$1=\"STATE PLANE GRID - METERS\",$G$2=\"STATE PLANE GRID - US SURVEY FEET\"),C72*$K$3,IF(AND($G$1=\"STATE PLANE GRID - METERS\",$G$2=\"GROUND - METERS\"),C72*$K$1,IF(AND($G$1=\"STATE PLANE GRID - METERS\",$G$2=\"GROUND - US SURVEY FEET\"),C72*$K$2,IF(AND($G$1=\"STATE PLANE GRID - US SURVEY FEET\",$G$2=\"STATE PLANE GRID - METERS\"),C72/$K$3,IF(AND($G$1=\"STATE PLANE GRID - US SURVEY FEET\",$G$2=\"GROUND - METERS\"),C72/$K$2,IF(AND($G$1=\"STATE PLANE GRID - US SURVEY FEET\",$G$2=\"GROUND - US SURVEY FEET\"),C72*$K$1,IF(AND($G$1=\"GROUND - METERS\",$G$2=\"STATE PLANE GRID - US SURVEY FEET\"),C72*$K$3/$K$1,IF(AND($G$1=\"GROUND - METERS\",$G$2=\"STATE PLANE GRID - METERS\"),C72/$K$1,IF(AND($G$1=\"GROUND - METERS\",$G$2=\"GROUND - US SURVEY FEET\"),C72*$K$3,IF(AND($G$1=\"GROUND - US SURVEY FEET\",$G$2=\"STATE PLANE GRID - US SURVEY FEET\"),C72/$K$1,IF(AND($G$1=\"GROUND - US SURVEY FEET\",$G$2=\"STATE PLANE GRID - METERS\"),C72/$K$2,IF(AND($G$1=\"GROUND - US SURVEY FEET\",$G$2=\"GROUND - METERS\"),C72/$K$3))))))))))))","v":0},{"$f":"IF(AND($G$1=\"STATE PLANE GRID - METERS\",$G$2=\"STATE PLANE GRID - US SURVEY FEET\"),D72*$K$3,IF(AND($G$1=\"STATE PLANE GRID - METERS\",$G$2=\"GROUND - METERS\"),B72,IF(AND($G$1=\"STATE PLANE GRID - METERS\",$G$2=\"GROUND - US SURVEY FEET\"),D72*$K$3,IF(AND($G$1=\"STATE PLANE GRID - US SURVEY FEET\",$G$2=\"STATE PLANE GRID - METERS\"),D72/$K$3,IF(AND($G$1=\"STATE PLANE GRID - US SURVEY FEET\",$G$2=\"GROUND - METERS\"),D72/$K$3,IF(AND($G$1=\"STATE PLANE GRID - US SURVEY FEET\",$G$2=\"GROUND - US SURVEY FEET\"),D72,IF(AND($G$1=\"GROUND - METERS\",$G$2=\"STATE PLANE GRID - US SURVEY FEET\"),D72*$K$3,IF(AND($G$1=\"GROUND - METERS\",$G$2=\"STATE PLANE GRID - METERS\"),D72,IF(AND($G$1=\"GROUND - METERS\",$G$2=\"GROUND - US SURVEY FEET\"),D72*$K$3,IF(AND($G$1=\"GROUND - US SURVEY FEET\",$G$2=\"STATE PLANE GRID - US SURVEY FEET\"),D72,IF(AND($G$1=\"GROUND - US SURVEY FEET\",$G$2=\"STATE PLANE GRID - METERS\"),D72/$K$3,IF(AND($G$1=\"GROUND - US SURVEY FEET\",$G$2=\"GROUND - METERS\"),D72/$K$3))))))))))))","v":0},{"$f":"E72","v":0}]
[null,null,null,null,null,null,0,0,0,0,0]
[null,null,null,null,null,null,0,0,0,0,0]
[null,null,null,null,null,null,0,0,0,0,0]
[null,null,null,null,null,null,0,0,0,0,0]
[null,null,null,null,null,null,0,0,0,0,0]
[null,null,null,null,null,null,0,0,0,0,0]
[null,null,null,null,null,null,0,0,0,0,0]
[null,null,null,null,null,null,0,0,0,0,0]
[null,null,null,null,null,null,0,0,0,0,0]
[null,null,null,null,null,null,0,0,0,0,0]
[null,null,null,null,null,null,0,0,0,0,0]
[null,null,null,null,null,null,0,0,0,0,0]
[null,null,null,null,null,null,0,0,0,0,0]
[null,null,null,null,null,null,0,0,0,0,0]
[null,null,null,null,null,null,0,0,0,0,0]
[null,null,null,null,null,null,0,0,0,0,0]
[null,null,null,null,null,null,0,0,0,0,0]
[null,null,null,null,null,null,0,0,0,0,0]
[null,null,null,null,null,null,0,0,0,0,0]
[null,null,null,null,null,null,0,0,0,0,0]
[null,null,null,null,null,null,0,0,0,0,0]
[null,null,null,null,null,null,0,0,0,0,0]
[null,null,null,null,null,null,0,0,0,0,0]

{"sheet":"OWNERS","index":3,"n_rows":1,"n_cols":12,"rows_kept":1,"cut":false,"hidden":false,"merged":[]}
["First","Last","Address","City","State","Zip Code","Deed Book/Page","Auditor Parcel Number","Area","Section","Lot","Tax Map Parcel"]

{"sheet":"OSIP","index":4,"n_rows":96,"n_cols":18,"rows_kept":96,"cut":false,"hidden":false,"merged":[[0,2,0,4],[1,2,1,4],[6,14,6,15],[6,16,6,17],[23,0,23,8],[15,0,15,8],[7,0,7,8]]}
[null,"Project:",{"$f":"REPORT!B2","v":"FRA-71-29.4"}]
[null,"Pid:",{"$f":"REPORT!E2","v":106471}]
[]
["Calculate the Project Coordinates for the corners of the Aerial Mapping Raster File"]
["To scale the Geo-referenced file to the Project Datum  ",null,null,null,null,null,null,null,null,null,null,null,null,"Project County:",null,{"$f":"REPORT!B2","v":"FRA-71-29.4"},{"$f":"MID(P5,1,3)","v":"FRA"}]
[]
[null,null,null,null,null,null,null,null,null,null,null,null,null,null,"Photo Corners",null,"Pixel Range"]
["INPUT: SP GRID - US SURVEY FEET",null,null,null,null,null,null,null,null,null,null,null,null,"COUNTY","EASTING","NORTHING","EASTING","NORTHING"]
[null,"X (East)","Y (North) ",null,null,null,null,null,null,null,null,null,null,"ADA",1620000,215000,130000,175000]
["Lower left (SW) origin:",{"$f":"VLOOKUP(MID(REPORT!B2,1,3),OSIP!N9:R96,2,FALSE)","v":1755000},{"$f":"VLOOKUP(MID(REPORT!B2,1,3),OSIP!N9:R96,3,FALSE)","v":650000},"Enter X,Y from Georeferenced Raster File Header",null,null,null,null,null,null,null,null,null,"ALL",1440000,355000,150000,110000]
["Pixel Range:",{"$f":"VLOOKUP(MID(REPORT!B2,1,3),OSIP!N9:R96,4,FALSE)","v":145000},{"$f":"VLOOKUP(MID(REPORT!B2,1,3),OSIP!N9:R96,5,FALSE)","v":135000},"Enter X,Y from Georeferenced Raster File Header",null,null,null,null,null,null,null,null,null,"ASD",1985000,320000,90000,195000]
["Upper right (NE) origin:",{"$f":"B10+B11","v":1900000},{"$f":"C10+C11","v":785000},"Calculated NE ORIGIN using Delta X & Delta Y",null,null,null,null,null,null,null,null,null,"ASH",2375000,670000,140000,185000]
[null,null,null,null,null,null,null,null,null,null,null,null,null,"ATH",2025000,430000,165000,140000]
["PAF (scale multiplier):",{"$f":"REPORT!C13","v":1.0000901799999999},null,"Enter Unitless Project Adjustment Factor for Project",null,null,null,null,null,null,null,null,null,"AUG",1420000,255000,170000,125000]
[null,null,null,null,null,null,null,null,null,null,null,null,null,"BEL",2320000,675000,155000,120000]
["OUTPUT: PROJECT GROUND - US SURVEY FEET",null,null,null,null,null,null,null,null,null,null,null,null,"BRO",1525000,230000,115000,235000]
[null,"X (East)","Y (North) ",null,null,null,null,null,null,null,null,null,null,"BUT",1310000,475000,145000,115000]
["Lower left (SW) origin (MAP01):",{"$f":"PRODUCT(B10,B14)","v":1755158.2659},{"$f":"PRODUCT(C10,B14)","v":650058.61699999997},"Calculated Scaled ORIGIN Coordinates",null,null,null,null,null,null,null,null,null,"CAR",2295000,275000,130000,120000]
["Upper right (NE) origin (MAP02):",{"$f":"PRODUCT(B12,B14)","v":1900171.3419999999},{"$f":"PRODUCT(C12,B14)","v":785070.79129999992},"Calculated Scaled ORIGIN Coordinates",null,null,null,null,null,null,null,null,null,"CHP",1535000,730000,160000,105000]
[null,null,null,null,null,null,null,null,null,null,null,null,null,"CLA",1530000,645000,160000,105000]
[null,null,null,"(Edit Header & Footer for Printing File report copy)",null,null,null,null,null,null,null,null,null,"CLE",1450000,280000,100000,190000]
[null,null,null,null,null,null,null,null,null,null,null,null,null,"CLI",1540000,445000,125000,130000]
["1) Place a Shape (BOX) in the MicroStation file at the Project Origin Coordinates and use KEY-IN COMMAND  XY= (X value),(Y value) for both corners",null,null,null,null,null,null,null,null,null,null,null,null,"COL",2355000,335000,165000,130000]
["2) Attach the Raster File using the \"INTERACTIVE\" Toggle & PLACE at the Corners of the BOX",null,null,null,null,null,null,null,null,null,null,null,null,"COS",2050000,175000,165000,115000]
[null,null,null,null,null,null,null,null,null,null,null,null,null,"CRA",1795000,375000,115000,115000]
["This will scale the Aerial Mapping Ortho Photo to fit the PROJECT COORDINATES",null,null,null,null,null,null,null,null,null,null,null,null,"CUY",2110000,585000,170000,145000]
[null,null,null,null,null,null,null,null,null,null,null,null,null,"DAR",1315000,700000,115000,170000]
[null,null,null,null,null,null,null,null,null,null,null,null,null,"DEF",1330000,550000,165000,100000]
[null,null,null,null,null,null,null,null,null,null,null,null,null,"DEL",1755000,165000,150000,120000]
[null,null,null,null,null,null,null,null,null,null,null,null,null,"ERI",1855000,585000,160000,135000]
[null,null,null,null,null,null,null,null,null,null,null,null,null,"FAI",1870000,565000,140000,145000]
[null,null,null,null,null,null,null,null,null,null,null,null,null,"FAY",1635000,500000,125000,130000]
[null,null,null,null,null,null,null,null,null,null,null,null,null,"FRA",1755000,650000,145000,135000]
[null,null,null,null,null,null,null,null,null,null,null,null,null,"FUL",1445000,665000,150000,90000]
[null,null,null,null,null,null,null,null,null,null,null,null,null,"GAL",1940000,210000,145000,170000]
[null,null,null,null,null,null,null,null,null,null,null,null,null,"GEA",2270000,610000,110000,145000]
[null,null,null,null,null,null,null,null,null,null,null,null,null,"GRE",1510000,565000,140000,115000]
[null,null,null,null,null,null,null,null,null,null,null,null,null,"GUE",2180000,670000,145000,145000]
[null,null,null,null,null,null,null,null,null,null,null,null,null,"HAM",1305000,375000,170000,110000]
[null,null,null,null,null,null,null,null,null,null,null,null,null,"HAN",1585000,420000,135000,135000]
[null,null,null,null,null,null,null,null,null,null,null,null,null,"HAR",1580000,305000,135000,120000]
[null,null,null,null,null,null,null,null,null,null,null,null,null,"HAS",2290000,180000,135000,105000]
[null,null,null,null,null,null,null,null,null,null,null,null,null,"HEN",1460000,545000,130000,125000]
[null,null,null,null,null,null,null,null,null,null,null,null,null,"HIG",1575000,370000,155000,135000]
[null,null,null,null,null,null,null,null,null,null,null,null,null,"HOC",1895000,495000,170000,115000]
[null,null,null,null,null,null,null,null,null,null,null,null,null,"HOL",2045000,280000,160000,90000]
[null,null,null,null,null,null,null,null,null,null,null,null,null,"HUR",1870000,480000,145000,115000]
[null,null,null,null,null,null,null,null,null,null,null,null,null,"JAC",1880000,305000,110000,140000]
[null,null,null,null,null,null,null,null,null,null,null,null,null,"JEF",2400000,180000,100000,165000]
[null,null,null,null,null,null,null,null,null,null,null,null,null,"KNO",1895000,205000,165000,130000]
[null,null,null,null,null,null,null,null,null,null,null,null,null,"LAK",2240000,690000,140000,115000]
[null,null,null,null,null,null,null,null,null,null,null,null,null,"LAW",1875000,145000,155000,165000]
[null,null,null,null,null,null,null,null,null,null,null,null,null,"LIC",1885000,695000,175000,135000]
[null,null,null,null,null,null,null,null,null,null,null,null,null,"LOG",1545000,205000,145000,120000]
[null,null,null,null,null,null,null,null,null,null,null,null,null,"LOR",2005000,505000,135000,175000]
[null,null,null,null,null,null,null,null,null,null,null,null,null,"LUC",1585000,635000,225000,125000]
[null,null,null,null,null,null,null,null,null,null,null,null,null,"MAD",1640000,615000,135000,160000]
[null,null,null,null,null,null,null,null,null,null,null,null,null,"MAH",2355000,450000,165000,95000]
[null,null,null,null,null,null,null,null,null,null,null,null,null,"MAR",1710000,275000,160000,105000]
[null,null,null,null,null,null,null,null,null,null,null,null,null,"MED",2055000,480000,140000,110000]
[null,null,null,null,null,null,null,null,null,null,null,null,null,"MEG",2015000,315000,175000,125000]
[null,null,null,null,null,null,null,null,null,null,null,null,null,"MER",1325000,255000,110000,145000]
[null,null,null,null,null,null,null,null,null,null,null,null,null,"MIA",1425000,685000,120000,125000]
[null,null,null,null,null,null,null,null,null,null,null,null,null,"MOE",2300000,560000,145000,125000]
[null,null,null,null,null,null,null,null,null,null,null,null,null,"MOT",1410000,575000,125000,130000]
[null,null,null,null,null,null,null,null,null,null,null,null,null,"MRG",2085000,525000,145000,125000]
[null,null,null,null,null,null,null,null,null,null,null,null,null,"MRW",1820000,245000,115000,140000]
[null,null,null,null,null,null,null,null,null,null,null,null,null,"MUS",2040000,640000,160000,150000]
[null,null,null,null,null,null,null,null,null,null,null,null,null,"NOB",2190000,575000,135000,140000]
[null,null,null,null,null,null,null,null,null,null,null,null,null,"OTT",1715000,650000,20000,105000]
[null,null,null,null,null,null,null,null,null,null,null,null,null,"PAU",1330000,485000,135000,105000]
[null,null,null,null,null,null,null,null,null,null,null,null,null,"PER",1975000,560000,130000,145000]
[null,null,null,null,null,null,null,null,null,null,null,null,null,"PIC",1750000,530000,155000,135000]
[null,null,null,null,null,null,null,null,null,null,null,null,null,"PIK",1715000,345000,175000,95000]
[null,null,null,null,null,null,null,null,null,null,null,null,null,"POR",2270000,480000,115000,140000]
[null,null,null,null,null,null,null,null,null,null,null,null,null,"PRE",1310000,575000,105000,135000]
[null,null,null,null,null,null,null,null,null,null,null,null,null,"PUT",1440000,435000,150000,120000]
[null,null,null,null,null,null,null,null,null,null,null,null,null,"RIC",1900000,320000,115000,165000]
[null,null,null,null,null,null,null,null,null,null,null,null,null,"ROS",1715000,425000,190000,130000]
[null,null,null,null,null,null,null,null,null,null,null,null,null,"SAN",1715000,575000,165000,100000]
[null,null,null,null,null,null,null,null,null,null,null,null,null,"SCI",1745000,205000,185000,170000]
[null,null,null,null,null,null,null,null,null,null,null,null,null,"SEN",1710000,480000,170000,105000]
[null,null,null,null,null,null,null,null,null,null,null,null,null,"SHE",1425000,190000,130000,115000]
[null,null,null,null,null,null,null,null,null,null,null,null,null,"STA",2200000,350000,165000,135000]
[null,null,null,null,null,null,null,null,null,null,null,null,null,"SUM",2190000,450000,85000,175000]
[null,null,null,null,null,null,null,null,null,null,null,null,null,"TRU",2375000,535000,145000,140000]
[null,null,null,null,null,null,null,null,null,null,null,null,null,"TUS",2185000,200000,130000,170000]
[null,null,null,null,null,null,null,null,null,null,null,null,null,"UNI",1650000,160000,265000,295000]
[null,null,null,null,null,null,null,null,null,null,null,null,null,"VAN",1325000,375000,135000,120000]
[null,null,null,null,null,null,null,null,null,null,null,null,null,"VIN",1890000,370000,150000,140000]
[null,null,null,null,null,null,null,null,null,null,null,null,null,"WAR",1440000,460000,115000,125000]
[null,null,null,null,null,null,null,null,null,null,null,null,null,"WAS",2150000,440000,235000,165000]
[null,null,null,null,null,null,null,null,null,null,null,null,null,"WAY",2070000,360000,135000,125000]
[null,null,null,null,null,null,null,null,null,null,null,null,null,"WIL",1335000,645000,130000,105000]
[null,null,null,null,null,null,null,null,null,null,null,null,null,"WOO",1585000,545000,135000,170000]
[null,null,null,null,null,null,null,null,null,null,null,null,null,"WYA",1685000,370000,115000,115000]

{"sheet":"MON TABLE","index":5,"n_rows":218,"n_cols":17,"rows_kept":218,"cut":false,"hidden":false,"merged":[[106,9,107,14],[108,0,109,6],[108,7,109,7],[106,0,107,7],[101,0,101,1],[102,0,102,1],[103,0,103,1],[104,0,104,7],[103,4,103,7],[102,4,102,7],[101,4,101,7],[102,8,102,16],[101,8,101,16],[106,15,106,16],[107,15,108,16],[108,9,108,14],[37,0,37,7],[69,0,69,7],[1,0,2,7],[1,8,5,8],[3,13,4,13],[3,0,4,6],[3,7,4,7],[3,9,4,9],[3,10,4,10],[3,11,4,12],[1,9,2,14],[5,1,5,2],[5,9,5,14],[5,3,5,7],[0,0,0,3],[0,7,0,11],[0,13,0,16],[1,15,1,16],[2,15,3,16],[0,4,0,6],[3,14,4,14],[186,1,186,2],[103,8,103,16],[104,8,104,16],[150,3,150,7],[186,3,186,7],[184,0,185,6],[184,7,185,7],[146,0,147,7],[150,1,150,2],[148,0,149,6],[148,7,149,7],[183,0,183,7],[110,1,110,2],[110,9,110,14],[110,3,110,7],[106,8,110,8],[142,9,143,14],[142,16,143,16],[142,15,143,15],[183,8,186,8],[183,9,183,14],[184,9,184,14],[186,9,186,14],[150,9,150,14],[146,8,150,8],[146,9,147,14],[148,9,148,14]]}
["PROJECT: ",null,null,null,{"$f":"REPORT!B2","v":"FRA-71-29.4"},null,null,"PID:",null,null,null,null,{"$f":"REPORT!$E$2","v":106471}]
["PROJECT GROUND COORDINATES - US SURVEY FEET",null,null,null,null,null,null,null,"PROJECT CONTROL POINTS","STATE PLANE GRID COORDINATES",null,null,null,null,null,"  MONUMENTS TO BE SET"]
[null,null,null,null,null,null,null,null,null,null,null,null,null,null,null," DURING CONSTRUCTION"]
["Project coordinates (U.S. Survey Feet) are relative to State Plane Grid coordinates (meters) by a Project Adjustment Factor of:",null,null,null,null,null,null,{"$f":"C103","v":3.2811291988833329},null,"Horiz. Datum:",{"$f":"REPORT!C11","v":"NAD83 (2011)"},{"$f":"REPORT!C10","v":"Ohio State Plane, South Zone"},null,"Vert. Datum:",{"$f":"REPORT!C15","v":"NAVD88"}]
[null,null,null,null,null,null,null,null,null,null,null,null,null,null,null,"ITEM 623.05","ITEM 623.05"]
[null,{"$f":"\"C/L of Right-of-Way SR \"&MID(E1,5,3)","v":"C/L of Right-of-Way SR 71-"},null,{"$f":"REPORT!C32&\" used for alignment\"","v":" used for alignment"},null,null,null,null,null,{"$f":"REPORT!A44&\" defined by GPS from CORS using \"&REPORT!C16&\". All other elevations are established by leveling from \"&REPORT!A44&\".\"","v":" defined by GPS from CORS using Geoid 12B. All other elevations are established by leveling from ."},null,null,null,null,null,"MONUMENT ","REFERENCE"]
["NAME","STATION","OFFSET (US FT)","RT/LT","NORTH (US FT)","EAST (US FT)","ELEVATION (US FT)","FEATURE","DESCRIPTION","NAME","NORTH (sft)","EAST (sft)","ORTHO HT (sft)","NORTH (US FT)","EAST (US FT)","ASSEMBLY","MONUMENT"]
[null,null,null,{"$f":"IF(C8<0,\"LT\",\"RT\")","v":"RT"},null,null,null,null,null,{"$f":"A8","v":0},{"$f":"E8/$C$103","v":0},{"$f":"F8/$C$103","v":0},{"$f":"G8/$C$104","v":0},{"$f":"$K8*$C$104","v":0},{"$f":"$L8*$C$104","v":0}]
[null,null,null,{"$f":"IF(C9<0,\"LT\",\"RT\")","v":"RT"},null,null,null,null,null,{"$f":"A9","v":0},0,0,0,0,0]
[null,null,null,"RT",null,null,null,null,null,0,0,0,0,0,0]
[null,null,null,"RT",null,null,null,null,null,0,0,0,0,0,0]
[null,null,null,"RT",null,null,null,null,null,0,0,0,0,0,0]
[null,null,null,"RT",null,null,null,null,null,0,0,0,0,0,0]
[null,null,null,"RT",null,null,null,null,null,0,0,0,0,0,0]
[null,null,null,"RT",null,null,null,null,null,0,0,0,0,0,0]
[null,null,null,"RT",null,null,null,null,null,0,0,0,0,0,0]
[null,null,null,"RT",null,null,null,null,null,0,0,0,0,0,0]
[null,null,null,"RT",null,null,null,null,null,0,0,0,0,0,0]
[null,null,null,"RT",null,null,null,null,null,0,0,0,0,0,0]
[null,null,null,"RT",null,null,null,null,null,0,0,0,0,0,0]
[null,null,null,"RT",null,null,null,null,null,0,0,0,0,0,0]
[null,null,null,"RT",null,null,null,null,null,0,0,0,0,0,0]
[null,null,null,"RT",null,null,null,null,null,0,0,0,0,0,0]
[null,null,null,"RT",null,null,null,null,null,0,0,0,0,0,0]
[null,null,null,"RT",null,null,null,null,null,0,0,0,0,0,0]
[null,null,null,"RT",null,null,null,null,null,0,0,0,0,0,0]
[null,null,null,"RT",null,null,null,null,null,0,0,0,0,0,0]
[null,null,null,"RT",null,null,null,null,null,0,0,0,0,0,0]
[null,null,null,"RT",null,null,null,null,null,0,0,0,0,0,0]
[null,null,null,"RT",null,null,null,null,null,0,0,0,0,0,0]
[null,null,null,"RT",null,null,null,null,null,0,0,0,0,0,0]
[null,null,null,"RT",null,null,null,null,null,{"$f":"A32","v":0},0,0,0,0,0]
[null,null,null,"RT",null,null,null,null,null,0,0,0,0,0,0]
[null,null,null,"RT",null,null,null,null,null,0,0,0,0,0,0]
[null,null,null,"RT",null,null,null,null,null,0,0,0,0,0,0]
[null,null,null,"RT",null,null,null,null,null,{"$f":"A36","v":0},0,0,0,0,0]
[null,null,null,"RT",null,null,null,null,null,{"$f":"A37","v":0},0,0,0,0,0]
[{"$f":"\"EXISTING  MONUMENTATION    \"&\"CENTERLINE OF RIGHT OF WAY    STATE ROUTE \"&MID(E1,5,3)","v":"EXISTING  MONUMENTATION    CENTERLINE OF RIGHT OF WAY    STATE ROUTE 71-"},null,null,null,null,null,null,null,"EXISTING CENTERLINE CONTROL POINTS","Horiz. Datum:",{"$f":"REPORT!C11","v":"NAD83 (2011)"},{"$f":"REPORT!C10","v":"Ohio State Plane, South Zone"},null,"Vert. Datum:",{"$f":"REPORT!C15","v":"NAVD88"}]
["NAME","STATION","OFFSET (US FT)","RT/LT","NORTH (US FT)","EAST (US FT)","ELEVATION (US FT)","FEATURE","DESCRIPTION","NAME","NORTH (sft)","EAST (sft)","ORTHO HT (sft)","NORTH (US FT)","EAST (US FT)"]
[null,null,null,{"$f":"IF(C40<0,\"LT\",\"RT\")","v":"RT"},null,null,null,null,null,{"$f":"A40","v":0},{"$f":"E40/$C$103","v":0},{"$f":"F40/$C$103","v":0},{"$f":"G40/$C$104","v":0},{"$f":"$K40*$C$104","v":0},{"$f":"$L40*$C$104","v":0}]
[null,null,null,"RT",null,null,null,null,null,0,0,0,0,0,0]
[null,null,null,"RT",null,null,null,null,null,0,0,0,0,0,0]
[null,null,null,"RT",null,null,null,null,null,0,0,0,0,0,0]
[null,null,null,"RT",null,null,null,null,null,0,0,0,0,0,0]
[null,null,null,"RT",null,null,null,null,null,0,0,0,0,0,0]
[null,null,null,"RT",null,null,null,null,null,0,0,0,0,0,0]
[null,null,null,"RT",null,null,null,null,null,0,0,0,0,0,0]
[null,null,null,"RT",null,null,null,null,null,0,0,0,0,0,0]
[null,null,null,"RT",null,null,null,null,null,0,0,0,0,0,0]
[null,null,null,"RT",null,null,null,null,null,0,0,0,0,0,0]
[null,null,null,"RT",null,null,null,null,null,{"$f":"A51","v":0},0,0,0,0,0]
[null,null,null,"RT",null,null,null,null,null,0,0,0,0,0,0]
[null,null,null,"RT",null,null,null,null,null,0,0,0,0,0,0]
[null,null,null,"RT",null,null,null,null,null,0,0,0,0,0,0]
[null,null,null,"RT",null,null,null,null,null,0,0,0,0,0,0]
[null,null,null,"RT",null,null,null,null,null,0,0,0,0,0,0]
[null,null,null,"RT",null,null,null,null,null,{"$f":"A57","v":0},0,0,0,0,0]
[null,null,null,"RT",null,null,null,null,null,0,0,0,0,0,0]
[null,null,null,"RT",null,null,null,null,null,0,0,0,0,0,0]
[null,null,null,"RT",null,null,null,null,null,0,0,0,0,0,0]
[null,null,null,"RT",null,null,null,null,null,0,0,0,0,0,0]
[null,null,null,"RT",null,null,null,null,null,0,0,0,0,0,0]
[null,null,null,"RT",null,null,null,null,null,0,0,0,0,0,0]
[null,null,null,"RT",null,null,null,null,null,0,0,0,0,0,0]
[null,null,null,"RT",null,null,null,null,null,0,0,0,0,0,0]
[null,null,null,"RT",null,null,null,null,null,0,0,0,0,0,0]
[null,null,null,"RT",null,null,null,null,null,0,0,0,0,0,0]
[null,null,null,"RT",null,null,null,null,null,0,0,0,0,0,0]
[null,null,null,"RT",null,null,null,null,null,0,0,0,0,0,0]
[{"$f":"\"    CENTERLINE OF RIGHT OF WAY & CONSTRUCTION    \"&\"STATE ROUTE \"&MID(E1,5,3)","v":"    CENTERLINE OF RIGHT OF WAY & CONSTRUCTION    STATE ROUTE 71-"},null,null,null,null,null,null,null,"CENTERLINE ALIGNMENT","Horiz. Datum:",{"$f":"REPORT!C11","v":"NAD83 (2011)"},{"$f":"REPORT!C10","v":"Ohio State Plane, South Zone"},null,"Vert. Datum:",{"$f":"REPORT!C15","v":"NAVD88"}]
["NAME","STATION","OFFSET (US FT)","RT/LT","NORTH (US FT)","EAST (US FT)","ELEVATION (US FT)","FEATURE","DESCRIPTION","NAME","NORTH (sft)","EAST (sft)","ORTHO HT (sft)","NORTH (US FT)","EAST (US FT)"]
[null,null,null,{"$f":"IF(C72<0,\"LT\",\"RT\")","v":"RT"},null,null,null,null,null,{"$f":"A72","v":0},{"$f":"E72/$C$103","v":0},{"$f":"F72/$C$103","v":0},{"$f":"G72/$C$104","v":0},{"$f":"$K72*$C$104","v":0},{"$f":"$L72*$C$104","v":0}]
[null,null,null,"RT",null,null,null,null,null,{"$f":"A73","v":0},0,0,0,0,0]
[null,null,null,"RT",null,null,null,null,null,0,0,0,0,0,0]
[null,null,null,"RT",null,null,null,null,null,0,0,0,0,0,0]
[null,null,null,"RT",null,null,null,null,null,{"$f":"A76","v":0},0,0,0,0,0]
[null,null,null,"RT",null,null,null,null,null,0,0,0,0,0,0]
[null,null,null,"RT",null,null,null,null,null,0,0,0,0,0,0]
[null,null,null,"RT",null,null,null,null,null,0,0,0,0,0,0]
[null,null,null,"RT",null,null,null,null,null,0,0,0,0,0,0]
[null,null,null,"RT",null,null,null,null,null,0,0,0,0,0,0]
[null,null,null,"RT",null,null,null,null,null,0,0,0,0,0,0]
[null,null,null,"RT",null,null,null,null,null,0,0,0,0,0,0]
[null,null,null,"RT",null,null,null,null,null,0,0,0,0,0,0]
[null,null,null,"RT",null,null,null,null,null,0,0,0,0,0,0]
[null,null,null,"RT",null,null,null,null,null,0,0,0,0,0,0]
[null,null,null,"RT",null,null,null,null,null,0,0,0,0,0,0]
[null,null,null,"RT",null,null,null,null,null,0,0,0,0,0,0]
[null,null,null,"RT",null,null,null,null,null,0,0,0,0,0,0]
[null,null,null,"RT",null,null,null,null,null,0,0,0,0,0,0]
[null,null,null,"RT",null,null,null,null,null,0,0,0,0,0,0]
[null,null,null,"RT",null,null,null,null,null,0,0,0,0,0,0]
[null,null,null,"RT",null,null,null,null,null,0,0,0,0,0,0]
[null,null,null,"RT",null,null,null,null,null,0,0,0,0,0,0]
[null,null,null,"RT",null,null,null,null,null,0,0,0,0,0,0]
[null,null,null,"RT",null,null,null,null,null,0,0,0,0,0,0]
[null,null,null,"RT",null,null,null,null,null,0,0,0,0,0,0]
[null,null,null,"RT",null,null,null,null,null,0,0,0,0,0,0]
[null,null,null,"RT",null,null,null,null,null,0,0,0,0,0,0]
[null,null,null,"RT",null,null,null,null,null,0,0,0,0,0,0]
[null,null,null,"RT",null,null,null,null,null,0,0,0,0,0,0," "]
["Grid to Ground Multiplier (1/CSF) = ",null,{"$f":"REPORT!C13","v":1.0000901799999999},null,"State Plane Grid to Project Ground (same units)",null,null,null,"Unitless Factor:"]
["Project Adjustment Factor (PAF) =",null,{"$f":"C102*C104","v":3.2811291988833329},null,"State Plane Grid (meters) to Project Ground (US Survey Feet)",null,null,null,{"$f":"REPORT!A45&REPORT!A46&REPORT!C46","v":""}]
["English to metric conversion =",null,{"$f":"3937/1200","v":3.2808333333333333},null,"US Survey foor to meters conversion factor",null,null,null,"Primary Project Control:"]
["PROJECT coordinates are scaled from GRID coordinates about the Ohio North Zone grid point N=0, E=0 (N 39⁰ 27' 01.76097\", W 89⁰ 28' 32.98476\").",null,null,null,null,null,null,null,{"$f":"REPORT!A41&REPORT!A42&REPORT!A43","v":""}]
[]
["PROJECT GROUND COORDINATES - US SURVEY FEET",null,null,null,null,null,null,null,"PROPOSED RIGHT OF WAY MONUMENTS","STATE PLANE GRID COORDINATES",null,null,null,null,null,"MONUMENTS TO BE RESET"]
[null,null,null,null,null,null,null,null,null,null,null,null,null,null,null,"AFTER CONSTRUCTION"]
[{"$f":"A4","v":"Project coordinates (U.S. Survey Feet) are relative to State Plane Grid coordinates (meters) by a Project Adjustment Factor of:"},null,null,null,null,null,null,{"$f":"H4","v":3.2811291988833329}]
[null,null,null,null,null,null,null,null,null,"Horiz. Datum:",{"$f":"REPORT!C11","v":"NAD83 (2011)"},{"$f":"REPORT!C10","v":"Ohio State Plane, South Zone"},null,"Vert. Datum:",{"$f":"REPORT!C15","v":"NAVD88"},"ITEM 623.05","ITEM 623.05"]
[null,{"$f":"$B$6","v":"C/L of Right-of-Way SR 71-"},null,{"$f":"$D$6","v":" used for alignment"},null,null,null,null,null,null,null,null,null,null,null,"RIGHT OF WAY ","BOUNDARY"]
["NAME","STATION","OFFSET (US FT)","RT/LT","NORTH (US FT)","EAST (US FT)","ELEVATION (US FT)","FEATURE","DESCRIPTION","NAME","NORTH (sft)","EAST (sft)","ORTHO HT (sft)","NORTH (US FT)","EAST (US FT)","PIN (TYPE \"B\")","PIN (TYPE \"B\")"]
[null,null,null,{"$f":"IF(C113<0,\"LT\",\"RT\")","v":"RT"},null,null,null,null,null,{"$f":"A113","v":0},{"$f":"E113/$C$103","v":0},{"$f":"F113/$C$103","v":0},{"$f":"G113/$C$104","v":0},{"$f":"$K113*$C$104","v":0},{"$f":"$L113*$C$104","v":0}]
[null,null,null,{"$f":"IF(C114<0,\"LT\",\"RT\")","v":"RT"},null,null,null,null,null,{"$f":"A114","v":0},{"$f":"E114/$C$103","v":0},{"$f":"F114/$C$103","v":0},{"$f":"G114/$C$104","v":0},0,0," "]
[null,null,null,"RT",null,null,null,null,null,0,0,0,0,0,0]
[null,null,null,"RT",null,null,null,null,null,0,0,0,0,0,0]
[null,null,null,"RT",null,null,null,null,null,0,0,0,0,0,0]
[null,null,null,"RT",null,null,null,null,null,0,0,0,0,0,0," "]
[null,null,null,"RT",null,null,null,null,null,0,0,0,0,0,0]
[null,null,null,"RT",null,null,null,null,null,0,0,0,0,0,0]
[null,null,null,"RT",null,null,null,null,null,0,0,0,0,0,0]
[null,null,null,"RT",null,null,null,null,null,0,0,0,0,0,0," "]
[null,null,null,"RT",null,null,null,null,null,0,0,0,0,0,0]
[null,null,null,"RT",null,null,null,null,null,0,0,0,0,0,0]
[null,null,null,"RT",null,null,null,null,null,0,0,0,0,0,0]
[null,null,null,"RT",null,null,null,null,null,0,{"$f":"E126/$C$103","v":0},0,0,0,0," "]
[null,null,null,"RT",null,null,null,null,null,0,0,0,0,0,0]
[null,null,null,"RT",null,null,null,null,null,0,0,0,0,0,0]
[null,null,null,"RT",null,null,null,null,null,0,0,0,0,0,0]
[null,null,null,"RT",null,null,null,null,null,{"$f":"A130","v":0},0,{"$f":"F130/$C$103","v":0},{"$f":"G130/$C$104","v":0},0,0," "]
[null,null,null,"RT",null,null,null,null,null,0,0,0,0,0,0]
[null,null,null,"RT",null,null,null,null,null,0,0,0,0,0,0]
[null,null,null,"RT",null,null,null,null,null,0,0,0,0,0,0]
[null,null,null,"RT",null,null,null,null,null,{"$f":"A134","v":0},{"$f":"E134/$C$103","v":0},{"$f":"F134/$C$103","v":0},{"$f":"G134/$C$104","v":0},0,0," "]
[null,null,null,"RT",null,null,null,null,null,0,0,0,0,0,0]
[null,null,null,"RT",null,null,null,null,null,0,0,0,0,0,0]
[null,null,null,"RT",null,null,null,null,null,0,0,0,0,0,0]
[null,null,null,"RT",null,null,null,null,null,0,0,0,0,0,0," "]
[null,null,null,"RT",null,null,null,null,null,0,0,0,0,0,0]
[null,null,null,"RT",null,null,null,null,null,0,0,0,0,0,0]
[null,null,null,"RT",null,null,null,null,null,0,0,0,0,0,0]
[null,null,null,"RT",null,null,null,null,null,0,0,0,0,0,0]
[null,null,null,null,null,null,null,null,null,"SUBTOTAL MONUMENTS - QUANTITY CARRIED TO CENTERLINE PLAT SHEET 3 OF 4 ",null,null,null,null,null,{"$f":"+SUM(P112:P142)","v":0},{"$f":"+SUM(Q7:Q142)","v":0}]
[]
[]
[]
["PROJECT GROUND COORDINATES - US SURVEY FEET",null,null,null,null,null,null,null,"EXISTING RIGHT OF WAY POINTS","STATE PLANE GRID COORDINATES"]
[]
[{"$f":"A4","v":"Project coordinates (U.S. Survey Feet) are relative to State Plane Grid coordinates (meters) by a Project Adjustment Factor of:"},null,null,null,null,null,null,{"$f":"H4","v":3.2811291988833329}]
[null,null,null,null,null,null,null,null,null,"Horiz. Datum:",{"$f":"REPORT!C11","v":"NAD83 (2011)"},{"$f":"REPORT!C10","v":"Ohio State Plane, South Zone"},null,"Vert. Datum:",{"$f":"REPORT!C15","v":"NAVD88"}]
[null,{"$f":"$B$6","v":"C/L of Right-of-Way SR 71-"},null,{"$f":"$D$6","v":" used for alignment"}]
["NAME","STATION","OFFSET (US FT)","RT/LT","NORTH (US FT)","EAST (US FT)","ELEVATION (US FT)","FEATURE","DESCRIPTION","NAME","NORTH (sft)","EAST (sft)","ORTHO HT (sft)","NORTH (US FT)","EAST (US FT)"]
[null,null,null,{"$f":"IF(C153<0,\"LT\",\"RT\")","v":"RT"},null,null,null,null,null,{"$f":"A153","v":0},{"$f":"E153/$C$103","v":0},0,{"$f":"G153/$C$104","v":0},{"$f":"$K153*$C$104","v":0},{"$f":"$L153*$C$104","v":0}]
[null,null,null,"RT",null,null,null,null,null,0,0,0,0,0,0]
[null,null,null,"RT",null,null,null,null,null,0,0,0,0,0,0]
[null,null,null,"RT",null,null,null,null,null,0,0,0,0,0,0]
[null,null,null,"RT",null,null,null,null,null,0,0,0,0,0,0]
[null,null,null,"RT",null,null,null,null,null,0,0,0,0,0,0]
[null,null,null,"RT",null,null,null,null,null,0,0,0,0,0,0]
[null,null,null,"RT",null,null,null,null,null,{"$f":"A160","v":0},{"$f":"E160/$C$103","v":0},{"$f":"F160/$C$103","v":0},{"$f":"G160/$C$104","v":0},0,0]
[null,null,null,"RT",null,null,null,null,null,0,0,0,0,0,0]
[null,null,null,"RT",null,null,null,null,null,0,0,0,0,0,0]
[null,null,null,"RT",null,null,null,null,null,0,0,0,0,0,0]
[null,null,null,"RT",null,null,null,null,null,0,0,0,0,0,0]
[null,null,null,"RT",null,null,null,null,null,0,0,0,0,0,0]
[null,null,null,"RT",null,null,null,null,null,0,0,0,0,0,0]
[null,null,null,"RT",null,null,null,null,null,0,0,0,0,0,0]
[null,null,null,"RT",null,null,null,null,null,0,0,0,0,0,0]
[null,null,null,"RT",null,null,null,null,null,0,0,0,0,0,0]
[null,null,null,"RT",null,null,null,null,null,0,0,0,0,0,0]
[null,null,null,"RT",null,null,null,null,null,0,0,0,0,0,0]
[null,null,null,"RT",null,null,null,null,null,0,0,0,0,0,0]
[null,null,null,"RT",null,null,null,null,null,0,0,0,0,0,0]
[null,null,null,"RT",null,null,null,null,null,0,0,0,0,0,0]
[null,null,null,"RT",null,null,null,null,null,0,0,0,0,0,0]
[null,null,null,"RT",null,null,null,null,null,0,0,0,0,0,0]
[null,null,null,"RT",null,null,null,null,null,0,0,0,0,0,0]
[null,null,null,"RT",null,null,null,null,null,0,0,0,0,0,0]
[null,null,null,"RT",null,null,null,null,null,0,0,0,0,0,0]
[null,null,null,"RT",null,null,null,null,null,0,0,0,0,0,0]
[null,null,null,"RT",null,null,null,null,null,0,0,0,0,0,0]
[null,null,null,"RT",null,null,null,null,null,0,0,0,0,0,0]
[]
["PROJECT GROUND COORDINATES - US SURVEY FEET",null,null,null,null,null,null,null,"EXISTING BOUNDARY MONUMENTS","STATE PLANE GRID COORDINATES"]
[{"$f":"A4","v":"Project coordinates (U.S. Survey Feet) are relative to State Plane Grid coordinates (meters) by a Project Adjustment Factor of:"},null,null,null,null,null,null,{"$f":"H4","v":3.2811291988833329}]
[null,null,null,null,null,null,null,null,null,"Horiz. Datum:",{"$f":"REPORT!C11","v":"NAD83 (2011)"},{"$f":"REPORT!C10","v":"Ohio State Plane, South Zone"},null,"Vert. Datum:",{"$f":"REPORT!C15","v":"NAVD88"}]
[null,{"$f":"$B$6","v":"C/L of Right-of-Way SR 71-"},null,{"$f":"$D$6","v":" used for alignment"}]
["NAME","STATION","OFFSET (US FT)","RT/LT","NORTH (US FT)","EAST (US FT)","ELEVATION (US FT)","FEATURE","DESCRIPTION","NAME","NORTH (sft)","EAST (sft)","ORTHO HT (sft)","NORTH (US FT)","EAST (US FT)"]
[null,null,null,{"$f":"IF(C189<0,\"LT\",\"RT\")","v":"RT"},null,null,null,null,null,{"$f":"A189","v":0},{"$f":"E189/$C$103","v":0},0,{"$f":"G189/$C$104","v":0},{"$f":"$K189*$C$104","v":0},{"$f":"$L189*$C$104","v":0}]
[null,null,null,"RT",null,null,null,null,null,{"$f":"A190","v":0},{"$f":"E190/$C$103","v":0},{"$f":"F190/$C$103","v":0},{"$f":"G190/$C$104","v":0},0,0]
[null,null,null,"RT",null,null,null,null,null,0,0,0,0,0,0]
[null,null,null,"RT",null,null,null,null,null,0,0,0,0,0,0]
[null,null,null,"RT",null,null,null,null,null,{"$f":"A193","v":0},{"$f":"E193/$C$103","v":0},{"$f":"F193/$C$103","v":0},{"$f":"G193/$C$104","v":0},0,0]
[null,null,null,"RT",null,null,null,null,null,0,0,0,0,0,0]
[null,null,null,"RT",null,null,null,null,null,0,0,0,0,0,0]
[null,null,null,"RT",null,null,null,null,null,0,0,0,0,0,0]
[null,null,null,"RT",null,null,null,null,null,0,0,0,0,0,0]
[null,null,null,"RT",null,null,null,null,null,0,0,0,0,0,0]
[null,null,null,"RT",null,null,null,null,null,0,0,0,0,0,0]
[null,null,null,"RT",null,null,null,null,null,0,0,0,0,0,0]
[null,null,null,"RT",null,null,null,null,null,0,0,0,0,0,0]
[null,null,null,"RT",null,null,null,null,null,0,0,0,0,0,0]
[null,null,null,"RT",null,null,null,null,null,0,0,0,0,0,0]
[null,null,null,"RT",null,null,null,null,null,0,0,0,0,0,0]
[null,null,null,"RT",null,null,null,null,null,0,0,0,0,0,0]
[null,null,null,"RT",null,null,null,null,null,0,0,0,0,0,0]
[null,null,null,"RT",null,null,null,null,null,0,0,0,0,0,0]
[null,null,null,"RT",null,null,null,null,null,0,0,0,0,0,0]
[null,null,null,"RT",null,null,null,null,null,0,0,0,0,0,0]
[null,null,null,"RT",null,null,null,null,null,0,0,0,0,0,0]
[null,null,null,"RT",null,null,null,null,null,0,0,0,0,0,0]
[null,null,null,"RT",null,null,null,null,null,0,0,0,0,0,0]
[null,null,null,"RT",null,null,null,null,null,0,0,0,0,0,0]
[null,null,null,"RT",null,null,null,null,null,0,0,0,0,0,0]
[null,null,null,"RT",null,null,null,null,null,0,0,0,0,0,0]
[null,null,null,"RT",null,null,null,null,null,0,0,0,0,0,0]
[null,null,null,"RT",null,null,null,null,null,0,0,0,0,0,0]
[null,null,null,"RT",null,null,null,null,null,0,0,0,0,0,0]

{"sheet":"GPS_IMPORT","index":6,"n_rows":173,"n_cols":7,"rows_kept":173,"cut":false,"hidden":false,"merged":[[4,8,6,9]]}
["SV1"," 3.10.2019","00:55:28.100",379910.57439999998,2458017.0410000002,995.35629340000003,"AERTAR"]
["SV1"," 3.10.2019","00:55:39.200",379910.57630000002,2458017.0419999999,995.35808469999995,"AERTAR"]
["SV1"," 3.10.2019","00:55:50.100",379910.5722,2458017.0440000002,995.34435859999996,"AERTAR"]
["SV1",3.1032019000000002,"00:55:55.100",37998,2458016.0499999998,995.86099999999999,"AERTAR"]
["SV1"," 3.10.2019","00:56:01.400",379910.56959999999,2458017.0499999998,995.36376299999995,"AERTAR"]
["SV1"," 3.10.2019","00:56:19.100",379910.5735,2458017.0550000002,995.35363789999997,"AERTAR"]
["SV1"," 3.10.2019","00:56:30.100",379910.57049999997,2458017.0520000001,995.35421029999998,"AERTAR"]
["SV1"," 3.10.2019","00:56:41.300",379910.56599999999,2458017.0559999999,995.34306000000004,"AERTAR"]
["SV1"," 3.10.2019","00:56:52.100",379910.56949999998,2458017.0610000002,995.35300810000001,"AERTAR"]
["SV1"," 3.10.2019","00:57:10",379910.5563,2458017.0529999998,995.36268829999995,"AERTAR"]
["SV1"," 3.10.2019","00:57:20.100",379910.55310000002,2458017.048,995.36037650000003,"AERTAR"]
["SV1"," 3.10.2019","00:57:31.500",379910.54969999997,2458017.0460000001,995.36960899999997,"AERTAR"]
["SV1"," 3.10.2019","00:57:42.100",379910.56410000002,2458017.0499999998,995.36787709999999,"AERTAR"]
["SV2"," 3.10.2019","00:03:36.500",380188.4094,2460342.983,975.0115022,"AERTAR"]
["SV2"," 3.10.2019","00:03:49.100",380188.4117,2460342.9870000002,975.00911499999995,"AERTAR"]
["SV2"," 3.10.2019","00:03:59",380188.40620000003,2460342.9879999999,975.0067348,"AERTAR"]
["SV2"," 3.10.2019","00:04:09.100",380188.39980000001,2460342.9900000002,975.00660359999995,"AERTAR"]
["SV2"," 3.10.2019","00:04:22",380188.39539999998,2460342.9890000001,975.00578210000003,"AERTAR"]
["SV2"," 3.10.2019","00:04:32",380188.39449999999,2460342.9870000002,975.00601640000002,"AERTAR"]
["SV2"," 3.10.2019","00:04:42",380188.39559999999,2460342.9890000001,975.00219830000003,"AERTAR"]
["SV2"," 3.10.2019","00:04:52.100",380188.39510000002,2460342.9920000001,975.00730720000001,"AERTAR"]
["SV2"," 3.10.2019","00:05:06.200",380188.39610000001,2460342.9909999999,975.00103839999997,"AERTAR"]
["SV2"," 3.10.2019","00:05:16.300",380188.3947,2460342.986,975.00530300000003,"AERTAR"]
["SV2"," 3.10.2019","00:05:26.400",380188.39230000001,2460342.9870000002,975.00645610000004,"AERTAR"]
["SV2"," 3.10.2019","00:05:37.100",380188.39260000002,2460342.9840000002,975.0184051,"AERTAR"]
["SV2"," 3.10.2019","00:05:56.400",380188.38380000001,2460342.983,975.03339649999998,"AERTAR"]
["SV3"," 3.10.2019","00:34:20.100",376919.52360000001,2458129.79,1021.8495359999999,"AERTAR"]
["SV3"," 3.10.2019","00:34:30.200",376919.52240000002,2458129.7919999999,1021.86292,"AERTAR"]
["SV3"," 3.10.2019","00:34:41.300",376919.51760000002,2458129.7969999998,1021.865229,"AERTAR"]
["SV3"," 3.10.2019","00:34:52",376919.52529999998,2458129.7969999998,1021.8707889999999,"AERTAR"]
["SV3"," 3.10.2019","00:35:07",376919.52490000002,2458129.7960000001,1021.868166,"AERTAR"]
["SV3"," 3.10.2019","00:35:19",376919.53009999997,2458129.7969999998,1021.870578,"AERTAR"]
["SV3"," 3.10.2019","00:35:29.100",376919.52370000002,2458129.7990000001,1021.862183,"AERTAR"]
["SV3"," 3.10.2019","00:35:40",376919.5245,2458129.7960000001,1021.859932,"AERTAR"]
["SV3"," 3.10.2019","00:35:55.100",376919.53139999998,2458129.7940000002,1021.849082,"AERTAR"]
["SV3"," 3.10.2019","00:36:06.200",376919.53049999999,2458129.7930000001,1021.852582,"AERTAR"]
["SV3"," 3.10.2019","00:36:17.100",376919.52649999998,2458129.7850000001,1021.861501,"AERTAR"]
["SV3"," 3.10.2019","00:36:28",376919.5281,2458129.7850000001,1021.849278,"AERTAR"]
["CNTL1"," 3.10.2019","00:37:16.500",376931.96470000001,2458075.6030000001,1021.869206,"IPINS"]
["CNTL1"," 3.10.2019","00:37:25.100",376931.96639999998,2458075.5959999999,1021.86035,"IPINS"]
["CNTL1"," 3.10.2019","00:37:34.200",376931.96919999999,2458075.5980000002,1021.865102,"IPINS"]
["CNTL1"," 3.10.2019","00:37:45.100",376931.96779999998,2458075.5989999999,1021.866611,"IPINS"]
["CNTL1"," 3.10.2019","00:38:03.100",376931.96950000001,2458075.591,1021.868127,"IPINS"]
["CNTL1"," 3.10.2019","00:38:14",376931.97259999998,2458075.5929999999,1021.854132,"IPINS"]
["CNTL1"," 3.10.2019","00:38:25",376931.96649999998,2458075.5959999999,1021.851454,"IPINS"]
["CNTL1"," 3.10.2019","00:38:35",376931.96539999999,2458075.5980000002,1021.848056,"IPINS"]
["CNTL1"," 3.10.2019","00:38:50",376931.97090000001,2458075.6009999998,1021.834984,"IPINS"]
["CNTL1"," 3.10.2019","00:39:00",376931.97139999998,2458075.6,1021.838636,"IPINS"]
["CNTL1"," 3.10.2019","00:39:11.200",376931.97090000001,2458075.6009999998,1021.840596,"IPINS"]
["CNTL1"," 3.10.2019","00:39:23.900",376931.96860000002,2458075.602,1021.843629,"IPINS"]
["CNTL2"," 3.10.2019","00:41:43.100",376988.95510000002,2458323.44,1012.8453919999999,"IPINS"]
["CNTL2"," 3.10.2019","00:41:56.400",376988.95870000002,2458323.446,1012.862208,"IPINS"]
["CNTL2"," 3.10.2019","00:42:08.100",376988.95649999997,2458323.449,1012.877662,"IPINS"]
["CNTL2"," 3.10.2019","00:42:19.200",376988.951,2458323.4539999999,1012.872436,"IPINS"]
["CNTL2"," 3.10.2019","00:42:34.200",376988.9547,2458323.4530000002,1012.89104,"IPINS"]
["CNTL2"," 3.10.2019","00:42:45.100",376988.95110000001,2458323.452,1012.887639,"IPINS"]
["CNTL2"," 3.10.2019","00:42:56.200",376988.9535,2458323.4440000001,1012.879321,"IPINS"]
["CNTL2"," 3.10.2019","00:43:07",376988.9523,2458323.446,1012.8859210000001,"IPINS"]
["CNTL2"," 3.10.2019","00:43:23.200",376988.96159999998,2458323.4449999998,1012.862546,"IPINS"]
["CNTL2"," 3.10.2019","00:43:36.300",376988.95939999999,2458323.4470000002,1012.867202,"IPINS"]
["CNTL2"," 3.10.2019","00:43:47.600",376988.96840000001,2458323.449,1012.88205,"IPINS"]
["CNTL2"," 3.10.2019","00:43:58.900",376988.96740000002,2458323.4440000001,1012.903228,"IPINS"]
["CNTL3"," 3.10.2019","00:46:28.100",376669.8652,2458138.111,1034.830856,"IPINS"]
["CNTL3"," 3.10.2019","00:46:39.100",376669.86849999998,2458138.1129999999,1034.813615,"IPINS"]
["CNTL3"," 3.10.2019","00:46:50.200",376669.8664,2458138.1120000002,1034.8022470000001,"IPINS"]
["CNTL3"," 3.10.2019","00:47:02",376669.86499999999,2458138.1090000002,1034.7938340000001,"IPINS"]
["CNTL3"," 3.10.2019","00:47:19.200",376669.84980000003,2458138.1159999999,1034.7696739999999,"IPINS"]
["CNTL3"," 3.10.2019","00:47:30.100",376669.85210000002,2458138.1140000001,1034.771191,"IPINS"]
["CNTL3"," 3.10.2019","00:47:41.300",376669.85499999998,2458138.1189999999,1034.7681319999999,"IPINS"]
["CNTL3"," 3.10.2019","00:47:52",376669.85019999999,2458138.1179999998,1034.76109,"IPINS"]
["CNTL3"," 3.10.2019","00:48:09",376669.85570000001,2458138.1230000001,1034.738589,"IPINS"]
["CNTL3"," 3.10.2019","00:48:20.100",376669.85920000001,2458138.125,1034.7312959999999,"IPINS"]
["CNTL3"," 3.10.2019","00:48:32.200",376669.85379999998,2458138.1260000002,1034.740121,"IPINS"]
["CNTL3"," 3.10.2019","00:48:44.100",376669.8529,2458138.1269999999,1034.7334679999999,"IPINS"]
["SV100"," 3.10.2019","00:49:22",376673.1764,2458142.713,1034.5663549999999,"AERLCS"]
["SV101"," 3.10.2019","00:49:42.100",376709.30070000002,2458165.2910000002,1031.876168,"AERLCS"]
["SV102"," 3.10.2019","00:50:02.100",376749.0563,2458190.298,1029.8358109999999,"AERLCS"]
["SV103"," 3.10.2019","00:50:17.100",376776.1349,2458192.264,1027.429228,"AERLCS"]
["SV104"," 3.10.2019","00:50:31.300",376795.92349999998,2458183.9040000001,1025.1345309999999,"AERLCS"]
["SV105"," 3.10.2019","00:51:20.100",376897.3627,2458102.9720000001,1022.553993,"AERLCS"]
["SV106"," 3.10.2019","00:51:37.100",376921.00510000001,2458084.4249999998,1021.705267,"AERLCS"]
["SV107"," 3.10.2019","00:51:52",376935.20760000002,2458060.264,1021.703259,"AERLCS"]
["SV108"," 3.10.2019","00:52:15",376961.11489999999,2458078.088,1018.554144,"AERLCS"]
["SV109"," 3.10.2019","00:52:28",376980.50069999998,2458086.6669999999,1016.489729,"AERLCS"]
["SV110"," 3.10.2019","00:52:44.100",376998.92090000003,2458110.952,1015.089625,"AERLCS"]
["SV111"," 3.10.2019","00:52:58.200",377016.34360000002,2458128.9980000001,1013.7243,"AERLCS"]
["SV112"," 3.10.2019","00:53:15",377025.1937,2458159.1030000001,1013.0774259999999,"AERLCS"]
["SV113"," 3.10.2019","00:53:32.100",376998.62660000002,2458180.2549999999,1015.4700800000001,"AERLCS"]
["SV114"," 3.10.2019","00:53:46.300",376976.41889999999,2458180.5720000002,1017.1994999999999,"AERLCS"]
["SV115"," 3.10.2019","00:54:10.200",376946.93819999998,2458180.6150000002,1019.356899,"AERLCS"]
["SV116"," 3.10.2019","00:54:22",376929.2071,2458177.9929999998,1020.810205,"AERLCS"]
["SV117"," 3.10.2019","00:54:34.900",376918.1397,2458165.8139999998,1021.90865,"AERLCS"]
["SV118"," 3.10.2019","00:54:49",376925.2487,2458144.8020000001,1021.251177,"AERLCS"]
["SV119"," 3.10.2019","00:55:03",376935.86560000002,2458123.9950000001,1020.454624,"AERLCS"]
["SV120"," 3.10.2019","00:55:19",376951.88789999997,2458105.1579999998,1019.325548,"AERLCS"]
["SV121"," 3.10.2019","00:55:32",376972.00540000002,2458115.2940000002,1017.5199679999999,"AERLCS"]
["SV122"," 3.10.2019","00:55:56.400",376947.39439999999,2458157.5410000002,1019.46431,"AERLCS"]
["SV123"," 3.10.2019","00:16:17",376859,2458133.8849999998,1023.466682,"H"]
["SV124"," 3.10.2019","00:16:28",376851.9523,2458130.5830000001,1023.418062,"H"]
["SV125"," 3.10.2019","00:16:39",376844.12449999998,2458127.0350000001,1023.411869,"H"]
["SV126"," 3.10.2019","00:16:50.400",376836.7929,2458124.284,1023.467323,"H"]
["SV127"," 3.10.2019","00:17:00",376828.9632,2458121.7689999999,1023.560277,"H"]
["SV128"," 3.10.2019","00:17:11.200",376820.02879999997,2458117.6770000001,1023.6916639999999,"H"]
["SV129"," 3.10.2019","00:17:23.900",376810.91159999999,2458111.702,1023.903292,"H"]
["SV130"," 3.10.2019","00:17:37",376804.14030000003,2458106.483,1023.997729,"H"]
["SV131"," 3.10.2019","00:17:46.900",376798.71029999998,2458101.7889999999,1024.08977,"H"]
["SV132"," 3.10.2019","00:17:57.900",376793.78840000002,2458098.014,1024.167166,"H"]
["SV133"," 3.10.2019","00:18:56.300",376705.92959999997,2458015.844,1028.8878299999999,"AERLCH"]
["SV134"," 3.10.2019","00:19:17.600",376666.95730000001,2457966.3670000001,1033.6585889999999,"AERLCH"]
["SV135"," 3.10.2019","00:19:50.400",376634.9792,2457912.19,1038.100972,"AERLCH"]
["SV136"," 3.10.2019","00:20:41.100",376592.21759999997,2457828.4950000001,1036.709625,"AERLCH"]
["SV137"," 3.10.2019","00:23:17.100",376564.00569999998,2457761.9900000002,1031.3446960000001,"AERLCH"]
["SV138"," 3.10.2019","00:23:48.100",376552.27870000002,2457721.125,1026.8531149999999,"AERLCH"]
["SV139"," 3.10.2019","00:24:06.300",376549.46429999999,2457699.0929999999,1024.8515199999999,"AERLCH"]
["SV140"," 3.10.2019","00:24:33",376552.78360000002,2457671.4440000001,1021.9938509999999,"AERLCH"]
["SV141"," 3.10.2019","00:25:09",376560.33639999997,2457649.6150000002,1019.442472,"AERLCH"]
["SV142"," 3.10.2019","00:25:30.800",376569.96029999998,2457626.872,1016.255034,"AERLCH"]
["SV143"," 3.10.2019","00:27:20.100",376594.57990000001,2457563.5389999999,1005.807114,"AERLCH"]
["SV144"," 3.10.2019","00:28:22.900",376599.66249999998,2457556.0449999999,1004.287458,"H"]
["SV145"," 3.10.2019","00:28:45.400",376602.42589999997,2457549.6060000001,1003.124242,"H"]
["SV146"," 3.10.2019","00:28:58",376604.79019999999,2457544.233,1002.0030410000001,"H"]
["SV147"," 3.10.2019","00:29:11.300",376608.77220000001,2457537.0759999999,1000.676258,"H"]
["SV148"," 3.10.2019","00:30:21.900",376611.34049999999,2457532.0789999999,999.81414040000004,"H"]
["SV149"," 3.10.2019","00:30:32.300",376614.9326,2457526.2910000002,998.81173520000004,"H"]
["SV150"," 3.10.2019","00:30:44",376618.70209999999,2457520.5780000002,997.59301689999995,"H"]
["SV151"," 3.10.2019","00:30:58.100",376621.4988,2457515.3509999998,996.5615282,"H"]
["SV152"," 3.10.2019","00:31:10",376624.64270000003,2457510.6009999998,995.67604749999998,"H"]
["SV153"," 3.10.2019","00:31:24",376627.60499999998,2457506.375,994.93290079999997,"H"]
["SV154"," 3.10.2019","00:31:53.100",376638.17190000002,2457484.2570000002,992.10388650000004,"AERLCH"]
["SV155"," 3.10.2019","00:32:23.800",376640.05469999998,2457471.0350000001,991.05199479999999,"AERLCH"]
["SV156"," 3.10.2019","00:32:38.200",376634.9474,2457456.75,991.0156068,"AERLCH"]
["SV157"," 3.10.2019","00:33:01.400",376626.08250000002,2457447.3309999998,990.98905139999999,"AERLCH"]
["SV158"," 3.10.2019","00:33:12",376618.946,2457440.977,991.08867329999998,"AERLCH"]
["SV159"," 3.10.2019","00:33:23",376613.29330000002,2457434.5410000002,991.21787110000002,"AERLCH"]
["SV160"," 3.10.2019","00:33:35.100",376607.26579999999,2457427.36,991.32177690000003,"AERLCH"]
["SV161"," 3.10.2019","00:33:54.900",376601.54700000002,2457421.4410000001,991.3917477,"AERLCH"]
["SV162"," 3.10.2019","00:34:07.400",376595.7439,2457415.2390000001,991.52468710000005,"AERLCH"]
["SV163"," 3.10.2019","00:35:47.200",375746.2746,2456816.8319999999,1004.961487,"AERLCH"]
["SV164"," 3.10.2019","00:36:12.900",375769.75280000002,2456840.2799999998,1005.39933,"AERLCH"]
["SV165"," 3.10.2019","00:36:34.900",375794.89279999997,2456865.2969999998,1006.535662,"AERLCH"]
["SV166"," 3.10.2019","00:37:07.500",375832.7071,2456900.2450000001,1009.450099,"AERLCH"]
["SV167"," 3.10.2019","00:37:42.500",375867.63020000001,2456937.5559999999,1011.335369,"AERLCH"]
["SV168"," 3.10.2019","00:38:08.600",375851.21370000002,2456944.926,1010.932264,"AERLCS"]
["SV169"," 3.10.2019","00:38:22.200",375860.32250000001,2456949.7200000002,1010.926906,"AERLCS"]
["SV170"," 3.10.2019","00:38:34",375866.04190000001,2456955.6940000001,1010.974126,"AERLCS"]
["SV171"," 3.10.2019","00:38:47",375874.89539999998,2456961.2140000002,1010.7718609999999,"AERLCS"]
["SV172"," 3.10.2019","00:38:57.800",375880.73680000001,2456965.784,1010.673824,"AERLCS"]
["SV173"," 3.10.2019","00:39:19.800",375887.96740000002,2456969.8390000002,1010.57677,"AERLCS"]
["SV174"," 3.10.2019","00:39:31.200",375895.04759999999,2456974.2599999998,1010.275756,"AERLCS"]
["SV4"," 3.10.2019","00:46:56.100",372819.66019999998,2455642.1740000001,1050.1768589999999,"AERTAR"]
["SV4"," 3.10.2019","00:47:07.800",372819.67739999999,2455642.176,1050.1995899999999,"AERTAR"]
["SV4"," 3.10.2019","00:47:18.700",372819.68489999999,2455642.1779999998,1050.1875709999999,"AERTAR"]
["SV4"," 3.10.2019","00:47:31",372819.68280000001,2455642.1710000001,1050.209758,"AERTAR"]
["SV4"," 3.10.2019","00:47:52.800",372819.68170000002,2455642.19,1050.178557,"AERTAR"]
["SV4"," 3.10.2019","00:48:06",372819.68589999998,2455642.1940000001,1050.1707249999999,"AERTAR"]
["SV4"," 3.10.2019","00:48:17.900",372819.68790000002,2455642.1889999998,1050.188883,"AERTAR"]
["SV4"," 3.10.2019","00:48:31",372819.69540000003,2455642.2000000002,1050.175234,"AERTAR"]
["SV4"," 3.10.2019","00:48:48.800",372819.68949999998,2455642.2039999999,1050.171057,"AERTAR"]
["SV4"," 3.10.2019","00:48:59.800",372819.69420000003,2455642.2009999999,1050.156585,"AERTAR"]
["SV4"," 3.10.2019","00:49:11",372819.685,2455642.1940000001,1050.1323440000001,"AERTAR"]
["SV4"," 3.10.2019","00:49:22.700",372819.68310000002,2455642.199,1050.131785,"AERTAR"]
["SV5"," 3.10.2019","00:55:16",372152.45750000002,2457046.1910000001,1086.083648,"AERTAR"]
["SV5"," 3.10.2019","00:55:26",372152.45569999999,2457046.1910000001,1086.079234,"AERTAR"]
["SV5"," 3.10.2019","00:55:36",372152.45240000001,2457046.19,1086.0676619999999,"AERTAR"]
["SV5"," 3.10.2019","00:55:46",372152.4411,2457046.1830000002,1086.0814580000001,"AERTAR"]
["SV5"," 3.10.2019","00:56:01.100",372152.44179999997,2457046.1809999999,1086.0915110000001,"AERTAR"]
["SV5"," 3.10.2019","00:56:11.800",372152.4486,2457046.1770000001,1086.103574,"AERTAR"]
["SV5"," 3.10.2019","00:56:22.700",372152.43540000002,2457046.1770000001,1086.1342380000001,"AERTAR"]
["SV5"," 3.10.2019","00:56:34.800",372152.45309999998,2457046.1889999998,1086.122991,"AERTAR"]
["SV5"," 3.10.2019","00:56:58.900",372152.45319999999,2457046.1869999999,1086.141419,"AERTAR"]
["SV5"," 3.10.2019","00:57:19.800",372152.44839999999,2457046.1869999999,1086.1483559999999,"AERTAR"]
["SV5"," 3.10.2019","00:57:31.100",372152.45409999997,2457046.19,1086.1485049999999,"AERTAR"]
["SV5"," 3.10.2019","00:57:41.700",372152.44910000003,2457046.1949999998,1086.156129,"AERTAR"]

{"sheet":"SV1","index":7,"n_rows":41,"n_cols":11,"rows_kept":41,"cut":false,"hidden":false,"merged":[[0,0,0,10],[26,0,26,6],[27,1,27,2],[27,8,38,10],[28,1,28,2],[30,0,30,6],[35,0,35,6],[36,1,36,2],[37,1,37,2],[38,1,38,2]]}
["VRS GNSS Project Control Monument Coordinate Analysis"]
[]
["Project:",{"$f":"REPORT!B2","v":"FRA-71-29.4"},"GPS Antenna:","LEICA GS14",null,null,null,null,null,"Report Date:",{"$f":"REPORT!C49","v":"2019-04-25"}]
["PID:",{"$f":"REPORT!E2","v":106471},"VRS Network:","ODOT VRS",null,null,null,null,null,"Prepared By:",{"$f":"REPORT!C48","v":"Kolton Wilson"}]
["Point ID:","SV1","No. of Sessions:",{"$f":"COUNTIF(GPS_IMPORT!A2:A1000,$B$5)","v":12},null,null,null,null,null,"Checked By:",{"$f":"REPORT!C52","v":"David Ogden"}]
["SESSION #","Point","Observation Date","Start Time","Northing(sft)","Easting(sft)","Height(sft)","∆ Northing(sft)","∆ Easting(sft)","∆ Height(sft)","Include in Solution?"]
[1,{"$f":"IF(ROWS(GPS_IMPORT!$1:1)<=COUNTIF(GPS_IMPORT!$A$2:$A$10000,$B$5),INDEX(GPS_IMPORT!$2:$10000,MATCH($B$5,(GPS_IMPORT!$A$2:$A$10000),0)+ROWS($1:1)-1,COLUMN()-1),0)","v":"SV1"},{"$f":"IF(ROWS(GPS_IMPORT!$1:1)<=COUNTIF(GPS_IMPORT!$A$2:$A$10000,$B$5),INDEX(GPS_IMPORT!$2:$10000,MATCH($B$5,(GPS_IMPORT!$A$2:$A$10000),0)+ROWS($1:1)-1,COLUMN()-1),0)","v":" 3.10.2019"},{"$f":"IF(ROWS(GPS_IMPORT!$1:1)<=COUNTIF(GPS_IMPORT!$A$2:$A$10000,$B$5),INDEX(GPS_IMPORT!$2:$10000,MATCH($B$5,(GPS_IMPORT!$A$2:$A$10000),0)+ROWS($1:1)-1,COLUMN()-1),0)","v":"00:55:39.200"},{"$f":"IF(ROWS(GPS_IMPORT!$1:1)<=COUNTIF(GPS_IMPORT!$A$2:$A$10000,$B$5),INDEX(GPS_IMPORT!$2:$10000,MATCH($B$5,(GPS_IMPORT!$A$2:$A$10000),0)+ROWS($1:1)-1,COLUMN()-1),0)","v":379910.57630000002},{"$f":"IF(ROWS(GPS_IMPORT!$1:1)<=COUNTIF(GPS_IMPORT!$A$2:$A$10000,$B$5),INDEX(GPS_IMPORT!$2:$10000,MATCH($B$5,(GPS_IMPORT!$A$2:$A$10000),0)+ROWS($1:1)-1,COLUMN()-1),0)","v":2458017.0419999999},{"$f":"IF(ROWS(GPS_IMPORT!$1:1)<=COUNTIF(GPS_IMPORT!$A$2:$A$10000,$B$5),INDEX(GPS_IMPORT!$2:$10000,MATCH($B$5,(GPS_IMPORT!$A$2:$A$10000),0)+ROWS($1:1)-1,COLUMN()-1),0)","v":995.35808469999995},{"$f":"IF(E7>0,E$22-E7,0)","v":-28492.724566666759},-7.4749999679625034E-2,4.1221425000003364E-2,true]
[2,{"$f":"IF(ROWS(GPS_IMPORT!$1:2)<=COUNTIF(GPS_IMPORT!$A$2:$A$10000,$B$5),INDEX(GPS_IMPORT!$2:$10000,MATCH($B$5,(GPS_IMPORT!$A$2:$A$10000),0)+ROWS($1:2)-1,COLUMN()-1),0)","v":"SV1"},{"$f":"IF(ROWS(GPS_IMPORT!$1:2)<=COUNTIF(GPS_IMPORT!$A$2:$A$10000,$B$5),INDEX(GPS_IMPORT!$2:$10000,MATCH($B$5,(GPS_IMPORT!$A$2:$A$10000),0)+ROWS($1:2)-1,COLUMN()-1),0)","v":" 3.10.2019"},{"$f":"IF(ROWS(GPS_IMPORT!$1:2)<=COUNTIF(GPS_IMPORT!$A$2:$A$10000,$B$5),INDEX(GPS_IMPORT!$2:$10000,MATCH($B$5,(GPS_IMPORT!$A$2:$A$10000),0)+ROWS($1:2)-1,COLUMN()-1),0)","v":"00:55:50.100"},{"$f":"IF(ROWS(GPS_IMPORT!$1:2)<=COUNTIF(GPS_IMPORT!$A$2:$A$10000,$B$5),INDEX(GPS_IMPORT!$2:$10000,MATCH($B$5,(GPS_IMPORT!$A$2:$A$10000),0)+ROWS($1:2)-1,COLUMN()-1),0)","v":379910.5722},{"$f":"IF(ROWS(GPS_IMPORT!$1:2)<=COUNTIF(GPS_IMPORT!$A$2:$A$10000,$B$5),INDEX(GPS_IMPORT!$2:$10000,MATCH($B$5,(GPS_IMPORT!$A$2:$A$10000),0)+ROWS($1:2)-1,COLUMN()-1),0)","v":2458017.0440000002},{"$f":"IF(ROWS(GPS_IMPORT!$1:2)<=COUNTIF(GPS_IMPORT!$A$2:$A$10000,$B$5),INDEX(GPS_IMPORT!$2:$10000,MATCH($B$5,(GPS_IMPORT!$A$2:$A$10000),0)+ROWS($1:2)-1,COLUMN()-1),0)","v":995.34435859999996},-28492.720466666739,-7.6750000007450581E-2,5.4947524999988673E-2,true]
[3,{"$f":"IF(ROWS(GPS_IMPORT!$1:3)<=COUNTIF(GPS_IMPORT!$A$2:$A$10000,$B$5),INDEX(GPS_IMPORT!$2:$10000,MATCH($B$5,(GPS_IMPORT!$A$2:$A$10000),0)+ROWS($1:3)-1,COLUMN()-1),0)","v":"SV1"},{"$f":"IF(ROWS(GPS_IMPORT!$1:3)<=COUNTIF(GPS_IMPORT!$A$2:$A$10000,$B$5),INDEX(GPS_IMPORT!$2:$10000,MATCH($B$5,(GPS_IMPORT!$A$2:$A$10000),0)+ROWS($1:3)-1,COLUMN()-1),0)","v":3.1032019000000002},{"$f":"IF(ROWS(GPS_IMPORT!$1:3)<=COUNTIF(GPS_IMPORT!$A$2:$A$10000,$B$5),INDEX(GPS_IMPORT!$2:$10000,MATCH($B$5,(GPS_IMPORT!$A$2:$A$10000),0)+ROWS($1:3)-1,COLUMN()-1),0)","v":"00:55:55.100"},{"$f":"IF(ROWS(GPS_IMPORT!$1:3)<=COUNTIF(GPS_IMPORT!$A$2:$A$10000,$B$5),INDEX(GPS_IMPORT!$2:$10000,MATCH($B$5,(GPS_IMPORT!$A$2:$A$10000),0)+ROWS($1:3)-1,COLUMN()-1),0)","v":37998},{"$f":"IF(ROWS(GPS_IMPORT!$1:3)<=COUNTIF(GPS_IMPORT!$A$2:$A$10000,$B$5),INDEX(GPS_IMPORT!$2:$10000,MATCH($B$5,(GPS_IMPORT!$A$2:$A$10000),0)+ROWS($1:3)-1,COLUMN()-1),0)","v":2458016.0499999998},{"$f":"IF(ROWS(GPS_IMPORT!$1:3)<=COUNTIF(GPS_IMPORT!$A$2:$A$10000,$B$5),INDEX(GPS_IMPORT!$2:$10000,MATCH($B$5,(GPS_IMPORT!$A$2:$A$10000),0)+ROWS($1:3)-1,COLUMN()-1),0)","v":995.86099999999999},313419.85173333326,0.91725000040605664,-0.46169387500003722,true]
[4,{"$f":"IF(ROWS(GPS_IMPORT!$1:4)<=COUNTIF(GPS_IMPORT!$A$2:$A$10000,$B$5),INDEX(GPS_IMPORT!$2:$10000,MATCH($B$5,(GPS_IMPORT!$A$2:$A$10000),0)+ROWS($1:4)-1,COLUMN()-1),0)","v":"SV1"},{"$f":"IF(ROWS(GPS_IMPORT!$1:4)<=COUNTIF(GPS_IMPORT!$A$2:$A$10000,$B$5),INDEX(GPS_IMPORT!$2:$10000,MATCH($B$5,(GPS_IMPORT!$A$2:$A$10000),0)+ROWS($1:4)-1,COLUMN()-1),0)","v":" 3.10.2019"},{"$f":"IF(ROWS(GPS_IMPORT!$1:4)<=COUNTIF(GPS_IMPORT!$A$2:$A$10000,$B$5),INDEX(GPS_IMPORT!$2:$10000,MATCH($B$5,(GPS_IMPORT!$A$2:$A$10000),0)+ROWS($1:4)-1,COLUMN()-1),0)","v":"00:56:01.400"},{"$f":"IF(ROWS(GPS_IMPORT!$1:4)<=COUNTIF(GPS_IMPORT!$A$2:$A$10000,$B$5),INDEX(GPS_IMPORT!$2:$10000,MATCH($B$5,(GPS_IMPORT!$A$2:$A$10000),0)+ROWS($1:4)-1,COLUMN()-1),0)","v":379910.56959999999},{"$f":"IF(ROWS(GPS_IMPORT!$1:4)<=COUNTIF(GPS_IMPORT!$A$2:$A$10000,$B$5),INDEX(GPS_IMPORT!$2:$10000,MATCH($B$5,(GPS_IMPORT!$A$2:$A$10000),0)+ROWS($1:4)-1,COLUMN()-1),0)","v":2458017.0499999998},{"$f":"IF(ROWS(GPS_IMPORT!$1:4)<=COUNTIF(GPS_IMPORT!$A$2:$A$10000,$B$5),INDEX(GPS_IMPORT!$2:$10000,MATCH($B$5,(GPS_IMPORT!$A$2:$A$10000),0)+ROWS($1:4)-1,COLUMN()-1),0)","v":995.36376299999995},-28492.717866666731,-8.2749999593943357E-2,3.5543125000003783E-2,true]
[5,{"$f":"IF(ROWS(GPS_IMPORT!$1:5)<=COUNTIF(GPS_IMPORT!$A$2:$A$10000,$B$5),INDEX(GPS_IMPORT!$2:$10000,MATCH($B$5,(GPS_IMPORT!$A$2:$A$10000),0)+ROWS($1:5)-1,COLUMN()-1),0)","v":"SV1"},{"$f":"IF(ROWS(GPS_IMPORT!$1:5)<=COUNTIF(GPS_IMPORT!$A$2:$A$10000,$B$5),INDEX(GPS_IMPORT!$2:$10000,MATCH($B$5,(GPS_IMPORT!$A$2:$A$10000),0)+ROWS($1:5)-1,COLUMN()-1),0)","v":" 3.10.2019"},{"$f":"IF(ROWS(GPS_IMPORT!$1:5)<=COUNTIF(GPS_IMPORT!$A$2:$A$10000,$B$5),INDEX(GPS_IMPORT!$2:$10000,MATCH($B$5,(GPS_IMPORT!$A$2:$A$10000),0)+ROWS($1:5)-1,COLUMN()-1),0)","v":"00:56:19.100"},{"$f":"IF(ROWS(GPS_IMPORT!$1:5)<=COUNTIF(GPS_IMPORT!$A$2:$A$10000,$B$5),INDEX(GPS_IMPORT!$2:$10000,MATCH($B$5,(GPS_IMPORT!$A$2:$A$10000),0)+ROWS($1:5)-1,COLUMN()-1),0)","v":379910.5735},{"$f":"IF(ROWS(GPS_IMPORT!$1:5)<=COUNTIF(GPS_IMPORT!$A$2:$A$10000,$B$5),INDEX(GPS_IMPORT!$2:$10000,MATCH($B$5,(GPS_IMPORT!$A$2:$A$10000),0)+ROWS($1:5)-1,COLUMN()-1),0)","v":2458017.0550000002},{"$f":"IF(ROWS(GPS_IMPORT!$1:5)<=COUNTIF(GPS_IMPORT!$A$2:$A$10000,$B$5),INDEX(GPS_IMPORT!$2:$10000,MATCH($B$5,(GPS_IMPORT!$A$2:$A$10000),0)+ROWS($1:5)-1,COLUMN()-1),0)","v":995.35363789999997},-28492.721766666742,-8.7749999947845936E-2,4.5668224999985796E-2,true]
[6,{"$f":"IF(ROWS(GPS_IMPORT!$1:6)<=COUNTIF(GPS_IMPORT!$A$2:$A$10000,$B$5),INDEX(GPS_IMPORT!$2:$10000,MATCH($B$5,(GPS_IMPORT!$A$2:$A$10000),0)+ROWS($1:6)-1,COLUMN()-1),0)","v":"SV1"},{"$f":"IF(ROWS(GPS_IMPORT!$1:6)<=COUNTIF(GPS_IMPORT!$A$2:$A$10000,$B$5),INDEX(GPS_IMPORT!$2:$10000,MATCH($B$5,(GPS_IMPORT!$A$2:$A$10000),0)+ROWS($1:6)-1,COLUMN()-1),0)","v":" 3.10.2019"},{"$f":"IF(ROWS(GPS_IMPORT!$1:6)<=COUNTIF(GPS_IMPORT!$A$2:$A$10000,$B$5),INDEX(GPS_IMPORT!$2:$10000,MATCH($B$5,(GPS_IMPORT!$A$2:$A$10000),0)+ROWS($1:6)-1,COLUMN()-1),0)","v":"00:56:30.100"},{"$f":"IF(ROWS(GPS_IMPORT!$1:6)<=COUNTIF(GPS_IMPORT!$A$2:$A$10000,$B$5),INDEX(GPS_IMPORT!$2:$10000,MATCH($B$5,(GPS_IMPORT!$A$2:$A$10000),0)+ROWS($1:6)-1,COLUMN()-1),0)","v":379910.57049999997},{"$f":"IF(ROWS(GPS_IMPORT!$1:6)<=COUNTIF(GPS_IMPORT!$A$2:$A$10000,$B$5),INDEX(GPS_IMPORT!$2:$10000,MATCH($B$5,(GPS_IMPORT!$A$2:$A$10000),0)+ROWS($1:6)-1,COLUMN()-1),0)","v":2458017.0520000001},{"$f":"IF(ROWS(GPS_IMPORT!$1:6)<=COUNTIF(GPS_IMPORT!$A$2:$A$10000,$B$5),INDEX(GPS_IMPORT!$2:$10000,MATCH($B$5,(GPS_IMPORT!$A$2:$A$10000),0)+ROWS($1:6)-1,COLUMN()-1),0)","v":995.35421029999998},-28492.718766666716,-8.4749999921768904E-2,4.5095824999975775E-2,true]
[7,{"$f":"IF(ROWS(GPS_IMPORT!$1:7)<=COUNTIF(GPS_IMPORT!$A$2:$A$10000,$B$5),INDEX(GPS_IMPORT!$2:$10000,MATCH($B$5,(GPS_IMPORT!$A$2:$A$10000),0)+ROWS($1:7)-1,COLUMN()-1),0)","v":"SV1"},{"$f":"IF(ROWS(GPS_IMPORT!$1:7)<=COUNTIF(GPS_IMPORT!$A$2:$A$10000,$B$5),INDEX(GPS_IMPORT!$2:$10000,MATCH($B$5,(GPS_IMPORT!$A$2:$A$10000),0)+ROWS($1:7)-1,COLUMN()-1),0)","v":" 3.10.2019"},{"$f":"IF(ROWS(GPS_IMPORT!$1:7)<=COUNTIF(GPS_IMPORT!$A$2:$A$10000,$B$5),INDEX(GPS_IMPORT!$2:$10000,MATCH($B$5,(GPS_IMPORT!$A$2:$A$10000),0)+ROWS($1:7)-1,COLUMN()-1),0)","v":"00:56:41.300"},{"$f":"IF(ROWS(GPS_IMPORT!$1:7)<=COUNTIF(GPS_IMPORT!$A$2:$A$10000,$B$5),INDEX(GPS_IMPORT!$2:$10000,MATCH($B$5,(GPS_IMPORT!$A$2:$A$10000),0)+ROWS($1:7)-1,COLUMN()-1),0)","v":379910.56599999999},{"$f":"IF(ROWS(GPS_IMPORT!$1:7)<=COUNTIF(GPS_IMPORT!$A$2:$A$10000,$B$5),INDEX(GPS_IMPORT!$2:$10000,MATCH($B$5,(GPS_IMPORT!$A$2:$A$10000),0)+ROWS($1:7)-1,COLUMN()-1),0)","v":2458017.0559999999},{"$f":"IF(ROWS(GPS_IMPORT!$1:7)<=COUNTIF(GPS_IMPORT!$A$2:$A$10000,$B$5),INDEX(GPS_IMPORT!$2:$10000,MATCH($B$5,(GPS_IMPORT!$A$2:$A$10000),0)+ROWS($1:7)-1,COLUMN()-1),0)","v":995.34306000000004},-28492.714266666735,-8.8749999646097422E-2,5.6246124999915992E-2,true]
[8,{"$f":"IF(ROWS(GPS_IMPORT!$1:8)<=COUNTIF(GPS_IMPORT!$A$2:$A$10000,$B$5),INDEX(GPS_IMPORT!$2:$10000,MATCH($B$5,(GPS_IMPORT!$A$2:$A$10000),0)+ROWS($1:8)-1,COLUMN()-1),0)","v":"SV1"},{"$f":"IF(ROWS(GPS_IMPORT!$1:8)<=COUNTIF(GPS_IMPORT!$A$2:$A$10000,$B$5),INDEX(GPS_IMPORT!$2:$10000,MATCH($B$5,(GPS_IMPORT!$A$2:$A$10000),0)+ROWS($1:8)-1,COLUMN()-1),0)","v":" 3.10.2019"},{"$f":"IF(ROWS(GPS_IMPORT!$1:8)<=COUNTIF(GPS_IMPORT!$A$2:$A$10000,$B$5),INDEX(GPS_IMPORT!$2:$10000,MATCH($B$5,(GPS_IMPORT!$A$2:$A$10000),0)+ROWS($1:8)-1,COLUMN()-1),0)","v":"00:56:52.100"},{"$f":"IF(ROWS(GPS_IMPORT!$1:8)<=COUNTIF(GPS_IMPORT!$A$2:$A$10000,$B$5),INDEX(GPS_IMPORT!$2:$10000,MATCH($B$5,(GPS_IMPORT!$A$2:$A$10000),0)+ROWS($1:8)-1,COLUMN()-1),0)","v":379910.56949999998},{"$f":"IF(ROWS(GPS_IMPORT!$1:8)<=COUNTIF(GPS_IMPORT!$A$2:$A$10000,$B$5),INDEX(GPS_IMPORT!$2:$10000,MATCH($B$5,(GPS_IMPORT!$A$2:$A$10000),0)+ROWS($1:8)-1,COLUMN()-1),0)","v":2458017.0610000002},{"$f":"IF(ROWS(GPS_IMPORT!$1:8)<=COUNTIF(GPS_IMPORT!$A$2:$A$10000,$B$5),INDEX(GPS_IMPORT!$2:$10000,MATCH($B$5,(GPS_IMPORT!$A$2:$A$10000),0)+ROWS($1:8)-1,COLUMN()-1),0)","v":995.35300810000001},-28492.717766666727,-9.375E-2,4.6298024999941845E-2,true]
[9,{"$f":"IF(ROWS(GPS_IMPORT!$1:9)<=COUNTIF(GPS_IMPORT!$A$2:$A$10000,$B$5),INDEX(GPS_IMPORT!$2:$10000,MATCH($B$5,(GPS_IMPORT!$A$2:$A$10000),0)+ROWS($1:9)-1,COLUMN()-1),0)","v":"SV1"},{"$f":"IF(ROWS(GPS_IMPORT!$1:9)<=COUNTIF(GPS_IMPORT!$A$2:$A$10000,$B$5),INDEX(GPS_IMPORT!$2:$10000,MATCH($B$5,(GPS_IMPORT!$A$2:$A$10000),0)+ROWS($1:9)-1,COLUMN()-1),0)","v":" 3.10.2019"},{"$f":"IF(ROWS(GPS_IMPORT!$1:9)<=COUNTIF(GPS_IMPORT!$A$2:$A$10000,$B$5),INDEX(GPS_IMPORT!$2:$10000,MATCH($B$5,(GPS_IMPORT!$A$2:$A$10000),0)+ROWS($1:9)-1,COLUMN()-1),0)","v":"00:57:10"},{"$f":"IF(ROWS(GPS_IMPORT!$1:9)<=COUNTIF(GPS_IMPORT!$A$2:$A$10000,$B$5),INDEX(GPS_IMPORT!$2:$10000,MATCH($B$5,(GPS_IMPORT!$A$2:$A$10000),0)+ROWS($1:9)-1,COLUMN()-1),0)","v":379910.5563},{"$f":"IF(ROWS(GPS_IMPORT!$1:9)<=COUNTIF(GPS_IMPORT!$A$2:$A$10000,$B$5),INDEX(GPS_IMPORT!$2:$10000,MATCH($B$5,(GPS_IMPORT!$A$2:$A$10000),0)+ROWS($1:9)-1,COLUMN()-1),0)","v":2458017.0529999998},{"$f":"IF(ROWS(GPS_IMPORT!$1:9)<=COUNTIF(GPS_IMPORT!$A$2:$A$10000,$B$5),INDEX(GPS_IMPORT!$2:$10000,MATCH($B$5,(GPS_IMPORT!$A$2:$A$10000),0)+ROWS($1:9)-1,COLUMN()-1),0)","v":995.36268829999995},-28492.70456666674,-8.574999962002039E-2,3.6617825000007542E-2,true]
[10,{"$f":"IF(ROWS(GPS_IMPORT!$1:10)<=COUNTIF(GPS_IMPORT!$A$2:$A$10000,$B$5),INDEX(GPS_IMPORT!$2:$10000,MATCH($B$5,(GPS_IMPORT!$A$2:$A$10000),0)+ROWS($1:10)-1,COLUMN()-1),0)","v":"SV1"},{"$f":"IF(ROWS(GPS_IMPORT!$1:10)<=COUNTIF(GPS_IMPORT!$A$2:$A$10000,$B$5),INDEX(GPS_IMPORT!$2:$10000,MATCH($B$5,(GPS_IMPORT!$A$2:$A$10000),0)+ROWS($1:10)-1,COLUMN()-1),0)","v":" 3.10.2019"},{"$f":"IF(ROWS(GPS_IMPORT!$1:10)<=COUNTIF(GPS_IMPORT!$A$2:$A$10000,$B$5),INDEX(GPS_IMPORT!$2:$10000,MATCH($B$5,(GPS_IMPORT!$A$2:$A$10000),0)+ROWS($1:10)-1,COLUMN()-1),0)","v":"00:57:20.100"},{"$f":"IF(ROWS(GPS_IMPORT!$1:10)<=COUNTIF(GPS_IMPORT!$A$2:$A$10000,$B$5),INDEX(GPS_IMPORT!$2:$10000,MATCH($B$5,(GPS_IMPORT!$A$2:$A$10000),0)+ROWS($1:10)-1,COLUMN()-1),0)","v":379910.55310000002},{"$f":"IF(ROWS(GPS_IMPORT!$1:10)<=COUNTIF(GPS_IMPORT!$A$2:$A$10000,$B$5),INDEX(GPS_IMPORT!$2:$10000,MATCH($B$5,(GPS_IMPORT!$A$2:$A$10000),0)+ROWS($1:10)-1,COLUMN()-1),0)","v":2458017.048},{"$f":"IF(ROWS(GPS_IMPORT!$1:10)<=COUNTIF(GPS_IMPORT!$A$2:$A$10000,$B$5),INDEX(GPS_IMPORT!$2:$10000,MATCH($B$5,(GPS_IMPORT!$A$2:$A$10000),0)+ROWS($1:10)-1,COLUMN()-1),0)","v":995.36037650000003},-28492.701366666763,-8.0749999731779099E-2,3.8929624999923362E-2,true]
[11,{"$f":"IF(ROWS(GPS_IMPORT!$1:11)<=COUNTIF(GPS_IMPORT!$A$2:$A$10000,$B$5),INDEX(GPS_IMPORT!$2:$10000,MATCH($B$5,(GPS_IMPORT!$A$2:$A$10000),0)+ROWS($1:11)-1,COLUMN()-1),0)","v":"SV1"},{"$f":"IF(ROWS(GPS_IMPORT!$1:11)<=COUNTIF(GPS_IMPORT!$A$2:$A$10000,$B$5),INDEX(GPS_IMPORT!$2:$10000,MATCH($B$5,(GPS_IMPORT!$A$2:$A$10000),0)+ROWS($1:11)-1,COLUMN()-1),0)","v":" 3.10.2019"},{"$f":"IF(ROWS(GPS_IMPORT!$1:11)<=COUNTIF(GPS_IMPORT!$A$2:$A$10000,$B$5),INDEX(GPS_IMPORT!$2:$10000,MATCH($B$5,(GPS_IMPORT!$A$2:$A$10000),0)+ROWS($1:11)-1,COLUMN()-1),0)","v":"00:57:31.500"},{"$f":"IF(ROWS(GPS_IMPORT!$1:11)<=COUNTIF(GPS_IMPORT!$A$2:$A$10000,$B$5),INDEX(GPS_IMPORT!$2:$10000,MATCH($B$5,(GPS_IMPORT!$A$2:$A$10000),0)+ROWS($1:11)-1,COLUMN()-1),0)","v":379910.54969999997},{"$f":"IF(ROWS(GPS_IMPORT!$1:11)<=COUNTIF(GPS_IMPORT!$A$2:$A$10000,$B$5),INDEX(GPS_IMPORT!$2:$10000,MATCH($B$5,(GPS_IMPORT!$A$2:$A$10000),0)+ROWS($1:11)-1,COLUMN()-1),0)","v":2458017.0460000001},{"$f":"IF(ROWS(GPS_IMPORT!$1:11)<=COUNTIF(GPS_IMPORT!$A$2:$A$10000,$B$5),INDEX(GPS_IMPORT!$2:$10000,MATCH($B$5,(GPS_IMPORT!$A$2:$A$10000),0)+ROWS($1:11)-1,COLUMN()-1),0)","v":995.36960899999997},-28492.697966666718,-7.874999986961484E-2,2.9697124999984226E-2,true]
[12,{"$f":"IF(ROWS(GPS_IMPORT!$1:12)<=COUNTIF(GPS_IMPORT!$A$2:$A$10000,$B$5),INDEX(GPS_IMPORT!$2:$10000,MATCH($B$5,(GPS_IMPORT!$A$2:$A$10000),0)+ROWS($1:12)-1,COLUMN()-1),0)","v":"SV1"},{"$f":"IF(ROWS(GPS_IMPORT!$1:12)<=COUNTIF(GPS_IMPORT!$A$2:$A$10000,$B$5),INDEX(GPS_IMPORT!$2:$10000,MATCH($B$5,(GPS_IMPORT!$A$2:$A$10000),0)+ROWS($1:12)-1,COLUMN()-1),0)","v":" 3.10.2019"},{"$f":"IF(ROWS(GPS_IMPORT!$1:12)<=COUNTIF(GPS_IMPORT!$A$2:$A$10000,$B$5),INDEX(GPS_IMPORT!$2:$10000,MATCH($B$5,(GPS_IMPORT!$A$2:$A$10000),0)+ROWS($1:12)-1,COLUMN()-1),0)","v":"00:57:42.100"},{"$f":"IF(ROWS(GPS_IMPORT!$1:12)<=COUNTIF(GPS_IMPORT!$A$2:$A$10000,$B$5),INDEX(GPS_IMPORT!$2:$10000,MATCH($B$5,(GPS_IMPORT!$A$2:$A$10000),0)+ROWS($1:12)-1,COLUMN()-1),0)","v":379910.56410000002},{"$f":"IF(ROWS(GPS_IMPORT!$1:12)<=COUNTIF(GPS_IMPORT!$A$2:$A$10000,$B$5),INDEX(GPS_IMPORT!$2:$10000,MATCH($B$5,(GPS_IMPORT!$A$2:$A$10000),0)+ROWS($1:12)-1,COLUMN()-1),0)","v":2458017.0499999998},{"$f":"IF(ROWS(GPS_IMPORT!$1:12)<=COUNTIF(GPS_IMPORT!$A$2:$A$10000,$B$5),INDEX(GPS_IMPORT!$2:$10000,MATCH($B$5,(GPS_IMPORT!$A$2:$A$10000),0)+ROWS($1:12)-1,COLUMN()-1),0)","v":995.36787709999999},-28492.712366666761,-8.2749999593943357E-2,3.1429024999965804E-2,true]
[13,{"$f":"IF(ROWS(GPS_IMPORT!$1:13)<=COUNTIF(GPS_IMPORT!$A$2:$A$10000,$B$5),INDEX(GPS_IMPORT!$2:$10000,MATCH($B$5,(GPS_IMPORT!$A$2:$A$10000),0)+ROWS($1:13)-1,COLUMN()-1),0)","v":0},{"$f":"IF(ROWS(GPS_IMPORT!$1:13)<=COUNTIF(GPS_IMPORT!$A$2:$A$10000,$B$5),INDEX(GPS_IMPORT!$2:$10000,MATCH($B$5,(GPS_IMPORT!$A$2:$A$10000),0)+ROWS($1:13)-1,COLUMN()-1),0)","v":"00:00:00"},{"$f":"IF(ROWS(GPS_IMPORT!$1:13)<=COUNTIF(GPS_IMPORT!$A$2:$A$10000,$B$5),INDEX(GPS_IMPORT!$2:$10000,MATCH($B$5,(GPS_IMPORT!$A$2:$A$10000),0)+ROWS($1:13)-1,COLUMN()-1),0)","v":"00:00:00"},{"$f":"IF(ROWS(GPS_IMPORT!$1:13)<=COUNTIF(GPS_IMPORT!$A$2:$A$10000,$B$5),INDEX(GPS_IMPORT!$2:$10000,MATCH($B$5,(GPS_IMPORT!$A$2:$A$10000),0)+ROWS($1:13)-1,COLUMN()-1),0)","v":0},{"$f":"IF(ROWS(GPS_IMPORT!$1:13)<=COUNTIF(GPS_IMPORT!$A$2:$A$10000,$B$5),INDEX(GPS_IMPORT!$2:$10000,MATCH($B$5,(GPS_IMPORT!$A$2:$A$10000),0)+ROWS($1:13)-1,COLUMN()-1),0)","v":0},{"$f":"IF(ROWS(GPS_IMPORT!$1:13)<=COUNTIF(GPS_IMPORT!$A$2:$A$10000,$B$5),INDEX(GPS_IMPORT!$2:$10000,MATCH($B$5,(GPS_IMPORT!$A$2:$A$10000),0)+ROWS($1:13)-1,COLUMN()-1),0)","v":0},{"$f":"IF(E19>0,E$22-E19,0)","v":0},0,0,false]
[14,{"$f":"IF(ROWS(GPS_IMPORT!$1:14)<=COUNTIF(GPS_IMPORT!$A$2:$A$10000,$B$5),INDEX(GPS_IMPORT!$2:$10000,MATCH($B$5,(GPS_IMPORT!$A$2:$A$10000),0)+ROWS($1:14)-1,COLUMN()-1),0)","v":0},{"$f":"IF(ROWS(GPS_IMPORT!$1:14)<=COUNTIF(GPS_IMPORT!$A$2:$A$10000,$B$5),INDEX(GPS_IMPORT!$2:$10000,MATCH($B$5,(GPS_IMPORT!$A$2:$A$10000),0)+ROWS($1:14)-1,COLUMN()-1),0)","v":"00:00:00"},{"$f":"IF(ROWS(GPS_IMPORT!$1:14)<=COUNTIF(GPS_IMPORT!$A$2:$A$10000,$B$5),INDEX(GPS_IMPORT!$2:$10000,MATCH($B$5,(GPS_IMPORT!$A$2:$A$10000),0)+ROWS($1:14)-1,COLUMN()-1),0)","v":"00:00:00"},{"$f":"IF(ROWS(GPS_IMPORT!$1:14)<=COUNTIF(GPS_IMPORT!$A$2:$A$10000,$B$5),INDEX(GPS_IMPORT!$2:$10000,MATCH($B$5,(GPS_IMPORT!$A$2:$A$10000),0)+ROWS($1:14)-1,COLUMN()-1),0)","v":0},{"$f":"IF(ROWS(GPS_IMPORT!$1:14)<=COUNTIF(GPS_IMPORT!$A$2:$A$10000,$B$5),INDEX(GPS_IMPORT!$2:$10000,MATCH($B$5,(GPS_IMPORT!$A$2:$A$10000),0)+ROWS($1:14)-1,COLUMN()-1),0)","v":0},{"$f":"IF(ROWS(GPS_IMPORT!$1:14)<=COUNTIF(GPS_IMPORT!$A$2:$A$10000,$B$5),INDEX(GPS_IMPORT!$2:$10000,MATCH($B$5,(GPS_IMPORT!$A$2:$A$10000),0)+ROWS($1:14)-1,COLUMN()-1),0)","v":0},0,0,0,false]
[15,{"$f":"IF(ROWS(GPS_IMPORT!$1:15)<=COUNTIF(GPS_IMPORT!$A$2:$A$10000,$B$5),INDEX(GPS_IMPORT!$2:$10000,MATCH($B$5,(GPS_IMPORT!$A$2:$A$10000),0)+ROWS($1:15)-1,COLUMN()-1),0)","v":0},{"$f":"IF(ROWS(GPS_IMPORT!$1:15)<=COUNTIF(GPS_IMPORT!$A$2:$A$10000,$B$5),INDEX(GPS_IMPORT!$2:$10000,MATCH($B$5,(GPS_IMPORT!$A$2:$A$10000),0)+ROWS($1:15)-1,COLUMN()-1),0)","v":"00:00:00"},{"$f":"IF(ROWS(GPS_IMPORT!$1:15)<=COUNTIF(GPS_IMPORT!$A$2:$A$10000,$B$5),INDEX(GPS_IMPORT!$2:$10000,MATCH($B$5,(GPS_IMPORT!$A$2:$A$10000),0)+ROWS($1:15)-1,COLUMN()-1),0)","v":"00:00:00"},{"$f":"IF(ROWS(GPS_IMPORT!$1:15)<=COUNTIF(GPS_IMPORT!$A$2:$A$10000,$B$5),INDEX(GPS_IMPORT!$2:$10000,MATCH($B$5,(GPS_IMPORT!$A$2:$A$10000),0)+ROWS($1:15)-1,COLUMN()-1),0)","v":0},{"$f":"IF(ROWS(GPS_IMPORT!$1:15)<=COUNTIF(GPS_IMPORT!$A$2:$A$10000,$B$5),INDEX(GPS_IMPORT!$2:$10000,MATCH($B$5,(GPS_IMPORT!$A$2:$A$10000),0)+ROWS($1:15)-1,COLUMN()-1),0)","v":0},{"$f":"IF(ROWS(GPS_IMPORT!$1:15)<=COUNTIF(GPS_IMPORT!$A$2:$A$10000,$B$5),INDEX(GPS_IMPORT!$2:$10000,MATCH($B$5,(GPS_IMPORT!$A$2:$A$10000),0)+ROWS($1:15)-1,COLUMN()-1),0)","v":0},0,0,0,false]
[null,null,null,"AVERAGE",{"$f":"(IF($K$7=TRUE,E7,0)+IF($K$8=TRUE,E8,0)+IF($K$9=TRUE,E9,0)+IF($K$10=TRUE,E10,0)+IF($K$11=TRUE,E11,0)+IF($K$12=TRUE,E12,0)+IF($K$13=TRUE,E13,0)+IF($K$14=TRUE,E14,0)+IF($K$15=TRUE,E15,0)+IF($K$16=TRUE,E16,0)+IF($K$17=TRUE,E17,0)+IF($K$18=TRUE,E18,0)+IF($K$19=TRUE,E19,0)+IF($K$20=TRUE,E20,0)+IF($K$21=TRUE,E21,0))/(IF($K$7=TRUE,1,0)+IF($K$8=TRUE,1,0)+IF($K$9=TRUE,1,0)+IF($K$10=TRUE,1,0)+IF($K$11=TRUE,1,0)+IF($K$12=TRUE,1,0)+IF($K$13=TRUE,1,0)+IF($K$14=TRUE,1,0)+IF($K$15=TRUE,1,0)+IF($K$16=TRUE,1,0)+IF($K$17=TRUE,1,0)+IF($K$18=TRUE,1,0)+IF($K$19=TRUE,1,0)+IF($K$20=TRUE,1,0)+IF($K$21=TRUE,1,0))","v":351417.85173333326},{"$f":"(IF($K$7=TRUE,F7,0)+IF($K$8=TRUE,F8,0)+IF($K$9=TRUE,F9,0)+IF($K$10=TRUE,F10,0)+IF($K$11=TRUE,F11,0)+IF($K$12=TRUE,F12,0)+IF($K$13=TRUE,F13,0)+IF($K$14=TRUE,F14,0)+IF($K$15=TRUE,F15,0)+IF($K$16=TRUE,F16,0)+IF($K$17=TRUE,F17,0)+IF($K$18=TRUE,F18,0)+IF($K$19=TRUE,F19,0)+IF($K$20=TRUE,F20,0)+IF($K$21=TRUE,F21,0))/(IF($K$7=TRUE,1,0)+IF($K$8=TRUE,1,0)+IF($K$9=TRUE,1,0)+IF($K$10=TRUE,1,0)+IF($K$11=TRUE,1,0)+IF($K$12=TRUE,1,0)+IF($K$13=TRUE,1,0)+IF($K$14=TRUE,1,0)+IF($K$15=TRUE,1,0)+IF($K$16=TRUE,1,0)+IF($K$17=TRUE,1,0)+IF($K$18=TRUE,1,0)+IF($K$19=TRUE,1,0)+IF($K$20=TRUE,1,0)+IF($K$21=TRUE,1,0))","v":2458016.9672500002},{"$f":"(IF($K$7=TRUE,G7,0)+IF($K$8=TRUE,G8,0)+IF($K$9=TRUE,G9,0)+IF($K$10=TRUE,G10,0)+IF($K$11=TRUE,G11,0)+IF($K$12=TRUE,G12,0)+IF($K$13=TRUE,G13,0)+IF($K$14=TRUE,G14,0)+IF($K$15=TRUE,G15,0)+IF($K$16=TRUE,G16,0)+IF($K$17=TRUE,G17,0)+IF($K$18=TRUE,G18,0)+IF($K$19=TRUE,G19,0)+IF($K$20=TRUE,G20,0)+IF($K$21=TRUE,G21,0))/\n(IF($K$7=TRUE,1,0)+IF($K$8=TRUE,1,0)+IF($K$9=TRUE,1,0)+IF($K$10=TRUE,1,0)+IF($K$11=TRUE,1,0)+IF($K$12=TRUE,1,0)+IF($K$13=TRUE,1,0)+IF($K$14=TRUE,1,0)+IF($K$15=TRUE,1,0)+IF($K$16=TRUE,1,0)+IF($K$17=TRUE,1,0)+IF($K$18=TRUE,1,0)+IF($K$19=TRUE,1,0)+IF($K$20=TRUE,1,0)+IF($K$21=TRUE,1,0))","v":995.39930612499995},"RMSE:","RMSE:","RMSE:"]
[null,null,null,null,null,null,"RMSE IN US SURVEY FEET:",{"$f":"SQRT((\n(IF($K$7=TRUE,H7^2,0))+(IF($K$8=TRUE,H8^2,0))+(IF($K$9=TRUE,H9^2,0))+(IF($K$10=TRUE,H10^2,0))+(IF($K$11=TRUE,H11^2,0))+(IF($K$12=TRUE,H12^2,0))+(IF($K$13=TRUE,H13^2,0))+(IF($K$14=TRUE,H14^2,0))+(IF($K$15=TRUE,H15^2,0))+(IF($K$16=TRUE,H16^2,0))+(IF($K$17=TRUE,H17^2,0))+(IF($K$18=TRUE,H18^2,0))+(IF($K$19=TRUE,H19^2,0))+(IF($K$20=TRUE,H20^2,0))+(IF($K$21=TRUE,H21^2,0)))/\n(IF($K$7=TRUE,1,0)+IF($K$8=TRUE,1,0)+IF($K$9=TRUE,1,0)+IF($K$10=TRUE,1,0)+IF($K$11=TRUE,1,0)+IF($K$12=TRUE,1,0)+IF($K$13=TRUE,1,0)+IF($K$14=TRUE,1,0)+IF($K$15=TRUE,1,0)+IF($K$16=TRUE,1,0)+IF($K$17=TRUE,1,0)+IF($K$18=TRUE,1,0)+IF($K$19=TRUE,1,0)+IF($K$20=TRUE,1,0)+IF($K$21=TRUE,1,0)))","v":94499.640913480995},{"$f":"SQRT((\n(IF($K$7=TRUE,I7^2,0))+(IF($K$8=TRUE,I8^2,0))+(IF($K$9=TRUE,I9^2,0))+(IF($K$10=TRUE,I10^2,0))+(IF($K$11=TRUE,I11^2,0))+(IF($K$12=TRUE,I12^2,0))+(IF($K$13=TRUE,I13^2,0))+(IF($K$14=TRUE,I14^2,0))+(IF($K$15=TRUE,I15^2,0))+(IF($K$16=TRUE,I16^2,0))+(IF($K$17=TRUE,I17^2,0))+(IF($K$18=TRUE,I18^2,0))+(IF($K$19=TRUE,I19^2,0))+(IF($K$20=TRUE,I20^2,0))+(IF($K$21=TRUE,I21^2,0)))/\n(IF($K$7=TRUE,1,0)+IF($K$8=TRUE,1,0)+IF($K$9=TRUE,1,0)+IF($K$10=TRUE,1,0)+IF($K$11=TRUE,1,0)+IF($K$12=TRUE,1,0)+IF($K$13=TRUE,1,0)+IF($K$14=TRUE,1,0)+IF($K$15=TRUE,1,0)+IF($K$16=TRUE,1,0)+IF($K$17=TRUE,1,0)+IF($K$18=TRUE,1,0)+IF($K$19=TRUE,1,0)+IF($K$20=TRUE,1,0)+IF($K$21=TRUE,1,0)))","v":0.27660806362515639},{"$f":"SQRT((\n(IF($K$7=TRUE,J7^2,0))+(IF($K$8=TRUE,J8^2,0))+(IF($K$9=TRUE,J9^2,0))+(IF($K$10=TRUE,J10^2,0))+(IF($K$11=TRUE,J11^2,0))+(IF($K$12=TRUE,J12^2,0))+(IF($K$13=TRUE,J13^2,0))+(IF($K$14=TRUE,J14^2,0))+(IF($K$15=TRUE,J15^2,0))+(IF($K$16=TRUE,J16^2,0))+(IF($K$17=TRUE,J17^2,0))+(IF($K$18=TRUE,J18^2,0))+(IF($K$19=TRUE,J19^2,0))+(IF($K$20=TRUE,J20^2,0))+(IF($K$21=TRUE,J21^2,0)))/\n(IF($K$7=TRUE,1,0)+IF($K$8=TRUE,1,0)+IF($K$9=TRUE,1,0)+IF($K$10=TRUE,1,0)+IF($K$11=TRUE,1,0)+IF($K$12=TRUE,1,0)+IF($K$13=TRUE,1,0)+IF($K$14=TRUE,1,0)+IF($K$15=TRUE,1,0)+IF($K$16=TRUE,1,0)+IF($K$17=TRUE,1,0)+IF($K$18=TRUE,1,0)+IF($K$19=TRUE,1,0)+IF($K$20=TRUE,1,0)+IF($K$21=TRUE,1,0)))","v":0.13943200908493281}]
[null,null,null,1]
[null,null,"UNITLESS GRID TO GROUND MULTIPLIER",{"$f":"IF(REPORT!C13=\"n/a\",\"0.00000000\",REPORT!C13)","v":1.0000901799999999},null,null,null,{"$f":"IF(H23<=0.029,\"PASS\",\"FAIL\")","v":"FAIL"},{"$f":"IF(I23<=0.029,\"PASS\",\"FAIL\")","v":"FAIL"},{"$f":"IF(J23<=0.039,\"PASS\",\"FAIL\")","v":"FAIL"}]
[]
["AVERAGED GPS-DERIVED POSITION",null,null,null,null,null,null,null,"Notes:"]
[null,"MONUMENT COORDINATES",null,"NORTHING","EASTING","ORTHO HEIGHT"]
[null,"US Survey Feet (GRID)",null,{"$f":"$E$22","v":351417.85173333326},{"$f":"$F$22","v":2458016.9672500002},{"$f":"$G$22","v":995.39930612499995}]
[]
["LEVELED ELEVATION"]
["US SURVEY FEET",null,{"$f":"IFERROR(VLOOKUP(B5,'LEVEL RUN'!A8:I59,9,FALSE),\"N/A\")","v":"N/A"},"(Type the leveled elevation or N/A if no leveled elevation is available)"]
["MONUMENT HELD",null,null,"(Type the monument name from which leveling originated)"]
["LEVELED ELEVATION - GPS DERIVED ELEVATION   = ",null,null,null,{"$f":"IF(C32=\"N/A\",\"N/A\",C32-(F29*D24))","v":"N/A"}]
[]
["FINAL MONUMENT COORDINATES"]
[null,"MONUMENT COORDINATES",null,"NORTHING","EASTING","ELEVATION","FEATURE CODE"]
[null,"US SURVEY FEET (GRID)",null,{"$f":"$E$22*$D$24","v":351417.85173333326},{"$f":"$F$22*$D$24","v":2458016.9672500002},{"$f":"IF($C$32=\"N/A\",($G$22*$D$24),$C$32)","v":995.39930612499995},{"$f":"VLOOKUP($B$5,GPS_IMPORT!$A$2:$G$2000,7,FALSE)","v":"AERTAR"}]
[null,"US SURVEY FEET (GROUND)",null,{"$f":"$D$38*$D$25","v":351449.54259520257},{"$f":"$E$38*$D$25","v":2458238.6312201065},{"$f":"IF($C$32=\"N/A\",($G$22*$D$24),$C$32)","v":995.39930612499995},{"$f":"$G$38","v":"AERTAR"}]
[]
["∆ North,  ∆ East, and ∆ Ht. are the difference between the average northing, easting, and height for each observation.",null,null,null,null,null,null,null,"Mask Angle:","10°"]

{"sheet":"SV2","index":8,"n_rows":41,"n_cols":11,"rows_kept":41,"cut":false,"hidden":false,"merged":[[0,0,0,10],[26,0,26,6],[27,1,27,2],[27,8,38,10],[28,1,28,2],[30,0,30,6],[35,0,35,6],[36,1,36,2],[37,1,37,2],[38,1,38,2]]}
["VRS GNSS Project Control Monument Coordinate Analysis"]
[]
["Project:",{"$f":"REPORT!B2","v":"FRA-71-29.4"},"GPS Antenna:","LEICA GS14",null,null,null,null,null,"Report Date:",{"$f":"REPORT!C49","v":"2019-04-25"}]
["PID:",{"$f":"REPORT!E2","v":106471},"VRS Network:","ODOT VRS",null,null,null,null,null,"Prepared By:",{"$f":"REPORT!C48","v":"Kolton Wilson"}]
["Point ID:","SV2","No. of Sessions:",{"$f":"COUNTIF(GPS_IMPORT!A2:A1000,$B$5)","v":13},null,null,null,null,null,"Checked By:",{"$f":"REPORT!C52","v":"David Ogden"}]
["SESSION #","Point","Observation Date","Start Time","Northing(sft)","Easting(sft)","Height(sft)","∆ Northing(sft)","∆ Easting(sft)","∆ Height(sft)","Include in Solution?"]
[1,{"$f":"IF(ROWS(GPS_IMPORT!$1:1)<=COUNTIF(GPS_IMPORT!$A$2:$A$10000,$B$5),INDEX(GPS_IMPORT!$2:$10000,MATCH($B$5,(GPS_IMPORT!$A$2:$A$10000),0)+ROWS($1:1)-1,COLUMN()-1),0)","v":"SV2"},{"$f":"IF(ROWS(GPS_IMPORT!$1:1)<=COUNTIF(GPS_IMPORT!$A$2:$A$10000,$B$5),INDEX(GPS_IMPORT!$2:$10000,MATCH($B$5,(GPS_IMPORT!$A$2:$A$10000),0)+ROWS($1:1)-1,COLUMN()-1),0)","v":" 3.10.2019"},{"$f":"IF(ROWS(GPS_IMPORT!$1:1)<=COUNTIF(GPS_IMPORT!$A$2:$A$10000,$B$5),INDEX(GPS_IMPORT!$2:$10000,MATCH($B$5,(GPS_IMPORT!$A$2:$A$10000),0)+ROWS($1:1)-1,COLUMN()-1),0)","v":"00:03:36.500"},{"$f":"IF(ROWS(GPS_IMPORT!$1:1)<=COUNTIF(GPS_IMPORT!$A$2:$A$10000,$B$5),INDEX(GPS_IMPORT!$2:$10000,MATCH($B$5,(GPS_IMPORT!$A$2:$A$10000),0)+ROWS($1:1)-1,COLUMN()-1),0)","v":380188.4094},{"$f":"IF(ROWS(GPS_IMPORT!$1:1)<=COUNTIF(GPS_IMPORT!$A$2:$A$10000,$B$5),INDEX(GPS_IMPORT!$2:$10000,MATCH($B$5,(GPS_IMPORT!$A$2:$A$10000),0)+ROWS($1:1)-1,COLUMN()-1),0)","v":2460342.983},{"$f":"IF(ROWS(GPS_IMPORT!$1:1)<=COUNTIF(GPS_IMPORT!$A$2:$A$10000,$B$5),INDEX(GPS_IMPORT!$2:$10000,MATCH($B$5,(GPS_IMPORT!$A$2:$A$10000),0)+ROWS($1:1)-1,COLUMN()-1),0)","v":975.0115022},{"$f":"IF(E7>0,E$22-E7,0)","v":-1.0783333331346512E-2},4.7500003129243851E-3,-4.297016666782838E-3,true]
[2,{"$f":"IF(ROWS(GPS_IMPORT!$1:2)<=COUNTIF(GPS_IMPORT!$A$2:$A$10000,$B$5),INDEX(GPS_IMPORT!$2:$10000,MATCH($B$5,(GPS_IMPORT!$A$2:$A$10000),0)+ROWS($1:2)-1,COLUMN()-1),0)","v":"SV2"},{"$f":"IF(ROWS(GPS_IMPORT!$1:2)<=COUNTIF(GPS_IMPORT!$A$2:$A$10000,$B$5),INDEX(GPS_IMPORT!$2:$10000,MATCH($B$5,(GPS_IMPORT!$A$2:$A$10000),0)+ROWS($1:2)-1,COLUMN()-1),0)","v":" 3.10.2019"},{"$f":"IF(ROWS(GPS_IMPORT!$1:2)<=COUNTIF(GPS_IMPORT!$A$2:$A$10000,$B$5),INDEX(GPS_IMPORT!$2:$10000,MATCH($B$5,(GPS_IMPORT!$A$2:$A$10000),0)+ROWS($1:2)-1,COLUMN()-1),0)","v":"00:03:49.100"},{"$f":"IF(ROWS(GPS_IMPORT!$1:2)<=COUNTIF(GPS_IMPORT!$A$2:$A$10000,$B$5),INDEX(GPS_IMPORT!$2:$10000,MATCH($B$5,(GPS_IMPORT!$A$2:$A$10000),0)+ROWS($1:2)-1,COLUMN()-1),0)","v":380188.4117},{"$f":"IF(ROWS(GPS_IMPORT!$1:2)<=COUNTIF(GPS_IMPORT!$A$2:$A$10000,$B$5),INDEX(GPS_IMPORT!$2:$10000,MATCH($B$5,(GPS_IMPORT!$A$2:$A$10000),0)+ROWS($1:2)-1,COLUMN()-1),0)","v":2460342.9870000002},{"$f":"IF(ROWS(GPS_IMPORT!$1:2)<=COUNTIF(GPS_IMPORT!$A$2:$A$10000,$B$5),INDEX(GPS_IMPORT!$2:$10000,MATCH($B$5,(GPS_IMPORT!$A$2:$A$10000),0)+ROWS($1:2)-1,COLUMN()-1),0)","v":975.00911499999995},-1.3083333324175328E-2,7.5000012293457985E-4,-1.9098166667390615E-3,true]
[3,{"$f":"IF(ROWS(GPS_IMPORT!$1:3)<=COUNTIF(GPS_IMPORT!$A$2:$A$10000,$B$5),INDEX(GPS_IMPORT!$2:$10000,MATCH($B$5,(GPS_IMPORT!$A$2:$A$10000),0)+ROWS($1:3)-1,COLUMN()-1),0)","v":"SV2"},{"$f":"IF(ROWS(GPS_IMPORT!$1:3)<=COUNTIF(GPS_IMPORT!$A$2:$A$10000,$B$5),INDEX(GPS_IMPORT!$2:$10000,MATCH($B$5,(GPS_IMPORT!$A$2:$A$10000),0)+ROWS($1:3)-1,COLUMN()-1),0)","v":" 3.10.2019"},{"$f":"IF(ROWS(GPS_IMPORT!$1:3)<=COUNTIF(GPS_IMPORT!$A$2:$A$10000,$B$5),INDEX(GPS_IMPORT!$2:$10000,MATCH($B$5,(GPS_IMPORT!$A$2:$A$10000),0)+ROWS($1:3)-1,COLUMN()-1),0)","v":"00:03:59"},{"$f":"IF(ROWS(GPS_IMPORT!$1:3)<=COUNTIF(GPS_IMPORT!$A$2:$A$10000,$B$5),INDEX(GPS_IMPORT!$2:$10000,MATCH($B$5,(GPS_IMPORT!$A$2:$A$10000),0)+ROWS($1:3)-1,COLUMN()-1),0)","v":380188.40620000003},{"$f":"IF(ROWS(GPS_IMPORT!$1:3)<=COUNTIF(GPS_IMPORT!$A$2:$A$10000,$B$5),INDEX(GPS_IMPORT!$2:$10000,MATCH($B$5,(GPS_IMPORT!$A$2:$A$10000),0)+ROWS($1:3)-1,COLUMN()-1),0)","v":2460342.9879999999},{"$f":"IF(ROWS(GPS_IMPORT!$1:3)<=COUNTIF(GPS_IMPORT!$A$2:$A$10000,$B$5),INDEX(GPS_IMPORT!$2:$10000,MATCH($B$5,(GPS_IMPORT!$A$2:$A$10000),0)+ROWS($1:3)-1,COLUMN()-1),0)","v":975.0067348},-7.5833333539776504E-3,-2.4999957531690598E-4,4.7038333320870152E-4,true]
[4,{"$f":"IF(ROWS(GPS_IMPORT!$1:4)<=COUNTIF(GPS_IMPORT!$A$2:$A$10000,$B$5),INDEX(GPS_IMPORT!$2:$10000,MATCH($B$5,(GPS_IMPORT!$A$2:$A$10000),0)+ROWS($1:4)-1,COLUMN()-1),0)","v":"SV2"},{"$f":"IF(ROWS(GPS_IMPORT!$1:4)<=COUNTIF(GPS_IMPORT!$A$2:$A$10000,$B$5),INDEX(GPS_IMPORT!$2:$10000,MATCH($B$5,(GPS_IMPORT!$A$2:$A$10000),0)+ROWS($1:4)-1,COLUMN()-1),0)","v":" 3.10.2019"},{"$f":"IF(ROWS(GPS_IMPORT!$1:4)<=COUNTIF(GPS_IMPORT!$A$2:$A$10000,$B$5),INDEX(GPS_IMPORT!$2:$10000,MATCH($B$5,(GPS_IMPORT!$A$2:$A$10000),0)+ROWS($1:4)-1,COLUMN()-1),0)","v":"00:04:09.100"},{"$f":"IF(ROWS(GPS_IMPORT!$1:4)<=COUNTIF(GPS_IMPORT!$A$2:$A$10000,$B$5),INDEX(GPS_IMPORT!$2:$10000,MATCH($B$5,(GPS_IMPORT!$A$2:$A$10000),0)+ROWS($1:4)-1,COLUMN()-1),0)","v":380188.39980000001},{"$f":"IF(ROWS(GPS_IMPORT!$1:4)<=COUNTIF(GPS_IMPORT!$A$2:$A$10000,$B$5),INDEX(GPS_IMPORT!$2:$10000,MATCH($B$5,(GPS_IMPORT!$A$2:$A$10000),0)+ROWS($1:4)-1,COLUMN()-1),0)","v":2460342.9900000002},{"$f":"IF(ROWS(GPS_IMPORT!$1:4)<=COUNTIF(GPS_IMPORT!$A$2:$A$10000,$B$5),INDEX(GPS_IMPORT!$2:$10000,MATCH($B$5,(GPS_IMPORT!$A$2:$A$10000),0)+ROWS($1:4)-1,COLUMN()-1),0)","v":975.00660359999995},-1.1833333410322666E-3,-2.2499999031424522E-3,6.0158333326398861E-4,true]
[5,{"$f":"IF(ROWS(GPS_IMPORT!$1:5)<=COUNTIF(GPS_IMPORT!$A$2:$A$10000,$B$5),INDEX(GPS_IMPORT!$2:$10000,MATCH($B$5,(GPS_IMPORT!$A$2:$A$10000),0)+ROWS($1:5)-1,COLUMN()-1),0)","v":"SV2"},{"$f":"IF(ROWS(GPS_IMPORT!$1:5)<=COUNTIF(GPS_IMPORT!$A$2:$A$10000,$B$5),INDEX(GPS_IMPORT!$2:$10000,MATCH($B$5,(GPS_IMPORT!$A$2:$A$10000),0)+ROWS($1:5)-1,COLUMN()-1),0)","v":" 3.10.2019"},{"$f":"IF(ROWS(GPS_IMPORT!$1:5)<=COUNTIF(GPS_IMPORT!$A$2:$A$10000,$B$5),INDEX(GPS_IMPORT!$2:$10000,MATCH($B$5,(GPS_IMPORT!$A$2:$A$10000),0)+ROWS($1:5)-1,COLUMN()-1),0)","v":"00:04:22"},{"$f":"IF(ROWS(GPS_IMPORT!$1:5)<=COUNTIF(GPS_IMPORT!$A$2:$A$10000,$B$5),INDEX(GPS_IMPORT!$2:$10000,MATCH($B$5,(GPS_IMPORT!$A$2:$A$10000),0)+ROWS($1:5)-1,COLUMN()-1),0)","v":380188.39539999998},{"$f":"IF(ROWS(GPS_IMPORT!$1:5)<=COUNTIF(GPS_IMPORT!$A$2:$A$10000,$B$5),INDEX(GPS_IMPORT!$2:$10000,MATCH($B$5,(GPS_IMPORT!$A$2:$A$10000),0)+ROWS($1:5)-1,COLUMN()-1),0)","v":2460342.9890000001},{"$f":"IF(ROWS(GPS_IMPORT!$1:5)<=COUNTIF(GPS_IMPORT!$A$2:$A$10000,$B$5),INDEX(GPS_IMPORT!$2:$10000,MATCH($B$5,(GPS_IMPORT!$A$2:$A$10000),0)+ROWS($1:5)-1,COLUMN()-1),0)","v":975.00578210000003},3.2166666933335364E-3,-1.2499997392296791E-3,1.4230833331794202E-3,true]
[6,{"$f":"IF(ROWS(GPS_IMPORT!$1:6)<=COUNTIF(GPS_IMPORT!$A$2:$A$10000,$B$5),INDEX(GPS_IMPORT!$2:$10000,MATCH($B$5,(GPS_IMPORT!$A$2:$A$10000),0)+ROWS($1:6)-1,COLUMN()-1),0)","v":"SV2"},{"$f":"IF(ROWS(GPS_IMPORT!$1:6)<=COUNTIF(GPS_IMPORT!$A$2:$A$10000,$B$5),INDEX(GPS_IMPORT!$2:$10000,MATCH($B$5,(GPS_IMPORT!$A$2:$A$10000),0)+ROWS($1:6)-1,COLUMN()-1),0)","v":" 3.10.2019"},{"$f":"IF(ROWS(GPS_IMPORT!$1:6)<=COUNTIF(GPS_IMPORT!$A$2:$A$10000,$B$5),INDEX(GPS_IMPORT!$2:$10000,MATCH($B$5,(GPS_IMPORT!$A$2:$A$10000),0)+ROWS($1:6)-1,COLUMN()-1),0)","v":"00:04:32"},{"$f":"IF(ROWS(GPS_IMPORT!$1:6)<=COUNTIF(GPS_IMPORT!$A$2:$A$10000,$B$5),INDEX(GPS_IMPORT!$2:$10000,MATCH($B$5,(GPS_IMPORT!$A$2:$A$10000),0)+ROWS($1:6)-1,COLUMN()-1),0)","v":380188.39449999999},{"$f":"IF(ROWS(GPS_IMPORT!$1:6)<=COUNTIF(GPS_IMPORT!$A$2:$A$10000,$B$5),INDEX(GPS_IMPORT!$2:$10000,MATCH($B$5,(GPS_IMPORT!$A$2:$A$10000),0)+ROWS($1:6)-1,COLUMN()-1),0)","v":2460342.9870000002},{"$f":"IF(ROWS(GPS_IMPORT!$1:6)<=COUNTIF(GPS_IMPORT!$A$2:$A$10000,$B$5),INDEX(GPS_IMPORT!$2:$10000,MATCH($B$5,(GPS_IMPORT!$A$2:$A$10000),0)+ROWS($1:6)-1,COLUMN()-1),0)","v":975.00601640000002},4.1166666778735816E-3,7.5000012293457985E-4,1.1887833331911679E-3,true]
[7,{"$f":"IF(ROWS(GPS_IMPORT!$1:7)<=COUNTIF(GPS_IMPORT!$A$2:$A$10000,$B$5),INDEX(GPS_IMPORT!$2:$10000,MATCH($B$5,(GPS_IMPORT!$A$2:$A$10000),0)+ROWS($1:7)-1,COLUMN()-1),0)","v":"SV2"},{"$f":"IF(ROWS(GPS_IMPORT!$1:7)<=COUNTIF(GPS_IMPORT!$A$2:$A$10000,$B$5),INDEX(GPS_IMPORT!$2:$10000,MATCH($B$5,(GPS_IMPORT!$A$2:$A$10000),0)+ROWS($1:7)-1,COLUMN()-1),0)","v":" 3.10.2019"},{"$f":"IF(ROWS(GPS_IMPORT!$1:7)<=COUNTIF(GPS_IMPORT!$A$2:$A$10000,$B$5),INDEX(GPS_IMPORT!$2:$10000,MATCH($B$5,(GPS_IMPORT!$A$2:$A$10000),0)+ROWS($1:7)-1,COLUMN()-1),0)","v":"00:04:42"},{"$f":"IF(ROWS(GPS_IMPORT!$1:7)<=COUNTIF(GPS_IMPORT!$A$2:$A$10000,$B$5),INDEX(GPS_IMPORT!$2:$10000,MATCH($B$5,(GPS_IMPORT!$A$2:$A$10000),0)+ROWS($1:7)-1,COLUMN()-1),0)","v":380188.39559999999},{"$f":"IF(ROWS(GPS_IMPORT!$1:7)<=COUNTIF(GPS_IMPORT!$A$2:$A$10000,$B$5),INDEX(GPS_IMPORT!$2:$10000,MATCH($B$5,(GPS_IMPORT!$A$2:$A$10000),0)+ROWS($1:7)-1,COLUMN()-1),0)","v":2460342.9890000001},{"$f":"IF(ROWS(GPS_IMPORT!$1:7)<=COUNTIF(GPS_IMPORT!$A$2:$A$10000,$B$5),INDEX(GPS_IMPORT!$2:$10000,MATCH($B$5,(GPS_IMPORT!$A$2:$A$10000),0)+ROWS($1:7)-1,COLUMN()-1),0)","v":975.00219830000003},3.0166666838340461E-3,-1.2499997392296791E-3,5.0068833331806673E-3,true]
[8,{"$f":"IF(ROWS(GPS_IMPORT!$1:8)<=COUNTIF(GPS_IMPORT!$A$2:$A$10000,$B$5),INDEX(GPS_IMPORT!$2:$10000,MATCH($B$5,(GPS_IMPORT!$A$2:$A$10000),0)+ROWS($1:8)-1,COLUMN()-1),0)","v":"SV2"},{"$f":"IF(ROWS(GPS_IMPORT!$1:8)<=COUNTIF(GPS_IMPORT!$A$2:$A$10000,$B$5),INDEX(GPS_IMPORT!$2:$10000,MATCH($B$5,(GPS_IMPORT!$A$2:$A$10000),0)+ROWS($1:8)-1,COLUMN()-1),0)","v":" 3.10.2019"},{"$f":"IF(ROWS(GPS_IMPORT!$1:8)<=COUNTIF(GPS_IMPORT!$A$2:$A$10000,$B$5),INDEX(GPS_IMPORT!$2:$10000,MATCH($B$5,(GPS_IMPORT!$A$2:$A$10000),0)+ROWS($1:8)-1,COLUMN()-1),0)","v":"00:04:52.100"},{"$f":"IF(ROWS(GPS_IMPORT!$1:8)<=COUNTIF(GPS_IMPORT!$A$2:$A$10000,$B$5),INDEX(GPS_IMPORT!$2:$10000,MATCH($B$5,(GPS_IMPORT!$A$2:$A$10000),0)+ROWS($1:8)-1,COLUMN()-1),0)","v":380188.39510000002},{"$f":"IF(ROWS(GPS_IMPORT!$1:8)<=COUNTIF(GPS_IMPORT!$A$2:$A$10000,$B$5),INDEX(GPS_IMPORT!$2:$10000,MATCH($B$5,(GPS_IMPORT!$A$2:$A$10000),0)+ROWS($1:8)-1,COLUMN()-1),0)","v":2460342.9920000001},{"$f":"IF(ROWS(GPS_IMPORT!$1:8)<=COUNTIF(GPS_IMPORT!$A$2:$A$10000,$B$5),INDEX(GPS_IMPORT!$2:$10000,MATCH($B$5,(GPS_IMPORT!$A$2:$A$10000),0)+ROWS($1:8)-1,COLUMN()-1),0)","v":975.00730720000001},3.5166666493751109E-3,-4.2499997653067112E-3,-1.0201666680131893E-4,true]
[9,{"$f":"IF(ROWS(GPS_IMPORT!$1:9)<=COUNTIF(GPS_IMPORT!$A$2:$A$10000,$B$5),INDEX(GPS_IMPORT!$2:$10000,MATCH($B$5,(GPS_IMPORT!$A$2:$A$10000),0)+ROWS($1:9)-1,COLUMN()-1),0)","v":"SV2"},{"$f":"IF(ROWS(GPS_IMPORT!$1:9)<=COUNTIF(GPS_IMPORT!$A$2:$A$10000,$B$5),INDEX(GPS_IMPORT!$2:$10000,MATCH($B$5,(GPS_IMPORT!$A$2:$A$10000),0)+ROWS($1:9)-1,COLUMN()-1),0)","v":" 3.10.2019"},{"$f":"IF(ROWS(GPS_IMPORT!$1:9)<=COUNTIF(GPS_IMPORT!$A$2:$A$10000,$B$5),INDEX(GPS_IMPORT!$2:$10000,MATCH($B$5,(GPS_IMPORT!$A$2:$A$10000),0)+ROWS($1:9)-1,COLUMN()-1),0)","v":"00:05:06.200"},{"$f":"IF(ROWS(GPS_IMPORT!$1:9)<=COUNTIF(GPS_IMPORT!$A$2:$A$10000,$B$5),INDEX(GPS_IMPORT!$2:$10000,MATCH($B$5,(GPS_IMPORT!$A$2:$A$10000),0)+ROWS($1:9)-1,COLUMN()-1),0)","v":380188.39610000001},{"$f":"IF(ROWS(GPS_IMPORT!$1:9)<=COUNTIF(GPS_IMPORT!$A$2:$A$10000,$B$5),INDEX(GPS_IMPORT!$2:$10000,MATCH($B$5,(GPS_IMPORT!$A$2:$A$10000),0)+ROWS($1:9)-1,COLUMN()-1),0)","v":2460342.9909999999},{"$f":"IF(ROWS(GPS_IMPORT!$1:9)<=COUNTIF(GPS_IMPORT!$A$2:$A$10000,$B$5),INDEX(GPS_IMPORT!$2:$10000,MATCH($B$5,(GPS_IMPORT!$A$2:$A$10000),0)+ROWS($1:9)-1,COLUMN()-1),0)","v":975.00103839999997},2.5166666600853205E-3,-3.2499996013939381E-3,6.1667833332421651E-3,true]
[10,{"$f":"IF(ROWS(GPS_IMPORT!$1:10)<=COUNTIF(GPS_IMPORT!$A$2:$A$10000,$B$5),INDEX(GPS_IMPORT!$2:$10000,MATCH($B$5,(GPS_IMPORT!$A$2:$A$10000),0)+ROWS($1:10)-1,COLUMN()-1),0)","v":"SV2"},{"$f":"IF(ROWS(GPS_IMPORT!$1:10)<=COUNTIF(GPS_IMPORT!$A$2:$A$10000,$B$5),INDEX(GPS_IMPORT!$2:$10000,MATCH($B$5,(GPS_IMPORT!$A$2:$A$10000),0)+ROWS($1:10)-1,COLUMN()-1),0)","v":" 3.10.2019"},{"$f":"IF(ROWS(GPS_IMPORT!$1:10)<=COUNTIF(GPS_IMPORT!$A$2:$A$10000,$B$5),INDEX(GPS_IMPORT!$2:$10000,MATCH($B$5,(GPS_IMPORT!$A$2:$A$10000),0)+ROWS($1:10)-1,COLUMN()-1),0)","v":"00:05:16.300"},{"$f":"IF(ROWS(GPS_IMPORT!$1:10)<=COUNTIF(GPS_IMPORT!$A$2:$A$10000,$B$5),INDEX(GPS_IMPORT!$2:$10000,MATCH($B$5,(GPS_IMPORT!$A$2:$A$10000),0)+ROWS($1:10)-1,COLUMN()-1),0)","v":380188.3947},{"$f":"IF(ROWS(GPS_IMPORT!$1:10)<=COUNTIF(GPS_IMPORT!$A$2:$A$10000,$B$5),INDEX(GPS_IMPORT!$2:$10000,MATCH($B$5,(GPS_IMPORT!$A$2:$A$10000),0)+ROWS($1:10)-1,COLUMN()-1),0)","v":2460342.986},{"$f":"IF(ROWS(GPS_IMPORT!$1:10)<=COUNTIF(GPS_IMPORT!$A$2:$A$10000,$B$5),INDEX(GPS_IMPORT!$2:$10000,MATCH($B$5,(GPS_IMPORT!$A$2:$A$10000),0)+ROWS($1:10)-1,COLUMN()-1),0)","v":975.00530300000003},3.9166666683740914E-3,1.750000286847353E-3,1.9021833331862581E-3,true]
[11,{"$f":"IF(ROWS(GPS_IMPORT!$1:11)<=COUNTIF(GPS_IMPORT!$A$2:$A$10000,$B$5),INDEX(GPS_IMPORT!$2:$10000,MATCH($B$5,(GPS_IMPORT!$A$2:$A$10000),0)+ROWS($1:11)-1,COLUMN()-1),0)","v":"SV2"},{"$f":"IF(ROWS(GPS_IMPORT!$1:11)<=COUNTIF(GPS_IMPORT!$A$2:$A$10000,$B$5),INDEX(GPS_IMPORT!$2:$10000,MATCH($B$5,(GPS_IMPORT!$A$2:$A$10000),0)+ROWS($1:11)-1,COLUMN()-1),0)","v":" 3.10.2019"},{"$f":"IF(ROWS(GPS_IMPORT!$1:11)<=COUNTIF(GPS_IMPORT!$A$2:$A$10000,$B$5),INDEX(GPS_IMPORT!$2:$10000,MATCH($B$5,(GPS_IMPORT!$A$2:$A$10000),0)+ROWS($1:11)-1,COLUMN()-1),0)","v":"00:05:26.400"},{"$f":"IF(ROWS(GPS_IMPORT!$1:11)<=COUNTIF(GPS_IMPORT!$A$2:$A$10000,$B$5),INDEX(GPS_IMPORT!$2:$10000,MATCH($B$5,(GPS_IMPORT!$A$2:$A$10000),0)+ROWS($1:11)-1,COLUMN()-1),0)","v":380188.39230000001},{"$f":"IF(ROWS(GPS_IMPORT!$1:11)<=COUNTIF(GPS_IMPORT!$A$2:$A$10000,$B$5),INDEX(GPS_IMPORT!$2:$10000,MATCH($B$5,(GPS_IMPORT!$A$2:$A$10000),0)+ROWS($1:11)-1,COLUMN()-1),0)","v":2460342.9870000002},{"$f":"IF(ROWS(GPS_IMPORT!$1:11)<=COUNTIF(GPS_IMPORT!$A$2:$A$10000,$B$5),INDEX(GPS_IMPORT!$2:$10000,MATCH($B$5,(GPS_IMPORT!$A$2:$A$10000),0)+ROWS($1:11)-1,COLUMN()-1),0)","v":975.00645610000004},6.3166666659526527E-3,7.5000012293457985E-4,7.49083333175804E-4,true]
[12,{"$f":"IF(ROWS(GPS_IMPORT!$1:12)<=COUNTIF(GPS_IMPORT!$A$2:$A$10000,$B$5),INDEX(GPS_IMPORT!$2:$10000,MATCH($B$5,(GPS_IMPORT!$A$2:$A$10000),0)+ROWS($1:12)-1,COLUMN()-1),0)","v":"SV2"},{"$f":"IF(ROWS(GPS_IMPORT!$1:12)<=COUNTIF(GPS_IMPORT!$A$2:$A$10000,$B$5),INDEX(GPS_IMPORT!$2:$10000,MATCH($B$5,(GPS_IMPORT!$A$2:$A$10000),0)+ROWS($1:12)-1,COLUMN()-1),0)","v":" 3.10.2019"},{"$f":"IF(ROWS(GPS_IMPORT!$1:12)<=COUNTIF(GPS_IMPORT!$A$2:$A$10000,$B$5),INDEX(GPS_IMPORT!$2:$10000,MATCH($B$5,(GPS_IMPORT!$A$2:$A$10000),0)+ROWS($1:12)-1,COLUMN()-1),0)","v":"00:05:37.100"},{"$f":"IF(ROWS(GPS_IMPORT!$1:12)<=COUNTIF(GPS_IMPORT!$A$2:$A$10000,$B$5),INDEX(GPS_IMPORT!$2:$10000,MATCH($B$5,(GPS_IMPORT!$A$2:$A$10000),0)+ROWS($1:12)-1,COLUMN()-1),0)","v":380188.39260000002},{"$f":"IF(ROWS(GPS_IMPORT!$1:12)<=COUNTIF(GPS_IMPORT!$A$2:$A$10000,$B$5),INDEX(GPS_IMPORT!$2:$10000,MATCH($B$5,(GPS_IMPORT!$A$2:$A$10000),0)+ROWS($1:12)-1,COLUMN()-1),0)","v":2460342.9840000002},{"$f":"IF(ROWS(GPS_IMPORT!$1:12)<=COUNTIF(GPS_IMPORT!$A$2:$A$10000,$B$5),INDEX(GPS_IMPORT!$2:$10000,MATCH($B$5,(GPS_IMPORT!$A$2:$A$10000),0)+ROWS($1:12)-1,COLUMN()-1),0)","v":975.0184051},6.0166666517034173E-3,3.7500001490116119E-3,-1.1199916666782883E-2,true]
[13,{"$f":"IF(ROWS(GPS_IMPORT!$1:13)<=COUNTIF(GPS_IMPORT!$A$2:$A$10000,$B$5),INDEX(GPS_IMPORT!$2:$10000,MATCH($B$5,(GPS_IMPORT!$A$2:$A$10000),0)+ROWS($1:13)-1,COLUMN()-1),0)","v":"SV2"},{"$f":"IF(ROWS(GPS_IMPORT!$1:13)<=COUNTIF(GPS_IMPORT!$A$2:$A$10000,$B$5),INDEX(GPS_IMPORT!$2:$10000,MATCH($B$5,(GPS_IMPORT!$A$2:$A$10000),0)+ROWS($1:13)-1,COLUMN()-1),0)","v":" 3.10.2019"},{"$f":"IF(ROWS(GPS_IMPORT!$1:13)<=COUNTIF(GPS_IMPORT!$A$2:$A$10000,$B$5),INDEX(GPS_IMPORT!$2:$10000,MATCH($B$5,(GPS_IMPORT!$A$2:$A$10000),0)+ROWS($1:13)-1,COLUMN()-1),0)","v":"00:05:56.400"},{"$f":"IF(ROWS(GPS_IMPORT!$1:13)<=COUNTIF(GPS_IMPORT!$A$2:$A$10000,$B$5),INDEX(GPS_IMPORT!$2:$10000,MATCH($B$5,(GPS_IMPORT!$A$2:$A$10000),0)+ROWS($1:13)-1,COLUMN()-1),0)","v":380188.38380000001},{"$f":"IF(ROWS(GPS_IMPORT!$1:13)<=COUNTIF(GPS_IMPORT!$A$2:$A$10000,$B$5),INDEX(GPS_IMPORT!$2:$10000,MATCH($B$5,(GPS_IMPORT!$A$2:$A$10000),0)+ROWS($1:13)-1,COLUMN()-1),0)","v":2460342.983},{"$f":"IF(ROWS(GPS_IMPORT!$1:13)<=COUNTIF(GPS_IMPORT!$A$2:$A$10000,$B$5),INDEX(GPS_IMPORT!$2:$10000,MATCH($B$5,(GPS_IMPORT!$A$2:$A$10000),0)+ROWS($1:13)-1,COLUMN()-1),0)","v":975.03339649999998},{"$f":"IF(E19>0,E$22-E19,0)","v":1.4816666662227362E-2},4.7500003129243851E-3,-2.6191316666768216E-2,false]
[14,{"$f":"IF(ROWS(GPS_IMPORT!$1:14)<=COUNTIF(GPS_IMPORT!$A$2:$A$10000,$B$5),INDEX(GPS_IMPORT!$2:$10000,MATCH($B$5,(GPS_IMPORT!$A$2:$A$10000),0)+ROWS($1:14)-1,COLUMN()-1),0)","v":0},{"$f":"IF(ROWS(GPS_IMPORT!$1:14)<=COUNTIF(GPS_IMPORT!$A$2:$A$10000,$B$5),INDEX(GPS_IMPORT!$2:$10000,MATCH($B$5,(GPS_IMPORT!$A$2:$A$10000),0)+ROWS($1:14)-1,COLUMN()-1),0)","v":"00:00:00"},{"$f":"IF(ROWS(GPS_IMPORT!$1:14)<=COUNTIF(GPS_IMPORT!$A$2:$A$10000,$B$5),INDEX(GPS_IMPORT!$2:$10000,MATCH($B$5,(GPS_IMPORT!$A$2:$A$10000),0)+ROWS($1:14)-1,COLUMN()-1),0)","v":"00:00:00"},{"$f":"IF(ROWS(GPS_IMPORT!$1:14)<=COUNTIF(GPS_IMPORT!$A$2:$A$10000,$B$5),INDEX(GPS_IMPORT!$2:$10000,MATCH($B$5,(GPS_IMPORT!$A$2:$A$10000),0)+ROWS($1:14)-1,COLUMN()-1),0)","v":0},{"$f":"IF(ROWS(GPS_IMPORT!$1:14)<=COUNTIF(GPS_IMPORT!$A$2:$A$10000,$B$5),INDEX(GPS_IMPORT!$2:$10000,MATCH($B$5,(GPS_IMPORT!$A$2:$A$10000),0)+ROWS($1:14)-1,COLUMN()-1),0)","v":0},{"$f":"IF(ROWS(GPS_IMPORT!$1:14)<=COUNTIF(GPS_IMPORT!$A$2:$A$10000,$B$5),INDEX(GPS_IMPORT!$2:$10000,MATCH($B$5,(GPS_IMPORT!$A$2:$A$10000),0)+ROWS($1:14)-1,COLUMN()-1),0)","v":0},0,0,0,false]
[15,{"$f":"IF(ROWS(GPS_IMPORT!$1:15)<=COUNTIF(GPS_IMPORT!$A$2:$A$10000,$B$5),INDEX(GPS_IMPORT!$2:$10000,MATCH($B$5,(GPS_IMPORT!$A$2:$A$10000),0)+ROWS($1:15)-1,COLUMN()-1),0)","v":0},{"$f":"IF(ROWS(GPS_IMPORT!$1:15)<=COUNTIF(GPS_IMPORT!$A$2:$A$10000,$B$5),INDEX(GPS_IMPORT!$2:$10000,MATCH($B$5,(GPS_IMPORT!$A$2:$A$10000),0)+ROWS($1:15)-1,COLUMN()-1),0)","v":"00:00:00"},{"$f":"IF(ROWS(GPS_IMPORT!$1:15)<=COUNTIF(GPS_IMPORT!$A$2:$A$10000,$B$5),INDEX(GPS_IMPORT!$2:$10000,MATCH($B$5,(GPS_IMPORT!$A$2:$A$10000),0)+ROWS($1:15)-1,COLUMN()-1),0)","v":"00:00:00"},{"$f":"IF(ROWS(GPS_IMPORT!$1:15)<=COUNTIF(GPS_IMPORT!$A$2:$A$10000,$B$5),INDEX(GPS_IMPORT!$2:$10000,MATCH($B$5,(GPS_IMPORT!$A$2:$A$10000),0)+ROWS($1:15)-1,COLUMN()-1),0)","v":0},{"$f":"IF(ROWS(GPS_IMPORT!$1:15)<=COUNTIF(GPS_IMPORT!$A$2:$A$10000,$B$5),INDEX(GPS_IMPORT!$2:$10000,MATCH($B$5,(GPS_IMPORT!$A$2:$A$10000),0)+ROWS($1:15)-1,COLUMN()-1),0)","v":0},{"$f":"IF(ROWS(GPS_IMPORT!$1:15)<=COUNTIF(GPS_IMPORT!$A$2:$A$10000,$B$5),INDEX(GPS_IMPORT!$2:$10000,MATCH($B$5,(GPS_IMPORT!$A$2:$A$10000),0)+ROWS($1:15)-1,COLUMN()-1),0)","v":0},0,0,0,false]
[null,null,null,"AVERAGE",{"$f":"(IF($K$7=TRUE,E7,0)+IF($K$8=TRUE,E8,0)+IF($K$9=TRUE,E9,0)+IF($K$10=TRUE,E10,0)+IF($K$11=TRUE,E11,0)+IF($K$12=TRUE,E12,0)+IF($K$13=TRUE,E13,0)+IF($K$14=TRUE,E14,0)+IF($K$15=TRUE,E15,0)+IF($K$16=TRUE,E16,0)+IF($K$17=TRUE,E17,0)+IF($K$18=TRUE,E18,0)+IF($K$19=TRUE,E19,0)+IF($K$20=TRUE,E20,0)+IF($K$21=TRUE,E21,0))/(IF($K$7=TRUE,1,0)+IF($K$8=TRUE,1,0)+IF($K$9=TRUE,1,0)+IF($K$10=TRUE,1,0)+IF($K$11=TRUE,1,0)+IF($K$12=TRUE,1,0)+IF($K$13=TRUE,1,0)+IF($K$14=TRUE,1,0)+IF($K$15=TRUE,1,0)+IF($K$16=TRUE,1,0)+IF($K$17=TRUE,1,0)+IF($K$18=TRUE,1,0)+IF($K$19=TRUE,1,0)+IF($K$20=TRUE,1,0)+IF($K$21=TRUE,1,0))","v":380188.39861666667},{"$f":"(IF($K$7=TRUE,F7,0)+IF($K$8=TRUE,F8,0)+IF($K$9=TRUE,F9,0)+IF($K$10=TRUE,F10,0)+IF($K$11=TRUE,F11,0)+IF($K$12=TRUE,F12,0)+IF($K$13=TRUE,F13,0)+IF($K$14=TRUE,F14,0)+IF($K$15=TRUE,F15,0)+IF($K$16=TRUE,F16,0)+IF($K$17=TRUE,F17,0)+IF($K$18=TRUE,F18,0)+IF($K$19=TRUE,F19,0)+IF($K$20=TRUE,F20,0)+IF($K$21=TRUE,F21,0))/(IF($K$7=TRUE,1,0)+IF($K$8=TRUE,1,0)+IF($K$9=TRUE,1,0)+IF($K$10=TRUE,1,0)+IF($K$11=TRUE,1,0)+IF($K$12=TRUE,1,0)+IF($K$13=TRUE,1,0)+IF($K$14=TRUE,1,0)+IF($K$15=TRUE,1,0)+IF($K$16=TRUE,1,0)+IF($K$17=TRUE,1,0)+IF($K$18=TRUE,1,0)+IF($K$19=TRUE,1,0)+IF($K$20=TRUE,1,0)+IF($K$21=TRUE,1,0))","v":2460342.9877500003},{"$f":"(IF($K$7=TRUE,G7,0)+IF($K$8=TRUE,G8,0)+IF($K$9=TRUE,G9,0)+IF($K$10=TRUE,G10,0)+IF($K$11=TRUE,G11,0)+IF($K$12=TRUE,G12,0)+IF($K$13=TRUE,G13,0)+IF($K$14=TRUE,G14,0)+IF($K$15=TRUE,G15,0)+IF($K$16=TRUE,G16,0)+IF($K$17=TRUE,G17,0)+IF($K$18=TRUE,G18,0)+IF($K$19=TRUE,G19,0)+IF($K$20=TRUE,G20,0)+IF($K$21=TRUE,G21,0))/\n(IF($K$7=TRUE,1,0)+IF($K$8=TRUE,1,0)+IF($K$9=TRUE,1,0)+IF($K$10=TRUE,1,0)+IF($K$11=TRUE,1,0)+IF($K$12=TRUE,1,0)+IF($K$13=TRUE,1,0)+IF($K$14=TRUE,1,0)+IF($K$15=TRUE,1,0)+IF($K$16=TRUE,1,0)+IF($K$17=TRUE,1,0)+IF($K$18=TRUE,1,0)+IF($K$19=TRUE,1,0)+IF($K$20=TRUE,1,0)+IF($K$21=TRUE,1,0))","v":975.00720518333321},"RMSE:","RMSE:","RMSE:"]
[null,null,null,null,null,null,"RMSE IN US SURVEY FEET:",{"$f":"SQRT((\n(IF($K$7=TRUE,H7^2,0))+(IF($K$8=TRUE,H8^2,0))+(IF($K$9=TRUE,H9^2,0))+(IF($K$10=TRUE,H10^2,0))+(IF($K$11=TRUE,H11^2,0))+(IF($K$12=TRUE,H12^2,0))+(IF($K$13=TRUE,H13^2,0))+(IF($K$14=TRUE,H14^2,0))+(IF($K$15=TRUE,H15^2,0))+(IF($K$16=TRUE,H16^2,0))+(IF($K$17=TRUE,H17^2,0))+(IF($K$18=TRUE,H18^2,0))+(IF($K$19=TRUE,H19^2,0))+(IF($K$20=TRUE,H20^2,0))+(IF($K$21=TRUE,H21^2,0)))/\n(IF($K$7=TRUE,1,0)+IF($K$8=TRUE,1,0)+IF($K$9=TRUE,1,0)+IF($K$10=TRUE,1,0)+IF($K$11=TRUE,1,0)+IF($K$12=TRUE,1,0)+IF($K$13=TRUE,1,0)+IF($K$14=TRUE,1,0)+IF($K$15=TRUE,1,0)+IF($K$16=TRUE,1,0)+IF($K$17=TRUE,1,0)+IF($K$18=TRUE,1,0)+IF($K$19=TRUE,1,0)+IF($K$20=TRUE,1,0)+IF($K$21=TRUE,1,0)))","v":6.4089564071986163E-3},{"$f":"SQRT((\n(IF($K$7=TRUE,I7^2,0))+(IF($K$8=TRUE,I8^2,0))+(IF($K$9=TRUE,I9^2,0))+(IF($K$10=TRUE,I10^2,0))+(IF($K$11=TRUE,I11^2,0))+(IF($K$12=TRUE,I12^2,0))+(IF($K$13=TRUE,I13^2,0))+(IF($K$14=TRUE,I14^2,0))+(IF($K$15=TRUE,I15^2,0))+(IF($K$16=TRUE,I16^2,0))+(IF($K$17=TRUE,I17^2,0))+(IF($K$18=TRUE,I18^2,0))+(IF($K$19=TRUE,I19^2,0))+(IF($K$20=TRUE,I20^2,0))+(IF($K$21=TRUE,I21^2,0)))/\n(IF($K$7=TRUE,1,0)+IF($K$8=TRUE,1,0)+IF($K$9=TRUE,1,0)+IF($K$10=TRUE,1,0)+IF($K$11=TRUE,1,0)+IF($K$12=TRUE,1,0)+IF($K$13=TRUE,1,0)+IF($K$14=TRUE,1,0)+IF($K$15=TRUE,1,0)+IF($K$16=TRUE,1,0)+IF($K$17=TRUE,1,0)+IF($K$18=TRUE,1,0)+IF($K$19=TRUE,1,0)+IF($K$20=TRUE,1,0)+IF($K$21=TRUE,1,0)))","v":2.5535922264797945E-3},{"$f":"SQRT((\n(IF($K$7=TRUE,J7^2,0))+(IF($K$8=TRUE,J8^2,0))+(IF($K$9=TRUE,J9^2,0))+(IF($K$10=TRUE,J10^2,0))+(IF($K$11=TRUE,J11^2,0))+(IF($K$12=TRUE,J12^2,0))+(IF($K$13=TRUE,J13^2,0))+(IF($K$14=TRUE,J14^2,0))+(IF($K$15=TRUE,J15^2,0))+(IF($K$16=TRUE,J16^2,0))+(IF($K$17=TRUE,J17^2,0))+(IF($K$18=TRUE,J18^2,0))+(IF($K$19=TRUE,J19^2,0))+(IF($K$20=TRUE,J20^2,0))+(IF($K$21=TRUE,J21^2,0)))/\n(IF($K$7=TRUE,1,0)+IF($K$8=TRUE,1,0)+IF($K$9=TRUE,1,0)+IF($K$10=TRUE,1,0)+IF($K$11=TRUE,1,0)+IF($K$12=TRUE,1,0)+IF($K$13=TRUE,1,0)+IF($K$14=TRUE,1,0)+IF($K$15=TRUE,1,0)+IF($K$16=TRUE,1,0)+IF($K$17=TRUE,1,0)+IF($K$18=TRUE,1,0)+IF($K$19=TRUE,1,0)+IF($K$20=TRUE,1,0)+IF($K$21=TRUE,1,0)))","v":4.2706298551477041E-3}]
[null,null,null,1]
[null,null,"UNITLESS GRID TO GROUND MULTIPLIER",{"$f":"IF(REPORT!C13=\"n/a\",\"0.00000000\",REPORT!C13)","v":1.0000901799999999},null,null,null,{"$f":"IF(H23<=0.029,\"PASS\",\"FAIL\")","v":"PASS"},{"$f":"IF(I23<=0.029,\"PASS\",\"FAIL\")","v":"PASS"},{"$f":"IF(J23<=0.039,\"PASS\",\"FAIL\")","v":"PASS"}]
[]
["AVERAGED GPS-DERIVED POSITION",null,null,null,null,null,null,null,"Notes:"]
[null,"MONUMENT COORDINATES",null,"NORTHING","EASTING","ORTHO HEIGHT"]
[null,"US Survey Feet (GRID)",null,{"$f":"$E$22","v":380188.39861666667},{"$f":"$F$22","v":2460342.9877500003},{"$f":"$G$22","v":975.00720518333321}]
[]
["LEVELED ELEVATION"]
["US SURVEY FEET",null,{"$f":"IFERROR(VLOOKUP(B5,'LEVEL RUN'!A8:I59,9,FALSE),\"N/A\")","v":"N/A"},"(Type the leveled elevation or N/A if no leveled elevation is available)"]
["MONUMENT HELD",null,null,"(Type the monument name from which leveling originated)"]
["LEVELED ELEVATION - GPS DERIVED ELEVATION   = ",null,null,null,{"$f":"IF(C32=\"N/A\",\"N/A\",C32-(F29*D24))","v":"N/A"}]
[]
["FINAL MONUMENT COORDINATES"]
[null,"MONUMENT COORDINATES",null,"NORTHING","EASTING","ELEVATION","FEATURE CODE"]
[null,"US SURVEY FEET (GRID)",null,{"$f":"$E$22*$D$24","v":380188.39861666667},{"$f":"$F$22*$D$24","v":2460342.9877500003},{"$f":"IF($C$32=\"N/A\",($G$22*$D$24),$C$32)","v":975.00720518333321},{"$f":"VLOOKUP($B$5,GPS_IMPORT!$A$2:$G$2000,7,FALSE)","v":"AERTAR"}]
[null,"US SURVEY FEET (GROUND)",null,{"$f":"$D$38*$D$25","v":380222.6840064539},{"$f":"$E$38*$D$25","v":2460564.8614806356},{"$f":"IF($C$32=\"N/A\",($G$22*$D$24),$C$32)","v":975.00720518333321},{"$f":"G38","v":"AERTAR"}]
[]
["∆ North,  ∆ East, and ∆ Ht. are the difference between the average northing, easting, and height for each observation.",null,null,null,null,null,null,null,"Mask Angle:","10°"]

{"sheet":"SV3","index":9,"n_rows":41,"n_cols":11,"rows_kept":41,"cut":false,"hidden":false,"merged":[[0,0,0,10],[26,0,26,6],[27,1,27,2],[27,8,38,10],[28,1,28,2],[30,0,30,6],[35,0,35,6],[36,1,36,2],[37,1,37,2],[38,1,38,2]]}
["VRS GNSS Project Control Monument Coordinate Analysis"]
[]
["Project:",{"$f":"REPORT!B2","v":"FRA-71-29.4"},"GPS Antenna:","LEICA GS14",null,null,null,null,null,"Report Date:",{"$f":"REPORT!C49","v":"2019-04-25"}]
["PID:",{"$f":"REPORT!E2","v":106471},"VRS Network:","ODOT VRS",null,null,null,null,null,"Prepared By:",{"$f":"REPORT!C48","v":"Kolton Wilson"}]
["Point ID:","SV3","No. of Sessions:",{"$f":"COUNTIF(GPS_IMPORT!A2:A1000,$B$5)","v":12},null,null,null,null,null,"Checked By:",{"$f":"REPORT!C52","v":"David Ogden"}]
["SESSION #","Point","Observation Date","Start Time","Northing(sft)","Easting(sft)","Height(sft)","∆ Northing(sft)","∆ Easting(sft)","∆ Height(sft)","Include in Solution?"]
[1,{"$f":"IF(ROWS(GPS_IMPORT!$1:1)<=COUNTIF(GPS_IMPORT!$A$2:$A$10000,$B$5),INDEX(GPS_IMPORT!$2:$10000,MATCH($B$5,(GPS_IMPORT!$A$2:$A$10000),0)+ROWS($1:1)-1,COLUMN()-1),0)","v":"SV3"},{"$f":"IF(ROWS(GPS_IMPORT!$1:1)<=COUNTIF(GPS_IMPORT!$A$2:$A$10000,$B$5),INDEX(GPS_IMPORT!$2:$10000,MATCH($B$5,(GPS_IMPORT!$A$2:$A$10000),0)+ROWS($1:1)-1,COLUMN()-1),0)","v":" 3.10.2019"},{"$f":"IF(ROWS(GPS_IMPORT!$1:1)<=COUNTIF(GPS_IMPORT!$A$2:$A$10000,$B$5),INDEX(GPS_IMPORT!$2:$10000,MATCH($B$5,(GPS_IMPORT!$A$2:$A$10000),0)+ROWS($1:1)-1,COLUMN()-1),0)","v":"00:34:20.100"},{"$f":"IF(ROWS(GPS_IMPORT!$1:1)<=COUNTIF(GPS_IMPORT!$A$2:$A$10000,$B$5),INDEX(GPS_IMPORT!$2:$10000,MATCH($B$5,(GPS_IMPORT!$A$2:$A$10000),0)+ROWS($1:1)-1,COLUMN()-1),0)","v":376919.52360000001},{"$f":"IF(ROWS(GPS_IMPORT!$1:1)<=COUNTIF(GPS_IMPORT!$A$2:$A$10000,$B$5),INDEX(GPS_IMPORT!$2:$10000,MATCH($B$5,(GPS_IMPORT!$A$2:$A$10000),0)+ROWS($1:1)-1,COLUMN()-1),0)","v":2458129.79},{"$f":"IF(ROWS(GPS_IMPORT!$1:1)<=COUNTIF(GPS_IMPORT!$A$2:$A$10000,$B$5),INDEX(GPS_IMPORT!$2:$10000,MATCH($B$5,(GPS_IMPORT!$A$2:$A$10000),0)+ROWS($1:1)-1,COLUMN()-1),0)","v":1021.8495359999999},{"$f":"IF(E7>0,E$22-E7,0)","v":2.11666664108634E-3},3.4166667610406876E-3,1.0611999999923682E-2,true]
[2,{"$f":"IF(ROWS(GPS_IMPORT!$1:2)<=COUNTIF(GPS_IMPORT!$A$2:$A$10000,$B$5),INDEX(GPS_IMPORT!$2:$10000,MATCH($B$5,(GPS_IMPORT!$A$2:$A$10000),0)+ROWS($1:2)-1,COLUMN()-1),0)","v":"SV3"},{"$f":"IF(ROWS(GPS_IMPORT!$1:2)<=COUNTIF(GPS_IMPORT!$A$2:$A$10000,$B$5),INDEX(GPS_IMPORT!$2:$10000,MATCH($B$5,(GPS_IMPORT!$A$2:$A$10000),0)+ROWS($1:2)-1,COLUMN()-1),0)","v":" 3.10.2019"},{"$f":"IF(ROWS(GPS_IMPORT!$1:2)<=COUNTIF(GPS_IMPORT!$A$2:$A$10000,$B$5),INDEX(GPS_IMPORT!$2:$10000,MATCH($B$5,(GPS_IMPORT!$A$2:$A$10000),0)+ROWS($1:2)-1,COLUMN()-1),0)","v":"00:34:30.200"},{"$f":"IF(ROWS(GPS_IMPORT!$1:2)<=COUNTIF(GPS_IMPORT!$A$2:$A$10000,$B$5),INDEX(GPS_IMPORT!$2:$10000,MATCH($B$5,(GPS_IMPORT!$A$2:$A$10000),0)+ROWS($1:2)-1,COLUMN()-1),0)","v":376919.52240000002},{"$f":"IF(ROWS(GPS_IMPORT!$1:2)<=COUNTIF(GPS_IMPORT!$A$2:$A$10000,$B$5),INDEX(GPS_IMPORT!$2:$10000,MATCH($B$5,(GPS_IMPORT!$A$2:$A$10000),0)+ROWS($1:2)-1,COLUMN()-1),0)","v":2458129.7919999999},{"$f":"IF(ROWS(GPS_IMPORT!$1:2)<=COUNTIF(GPS_IMPORT!$A$2:$A$10000,$B$5),INDEX(GPS_IMPORT!$2:$10000,MATCH($B$5,(GPS_IMPORT!$A$2:$A$10000),0)+ROWS($1:2)-1,COLUMN()-1),0)","v":1021.86292},3.3166666398756206E-3,1.4166668988764286E-3,-2.7720000001636436E-3,true]
[3,{"$f":"IF(ROWS(GPS_IMPORT!$1:3)<=COUNTIF(GPS_IMPORT!$A$2:$A$10000,$B$5),INDEX(GPS_IMPORT!$2:$10000,MATCH($B$5,(GPS_IMPORT!$A$2:$A$10000),0)+ROWS($1:3)-1,COLUMN()-1),0)","v":"SV3"},{"$f":"IF(ROWS(GPS_IMPORT!$1:3)<=COUNTIF(GPS_IMPORT!$A$2:$A$10000,$B$5),INDEX(GPS_IMPORT!$2:$10000,MATCH($B$5,(GPS_IMPORT!$A$2:$A$10000),0)+ROWS($1:3)-1,COLUMN()-1),0)","v":" 3.10.2019"},{"$f":"IF(ROWS(GPS_IMPORT!$1:3)<=COUNTIF(GPS_IMPORT!$A$2:$A$10000,$B$5),INDEX(GPS_IMPORT!$2:$10000,MATCH($B$5,(GPS_IMPORT!$A$2:$A$10000),0)+ROWS($1:3)-1,COLUMN()-1),0)","v":"00:34:41.300"},{"$f":"IF(ROWS(GPS_IMPORT!$1:3)<=COUNTIF(GPS_IMPORT!$A$2:$A$10000,$B$5),INDEX(GPS_IMPORT!$2:$10000,MATCH($B$5,(GPS_IMPORT!$A$2:$A$10000),0)+ROWS($1:3)-1,COLUMN()-1),0)","v":376919.51760000002},{"$f":"IF(ROWS(GPS_IMPORT!$1:3)<=COUNTIF(GPS_IMPORT!$A$2:$A$10000,$B$5),INDEX(GPS_IMPORT!$2:$10000,MATCH($B$5,(GPS_IMPORT!$A$2:$A$10000),0)+ROWS($1:3)-1,COLUMN()-1),0)","v":2458129.7969999998},{"$f":"IF(ROWS(GPS_IMPORT!$1:3)<=COUNTIF(GPS_IMPORT!$A$2:$A$10000,$B$5),INDEX(GPS_IMPORT!$2:$10000,MATCH($B$5,(GPS_IMPORT!$A$2:$A$10000),0)+ROWS($1:3)-1,COLUMN()-1),0)","v":1021.865229},8.1166666350327432E-3,-3.5833329893648624E-3,-5.0810000001320077E-3,true]
[4,{"$f":"IF(ROWS(GPS_IMPORT!$1:4)<=COUNTIF(GPS_IMPORT!$A$2:$A$10000,$B$5),INDEX(GPS_IMPORT!$2:$10000,MATCH($B$5,(GPS_IMPORT!$A$2:$A$10000),0)+ROWS($1:4)-1,COLUMN()-1),0)","v":"SV3"},{"$f":"IF(ROWS(GPS_IMPORT!$1:4)<=COUNTIF(GPS_IMPORT!$A$2:$A$10000,$B$5),INDEX(GPS_IMPORT!$2:$10000,MATCH($B$5,(GPS_IMPORT!$A$2:$A$10000),0)+ROWS($1:4)-1,COLUMN()-1),0)","v":" 3.10.2019"},{"$f":"IF(ROWS(GPS_IMPORT!$1:4)<=COUNTIF(GPS_IMPORT!$A$2:$A$10000,$B$5),INDEX(GPS_IMPORT!$2:$10000,MATCH($B$5,(GPS_IMPORT!$A$2:$A$10000),0)+ROWS($1:4)-1,COLUMN()-1),0)","v":"00:34:52"},{"$f":"IF(ROWS(GPS_IMPORT!$1:4)<=COUNTIF(GPS_IMPORT!$A$2:$A$10000,$B$5),INDEX(GPS_IMPORT!$2:$10000,MATCH($B$5,(GPS_IMPORT!$A$2:$A$10000),0)+ROWS($1:4)-1,COLUMN()-1),0)","v":376919.52529999998},{"$f":"IF(ROWS(GPS_IMPORT!$1:4)<=COUNTIF(GPS_IMPORT!$A$2:$A$10000,$B$5),INDEX(GPS_IMPORT!$2:$10000,MATCH($B$5,(GPS_IMPORT!$A$2:$A$10000),0)+ROWS($1:4)-1,COLUMN()-1),0)","v":2458129.7969999998},{"$f":"IF(ROWS(GPS_IMPORT!$1:4)<=COUNTIF(GPS_IMPORT!$A$2:$A$10000,$B$5),INDEX(GPS_IMPORT!$2:$10000,MATCH($B$5,(GPS_IMPORT!$A$2:$A$10000),0)+ROWS($1:4)-1,COLUMN()-1),0)","v":1021.8707889999999},4.1666667675599456E-4,-3.5833329893648624E-3,-1.0641000000077838E-2,true]
[5,{"$f":"IF(ROWS(GPS_IMPORT!$1:5)<=COUNTIF(GPS_IMPORT!$A$2:$A$10000,$B$5),INDEX(GPS_IMPORT!$2:$10000,MATCH($B$5,(GPS_IMPORT!$A$2:$A$10000),0)+ROWS($1:5)-1,COLUMN()-1),0)","v":"SV3"},{"$f":"IF(ROWS(GPS_IMPORT!$1:5)<=COUNTIF(GPS_IMPORT!$A$2:$A$10000,$B$5),INDEX(GPS_IMPORT!$2:$10000,MATCH($B$5,(GPS_IMPORT!$A$2:$A$10000),0)+ROWS($1:5)-1,COLUMN()-1),0)","v":" 3.10.2019"},{"$f":"IF(ROWS(GPS_IMPORT!$1:5)<=COUNTIF(GPS_IMPORT!$A$2:$A$10000,$B$5),INDEX(GPS_IMPORT!$2:$10000,MATCH($B$5,(GPS_IMPORT!$A$2:$A$10000),0)+ROWS($1:5)-1,COLUMN()-1),0)","v":"00:35:07"},{"$f":"IF(ROWS(GPS_IMPORT!$1:5)<=COUNTIF(GPS_IMPORT!$A$2:$A$10000,$B$5),INDEX(GPS_IMPORT!$2:$10000,MATCH($B$5,(GPS_IMPORT!$A$2:$A$10000),0)+ROWS($1:5)-1,COLUMN()-1),0)","v":376919.52490000002},{"$f":"IF(ROWS(GPS_IMPORT!$1:5)<=COUNTIF(GPS_IMPORT!$A$2:$A$10000,$B$5),INDEX(GPS_IMPORT!$2:$10000,MATCH($B$5,(GPS_IMPORT!$A$2:$A$10000),0)+ROWS($1:5)-1,COLUMN()-1),0)","v":2458129.7960000001},{"$f":"IF(ROWS(GPS_IMPORT!$1:5)<=COUNTIF(GPS_IMPORT!$A$2:$A$10000,$B$5),INDEX(GPS_IMPORT!$2:$10000,MATCH($B$5,(GPS_IMPORT!$A$2:$A$10000),0)+ROWS($1:5)-1,COLUMN()-1),0)","v":1021.868166},8.1666663754731417E-4,-2.5833332911133766E-3,-8.01800000010644E-3,true]
[6,{"$f":"IF(ROWS(GPS_IMPORT!$1:6)<=COUNTIF(GPS_IMPORT!$A$2:$A$10000,$B$5),INDEX(GPS_IMPORT!$2:$10000,MATCH($B$5,(GPS_IMPORT!$A$2:$A$10000),0)+ROWS($1:6)-1,COLUMN()-1),0)","v":"SV3"},{"$f":"IF(ROWS(GPS_IMPORT!$1:6)<=COUNTIF(GPS_IMPORT!$A$2:$A$10000,$B$5),INDEX(GPS_IMPORT!$2:$10000,MATCH($B$5,(GPS_IMPORT!$A$2:$A$10000),0)+ROWS($1:6)-1,COLUMN()-1),0)","v":" 3.10.2019"},{"$f":"IF(ROWS(GPS_IMPORT!$1:6)<=COUNTIF(GPS_IMPORT!$A$2:$A$10000,$B$5),INDEX(GPS_IMPORT!$2:$10000,MATCH($B$5,(GPS_IMPORT!$A$2:$A$10000),0)+ROWS($1:6)-1,COLUMN()-1),0)","v":"00:35:19"},{"$f":"IF(ROWS(GPS_IMPORT!$1:6)<=COUNTIF(GPS_IMPORT!$A$2:$A$10000,$B$5),INDEX(GPS_IMPORT!$2:$10000,MATCH($B$5,(GPS_IMPORT!$A$2:$A$10000),0)+ROWS($1:6)-1,COLUMN()-1),0)","v":376919.53009999997},{"$f":"IF(ROWS(GPS_IMPORT!$1:6)<=COUNTIF(GPS_IMPORT!$A$2:$A$10000,$B$5),INDEX(GPS_IMPORT!$2:$10000,MATCH($B$5,(GPS_IMPORT!$A$2:$A$10000),0)+ROWS($1:6)-1,COLUMN()-1),0)","v":2458129.7969999998},{"$f":"IF(ROWS(GPS_IMPORT!$1:6)<=COUNTIF(GPS_IMPORT!$A$2:$A$10000,$B$5),INDEX(GPS_IMPORT!$2:$10000,MATCH($B$5,(GPS_IMPORT!$A$2:$A$10000),0)+ROWS($1:6)-1,COLUMN()-1),0)","v":1021.870578},-4.3833333184011281E-3,-3.5833329893648624E-3,-1.0430000000155815E-2,true]
[7,{"$f":"IF(ROWS(GPS_IMPORT!$1:7)<=COUNTIF(GPS_IMPORT!$A$2:$A$10000,$B$5),INDEX(GPS_IMPORT!$2:$10000,MATCH($B$5,(GPS_IMPORT!$A$2:$A$10000),0)+ROWS($1:7)-1,COLUMN()-1),0)","v":"SV3"},{"$f":"IF(ROWS(GPS_IMPORT!$1:7)<=COUNTIF(GPS_IMPORT!$A$2:$A$10000,$B$5),INDEX(GPS_IMPORT!$2:$10000,MATCH($B$5,(GPS_IMPORT!$A$2:$A$10000),0)+ROWS($1:7)-1,COLUMN()-1),0)","v":" 3.10.2019"},{"$f":"IF(ROWS(GPS_IMPORT!$1:7)<=COUNTIF(GPS_IMPORT!$A$2:$A$10000,$B$5),INDEX(GPS_IMPORT!$2:$10000,MATCH($B$5,(GPS_IMPORT!$A$2:$A$10000),0)+ROWS($1:7)-1,COLUMN()-1),0)","v":"00:35:29.100"},{"$f":"IF(ROWS(GPS_IMPORT!$1:7)<=COUNTIF(GPS_IMPORT!$A$2:$A$10000,$B$5),INDEX(GPS_IMPORT!$2:$10000,MATCH($B$5,(GPS_IMPORT!$A$2:$A$10000),0)+ROWS($1:7)-1,COLUMN()-1),0)","v":376919.52370000002},{"$f":"IF(ROWS(GPS_IMPORT!$1:7)<=COUNTIF(GPS_IMPORT!$A$2:$A$10000,$B$5),INDEX(GPS_IMPORT!$2:$10000,MATCH($B$5,(GPS_IMPORT!$A$2:$A$10000),0)+ROWS($1:7)-1,COLUMN()-1),0)","v":2458129.7990000001},{"$f":"IF(ROWS(GPS_IMPORT!$1:7)<=COUNTIF(GPS_IMPORT!$A$2:$A$10000,$B$5),INDEX(GPS_IMPORT!$2:$10000,MATCH($B$5,(GPS_IMPORT!$A$2:$A$10000),0)+ROWS($1:7)-1,COLUMN()-1),0)","v":1021.862183},2.0166666363365948E-3,-5.5833333171904087E-3,-2.0350000000917134E-3,true]
[8,{"$f":"IF(ROWS(GPS_IMPORT!$1:8)<=COUNTIF(GPS_IMPORT!$A$2:$A$10000,$B$5),INDEX(GPS_IMPORT!$2:$10000,MATCH($B$5,(GPS_IMPORT!$A$2:$A$10000),0)+ROWS($1:8)-1,COLUMN()-1),0)","v":"SV3"},{"$f":"IF(ROWS(GPS_IMPORT!$1:8)<=COUNTIF(GPS_IMPORT!$A$2:$A$10000,$B$5),INDEX(GPS_IMPORT!$2:$10000,MATCH($B$5,(GPS_IMPORT!$A$2:$A$10000),0)+ROWS($1:8)-1,COLUMN()-1),0)","v":" 3.10.2019"},{"$f":"IF(ROWS(GPS_IMPORT!$1:8)<=COUNTIF(GPS_IMPORT!$A$2:$A$10000,$B$5),INDEX(GPS_IMPORT!$2:$10000,MATCH($B$5,(GPS_IMPORT!$A$2:$A$10000),0)+ROWS($1:8)-1,COLUMN()-1),0)","v":"00:35:40"},{"$f":"IF(ROWS(GPS_IMPORT!$1:8)<=COUNTIF(GPS_IMPORT!$A$2:$A$10000,$B$5),INDEX(GPS_IMPORT!$2:$10000,MATCH($B$5,(GPS_IMPORT!$A$2:$A$10000),0)+ROWS($1:8)-1,COLUMN()-1),0)","v":376919.5245},{"$f":"IF(ROWS(GPS_IMPORT!$1:8)<=COUNTIF(GPS_IMPORT!$A$2:$A$10000,$B$5),INDEX(GPS_IMPORT!$2:$10000,MATCH($B$5,(GPS_IMPORT!$A$2:$A$10000),0)+ROWS($1:8)-1,COLUMN()-1),0)","v":2458129.7960000001},{"$f":"IF(ROWS(GPS_IMPORT!$1:8)<=COUNTIF(GPS_IMPORT!$A$2:$A$10000,$B$5),INDEX(GPS_IMPORT!$2:$10000,MATCH($B$5,(GPS_IMPORT!$A$2:$A$10000),0)+ROWS($1:8)-1,COLUMN()-1),0)","v":1021.859932},1.2166666565462947E-3,-2.5833332911133766E-3,2.1599999990939978E-4,true]
[9,{"$f":"IF(ROWS(GPS_IMPORT!$1:9)<=COUNTIF(GPS_IMPORT!$A$2:$A$10000,$B$5),INDEX(GPS_IMPORT!$2:$10000,MATCH($B$5,(GPS_IMPORT!$A$2:$A$10000),0)+ROWS($1:9)-1,COLUMN()-1),0)","v":"SV3"},{"$f":"IF(ROWS(GPS_IMPORT!$1:9)<=COUNTIF(GPS_IMPORT!$A$2:$A$10000,$B$5),INDEX(GPS_IMPORT!$2:$10000,MATCH($B$5,(GPS_IMPORT!$A$2:$A$10000),0)+ROWS($1:9)-1,COLUMN()-1),0)","v":" 3.10.2019"},{"$f":"IF(ROWS(GPS_IMPORT!$1:9)<=COUNTIF(GPS_IMPORT!$A$2:$A$10000,$B$5),INDEX(GPS_IMPORT!$2:$10000,MATCH($B$5,(GPS_IMPORT!$A$2:$A$10000),0)+ROWS($1:9)-1,COLUMN()-1),0)","v":"00:35:55.100"},{"$f":"IF(ROWS(GPS_IMPORT!$1:9)<=COUNTIF(GPS_IMPORT!$A$2:$A$10000,$B$5),INDEX(GPS_IMPORT!$2:$10000,MATCH($B$5,(GPS_IMPORT!$A$2:$A$10000),0)+ROWS($1:9)-1,COLUMN()-1),0)","v":376919.53139999998},{"$f":"IF(ROWS(GPS_IMPORT!$1:9)<=COUNTIF(GPS_IMPORT!$A$2:$A$10000,$B$5),INDEX(GPS_IMPORT!$2:$10000,MATCH($B$5,(GPS_IMPORT!$A$2:$A$10000),0)+ROWS($1:9)-1,COLUMN()-1),0)","v":2458129.7940000002},{"$f":"IF(ROWS(GPS_IMPORT!$1:9)<=COUNTIF(GPS_IMPORT!$A$2:$A$10000,$B$5),INDEX(GPS_IMPORT!$2:$10000,MATCH($B$5,(GPS_IMPORT!$A$2:$A$10000),0)+ROWS($1:9)-1,COLUMN()-1),0)","v":1021.849082},-5.6833333219401538E-3,-5.8333342894911766E-4,1.1065999999914311E-2,true]
[10,{"$f":"IF(ROWS(GPS_IMPORT!$1:10)<=COUNTIF(GPS_IMPORT!$A$2:$A$10000,$B$5),INDEX(GPS_IMPORT!$2:$10000,MATCH($B$5,(GPS_IMPORT!$A$2:$A$10000),0)+ROWS($1:10)-1,COLUMN()-1),0)","v":"SV3"},{"$f":"IF(ROWS(GPS_IMPORT!$1:10)<=COUNTIF(GPS_IMPORT!$A$2:$A$10000,$B$5),INDEX(GPS_IMPORT!$2:$10000,MATCH($B$5,(GPS_IMPORT!$A$2:$A$10000),0)+ROWS($1:10)-1,COLUMN()-1),0)","v":" 3.10.2019"},{"$f":"IF(ROWS(GPS_IMPORT!$1:10)<=COUNTIF(GPS_IMPORT!$A$2:$A$10000,$B$5),INDEX(GPS_IMPORT!$2:$10000,MATCH($B$5,(GPS_IMPORT!$A$2:$A$10000),0)+ROWS($1:10)-1,COLUMN()-1),0)","v":"00:36:06.200"},{"$f":"IF(ROWS(GPS_IMPORT!$1:10)<=COUNTIF(GPS_IMPORT!$A$2:$A$10000,$B$5),INDEX(GPS_IMPORT!$2:$10000,MATCH($B$5,(GPS_IMPORT!$A$2:$A$10000),0)+ROWS($1:10)-1,COLUMN()-1),0)","v":376919.53049999999},{"$f":"IF(ROWS(GPS_IMPORT!$1:10)<=COUNTIF(GPS_IMPORT!$A$2:$A$10000,$B$5),INDEX(GPS_IMPORT!$2:$10000,MATCH($B$5,(GPS_IMPORT!$A$2:$A$10000),0)+ROWS($1:10)-1,COLUMN()-1),0)","v":2458129.7930000001},{"$f":"IF(ROWS(GPS_IMPORT!$1:10)<=COUNTIF(GPS_IMPORT!$A$2:$A$10000,$B$5),INDEX(GPS_IMPORT!$2:$10000,MATCH($B$5,(GPS_IMPORT!$A$2:$A$10000),0)+ROWS($1:10)-1,COLUMN()-1),0)","v":1021.852582},-4.7833333374001086E-3,4.1666673496365547E-4,7.5659999998833882E-3,true]
[11,{"$f":"IF(ROWS(GPS_IMPORT!$1:11)<=COUNTIF(GPS_IMPORT!$A$2:$A$10000,$B$5),INDEX(GPS_IMPORT!$2:$10000,MATCH($B$5,(GPS_IMPORT!$A$2:$A$10000),0)+ROWS($1:11)-1,COLUMN()-1),0)","v":"SV3"},{"$f":"IF(ROWS(GPS_IMPORT!$1:11)<=COUNTIF(GPS_IMPORT!$A$2:$A$10000,$B$5),INDEX(GPS_IMPORT!$2:$10000,MATCH($B$5,(GPS_IMPORT!$A$2:$A$10000),0)+ROWS($1:11)-1,COLUMN()-1),0)","v":" 3.10.2019"},{"$f":"IF(ROWS(GPS_IMPORT!$1:11)<=COUNTIF(GPS_IMPORT!$A$2:$A$10000,$B$5),INDEX(GPS_IMPORT!$2:$10000,MATCH($B$5,(GPS_IMPORT!$A$2:$A$10000),0)+ROWS($1:11)-1,COLUMN()-1),0)","v":"00:36:17.100"},{"$f":"IF(ROWS(GPS_IMPORT!$1:11)<=COUNTIF(GPS_IMPORT!$A$2:$A$10000,$B$5),INDEX(GPS_IMPORT!$2:$10000,MATCH($B$5,(GPS_IMPORT!$A$2:$A$10000),0)+ROWS($1:11)-1,COLUMN()-1),0)","v":376919.52649999998},{"$f":"IF(ROWS(GPS_IMPORT!$1:11)<=COUNTIF(GPS_IMPORT!$A$2:$A$10000,$B$5),INDEX(GPS_IMPORT!$2:$10000,MATCH($B$5,(GPS_IMPORT!$A$2:$A$10000),0)+ROWS($1:11)-1,COLUMN()-1),0)","v":2458129.7850000001},{"$f":"IF(ROWS(GPS_IMPORT!$1:11)<=COUNTIF(GPS_IMPORT!$A$2:$A$10000,$B$5),INDEX(GPS_IMPORT!$2:$10000,MATCH($B$5,(GPS_IMPORT!$A$2:$A$10000),0)+ROWS($1:11)-1,COLUMN()-1),0)","v":1021.861501},-7.8333332203328609E-4,8.4166666492819786E-3,-1.3530000001082954E-3,true]
[12,{"$f":"IF(ROWS(GPS_IMPORT!$1:12)<=COUNTIF(GPS_IMPORT!$A$2:$A$10000,$B$5),INDEX(GPS_IMPORT!$2:$10000,MATCH($B$5,(GPS_IMPORT!$A$2:$A$10000),0)+ROWS($1:12)-1,COLUMN()-1),0)","v":"SV3"},{"$f":"IF(ROWS(GPS_IMPORT!$1:12)<=COUNTIF(GPS_IMPORT!$A$2:$A$10000,$B$5),INDEX(GPS_IMPORT!$2:$10000,MATCH($B$5,(GPS_IMPORT!$A$2:$A$10000),0)+ROWS($1:12)-1,COLUMN()-1),0)","v":" 3.10.2019"},{"$f":"IF(ROWS(GPS_IMPORT!$1:12)<=COUNTIF(GPS_IMPORT!$A$2:$A$10000,$B$5),INDEX(GPS_IMPORT!$2:$10000,MATCH($B$5,(GPS_IMPORT!$A$2:$A$10000),0)+ROWS($1:12)-1,COLUMN()-1),0)","v":"00:36:28"},{"$f":"IF(ROWS(GPS_IMPORT!$1:12)<=COUNTIF(GPS_IMPORT!$A$2:$A$10000,$B$5),INDEX(GPS_IMPORT!$2:$10000,MATCH($B$5,(GPS_IMPORT!$A$2:$A$10000),0)+ROWS($1:12)-1,COLUMN()-1),0)","v":376919.5281},{"$f":"IF(ROWS(GPS_IMPORT!$1:12)<=COUNTIF(GPS_IMPORT!$A$2:$A$10000,$B$5),INDEX(GPS_IMPORT!$2:$10000,MATCH($B$5,(GPS_IMPORT!$A$2:$A$10000),0)+ROWS($1:12)-1,COLUMN()-1),0)","v":2458129.7850000001},{"$f":"IF(ROWS(GPS_IMPORT!$1:12)<=COUNTIF(GPS_IMPORT!$A$2:$A$10000,$B$5),INDEX(GPS_IMPORT!$2:$10000,MATCH($B$5,(GPS_IMPORT!$A$2:$A$10000),0)+ROWS($1:12)-1,COLUMN()-1),0)","v":1021.849278},-2.3833333398215473E-3,8.4166666492819786E-3,1.0869999999840729E-2,true]
[13,{"$f":"IF(ROWS(GPS_IMPORT!$1:13)<=COUNTIF(GPS_IMPORT!$A$2:$A$10000,$B$5),INDEX(GPS_IMPORT!$2:$10000,MATCH($B$5,(GPS_IMPORT!$A$2:$A$10000),0)+ROWS($1:13)-1,COLUMN()-1),0)","v":0},{"$f":"IF(ROWS(GPS_IMPORT!$1:13)<=COUNTIF(GPS_IMPORT!$A$2:$A$10000,$B$5),INDEX(GPS_IMPORT!$2:$10000,MATCH($B$5,(GPS_IMPORT!$A$2:$A$10000),0)+ROWS($1:13)-1,COLUMN()-1),0)","v":"00:00:00"},{"$f":"IF(ROWS(GPS_IMPORT!$1:13)<=COUNTIF(GPS_IMPORT!$A$2:$A$10000,$B$5),INDEX(GPS_IMPORT!$2:$10000,MATCH($B$5,(GPS_IMPORT!$A$2:$A$10000),0)+ROWS($1:13)-1,COLUMN()-1),0)","v":"00:00:00"},{"$f":"IF(ROWS(GPS_IMPORT!$1:13)<=COUNTIF(GPS_IMPORT!$A$2:$A$10000,$B$5),INDEX(GPS_IMPORT!$2:$10000,MATCH($B$5,(GPS_IMPORT!$A$2:$A$10000),0)+ROWS($1:13)-1,COLUMN()-1),0)","v":0},{"$f":"IF(ROWS(GPS_IMPORT!$1:13)<=COUNTIF(GPS_IMPORT!$A$2:$A$10000,$B$5),INDEX(GPS_IMPORT!$2:$10000,MATCH($B$5,(GPS_IMPORT!$A$2:$A$10000),0)+ROWS($1:13)-1,COLUMN()-1),0)","v":0},{"$f":"IF(ROWS(GPS_IMPORT!$1:13)<=COUNTIF(GPS_IMPORT!$A$2:$A$10000,$B$5),INDEX(GPS_IMPORT!$2:$10000,MATCH($B$5,(GPS_IMPORT!$A$2:$A$10000),0)+ROWS($1:13)-1,COLUMN()-1),0)","v":0},{"$f":"IF(E19>0,E$22-E19,0)","v":0},0,0,false]
[14,{"$f":"IF(ROWS(GPS_IMPORT!$1:14)<=COUNTIF(GPS_IMPORT!$A$2:$A$10000,$B$5),INDEX(GPS_IMPORT!$2:$10000,MATCH($B$5,(GPS_IMPORT!$A$2:$A$10000),0)+ROWS($1:14)-1,COLUMN()-1),0)","v":0},{"$f":"IF(ROWS(GPS_IMPORT!$1:14)<=COUNTIF(GPS_IMPORT!$A$2:$A$10000,$B$5),INDEX(GPS_IMPORT!$2:$10000,MATCH($B$5,(GPS_IMPORT!$A$2:$A$10000),0)+ROWS($1:14)-1,COLUMN()-1),0)","v":"00:00:00"},{"$f":"IF(ROWS(GPS_IMPORT!$1:14)<=COUNTIF(GPS_IMPORT!$A$2:$A$10000,$B$5),INDEX(GPS_IMPORT!$2:$10000,MATCH($B$5,(GPS_IMPORT!$A$2:$A$10000),0)+ROWS($1:14)-1,COLUMN()-1),0)","v":"00:00:00"},{"$f":"IF(ROWS(GPS_IMPORT!$1:14)<=COUNTIF(GPS_IMPORT!$A$2:$A$10000,$B$5),INDEX(GPS_IMPORT!$2:$10000,MATCH($B$5,(GPS_IMPORT!$A$2:$A$10000),0)+ROWS($1:14)-1,COLUMN()-1),0)","v":0},{"$f":"IF(ROWS(GPS_IMPORT!$1:14)<=COUNTIF(GPS_IMPORT!$A$2:$A$10000,$B$5),INDEX(GPS_IMPORT!$2:$10000,MATCH($B$5,(GPS_IMPORT!$A$2:$A$10000),0)+ROWS($1:14)-1,COLUMN()-1),0)","v":0},{"$f":"IF(ROWS(GPS_IMPORT!$1:14)<=COUNTIF(GPS_IMPORT!$A$2:$A$10000,$B$5),INDEX(GPS_IMPORT!$2:$10000,MATCH($B$5,(GPS_IMPORT!$A$2:$A$10000),0)+ROWS($1:14)-1,COLUMN()-1),0)","v":0},0,0,0,false]
[15,{"$f":"IF(ROWS(GPS_IMPORT!$1:15)<=COUNTIF(GPS_IMPORT!$A$2:$A$10000,$B$5),INDEX(GPS_IMPORT!$2:$10000,MATCH($B$5,(GPS_IMPORT!$A$2:$A$10000),0)+ROWS($1:15)-1,COLUMN()-1),0)","v":0},{"$f":"IF(ROWS(GPS_IMPORT!$1:15)<=COUNTIF(GPS_IMPORT!$A$2:$A$10000,$B$5),INDEX(GPS_IMPORT!$2:$10000,MATCH($B$5,(GPS_IMPORT!$A$2:$A$10000),0)+ROWS($1:15)-1,COLUMN()-1),0)","v":"00:00:00"},{"$f":"IF(ROWS(GPS_IMPORT!$1:15)<=COUNTIF(GPS_IMPORT!$A$2:$A$10000,$B$5),INDEX(GPS_IMPORT!$2:$10000,MATCH($B$5,(GPS_IMPORT!$A$2:$A$10000),0)+ROWS($1:15)-1,COLUMN()-1),0)","v":"00:00:00"},{"$f":"IF(ROWS(GPS_IMPORT!$1:15)<=COUNTIF(GPS_IMPORT!$A$2:$A$10000,$B$5),INDEX(GPS_IMPORT!$2:$10000,MATCH($B$5,(GPS_IMPORT!$A$2:$A$10000),0)+ROWS($1:15)-1,COLUMN()-1),0)","v":0},{"$f":"IF(ROWS(GPS_IMPORT!$1:15)<=COUNTIF(GPS_IMPORT!$A$2:$A$10000,$B$5),INDEX(GPS_IMPORT!$2:$10000,MATCH($B$5,(GPS_IMPORT!$A$2:$A$10000),0)+ROWS($1:15)-1,COLUMN()-1),0)","v":0},{"$f":"IF(ROWS(GPS_IMPORT!$1:15)<=COUNTIF(GPS_IMPORT!$A$2:$A$10000,$B$5),INDEX(GPS_IMPORT!$2:$10000,MATCH($B$5,(GPS_IMPORT!$A$2:$A$10000),0)+ROWS($1:15)-1,COLUMN()-1),0)","v":0},0,0,0,false]
[null,null,null,"AVERAGE",{"$f":"(IF($K$7=TRUE,E7,0)+IF($K$8=TRUE,E8,0)+IF($K$9=TRUE,E9,0)+IF($K$10=TRUE,E10,0)+IF($K$11=TRUE,E11,0)+IF($K$12=TRUE,E12,0)+IF($K$13=TRUE,E13,0)+IF($K$14=TRUE,E14,0)+IF($K$15=TRUE,E15,0)+IF($K$16=TRUE,E16,0)+IF($K$17=TRUE,E17,0)+IF($K$18=TRUE,E18,0)+IF($K$19=TRUE,E19,0)+IF($K$20=TRUE,E20,0)+IF($K$21=TRUE,E21,0))/(IF($K$7=TRUE,1,0)+IF($K$8=TRUE,1,0)+IF($K$9=TRUE,1,0)+IF($K$10=TRUE,1,0)+IF($K$11=TRUE,1,0)+IF($K$12=TRUE,1,0)+IF($K$13=TRUE,1,0)+IF($K$14=TRUE,1,0)+IF($K$15=TRUE,1,0)+IF($K$16=TRUE,1,0)+IF($K$17=TRUE,1,0)+IF($K$18=TRUE,1,0)+IF($K$19=TRUE,1,0)+IF($K$20=TRUE,1,0)+IF($K$21=TRUE,1,0))","v":376919.52571666666},{"$f":"(IF($K$7=TRUE,F7,0)+IF($K$8=TRUE,F8,0)+IF($K$9=TRUE,F9,0)+IF($K$10=TRUE,F10,0)+IF($K$11=TRUE,F11,0)+IF($K$12=TRUE,F12,0)+IF($K$13=TRUE,F13,0)+IF($K$14=TRUE,F14,0)+IF($K$15=TRUE,F15,0)+IF($K$16=TRUE,F16,0)+IF($K$17=TRUE,F17,0)+IF($K$18=TRUE,F18,0)+IF($K$19=TRUE,F19,0)+IF($K$20=TRUE,F20,0)+IF($K$21=TRUE,F21,0))/(IF($K$7=TRUE,1,0)+IF($K$8=TRUE,1,0)+IF($K$9=TRUE,1,0)+IF($K$10=TRUE,1,0)+IF($K$11=TRUE,1,0)+IF($K$12=TRUE,1,0)+IF($K$13=TRUE,1,0)+IF($K$14=TRUE,1,0)+IF($K$15=TRUE,1,0)+IF($K$16=TRUE,1,0)+IF($K$17=TRUE,1,0)+IF($K$18=TRUE,1,0)+IF($K$19=TRUE,1,0)+IF($K$20=TRUE,1,0)+IF($K$21=TRUE,1,0))","v":2458129.7934166668},{"$f":"(IF($K$7=TRUE,G7,0)+IF($K$8=TRUE,G8,0)+IF($K$9=TRUE,G9,0)+IF($K$10=TRUE,G10,0)+IF($K$11=TRUE,G11,0)+IF($K$12=TRUE,G12,0)+IF($K$13=TRUE,G13,0)+IF($K$14=TRUE,G14,0)+IF($K$15=TRUE,G15,0)+IF($K$16=TRUE,G16,0)+IF($K$17=TRUE,G17,0)+IF($K$18=TRUE,G18,0)+IF($K$19=TRUE,G19,0)+IF($K$20=TRUE,G20,0)+IF($K$21=TRUE,G21,0))/\n(IF($K$7=TRUE,1,0)+IF($K$8=TRUE,1,0)+IF($K$9=TRUE,1,0)+IF($K$10=TRUE,1,0)+IF($K$11=TRUE,1,0)+IF($K$12=TRUE,1,0)+IF($K$13=TRUE,1,0)+IF($K$14=TRUE,1,0)+IF($K$15=TRUE,1,0)+IF($K$16=TRUE,1,0)+IF($K$17=TRUE,1,0)+IF($K$18=TRUE,1,0)+IF($K$19=TRUE,1,0)+IF($K$20=TRUE,1,0)+IF($K$21=TRUE,1,0))","v":1021.8601479999999},"RMSE:","RMSE:","RMSE:"]
[null,null,null,null,null,null,"RMSE IN US SURVEY FEET:",{"$f":"SQRT((\n(IF($K$7=TRUE,H7^2,0))+(IF($K$8=TRUE,H8^2,0))+(IF($K$9=TRUE,H9^2,0))+(IF($K$10=TRUE,H10^2,0))+(IF($K$11=TRUE,H11^2,0))+(IF($K$12=TRUE,H12^2,0))+(IF($K$13=TRUE,H13^2,0))+(IF($K$14=TRUE,H14^2,0))+(IF($K$15=TRUE,H15^2,0))+(IF($K$16=TRUE,H16^2,0))+(IF($K$17=TRUE,H17^2,0))+(IF($K$18=TRUE,H18^2,0))+(IF($K$19=TRUE,H19^2,0))+(IF($K$20=TRUE,H20^2,0))+(IF($K$21=TRUE,H21^2,0)))/\n(IF($K$7=TRUE,1,0)+IF($K$8=TRUE,1,0)+IF($K$9=TRUE,1,0)+IF($K$10=TRUE,1,0)+IF($K$11=TRUE,1,0)+IF($K$12=TRUE,1,0)+IF($K$13=TRUE,1,0)+IF($K$14=TRUE,1,0)+IF($K$15=TRUE,1,0)+IF($K$16=TRUE,1,0)+IF($K$17=TRUE,1,0)+IF($K$18=TRUE,1,0)+IF($K$19=TRUE,1,0)+IF($K$20=TRUE,1,0)+IF($K$21=TRUE,1,0)))","v":3.7465168876432008E-3},{"$f":"SQRT((\n(IF($K$7=TRUE,I7^2,0))+(IF($K$8=TRUE,I8^2,0))+(IF($K$9=TRUE,I9^2,0))+(IF($K$10=TRUE,I10^2,0))+(IF($K$11=TRUE,I11^2,0))+(IF($K$12=TRUE,I12^2,0))+(IF($K$13=TRUE,I13^2,0))+(IF($K$14=TRUE,I14^2,0))+(IF($K$15=TRUE,I15^2,0))+(IF($K$16=TRUE,I16^2,0))+(IF($K$17=TRUE,I17^2,0))+(IF($K$18=TRUE,I18^2,0))+(IF($K$19=TRUE,I19^2,0))+(IF($K$20=TRUE,I20^2,0))+(IF($K$21=TRUE,I21^2,0)))/\n(IF($K$7=TRUE,1,0)+IF($K$8=TRUE,1,0)+IF($K$9=TRUE,1,0)+IF($K$10=TRUE,1,0)+IF($K$11=TRUE,1,0)+IF($K$12=TRUE,1,0)+IF($K$13=TRUE,1,0)+IF($K$14=TRUE,1,0)+IF($K$15=TRUE,1,0)+IF($K$16=TRUE,1,0)+IF($K$17=TRUE,1,0)+IF($K$18=TRUE,1,0)+IF($K$19=TRUE,1,0)+IF($K$20=TRUE,1,0)+IF($K$21=TRUE,1,0)))","v":4.4620311102008953E-3},{"$f":"SQRT((\n(IF($K$7=TRUE,J7^2,0))+(IF($K$8=TRUE,J8^2,0))+(IF($K$9=TRUE,J9^2,0))+(IF($K$10=TRUE,J10^2,0))+(IF($K$11=TRUE,J11^2,0))+(IF($K$12=TRUE,J12^2,0))+(IF($K$13=TRUE,J13^2,0))+(IF($K$14=TRUE,J14^2,0))+(IF($K$15=TRUE,J15^2,0))+(IF($K$16=TRUE,J16^2,0))+(IF($K$17=TRUE,J17^2,0))+(IF($K$18=TRUE,J18^2,0))+(IF($K$19=TRUE,J19^2,0))+(IF($K$20=TRUE,J20^2,0))+(IF($K$21=TRUE,J21^2,0)))/\n(IF($K$7=TRUE,1,0)+IF($K$8=TRUE,1,0)+IF($K$9=TRUE,1,0)+IF($K$10=TRUE,1,0)+IF($K$11=TRUE,1,0)+IF($K$12=TRUE,1,0)+IF($K$13=TRUE,1,0)+IF($K$14=TRUE,1,0)+IF($K$15=TRUE,1,0)+IF($K$16=TRUE,1,0)+IF($K$17=TRUE,1,0)+IF($K$18=TRUE,1,0)+IF($K$19=TRUE,1,0)+IF($K$20=TRUE,1,0)+IF($K$21=TRUE,1,0)))","v":7.8331310044831709E-3}]
[null,null,null,1]
[null,null,"UNITLESS GRID TO GROUND MULTIPLIER",{"$f":"IF(REPORT!C13=\"n/a\",\"0.00000000\",REPORT!C13)","v":1.0000901799999999},null,null,null,{"$f":"IF(H23<=0.029,\"PASS\",\"FAIL\")","v":"PASS"},{"$f":"IF(I23<=0.029,\"PASS\",\"FAIL\")","v":"PASS"},{"$f":"IF(J23<=0.039,\"PASS\",\"FAIL\")","v":"PASS"}]
[]
["AVERAGED GPS-DERIVED POSITION",null,null,null,null,null,null,null,"Notes:"]
[null,"MONUMENT COORDINATES",null,"NORTHING","EASTING","ORTHO HEIGHT"]
[null,"US Survey Feet (GRID)",null,{"$f":"$E$22","v":376919.52571666666},{"$f":"$F$22","v":2458129.7934166668},{"$f":"$G$22","v":1021.8601479999999}]
[]
["LEVELED ELEVATION"]
["US SURVEY FEET",null,{"$f":"IFERROR(VLOOKUP(B5,'LEVEL RUN'!A8:I59,9,FALSE),\"N/A\")","v":"N/A"},"(Type the leveled elevation or N/A if no leveled elevation is available)"]
["MONUMENT HELD",null,null,"(Type the monument name from which leveling originated)"]
["LEVELED ELEVATION - GPS DERIVED ELEVATION   = ",null,null,null,{"$f":"IF(C32=\"N/A\",\"N/A\",C32-(F29*D24))","v":"N/A"}]
[]
["FINAL MONUMENT COORDINATES"]
[null,"MONUMENT COORDINATES",null,"NORTHING","EASTING","ELEVATION","FEATURE CODE"]
[null,"US SURVEY FEET (GRID)",null,{"$f":"$E$22*$D$24","v":376919.52571666666},{"$f":"$F$22*$D$24","v":2458129.7934166668},{"$f":"IF($C$32=\"N/A\",($G$22*$D$24),$C$32)","v":1021.8601479999999},{"$f":"VLOOKUP($B$5,GPS_IMPORT!$A$2:$G$2000,7,FALSE)","v":"AERTAR"}]
[null,"US SURVEY FEET (GROUND)",null,{"$f":"$D$38*$D$25","v":376953.51631949574},{"$f":"$E$38*$D$25","v":2458351.4675614368},{"$f":"IF($C$32=\"N/A\",($G$22*$D$24),$C$32)","v":1021.8601479999999},{"$f":"G38","v":"AERTAR"}]
[]
["∆ North,  ∆ East, and ∆ Ht. are the difference between the average northing, easting, and height for each observation.",null,null,null,null,null,null,null,"Mask Angle:","10°"]

{"sheet":"SV4","index":10,"n_rows":41,"n_cols":11,"rows_kept":41,"cut":false,"hidden":false,"merged":[[0,0,0,10],[26,0,26,6],[27,1,27,2],[27,8,38,10],[28,1,28,2],[30,0,30,6],[35,0,35,6],[36,1,36,2],[37,1,37,2],[38,1,38,2]]}
["VRS GNSS Project Control Monument Coordinate Analysis"]
[]
["Project:",{"$f":"REPORT!B2","v":"FRA-71-29.4"},"GPS Antenna:","LEICA GS14",null,null,null,null,null,"Report Date:",{"$f":"REPORT!C49","v":"2019-04-25"}]
["PID:",{"$f":"REPORT!E2","v":106471},"VRS Network:","ODOT VRS",null,null,null,null,null,"Prepared By:",{"$f":"REPORT!C48","v":"Kolton Wilson"}]
["Point ID:","SV4","No. of Sessions:",{"$f":"COUNTIF(GPS_IMPORT!A2:A1000,$B$5)","v":12},null,null,null,null,null,"Checked By:",{"$f":"REPORT!C52","v":"David Ogden"}]
["SESSION #","Point","Observation Date","Start Time","Northing(sft)","Easting(sft)","Height(sft)","∆ Northing(sft)","∆ Easting(sft)","∆ Height(sft)","Include in Solution?"]
[1,{"$f":"IF(ROWS(GPS_IMPORT!$1:1)<=COUNTIF(GPS_IMPORT!$A$2:$A$10000,$B$5),INDEX(GPS_IMPORT!$2:$10000,MATCH($B$5,(GPS_IMPORT!$A$2:$A$10000),0)+ROWS($1:1)-1,COLUMN()-1),0)","v":"SV4"},{"$f":"IF(ROWS(GPS_IMPORT!$1:1)<=COUNTIF(GPS_IMPORT!$A$2:$A$10000,$B$5),INDEX(GPS_IMPORT!$2:$10000,MATCH($B$5,(GPS_IMPORT!$A$2:$A$10000),0)+ROWS($1:1)-1,COLUMN()-1),0)","v":" 3.10.2019"},{"$f":"IF(ROWS(GPS_IMPORT!$1:1)<=COUNTIF(GPS_IMPORT!$A$2:$A$10000,$B$5),INDEX(GPS_IMPORT!$2:$10000,MATCH($B$5,(GPS_IMPORT!$A$2:$A$10000),0)+ROWS($1:1)-1,COLUMN()-1),0)","v":"00:46:56.100"},{"$f":"IF(ROWS(GPS_IMPORT!$1:1)<=COUNTIF(GPS_IMPORT!$A$2:$A$10000,$B$5),INDEX(GPS_IMPORT!$2:$10000,MATCH($B$5,(GPS_IMPORT!$A$2:$A$10000),0)+ROWS($1:1)-1,COLUMN()-1),0)","v":372819.66019999998},{"$f":"IF(ROWS(GPS_IMPORT!$1:1)<=COUNTIF(GPS_IMPORT!$A$2:$A$10000,$B$5),INDEX(GPS_IMPORT!$2:$10000,MATCH($B$5,(GPS_IMPORT!$A$2:$A$10000),0)+ROWS($1:1)-1,COLUMN()-1),0)","v":2455642.1740000001},{"$f":"IF(ROWS(GPS_IMPORT!$1:1)<=COUNTIF(GPS_IMPORT!$A$2:$A$10000,$B$5),INDEX(GPS_IMPORT!$2:$10000,MATCH($B$5,(GPS_IMPORT!$A$2:$A$10000),0)+ROWS($1:1)-1,COLUMN()-1),0)","v":1050.1768589999999},{"$f":"IF(E7>0,E$22-E7,0)","v":2.3800000082701445E-2},1.5166666824370623E-2,-3.6133333333054907E-3,true]
[2,{"$f":"IF(ROWS(GPS_IMPORT!$1:2)<=COUNTIF(GPS_IMPORT!$A$2:$A$10000,$B$5),INDEX(GPS_IMPORT!$2:$10000,MATCH($B$5,(GPS_IMPORT!$A$2:$A$10000),0)+ROWS($1:2)-1,COLUMN()-1),0)","v":"SV4"},{"$f":"IF(ROWS(GPS_IMPORT!$1:2)<=COUNTIF(GPS_IMPORT!$A$2:$A$10000,$B$5),INDEX(GPS_IMPORT!$2:$10000,MATCH($B$5,(GPS_IMPORT!$A$2:$A$10000),0)+ROWS($1:2)-1,COLUMN()-1),0)","v":" 3.10.2019"},{"$f":"IF(ROWS(GPS_IMPORT!$1:2)<=COUNTIF(GPS_IMPORT!$A$2:$A$10000,$B$5),INDEX(GPS_IMPORT!$2:$10000,MATCH($B$5,(GPS_IMPORT!$A$2:$A$10000),0)+ROWS($1:2)-1,COLUMN()-1),0)","v":"00:47:07.800"},{"$f":"IF(ROWS(GPS_IMPORT!$1:2)<=COUNTIF(GPS_IMPORT!$A$2:$A$10000,$B$5),INDEX(GPS_IMPORT!$2:$10000,MATCH($B$5,(GPS_IMPORT!$A$2:$A$10000),0)+ROWS($1:2)-1,COLUMN()-1),0)","v":372819.67739999999},{"$f":"IF(ROWS(GPS_IMPORT!$1:2)<=COUNTIF(GPS_IMPORT!$A$2:$A$10000,$B$5),INDEX(GPS_IMPORT!$2:$10000,MATCH($B$5,(GPS_IMPORT!$A$2:$A$10000),0)+ROWS($1:2)-1,COLUMN()-1),0)","v":2455642.176},{"$f":"IF(ROWS(GPS_IMPORT!$1:2)<=COUNTIF(GPS_IMPORT!$A$2:$A$10000,$B$5),INDEX(GPS_IMPORT!$2:$10000,MATCH($B$5,(GPS_IMPORT!$A$2:$A$10000),0)+ROWS($1:2)-1,COLUMN()-1),0)","v":1050.1995899999999},6.600000080652535E-3,1.3166666962206364E-2,-2.6344333333327086E-2,true]
[3,{"$f":"IF(ROWS(GPS_IMPORT!$1:3)<=COUNTIF(GPS_IMPORT!$A$2:$A$10000,$B$5),INDEX(GPS_IMPORT!$2:$10000,MATCH($B$5,(GPS_IMPORT!$A$2:$A$10000),0)+ROWS($1:3)-1,COLUMN()-1),0)","v":"SV4"},{"$f":"IF(ROWS(GPS_IMPORT!$1:3)<=COUNTIF(GPS_IMPORT!$A$2:$A$10000,$B$5),INDEX(GPS_IMPORT!$2:$10000,MATCH($B$5,(GPS_IMPORT!$A$2:$A$10000),0)+ROWS($1:3)-1,COLUMN()-1),0)","v":" 3.10.2019"},{"$f":"IF(ROWS(GPS_IMPORT!$1:3)<=COUNTIF(GPS_IMPORT!$A$2:$A$10000,$B$5),INDEX(GPS_IMPORT!$2:$10000,MATCH($B$5,(GPS_IMPORT!$A$2:$A$10000),0)+ROWS($1:3)-1,COLUMN()-1),0)","v":"00:47:18.700"},{"$f":"IF(ROWS(GPS_IMPORT!$1:3)<=COUNTIF(GPS_IMPORT!$A$2:$A$10000,$B$5),INDEX(GPS_IMPORT!$2:$10000,MATCH($B$5,(GPS_IMPORT!$A$2:$A$10000),0)+ROWS($1:3)-1,COLUMN()-1),0)","v":372819.68489999999},{"$f":"IF(ROWS(GPS_IMPORT!$1:3)<=COUNTIF(GPS_IMPORT!$A$2:$A$10000,$B$5),INDEX(GPS_IMPORT!$2:$10000,MATCH($B$5,(GPS_IMPORT!$A$2:$A$10000),0)+ROWS($1:3)-1,COLUMN()-1),0)","v":2455642.1779999998},{"$f":"IF(ROWS(GPS_IMPORT!$1:3)<=COUNTIF(GPS_IMPORT!$A$2:$A$10000,$B$5),INDEX(GPS_IMPORT!$2:$10000,MATCH($B$5,(GPS_IMPORT!$A$2:$A$10000),0)+ROWS($1:3)-1,COLUMN()-1),0)","v":1050.1875709999999},-8.9999992633238435E-4,1.1166667100042105E-2,-1.4325333333317758E-2,true]
[4,{"$f":"IF(ROWS(GPS_IMPORT!$1:4)<=COUNTIF(GPS_IMPORT!$A$2:$A$10000,$B$5),INDEX(GPS_IMPORT!$2:$10000,MATCH($B$5,(GPS_IMPORT!$A$2:$A$10000),0)+ROWS($1:4)-1,COLUMN()-1),0)","v":"SV4"},{"$f":"IF(ROWS(GPS_IMPORT!$1:4)<=COUNTIF(GPS_IMPORT!$A$2:$A$10000,$B$5),INDEX(GPS_IMPORT!$2:$10000,MATCH($B$5,(GPS_IMPORT!$A$2:$A$10000),0)+ROWS($1:4)-1,COLUMN()-1),0)","v":" 3.10.2019"},{"$f":"IF(ROWS(GPS_IMPORT!$1:4)<=COUNTIF(GPS_IMPORT!$A$2:$A$10000,$B$5),INDEX(GPS_IMPORT!$2:$10000,MATCH($B$5,(GPS_IMPORT!$A$2:$A$10000),0)+ROWS($1:4)-1,COLUMN()-1),0)","v":"00:47:31"},{"$f":"IF(ROWS(GPS_IMPORT!$1:4)<=COUNTIF(GPS_IMPORT!$A$2:$A$10000,$B$5),INDEX(GPS_IMPORT!$2:$10000,MATCH($B$5,(GPS_IMPORT!$A$2:$A$10000),0)+ROWS($1:4)-1,COLUMN()-1),0)","v":372819.68280000001},{"$f":"IF(ROWS(GPS_IMPORT!$1:4)<=COUNTIF(GPS_IMPORT!$A$2:$A$10000,$B$5),INDEX(GPS_IMPORT!$2:$10000,MATCH($B$5,(GPS_IMPORT!$A$2:$A$10000),0)+ROWS($1:4)-1,COLUMN()-1),0)","v":2455642.1710000001},{"$f":"IF(ROWS(GPS_IMPORT!$1:4)<=COUNTIF(GPS_IMPORT!$A$2:$A$10000,$B$5),INDEX(GPS_IMPORT!$2:$10000,MATCH($B$5,(GPS_IMPORT!$A$2:$A$10000),0)+ROWS($1:4)-1,COLUMN()-1),0)","v":1050.209758},1.2000000569969416E-3,1.8166666850447655E-2,-3.6512333333348579E-2,true]
[5,{"$f":"IF(ROWS(GPS_IMPORT!$1:5)<=COUNTIF(GPS_IMPORT!$A$2:$A$10000,$B$5),INDEX(GPS_IMPORT!$2:$10000,MATCH($B$5,(GPS_IMPORT!$A$2:$A$10000),0)+ROWS($1:5)-1,COLUMN()-1),0)","v":"SV4"},{"$f":"IF(ROWS(GPS_IMPORT!$1:5)<=COUNTIF(GPS_IMPORT!$A$2:$A$10000,$B$5),INDEX(GPS_IMPORT!$2:$10000,MATCH($B$5,(GPS_IMPORT!$A$2:$A$10000),0)+ROWS($1:5)-1,COLUMN()-1),0)","v":" 3.10.2019"},{"$f":"IF(ROWS(GPS_IMPORT!$1:5)<=COUNTIF(GPS_IMPORT!$A$2:$A$10000,$B$5),INDEX(GPS_IMPORT!$2:$10000,MATCH($B$5,(GPS_IMPORT!$A$2:$A$10000),0)+ROWS($1:5)-1,COLUMN()-1),0)","v":"00:47:52.800"},{"$f":"IF(ROWS(GPS_IMPORT!$1:5)<=COUNTIF(GPS_IMPORT!$A$2:$A$10000,$B$5),INDEX(GPS_IMPORT!$2:$10000,MATCH($B$5,(GPS_IMPORT!$A$2:$A$10000),0)+ROWS($1:5)-1,COLUMN()-1),0)","v":372819.68170000002},{"$f":"IF(ROWS(GPS_IMPORT!$1:5)<=COUNTIF(GPS_IMPORT!$A$2:$A$10000,$B$5),INDEX(GPS_IMPORT!$2:$10000,MATCH($B$5,(GPS_IMPORT!$A$2:$A$10000),0)+ROWS($1:5)-1,COLUMN()-1),0)","v":2455642.19},{"$f":"IF(ROWS(GPS_IMPORT!$1:5)<=COUNTIF(GPS_IMPORT!$A$2:$A$10000,$B$5),INDEX(GPS_IMPORT!$2:$10000,MATCH($B$5,(GPS_IMPORT!$A$2:$A$10000),0)+ROWS($1:5)-1,COLUMN()-1),0)","v":1050.178557},2.3000000510364771E-3,-8.3333300426602364E-4,-5.3113333333385526E-3,true]
[6,{"$f":"IF(ROWS(GPS_IMPORT!$1:6)<=COUNTIF(GPS_IMPORT!$A$2:$A$10000,$B$5),INDEX(GPS_IMPORT!$2:$10000,MATCH($B$5,(GPS_IMPORT!$A$2:$A$10000),0)+ROWS($1:6)-1,COLUMN()-1),0)","v":"SV4"},{"$f":"IF(ROWS(GPS_IMPORT!$1:6)<=COUNTIF(GPS_IMPORT!$A$2:$A$10000,$B$5),INDEX(GPS_IMPORT!$2:$10000,MATCH($B$5,(GPS_IMPORT!$A$2:$A$10000),0)+ROWS($1:6)-1,COLUMN()-1),0)","v":" 3.10.2019"},{"$f":"IF(ROWS(GPS_IMPORT!$1:6)<=COUNTIF(GPS_IMPORT!$A$2:$A$10000,$B$5),INDEX(GPS_IMPORT!$2:$10000,MATCH($B$5,(GPS_IMPORT!$A$2:$A$10000),0)+ROWS($1:6)-1,COLUMN()-1),0)","v":"00:48:06"},{"$f":"IF(ROWS(GPS_IMPORT!$1:6)<=COUNTIF(GPS_IMPORT!$A$2:$A$10000,$B$5),INDEX(GPS_IMPORT!$2:$10000,MATCH($B$5,(GPS_IMPORT!$A$2:$A$10000),0)+ROWS($1:6)-1,COLUMN()-1),0)","v":372819.68589999998},{"$f":"IF(ROWS(GPS_IMPORT!$1:6)<=COUNTIF(GPS_IMPORT!$A$2:$A$10000,$B$5),INDEX(GPS_IMPORT!$2:$10000,MATCH($B$5,(GPS_IMPORT!$A$2:$A$10000),0)+ROWS($1:6)-1,COLUMN()-1),0)","v":2455642.1940000001},{"$f":"IF(ROWS(GPS_IMPORT!$1:6)<=COUNTIF(GPS_IMPORT!$A$2:$A$10000,$B$5),INDEX(GPS_IMPORT!$2:$10000,MATCH($B$5,(GPS_IMPORT!$A$2:$A$10000),0)+ROWS($1:6)-1,COLUMN()-1),0)","v":1050.1707249999999},-1.8999999156221747E-3,-4.8333331942558289E-3,2.520666666669058E-3,true]
[7,{"$f":"IF(ROWS(GPS_IMPORT!$1:7)<=COUNTIF(GPS_IMPORT!$A$2:$A$10000,$B$5),INDEX(GPS_IMPORT!$2:$10000,MATCH($B$5,(GPS_IMPORT!$A$2:$A$10000),0)+ROWS($1:7)-1,COLUMN()-1),0)","v":"SV4"},{"$f":"IF(ROWS(GPS_IMPORT!$1:7)<=COUNTIF(GPS_IMPORT!$A$2:$A$10000,$B$5),INDEX(GPS_IMPORT!$2:$10000,MATCH($B$5,(GPS_IMPORT!$A$2:$A$10000),0)+ROWS($1:7)-1,COLUMN()-1),0)","v":" 3.10.2019"},{"$f":"IF(ROWS(GPS_IMPORT!$1:7)<=COUNTIF(GPS_IMPORT!$A$2:$A$10000,$B$5),INDEX(GPS_IMPORT!$2:$10000,MATCH($B$5,(GPS_IMPORT!$A$2:$A$10000),0)+ROWS($1:7)-1,COLUMN()-1),0)","v":"00:48:17.900"},{"$f":"IF(ROWS(GPS_IMPORT!$1:7)<=COUNTIF(GPS_IMPORT!$A$2:$A$10000,$B$5),INDEX(GPS_IMPORT!$2:$10000,MATCH($B$5,(GPS_IMPORT!$A$2:$A$10000),0)+ROWS($1:7)-1,COLUMN()-1),0)","v":372819.68790000002},{"$f":"IF(ROWS(GPS_IMPORT!$1:7)<=COUNTIF(GPS_IMPORT!$A$2:$A$10000,$B$5),INDEX(GPS_IMPORT!$2:$10000,MATCH($B$5,(GPS_IMPORT!$A$2:$A$10000),0)+ROWS($1:7)-1,COLUMN()-1),0)","v":2455642.1889999998},{"$f":"IF(ROWS(GPS_IMPORT!$1:7)<=COUNTIF(GPS_IMPORT!$A$2:$A$10000,$B$5),INDEX(GPS_IMPORT!$2:$10000,MATCH($B$5,(GPS_IMPORT!$A$2:$A$10000),0)+ROWS($1:7)-1,COLUMN()-1),0)","v":1050.188883},-3.8999999524094164E-3,1.666671596467495E-4,-1.5637333333415881E-2,true]
[8,{"$f":"IF(ROWS(GPS_IMPORT!$1:8)<=COUNTIF(GPS_IMPORT!$A$2:$A$10000,$B$5),INDEX(GPS_IMPORT!$2:$10000,MATCH($B$5,(GPS_IMPORT!$A$2:$A$10000),0)+ROWS($1:8)-1,COLUMN()-1),0)","v":"SV4"},{"$f":"IF(ROWS(GPS_IMPORT!$1:8)<=COUNTIF(GPS_IMPORT!$A$2:$A$10000,$B$5),INDEX(GPS_IMPORT!$2:$10000,MATCH($B$5,(GPS_IMPORT!$A$2:$A$10000),0)+ROWS($1:8)-1,COLUMN()-1),0)","v":" 3.10.2019"},{"$f":"IF(ROWS(GPS_IMPORT!$1:8)<=COUNTIF(GPS_IMPORT!$A$2:$A$10000,$B$5),INDEX(GPS_IMPORT!$2:$10000,MATCH($B$5,(GPS_IMPORT!$A$2:$A$10000),0)+ROWS($1:8)-1,COLUMN()-1),0)","v":"00:48:31"},{"$f":"IF(ROWS(GPS_IMPORT!$1:8)<=COUNTIF(GPS_IMPORT!$A$2:$A$10000,$B$5),INDEX(GPS_IMPORT!$2:$10000,MATCH($B$5,(GPS_IMPORT!$A$2:$A$10000),0)+ROWS($1:8)-1,COLUMN()-1),0)","v":372819.69540000003},{"$f":"IF(ROWS(GPS_IMPORT!$1:8)<=COUNTIF(GPS_IMPORT!$A$2:$A$10000,$B$5),INDEX(GPS_IMPORT!$2:$10000,MATCH($B$5,(GPS_IMPORT!$A$2:$A$10000),0)+ROWS($1:8)-1,COLUMN()-1),0)","v":2455642.2000000002},{"$f":"IF(ROWS(GPS_IMPORT!$1:8)<=COUNTIF(GPS_IMPORT!$A$2:$A$10000,$B$5),INDEX(GPS_IMPORT!$2:$10000,MATCH($B$5,(GPS_IMPORT!$A$2:$A$10000),0)+ROWS($1:8)-1,COLUMN()-1),0)","v":1050.175234},-1.1399999959394336E-2,-1.0833333246409893E-2,-1.9883333334291819E-3,true]
[9,{"$f":"IF(ROWS(GPS_IMPORT!$1:9)<=COUNTIF(GPS_IMPORT!$A$2:$A$10000,$B$5),INDEX(GPS_IMPORT!$2:$10000,MATCH($B$5,(GPS_IMPORT!$A$2:$A$10000),0)+ROWS($1:9)-1,COLUMN()-1),0)","v":"SV4"},{"$f":"IF(ROWS(GPS_IMPORT!$1:9)<=COUNTIF(GPS_IMPORT!$A$2:$A$10000,$B$5),INDEX(GPS_IMPORT!$2:$10000,MATCH($B$5,(GPS_IMPORT!$A$2:$A$10000),0)+ROWS($1:9)-1,COLUMN()-1),0)","v":" 3.10.2019"},{"$f":"IF(ROWS(GPS_IMPORT!$1:9)<=COUNTIF(GPS_IMPORT!$A$2:$A$10000,$B$5),INDEX(GPS_IMPORT!$2:$10000,MATCH($B$5,(GPS_IMPORT!$A$2:$A$10000),0)+ROWS($1:9)-1,COLUMN()-1),0)","v":"00:48:48.800"},{"$f":"IF(ROWS(GPS_IMPORT!$1:9)<=COUNTIF(GPS_IMPORT!$A$2:$A$10000,$B$5),INDEX(GPS_IMPORT!$2:$10000,MATCH($B$5,(GPS_IMPORT!$A$2:$A$10000),0)+ROWS($1:9)-1,COLUMN()-1),0)","v":372819.68949999998},{"$f":"IF(ROWS(GPS_IMPORT!$1:9)<=COUNTIF(GPS_IMPORT!$A$2:$A$10000,$B$5),INDEX(GPS_IMPORT!$2:$10000,MATCH($B$5,(GPS_IMPORT!$A$2:$A$10000),0)+ROWS($1:9)-1,COLUMN()-1),0)","v":2455642.2039999999},{"$f":"IF(ROWS(GPS_IMPORT!$1:9)<=COUNTIF(GPS_IMPORT!$A$2:$A$10000,$B$5),INDEX(GPS_IMPORT!$2:$10000,MATCH($B$5,(GPS_IMPORT!$A$2:$A$10000),0)+ROWS($1:9)-1,COLUMN()-1),0)","v":1050.171057},-5.4999999119900167E-3,-1.4833332970738411E-2,2.1886666665977828E-3,true]
[10,{"$f":"IF(ROWS(GPS_IMPORT!$1:10)<=COUNTIF(GPS_IMPORT!$A$2:$A$10000,$B$5),INDEX(GPS_IMPORT!$2:$10000,MATCH($B$5,(GPS_IMPORT!$A$2:$A$10000),0)+ROWS($1:10)-1,COLUMN()-1),0)","v":"SV4"},{"$f":"IF(ROWS(GPS_IMPORT!$1:10)<=COUNTIF(GPS_IMPORT!$A$2:$A$10000,$B$5),INDEX(GPS_IMPORT!$2:$10000,MATCH($B$5,(GPS_IMPORT!$A$2:$A$10000),0)+ROWS($1:10)-1,COLUMN()-1),0)","v":" 3.10.2019"},{"$f":"IF(ROWS(GPS_IMPORT!$1:10)<=COUNTIF(GPS_IMPORT!$A$2:$A$10000,$B$5),INDEX(GPS_IMPORT!$2:$10000,MATCH($B$5,(GPS_IMPORT!$A$2:$A$10000),0)+ROWS($1:10)-1,COLUMN()-1),0)","v":"00:48:59.800"},{"$f":"IF(ROWS(GPS_IMPORT!$1:10)<=COUNTIF(GPS_IMPORT!$A$2:$A$10000,$B$5),INDEX(GPS_IMPORT!$2:$10000,MATCH($B$5,(GPS_IMPORT!$A$2:$A$10000),0)+ROWS($1:10)-1,COLUMN()-1),0)","v":372819.69420000003},{"$f":"IF(ROWS(GPS_IMPORT!$1:10)<=COUNTIF(GPS_IMPORT!$A$2:$A$10000,$B$5),INDEX(GPS_IMPORT!$2:$10000,MATCH($B$5,(GPS_IMPORT!$A$2:$A$10000),0)+ROWS($1:10)-1,COLUMN()-1),0)","v":2455642.2009999999},{"$f":"IF(ROWS(GPS_IMPORT!$1:10)<=COUNTIF(GPS_IMPORT!$A$2:$A$10000,$B$5),INDEX(GPS_IMPORT!$2:$10000,MATCH($B$5,(GPS_IMPORT!$A$2:$A$10000),0)+ROWS($1:10)-1,COLUMN()-1),0)","v":1050.156585},-1.0199999960605055E-2,-1.1833332944661379E-2,1.6660666666666657E-2,true]
[11,{"$f":"IF(ROWS(GPS_IMPORT!$1:11)<=COUNTIF(GPS_IMPORT!$A$2:$A$10000,$B$5),INDEX(GPS_IMPORT!$2:$10000,MATCH($B$5,(GPS_IMPORT!$A$2:$A$10000),0)+ROWS($1:11)-1,COLUMN()-1),0)","v":"SV4"},{"$f":"IF(ROWS(GPS_IMPORT!$1:11)<=COUNTIF(GPS_IMPORT!$A$2:$A$10000,$B$5),INDEX(GPS_IMPORT!$2:$10000,MATCH($B$5,(GPS_IMPORT!$A$2:$A$10000),0)+ROWS($1:11)-1,COLUMN()-1),0)","v":" 3.10.2019"},{"$f":"IF(ROWS(GPS_IMPORT!$1:11)<=COUNTIF(GPS_IMPORT!$A$2:$A$10000,$B$5),INDEX(GPS_IMPORT!$2:$10000,MATCH($B$5,(GPS_IMPORT!$A$2:$A$10000),0)+ROWS($1:11)-1,COLUMN()-1),0)","v":"00:49:11"},{"$f":"IF(ROWS(GPS_IMPORT!$1:11)<=COUNTIF(GPS_IMPORT!$A$2:$A$10000,$B$5),INDEX(GPS_IMPORT!$2:$10000,MATCH($B$5,(GPS_IMPORT!$A$2:$A$10000),0)+ROWS($1:11)-1,COLUMN()-1),0)","v":372819.685},{"$f":"IF(ROWS(GPS_IMPORT!$1:11)<=COUNTIF(GPS_IMPORT!$A$2:$A$10000,$B$5),INDEX(GPS_IMPORT!$2:$10000,MATCH($B$5,(GPS_IMPORT!$A$2:$A$10000),0)+ROWS($1:11)-1,COLUMN()-1),0)","v":2455642.1940000001},{"$f":"IF(ROWS(GPS_IMPORT!$1:11)<=COUNTIF(GPS_IMPORT!$A$2:$A$10000,$B$5),INDEX(GPS_IMPORT!$2:$10000,MATCH($B$5,(GPS_IMPORT!$A$2:$A$10000),0)+ROWS($1:11)-1,COLUMN()-1),0)","v":1050.1323440000001},-9.9999993108212948E-4,-4.8333331942558289E-3,4.0901666666513847E-2,true]
[12,{"$f":"IF(ROWS(GPS_IMPORT!$1:12)<=COUNTIF(GPS_IMPORT!$A$2:$A$10000,$B$5),INDEX(GPS_IMPORT!$2:$10000,MATCH($B$5,(GPS_IMPORT!$A$2:$A$10000),0)+ROWS($1:12)-1,COLUMN()-1),0)","v":"SV4"},{"$f":"IF(ROWS(GPS_IMPORT!$1:12)<=COUNTIF(GPS_IMPORT!$A$2:$A$10000,$B$5),INDEX(GPS_IMPORT!$2:$10000,MATCH($B$5,(GPS_IMPORT!$A$2:$A$10000),0)+ROWS($1:12)-1,COLUMN()-1),0)","v":" 3.10.2019"},{"$f":"IF(ROWS(GPS_IMPORT!$1:12)<=COUNTIF(GPS_IMPORT!$A$2:$A$10000,$B$5),INDEX(GPS_IMPORT!$2:$10000,MATCH($B$5,(GPS_IMPORT!$A$2:$A$10000),0)+ROWS($1:12)-1,COLUMN()-1),0)","v":"00:49:22.700"},{"$f":"IF(ROWS(GPS_IMPORT!$1:12)<=COUNTIF(GPS_IMPORT!$A$2:$A$10000,$B$5),INDEX(GPS_IMPORT!$2:$10000,MATCH($B$5,(GPS_IMPORT!$A$2:$A$10000),0)+ROWS($1:12)-1,COLUMN()-1),0)","v":372819.68310000002},{"$f":"IF(ROWS(GPS_IMPORT!$1:12)<=COUNTIF(GPS_IMPORT!$A$2:$A$10000,$B$5),INDEX(GPS_IMPORT!$2:$10000,MATCH($B$5,(GPS_IMPORT!$A$2:$A$10000),0)+ROWS($1:12)-1,COLUMN()-1),0)","v":2455642.199},{"$f":"IF(ROWS(GPS_IMPORT!$1:12)<=COUNTIF(GPS_IMPORT!$A$2:$A$10000,$B$5),INDEX(GPS_IMPORT!$2:$10000,MATCH($B$5,(GPS_IMPORT!$A$2:$A$10000),0)+ROWS($1:12)-1,COLUMN()-1),0)","v":1050.131785},9.0000004274770617E-4,-9.8333330824971199E-3,4.1460666666580437E-2,true]
[13,{"$f":"IF(ROWS(GPS_IMPORT!$1:13)<=COUNTIF(GPS_IMPORT!$A$2:$A$10000,$B$5),INDEX(GPS_IMPORT!$2:$10000,MATCH($B$5,(GPS_IMPORT!$A$2:$A$10000),0)+ROWS($1:13)-1,COLUMN()-1),0)","v":0},{"$f":"IF(ROWS(GPS_IMPORT!$1:13)<=COUNTIF(GPS_IMPORT!$A$2:$A$10000,$B$5),INDEX(GPS_IMPORT!$2:$10000,MATCH($B$5,(GPS_IMPORT!$A$2:$A$10000),0)+ROWS($1:13)-1,COLUMN()-1),0)","v":"00:00:00"},{"$f":"IF(ROWS(GPS_IMPORT!$1:13)<=COUNTIF(GPS_IMPORT!$A$2:$A$10000,$B$5),INDEX(GPS_IMPORT!$2:$10000,MATCH($B$5,(GPS_IMPORT!$A$2:$A$10000),0)+ROWS($1:13)-1,COLUMN()-1),0)","v":"00:00:00"},{"$f":"IF(ROWS(GPS_IMPORT!$1:13)<=COUNTIF(GPS_IMPORT!$A$2:$A$10000,$B$5),INDEX(GPS_IMPORT!$2:$10000,MATCH($B$5,(GPS_IMPORT!$A$2:$A$10000),0)+ROWS($1:13)-1,COLUMN()-1),0)","v":0},{"$f":"IF(ROWS(GPS_IMPORT!$1:13)<=COUNTIF(GPS_IMPORT!$A$2:$A$10000,$B$5),INDEX(GPS_IMPORT!$2:$10000,MATCH($B$5,(GPS_IMPORT!$A$2:$A$10000),0)+ROWS($1:13)-1,COLUMN()-1),0)","v":0},{"$f":"IF(ROWS(GPS_IMPORT!$1:13)<=COUNTIF(GPS_IMPORT!$A$2:$A$10000,$B$5),INDEX(GPS_IMPORT!$2:$10000,MATCH($B$5,(GPS_IMPORT!$A$2:$A$10000),0)+ROWS($1:13)-1,COLUMN()-1),0)","v":0},{"$f":"IF(E19>0,E$22-E19,0)","v":0},0,0,false]
[14,{"$f":"IF(ROWS(GPS_IMPORT!$1:14)<=COUNTIF(GPS_IMPORT!$A$2:$A$10000,$B$5),INDEX(GPS_IMPORT!$2:$10000,MATCH($B$5,(GPS_IMPORT!$A$2:$A$10000),0)+ROWS($1:14)-1,COLUMN()-1),0)","v":0},{"$f":"IF(ROWS(GPS_IMPORT!$1:14)<=COUNTIF(GPS_IMPORT!$A$2:$A$10000,$B$5),INDEX(GPS_IMPORT!$2:$10000,MATCH($B$5,(GPS_IMPORT!$A$2:$A$10000),0)+ROWS($1:14)-1,COLUMN()-1),0)","v":"00:00:00"},{"$f":"IF(ROWS(GPS_IMPORT!$1:14)<=COUNTIF(GPS_IMPORT!$A$2:$A$10000,$B$5),INDEX(GPS_IMPORT!$2:$10000,MATCH($B$5,(GPS_IMPORT!$A$2:$A$10000),0)+ROWS($1:14)-1,COLUMN()-1),0)","v":"00:00:00"},{"$f":"IF(ROWS(GPS_IMPORT!$1:14)<=COUNTIF(GPS_IMPORT!$A$2:$A$10000,$B$5),INDEX(GPS_IMPORT!$2:$10000,MATCH($B$5,(GPS_IMPORT!$A$2:$A$10000),0)+ROWS($1:14)-1,COLUMN()-1),0)","v":0},{"$f":"IF(ROWS(GPS_IMPORT!$1:14)<=COUNTIF(GPS_IMPORT!$A$2:$A$10000,$B$5),INDEX(GPS_IMPORT!$2:$10000,MATCH($B$5,(GPS_IMPORT!$A$2:$A$10000),0)+ROWS($1:14)-1,COLUMN()-1),0)","v":0},{"$f":"IF(ROWS(GPS_IMPORT!$1:14)<=COUNTIF(GPS_IMPORT!$A$2:$A$10000,$B$5),INDEX(GPS_IMPORT!$2:$10000,MATCH($B$5,(GPS_IMPORT!$A$2:$A$10000),0)+ROWS($1:14)-1,COLUMN()-1),0)","v":0},0,0,0,false]
[15,{"$f":"IF(ROWS(GPS_IMPORT!$1:15)<=COUNTIF(GPS_IMPORT!$A$2:$A$10000,$B$5),INDEX(GPS_IMPORT!$2:$10000,MATCH($B$5,(GPS_IMPORT!$A$2:$A$10000),0)+ROWS($1:15)-1,COLUMN()-1),0)","v":0},{"$f":"IF(ROWS(GPS_IMPORT!$1:15)<=COUNTIF(GPS_IMPORT!$A$2:$A$10000,$B$5),INDEX(GPS_IMPORT!$2:$10000,MATCH($B$5,(GPS_IMPORT!$A$2:$A$10000),0)+ROWS($1:15)-1,COLUMN()-1),0)","v":"00:00:00"},{"$f":"IF(ROWS(GPS_IMPORT!$1:15)<=COUNTIF(GPS_IMPORT!$A$2:$A$10000,$B$5),INDEX(GPS_IMPORT!$2:$10000,MATCH($B$5,(GPS_IMPORT!$A$2:$A$10000),0)+ROWS($1:15)-1,COLUMN()-1),0)","v":"00:00:00"},{"$f":"IF(ROWS(GPS_IMPORT!$1:15)<=COUNTIF(GPS_IMPORT!$A$2:$A$10000,$B$5),INDEX(GPS_IMPORT!$2:$10000,MATCH($B$5,(GPS_IMPORT!$A$2:$A$10000),0)+ROWS($1:15)-1,COLUMN()-1),0)","v":0},{"$f":"IF(ROWS(GPS_IMPORT!$1:15)<=COUNTIF(GPS_IMPORT!$A$2:$A$10000,$B$5),INDEX(GPS_IMPORT!$2:$10000,MATCH($B$5,(GPS_IMPORT!$A$2:$A$10000),0)+ROWS($1:15)-1,COLUMN()-1),0)","v":0},{"$f":"IF(ROWS(GPS_IMPORT!$1:15)<=COUNTIF(GPS_IMPORT!$A$2:$A$10000,$B$5),INDEX(GPS_IMPORT!$2:$10000,MATCH($B$5,(GPS_IMPORT!$A$2:$A$10000),0)+ROWS($1:15)-1,COLUMN()-1),0)","v":0},0,0,0,false]
[null,null,null,"AVERAGE",{"$f":"(IF($K$7=TRUE,E7,0)+IF($K$8=TRUE,E8,0)+IF($K$9=TRUE,E9,0)+IF($K$10=TRUE,E10,0)+IF($K$11=TRUE,E11,0)+IF($K$12=TRUE,E12,0)+IF($K$13=TRUE,E13,0)+IF($K$14=TRUE,E14,0)+IF($K$15=TRUE,E15,0)+IF($K$16=TRUE,E16,0)+IF($K$17=TRUE,E17,0)+IF($K$18=TRUE,E18,0)+IF($K$19=TRUE,E19,0)+IF($K$20=TRUE,E20,0)+IF($K$21=TRUE,E21,0))/(IF($K$7=TRUE,1,0)+IF($K$8=TRUE,1,0)+IF($K$9=TRUE,1,0)+IF($K$10=TRUE,1,0)+IF($K$11=TRUE,1,0)+IF($K$12=TRUE,1,0)+IF($K$13=TRUE,1,0)+IF($K$14=TRUE,1,0)+IF($K$15=TRUE,1,0)+IF($K$16=TRUE,1,0)+IF($K$17=TRUE,1,0)+IF($K$18=TRUE,1,0)+IF($K$19=TRUE,1,0)+IF($K$20=TRUE,1,0)+IF($K$21=TRUE,1,0))","v":372819.68400000007},{"$f":"(IF($K$7=TRUE,F7,0)+IF($K$8=TRUE,F8,0)+IF($K$9=TRUE,F9,0)+IF($K$10=TRUE,F10,0)+IF($K$11=TRUE,F11,0)+IF($K$12=TRUE,F12,0)+IF($K$13=TRUE,F13,0)+IF($K$14=TRUE,F14,0)+IF($K$15=TRUE,F15,0)+IF($K$16=TRUE,F16,0)+IF($K$17=TRUE,F17,0)+IF($K$18=TRUE,F18,0)+IF($K$19=TRUE,F19,0)+IF($K$20=TRUE,F20,0)+IF($K$21=TRUE,F21,0))/(IF($K$7=TRUE,1,0)+IF($K$8=TRUE,1,0)+IF($K$9=TRUE,1,0)+IF($K$10=TRUE,1,0)+IF($K$11=TRUE,1,0)+IF($K$12=TRUE,1,0)+IF($K$13=TRUE,1,0)+IF($K$14=TRUE,1,0)+IF($K$15=TRUE,1,0)+IF($K$16=TRUE,1,0)+IF($K$17=TRUE,1,0)+IF($K$18=TRUE,1,0)+IF($K$19=TRUE,1,0)+IF($K$20=TRUE,1,0)+IF($K$21=TRUE,1,0))","v":2455642.1891666669},{"$f":"(IF($K$7=TRUE,G7,0)+IF($K$8=TRUE,G8,0)+IF($K$9=TRUE,G9,0)+IF($K$10=TRUE,G10,0)+IF($K$11=TRUE,G11,0)+IF($K$12=TRUE,G12,0)+IF($K$13=TRUE,G13,0)+IF($K$14=TRUE,G14,0)+IF($K$15=TRUE,G15,0)+IF($K$16=TRUE,G16,0)+IF($K$17=TRUE,G17,0)+IF($K$18=TRUE,G18,0)+IF($K$19=TRUE,G19,0)+IF($K$20=TRUE,G20,0)+IF($K$21=TRUE,G21,0))/\n(IF($K$7=TRUE,1,0)+IF($K$8=TRUE,1,0)+IF($K$9=TRUE,1,0)+IF($K$10=TRUE,1,0)+IF($K$11=TRUE,1,0)+IF($K$12=TRUE,1,0)+IF($K$13=TRUE,1,0)+IF($K$14=TRUE,1,0)+IF($K$15=TRUE,1,0)+IF($K$16=TRUE,1,0)+IF($K$17=TRUE,1,0)+IF($K$18=TRUE,1,0)+IF($K$19=TRUE,1,0)+IF($K$20=TRUE,1,0)+IF($K$21=TRUE,1,0))","v":1050.1732456666666},"RMSE:","RMSE:","RMSE:"]
[null,null,null,null,null,null,"RMSE IN US SURVEY FEET:",{"$f":"SQRT((\n(IF($K$7=TRUE,H7^2,0))+(IF($K$8=TRUE,H8^2,0))+(IF($K$9=TRUE,H9^2,0))+(IF($K$10=TRUE,H10^2,0))+(IF($K$11=TRUE,H11^2,0))+(IF($K$12=TRUE,H12^2,0))+(IF($K$13=TRUE,H13^2,0))+(IF($K$14=TRUE,H14^2,0))+(IF($K$15=TRUE,H15^2,0))+(IF($K$16=TRUE,H16^2,0))+(IF($K$17=TRUE,H17^2,0))+(IF($K$18=TRUE,H18^2,0))+(IF($K$19=TRUE,H19^2,0))+(IF($K$20=TRUE,H20^2,0))+(IF($K$21=TRUE,H21^2,0)))/\n(IF($K$7=TRUE,1,0)+IF($K$8=TRUE,1,0)+IF($K$9=TRUE,1,0)+IF($K$10=TRUE,1,0)+IF($K$11=TRUE,1,0)+IF($K$12=TRUE,1,0)+IF($K$13=TRUE,1,0)+IF($K$14=TRUE,1,0)+IF($K$15=TRUE,1,0)+IF($K$16=TRUE,1,0)+IF($K$17=TRUE,1,0)+IF($K$18=TRUE,1,0)+IF($K$19=TRUE,1,0)+IF($K$20=TRUE,1,0)+IF($K$21=TRUE,1,0)))","v":8.6718894605397889E-3},{"$f":"SQRT((\n(IF($K$7=TRUE,I7^2,0))+(IF($K$8=TRUE,I8^2,0))+(IF($K$9=TRUE,I9^2,0))+(IF($K$10=TRUE,I10^2,0))+(IF($K$11=TRUE,I11^2,0))+(IF($K$12=TRUE,I12^2,0))+(IF($K$13=TRUE,I13^2,0))+(IF($K$14=TRUE,I14^2,0))+(IF($K$15=TRUE,I15^2,0))+(IF($K$16=TRUE,I16^2,0))+(IF($K$17=TRUE,I17^2,0))+(IF($K$18=TRUE,I18^2,0))+(IF($K$19=TRUE,I19^2,0))+(IF($K$20=TRUE,I20^2,0))+(IF($K$21=TRUE,I21^2,0)))/\n(IF($K$7=TRUE,1,0)+IF($K$8=TRUE,1,0)+IF($K$9=TRUE,1,0)+IF($K$10=TRUE,1,0)+IF($K$11=TRUE,1,0)+IF($K$12=TRUE,1,0)+IF($K$13=TRUE,1,0)+IF($K$14=TRUE,1,0)+IF($K$15=TRUE,1,0)+IF($K$16=TRUE,1,0)+IF($K$17=TRUE,1,0)+IF($K$18=TRUE,1,0)+IF($K$19=TRUE,1,0)+IF($K$20=TRUE,1,0)+IF($K$21=TRUE,1,0)))","v":1.1104303466614635E-2},{"$f":"SQRT((\n(IF($K$7=TRUE,J7^2,0))+(IF($K$8=TRUE,J8^2,0))+(IF($K$9=TRUE,J9^2,0))+(IF($K$10=TRUE,J10^2,0))+(IF($K$11=TRUE,J11^2,0))+(IF($K$12=TRUE,J12^2,0))+(IF($K$13=TRUE,J13^2,0))+(IF($K$14=TRUE,J14^2,0))+(IF($K$15=TRUE,J15^2,0))+(IF($K$16=TRUE,J16^2,0))+(IF($K$17=TRUE,J17^2,0))+(IF($K$18=TRUE,J18^2,0))+(IF($K$19=TRUE,J19^2,0))+(IF($K$20=TRUE,J20^2,0))+(IF($K$21=TRUE,J21^2,0)))/\n(IF($K$7=TRUE,1,0)+IF($K$8=TRUE,1,0)+IF($K$9=TRUE,1,0)+IF($K$10=TRUE,1,0)+IF($K$11=TRUE,1,0)+IF($K$12=TRUE,1,0)+IF($K$13=TRUE,1,0)+IF($K$14=TRUE,1,0)+IF($K$15=TRUE,1,0)+IF($K$16=TRUE,1,0)+IF($K$17=TRUE,1,0)+IF($K$18=TRUE,1,0)+IF($K$19=TRUE,1,0)+IF($K$20=TRUE,1,0)+IF($K$21=TRUE,1,0)))","v":2.2735417880936856E-2}]
[null,null,null,1]
[null,null,"UNITLESS GRID TO GROUND MULTIPLIER",{"$f":"IF(REPORT!C13=\"n/a\",\"0.00000000\",REPORT!C13)","v":1.0000901799999999},null,null,null,{"$f":"IF(H23<=0.029,\"PASS\",\"FAIL\")","v":"PASS"},{"$f":"IF(I23<=0.029,\"PASS\",\"FAIL\")","v":"PASS"},{"$f":"IF(J23<=0.039,\"PASS\",\"FAIL\")","v":"PASS"}]
[]
["AVERAGED GPS-DERIVED POSITION",null,null,null,null,null,null,null,"Notes:"]
[null,"MONUMENT COORDINATES",null,"NORTHING","EASTING","ORTHO HEIGHT"]
[null,"US Survey Feet (GRID)",null,{"$f":"$E$22","v":372819.68400000007},{"$f":"$F$22","v":2455642.1891666669},{"$f":"$G$22","v":1050.1732456666666}]
[]
["LEVELED ELEVATION"]
["US SURVEY FEET",null,{"$f":"IFERROR(VLOOKUP(B5,'LEVEL RUN'!A8:I59,9,FALSE),\"N/A\")","v":"N/A"},"(Type the leveled elevation or N/A if no leveled elevation is available)"]
["MONUMENT HELD",null,null,"(Type the monument name from which leveling originated)"]
["LEVELED ELEVATION - GPS DERIVED ELEVATION   = ",null,null,null,{"$f":"IF(C32=\"N/A\",\"N/A\",C32-(F29*D24))","v":"N/A"}]
[]
["FINAL MONUMENT COORDINATES"]
[null,"MONUMENT COORDINATES",null,"NORTHING","EASTING","ELEVATION","FEATURE CODE"]
[null,"US SURVEY FEET (GRID)",null,{"$f":"$E$22*$D$24","v":372819.68400000007},{"$f":"$F$22*$D$24","v":2455642.1891666669},{"$f":"IF($C$32=\"N/A\",($G$22*$D$24),$C$32)","v":1050.1732456666666},{"$f":"VLOOKUP($B$5,GPS_IMPORT!$A$2:$G$2000,7,FALSE)","v":"AERTAR"}]
[null,"US SURVEY FEET (GROUND)",null,{"$f":"$D$38*$D$25","v":372853.30487910315},{"$f":"$E$38*$D$25","v":2455863.638979286},{"$f":"IF($C$32=\"N/A\",($G$22*$D$24),$C$32)","v":1050.1732456666666},{"$f":"G38","v":"AERTAR"}]
[]
["∆ North,  ∆ East, and ∆ Ht. are the difference between the average northing, easting, and height for each observation.",null,null,null,null,null,null,null,"Mask Angle:","10°"]

{"sheet":"SV5","index":11,"n_rows":41,"n_cols":11,"rows_kept":41,"cut":false,"hidden":false,"merged":[[37,1,37,2],[38,1,38,2],[27,1,27,2],[0,0,0,10],[36,1,36,2],[30,0,30,6],[26,0,26,6],[35,0,35,6],[28,1,28,2],[27,8,38,10]]}
["VRS GNSS Project Control Monument Coordinate Analysis"]
[]
["Project:",{"$f":"REPORT!B2","v":"FRA-71-29.4"},"GPS Antenna:","LEICA GS14",null,null,null,null,null,"Report Date:",{"$f":"REPORT!C49","v":"2019-04-25"}]
["PID:",{"$f":"REPORT!E2","v":106471},"VRS Network:","ODOT VRS",null,null,null,null,null,"Prepared By:",{"$f":"REPORT!C48","v":"Kolton Wilson"}]
["Point ID:","SV5","No. of Sessions:",{"$f":"COUNTIF(GPS_IMPORT!A2:A1000,$B$5)","v":12},null,null,null,null,null,"Checked By:",{"$f":"REPORT!C52","v":"David Ogden"}]
["SESSION #","Point","Observation Date","Start Time","Northing(sft)","Easting(sft)","Height(sft)","∆ Northing(sft)","∆ Easting(sft)","∆ Height(sft)","Include in Solution?"]
[1,{"$f":"IF(ROWS(GPS_IMPORT!$1:1)<=COUNTIF(GPS_IMPORT!$A$2:$A$10000,$B$5),INDEX(GPS_IMPORT!$2:$10000,MATCH($B$5,(GPS_IMPORT!$A$2:$A$10000),0)+ROWS($1:1)-1,COLUMN()-1),0)","v":"SV5"},{"$f":"IF(ROWS(GPS_IMPORT!$1:1)<=COUNTIF(GPS_IMPORT!$A$2:$A$10000,$B$5),INDEX(GPS_IMPORT!$2:$10000,MATCH($B$5,(GPS_IMPORT!$A$2:$A$10000),0)+ROWS($1:1)-1,COLUMN()-1),0)","v":" 3.10.2019"},{"$f":"IF(ROWS(GPS_IMPORT!$1:1)<=COUNTIF(GPS_IMPORT!$A$2:$A$10000,$B$5),INDEX(GPS_IMPORT!$2:$10000,MATCH($B$5,(GPS_IMPORT!$A$2:$A$10000),0)+ROWS($1:1)-1,COLUMN()-1),0)","v":"00:55:16"},{"$f":"IF(ROWS(GPS_IMPORT!$1:1)<=COUNTIF(GPS_IMPORT!$A$2:$A$10000,$B$5),INDEX(GPS_IMPORT!$2:$10000,MATCH($B$5,(GPS_IMPORT!$A$2:$A$10000),0)+ROWS($1:1)-1,COLUMN()-1),0)","v":372152.45750000002},{"$f":"IF(ROWS(GPS_IMPORT!$1:1)<=COUNTIF(GPS_IMPORT!$A$2:$A$10000,$B$5),INDEX(GPS_IMPORT!$2:$10000,MATCH($B$5,(GPS_IMPORT!$A$2:$A$10000),0)+ROWS($1:1)-1,COLUMN()-1),0)","v":2457046.1910000001},{"$f":"IF(ROWS(GPS_IMPORT!$1:1)<=COUNTIF(GPS_IMPORT!$A$2:$A$10000,$B$5),INDEX(GPS_IMPORT!$2:$10000,MATCH($B$5,(GPS_IMPORT!$A$2:$A$10000),0)+ROWS($1:1)-1,COLUMN()-1),0)","v":1086.083648},{"$f":"IF(E7>0,E$22-E7,0)","v":-8.3000000449828804E-3},-4.4999998062849045E-3,2.9579083333146627E-2,true]
[2,{"$f":"IF(ROWS(GPS_IMPORT!$1:2)<=COUNTIF(GPS_IMPORT!$A$2:$A$10000,$B$5),INDEX(GPS_IMPORT!$2:$10000,MATCH($B$5,(GPS_IMPORT!$A$2:$A$10000),0)+ROWS($1:2)-1,COLUMN()-1),0)","v":"SV5"},{"$f":"IF(ROWS(GPS_IMPORT!$1:2)<=COUNTIF(GPS_IMPORT!$A$2:$A$10000,$B$5),INDEX(GPS_IMPORT!$2:$10000,MATCH($B$5,(GPS_IMPORT!$A$2:$A$10000),0)+ROWS($1:2)-1,COLUMN()-1),0)","v":" 3.10.2019"},{"$f":"IF(ROWS(GPS_IMPORT!$1:2)<=COUNTIF(GPS_IMPORT!$A$2:$A$10000,$B$5),INDEX(GPS_IMPORT!$2:$10000,MATCH($B$5,(GPS_IMPORT!$A$2:$A$10000),0)+ROWS($1:2)-1,COLUMN()-1),0)","v":"00:55:26"},{"$f":"IF(ROWS(GPS_IMPORT!$1:2)<=COUNTIF(GPS_IMPORT!$A$2:$A$10000,$B$5),INDEX(GPS_IMPORT!$2:$10000,MATCH($B$5,(GPS_IMPORT!$A$2:$A$10000),0)+ROWS($1:2)-1,COLUMN()-1),0)","v":372152.45569999999},{"$f":"IF(ROWS(GPS_IMPORT!$1:2)<=COUNTIF(GPS_IMPORT!$A$2:$A$10000,$B$5),INDEX(GPS_IMPORT!$2:$10000,MATCH($B$5,(GPS_IMPORT!$A$2:$A$10000),0)+ROWS($1:2)-1,COLUMN()-1),0)","v":2457046.1910000001},{"$f":"IF(ROWS(GPS_IMPORT!$1:2)<=COUNTIF(GPS_IMPORT!$A$2:$A$10000,$B$5),INDEX(GPS_IMPORT!$2:$10000,MATCH($B$5,(GPS_IMPORT!$A$2:$A$10000),0)+ROWS($1:2)-1,COLUMN()-1),0)","v":1086.079234},-6.5000000176951289E-3,-4.4999998062849045E-3,3.3993083333143659E-2,true]
[3,{"$f":"IF(ROWS(GPS_IMPORT!$1:3)<=COUNTIF(GPS_IMPORT!$A$2:$A$10000,$B$5),INDEX(GPS_IMPORT!$2:$10000,MATCH($B$5,(GPS_IMPORT!$A$2:$A$10000),0)+ROWS($1:3)-1,COLUMN()-1),0)","v":"SV5"},{"$f":"IF(ROWS(GPS_IMPORT!$1:3)<=COUNTIF(GPS_IMPORT!$A$2:$A$10000,$B$5),INDEX(GPS_IMPORT!$2:$10000,MATCH($B$5,(GPS_IMPORT!$A$2:$A$10000),0)+ROWS($1:3)-1,COLUMN()-1),0)","v":" 3.10.2019"},{"$f":"IF(ROWS(GPS_IMPORT!$1:3)<=COUNTIF(GPS_IMPORT!$A$2:$A$10000,$B$5),INDEX(GPS_IMPORT!$2:$10000,MATCH($B$5,(GPS_IMPORT!$A$2:$A$10000),0)+ROWS($1:3)-1,COLUMN()-1),0)","v":"00:55:36"},{"$f":"IF(ROWS(GPS_IMPORT!$1:3)<=COUNTIF(GPS_IMPORT!$A$2:$A$10000,$B$5),INDEX(GPS_IMPORT!$2:$10000,MATCH($B$5,(GPS_IMPORT!$A$2:$A$10000),0)+ROWS($1:3)-1,COLUMN()-1),0)","v":372152.45240000001},{"$f":"IF(ROWS(GPS_IMPORT!$1:3)<=COUNTIF(GPS_IMPORT!$A$2:$A$10000,$B$5),INDEX(GPS_IMPORT!$2:$10000,MATCH($B$5,(GPS_IMPORT!$A$2:$A$10000),0)+ROWS($1:3)-1,COLUMN()-1),0)","v":2457046.19},{"$f":"IF(ROWS(GPS_IMPORT!$1:3)<=COUNTIF(GPS_IMPORT!$A$2:$A$10000,$B$5),INDEX(GPS_IMPORT!$2:$10000,MATCH($B$5,(GPS_IMPORT!$A$2:$A$10000),0)+ROWS($1:3)-1,COLUMN()-1),0)","v":1086.0676619999999},-3.2000000355765224E-3,-3.4999996423721313E-3,4.5565083333258372E-2,true]
[4,{"$f":"IF(ROWS(GPS_IMPORT!$1:4)<=COUNTIF(GPS_IMPORT!$A$2:$A$10000,$B$5),INDEX(GPS_IMPORT!$2:$10000,MATCH($B$5,(GPS_IMPORT!$A$2:$A$10000),0)+ROWS($1:4)-1,COLUMN()-1),0)","v":"SV5"},{"$f":"IF(ROWS(GPS_IMPORT!$1:4)<=COUNTIF(GPS_IMPORT!$A$2:$A$10000,$B$5),INDEX(GPS_IMPORT!$2:$10000,MATCH($B$5,(GPS_IMPORT!$A$2:$A$10000),0)+ROWS($1:4)-1,COLUMN()-1),0)","v":" 3.10.2019"},{"$f":"IF(ROWS(GPS_IMPORT!$1:4)<=COUNTIF(GPS_IMPORT!$A$2:$A$10000,$B$5),INDEX(GPS_IMPORT!$2:$10000,MATCH($B$5,(GPS_IMPORT!$A$2:$A$10000),0)+ROWS($1:4)-1,COLUMN()-1),0)","v":"00:55:46"},{"$f":"IF(ROWS(GPS_IMPORT!$1:4)<=COUNTIF(GPS_IMPORT!$A$2:$A$10000,$B$5),INDEX(GPS_IMPORT!$2:$10000,MATCH($B$5,(GPS_IMPORT!$A$2:$A$10000),0)+ROWS($1:4)-1,COLUMN()-1),0)","v":372152.4411},{"$f":"IF(ROWS(GPS_IMPORT!$1:4)<=COUNTIF(GPS_IMPORT!$A$2:$A$10000,$B$5),INDEX(GPS_IMPORT!$2:$10000,MATCH($B$5,(GPS_IMPORT!$A$2:$A$10000),0)+ROWS($1:4)-1,COLUMN()-1),0)","v":2457046.1830000002},{"$f":"IF(ROWS(GPS_IMPORT!$1:4)<=COUNTIF(GPS_IMPORT!$A$2:$A$10000,$B$5),INDEX(GPS_IMPORT!$2:$10000,MATCH($B$5,(GPS_IMPORT!$A$2:$A$10000),0)+ROWS($1:4)-1,COLUMN()-1),0)","v":1086.0814580000001},8.0999999772757292E-3,3.5000001080334187E-3,3.1769083333074377E-2,true]
[5,{"$f":"IF(ROWS(GPS_IMPORT!$1:5)<=COUNTIF(GPS_IMPORT!$A$2:$A$10000,$B$5),INDEX(GPS_IMPORT!$2:$10000,MATCH($B$5,(GPS_IMPORT!$A$2:$A$10000),0)+ROWS($1:5)-1,COLUMN()-1),0)","v":"SV5"},{"$f":"IF(ROWS(GPS_IMPORT!$1:5)<=COUNTIF(GPS_IMPORT!$A$2:$A$10000,$B$5),INDEX(GPS_IMPORT!$2:$10000,MATCH($B$5,(GPS_IMPORT!$A$2:$A$10000),0)+ROWS($1:5)-1,COLUMN()-1),0)","v":" 3.10.2019"},{"$f":"IF(ROWS(GPS_IMPORT!$1:5)<=COUNTIF(GPS_IMPORT!$A$2:$A$10000,$B$5),INDEX(GPS_IMPORT!$2:$10000,MATCH($B$5,(GPS_IMPORT!$A$2:$A$10000),0)+ROWS($1:5)-1,COLUMN()-1),0)","v":"00:56:01.100"},{"$f":"IF(ROWS(GPS_IMPORT!$1:5)<=COUNTIF(GPS_IMPORT!$A$2:$A$10000,$B$5),INDEX(GPS_IMPORT!$2:$10000,MATCH($B$5,(GPS_IMPORT!$A$2:$A$10000),0)+ROWS($1:5)-1,COLUMN()-1),0)","v":372152.44179999997},{"$f":"IF(ROWS(GPS_IMPORT!$1:5)<=COUNTIF(GPS_IMPORT!$A$2:$A$10000,$B$5),INDEX(GPS_IMPORT!$2:$10000,MATCH($B$5,(GPS_IMPORT!$A$2:$A$10000),0)+ROWS($1:5)-1,COLUMN()-1),0)","v":2457046.1809999999},{"$f":"IF(ROWS(GPS_IMPORT!$1:5)<=COUNTIF(GPS_IMPORT!$A$2:$A$10000,$B$5),INDEX(GPS_IMPORT!$2:$10000,MATCH($B$5,(GPS_IMPORT!$A$2:$A$10000),0)+ROWS($1:5)-1,COLUMN()-1),0)","v":1086.0915110000001},7.4000000022351742E-3,5.5000004358589649E-3,2.1716083333103597E-2,true]
[6,{"$f":"IF(ROWS(GPS_IMPORT!$1:6)<=COUNTIF(GPS_IMPORT!$A$2:$A$10000,$B$5),INDEX(GPS_IMPORT!$2:$10000,MATCH($B$5,(GPS_IMPORT!$A$2:$A$10000),0)+ROWS($1:6)-1,COLUMN()-1),0)","v":"SV5"},{"$f":"IF(ROWS(GPS_IMPORT!$1:6)<=COUNTIF(GPS_IMPORT!$A$2:$A$10000,$B$5),INDEX(GPS_IMPORT!$2:$10000,MATCH($B$5,(GPS_IMPORT!$A$2:$A$10000),0)+ROWS($1:6)-1,COLUMN()-1),0)","v":" 3.10.2019"},{"$f":"IF(ROWS(GPS_IMPORT!$1:6)<=COUNTIF(GPS_IMPORT!$A$2:$A$10000,$B$5),INDEX(GPS_IMPORT!$2:$10000,MATCH($B$5,(GPS_IMPORT!$A$2:$A$10000),0)+ROWS($1:6)-1,COLUMN()-1),0)","v":"00:56:11.800"},{"$f":"IF(ROWS(GPS_IMPORT!$1:6)<=COUNTIF(GPS_IMPORT!$A$2:$A$10000,$B$5),INDEX(GPS_IMPORT!$2:$10000,MATCH($B$5,(GPS_IMPORT!$A$2:$A$10000),0)+ROWS($1:6)-1,COLUMN()-1),0)","v":372152.4486},{"$f":"IF(ROWS(GPS_IMPORT!$1:6)<=COUNTIF(GPS_IMPORT!$A$2:$A$10000,$B$5),INDEX(GPS_IMPORT!$2:$10000,MATCH($B$5,(GPS_IMPORT!$A$2:$A$10000),0)+ROWS($1:6)-1,COLUMN()-1),0)","v":2457046.1770000001},{"$f":"IF(ROWS(GPS_IMPORT!$1:6)<=COUNTIF(GPS_IMPORT!$A$2:$A$10000,$B$5),INDEX(GPS_IMPORT!$2:$10000,MATCH($B$5,(GPS_IMPORT!$A$2:$A$10000),0)+ROWS($1:6)-1,COLUMN()-1),0)","v":1086.103574},5.9999997029080987E-4,9.5000001601874828E-3,9.6530833332053589E-3,true]
[7,{"$f":"IF(ROWS(GPS_IMPORT!$1:7)<=COUNTIF(GPS_IMPORT!$A$2:$A$10000,$B$5),INDEX(GPS_IMPORT!$2:$10000,MATCH($B$5,(GPS_IMPORT!$A$2:$A$10000),0)+ROWS($1:7)-1,COLUMN()-1),0)","v":"SV5"},{"$f":"IF(ROWS(GPS_IMPORT!$1:7)<=COUNTIF(GPS_IMPORT!$A$2:$A$10000,$B$5),INDEX(GPS_IMPORT!$2:$10000,MATCH($B$5,(GPS_IMPORT!$A$2:$A$10000),0)+ROWS($1:7)-1,COLUMN()-1),0)","v":" 3.10.2019"},{"$f":"IF(ROWS(GPS_IMPORT!$1:7)<=COUNTIF(GPS_IMPORT!$A$2:$A$10000,$B$5),INDEX(GPS_IMPORT!$2:$10000,MATCH($B$5,(GPS_IMPORT!$A$2:$A$10000),0)+ROWS($1:7)-1,COLUMN()-1),0)","v":"00:56:22.700"},{"$f":"IF(ROWS(GPS_IMPORT!$1:7)<=COUNTIF(GPS_IMPORT!$A$2:$A$10000,$B$5),INDEX(GPS_IMPORT!$2:$10000,MATCH($B$5,(GPS_IMPORT!$A$2:$A$10000),0)+ROWS($1:7)-1,COLUMN()-1),0)","v":372152.43540000002},{"$f":"IF(ROWS(GPS_IMPORT!$1:7)<=COUNTIF(GPS_IMPORT!$A$2:$A$10000,$B$5),INDEX(GPS_IMPORT!$2:$10000,MATCH($B$5,(GPS_IMPORT!$A$2:$A$10000),0)+ROWS($1:7)-1,COLUMN()-1),0)","v":2457046.1770000001},{"$f":"IF(ROWS(GPS_IMPORT!$1:7)<=COUNTIF(GPS_IMPORT!$A$2:$A$10000,$B$5),INDEX(GPS_IMPORT!$2:$10000,MATCH($B$5,(GPS_IMPORT!$A$2:$A$10000),0)+ROWS($1:7)-1,COLUMN()-1),0)","v":1086.1342380000001},1.3799999956972897E-2,9.5000001601874828E-3,-2.1010916666909907E-2,true]
[8,{"$f":"IF(ROWS(GPS_IMPORT!$1:8)<=COUNTIF(GPS_IMPORT!$A$2:$A$10000,$B$5),INDEX(GPS_IMPORT!$2:$10000,MATCH($B$5,(GPS_IMPORT!$A$2:$A$10000),0)+ROWS($1:8)-1,COLUMN()-1),0)","v":"SV5"},{"$f":"IF(ROWS(GPS_IMPORT!$1:8)<=COUNTIF(GPS_IMPORT!$A$2:$A$10000,$B$5),INDEX(GPS_IMPORT!$2:$10000,MATCH($B$5,(GPS_IMPORT!$A$2:$A$10000),0)+ROWS($1:8)-1,COLUMN()-1),0)","v":" 3.10.2019"},{"$f":"IF(ROWS(GPS_IMPORT!$1:8)<=COUNTIF(GPS_IMPORT!$A$2:$A$10000,$B$5),INDEX(GPS_IMPORT!$2:$10000,MATCH($B$5,(GPS_IMPORT!$A$2:$A$10000),0)+ROWS($1:8)-1,COLUMN()-1),0)","v":"00:56:34.800"},{"$f":"IF(ROWS(GPS_IMPORT!$1:8)<=COUNTIF(GPS_IMPORT!$A$2:$A$10000,$B$5),INDEX(GPS_IMPORT!$2:$10000,MATCH($B$5,(GPS_IMPORT!$A$2:$A$10000),0)+ROWS($1:8)-1,COLUMN()-1),0)","v":372152.45309999998},{"$f":"IF(ROWS(GPS_IMPORT!$1:8)<=COUNTIF(GPS_IMPORT!$A$2:$A$10000,$B$5),INDEX(GPS_IMPORT!$2:$10000,MATCH($B$5,(GPS_IMPORT!$A$2:$A$10000),0)+ROWS($1:8)-1,COLUMN()-1),0)","v":2457046.1889999998},{"$f":"IF(ROWS(GPS_IMPORT!$1:8)<=COUNTIF(GPS_IMPORT!$A$2:$A$10000,$B$5),INDEX(GPS_IMPORT!$2:$10000,MATCH($B$5,(GPS_IMPORT!$A$2:$A$10000),0)+ROWS($1:8)-1,COLUMN()-1),0)","v":1086.122991},-3.9000000106170774E-3,-2.4999994784593582E-3,-9.7639166667704558E-3,true]
[9,{"$f":"IF(ROWS(GPS_IMPORT!$1:9)<=COUNTIF(GPS_IMPORT!$A$2:$A$10000,$B$5),INDEX(GPS_IMPORT!$2:$10000,MATCH($B$5,(GPS_IMPORT!$A$2:$A$10000),0)+ROWS($1:9)-1,COLUMN()-1),0)","v":"SV5"},{"$f":"IF(ROWS(GPS_IMPORT!$1:9)<=COUNTIF(GPS_IMPORT!$A$2:$A$10000,$B$5),INDEX(GPS_IMPORT!$2:$10000,MATCH($B$5,(GPS_IMPORT!$A$2:$A$10000),0)+ROWS($1:9)-1,COLUMN()-1),0)","v":" 3.10.2019"},{"$f":"IF(ROWS(GPS_IMPORT!$1:9)<=COUNTIF(GPS_IMPORT!$A$2:$A$10000,$B$5),INDEX(GPS_IMPORT!$2:$10000,MATCH($B$5,(GPS_IMPORT!$A$2:$A$10000),0)+ROWS($1:9)-1,COLUMN()-1),0)","v":"00:56:58.900"},{"$f":"IF(ROWS(GPS_IMPORT!$1:9)<=COUNTIF(GPS_IMPORT!$A$2:$A$10000,$B$5),INDEX(GPS_IMPORT!$2:$10000,MATCH($B$5,(GPS_IMPORT!$A$2:$A$10000),0)+ROWS($1:9)-1,COLUMN()-1),0)","v":372152.45319999999},{"$f":"IF(ROWS(GPS_IMPORT!$1:9)<=COUNTIF(GPS_IMPORT!$A$2:$A$10000,$B$5),INDEX(GPS_IMPORT!$2:$10000,MATCH($B$5,(GPS_IMPORT!$A$2:$A$10000),0)+ROWS($1:9)-1,COLUMN()-1),0)","v":2457046.1869999999},{"$f":"IF(ROWS(GPS_IMPORT!$1:9)<=COUNTIF(GPS_IMPORT!$A$2:$A$10000,$B$5),INDEX(GPS_IMPORT!$2:$10000,MATCH($B$5,(GPS_IMPORT!$A$2:$A$10000),0)+ROWS($1:9)-1,COLUMN()-1),0)","v":1086.141419},-4.0000000153668225E-3,-4.9999961629509926E-4,-2.8191916666855832E-2,true]
[10,{"$f":"IF(ROWS(GPS_IMPORT!$1:10)<=COUNTIF(GPS_IMPORT!$A$2:$A$10000,$B$5),INDEX(GPS_IMPORT!$2:$10000,MATCH($B$5,(GPS_IMPORT!$A$2:$A$10000),0)+ROWS($1:10)-1,COLUMN()-1),0)","v":"SV5"},{"$f":"IF(ROWS(GPS_IMPORT!$1:10)<=COUNTIF(GPS_IMPORT!$A$2:$A$10000,$B$5),INDEX(GPS_IMPORT!$2:$10000,MATCH($B$5,(GPS_IMPORT!$A$2:$A$10000),0)+ROWS($1:10)-1,COLUMN()-1),0)","v":" 3.10.2019"},{"$f":"IF(ROWS(GPS_IMPORT!$1:10)<=COUNTIF(GPS_IMPORT!$A$2:$A$10000,$B$5),INDEX(GPS_IMPORT!$2:$10000,MATCH($B$5,(GPS_IMPORT!$A$2:$A$10000),0)+ROWS($1:10)-1,COLUMN()-1),0)","v":"00:57:19.800"},{"$f":"IF(ROWS(GPS_IMPORT!$1:10)<=COUNTIF(GPS_IMPORT!$A$2:$A$10000,$B$5),INDEX(GPS_IMPORT!$2:$10000,MATCH($B$5,(GPS_IMPORT!$A$2:$A$10000),0)+ROWS($1:10)-1,COLUMN()-1),0)","v":372152.44839999999},{"$f":"IF(ROWS(GPS_IMPORT!$1:10)<=COUNTIF(GPS_IMPORT!$A$2:$A$10000,$B$5),INDEX(GPS_IMPORT!$2:$10000,MATCH($B$5,(GPS_IMPORT!$A$2:$A$10000),0)+ROWS($1:10)-1,COLUMN()-1),0)","v":2457046.1869999999},{"$f":"IF(ROWS(GPS_IMPORT!$1:10)<=COUNTIF(GPS_IMPORT!$A$2:$A$10000,$B$5),INDEX(GPS_IMPORT!$2:$10000,MATCH($B$5,(GPS_IMPORT!$A$2:$A$10000),0)+ROWS($1:10)-1,COLUMN()-1),0)","v":1086.1483559999999},7.9999997979030013E-4,-4.9999961629509926E-4,-3.5128916666735677E-2,true]
[11,{"$f":"IF(ROWS(GPS_IMPORT!$1:11)<=COUNTIF(GPS_IMPORT!$A$2:$A$10000,$B$5),INDEX(GPS_IMPORT!$2:$10000,MATCH($B$5,(GPS_IMPORT!$A$2:$A$10000),0)+ROWS($1:11)-1,COLUMN()-1),0)","v":"SV5"},{"$f":"IF(ROWS(GPS_IMPORT!$1:11)<=COUNTIF(GPS_IMPORT!$A$2:$A$10000,$B$5),INDEX(GPS_IMPORT!$2:$10000,MATCH($B$5,(GPS_IMPORT!$A$2:$A$10000),0)+ROWS($1:11)-1,COLUMN()-1),0)","v":" 3.10.2019"},{"$f":"IF(ROWS(GPS_IMPORT!$1:11)<=COUNTIF(GPS_IMPORT!$A$2:$A$10000,$B$5),INDEX(GPS_IMPORT!$2:$10000,MATCH($B$5,(GPS_IMPORT!$A$2:$A$10000),0)+ROWS($1:11)-1,COLUMN()-1),0)","v":"00:57:31.100"},{"$f":"IF(ROWS(GPS_IMPORT!$1:11)<=COUNTIF(GPS_IMPORT!$A$2:$A$10000,$B$5),INDEX(GPS_IMPORT!$2:$10000,MATCH($B$5,(GPS_IMPORT!$A$2:$A$10000),0)+ROWS($1:11)-1,COLUMN()-1),0)","v":372152.45409999997},{"$f":"IF(ROWS(GPS_IMPORT!$1:11)<=COUNTIF(GPS_IMPORT!$A$2:$A$10000,$B$5),INDEX(GPS_IMPORT!$2:$10000,MATCH($B$5,(GPS_IMPORT!$A$2:$A$10000),0)+ROWS($1:11)-1,COLUMN()-1),0)","v":2457046.19},{"$f":"IF(ROWS(GPS_IMPORT!$1:11)<=COUNTIF(GPS_IMPORT!$A$2:$A$10000,$B$5),INDEX(GPS_IMPORT!$2:$10000,MATCH($B$5,(GPS_IMPORT!$A$2:$A$10000),0)+ROWS($1:11)-1,COLUMN()-1),0)","v":1086.1485049999999},-4.8999999999068677E-3,-3.4999996423721313E-3,-3.5277916666700548E-2,true]
[12,{"$f":"IF(ROWS(GPS_IMPORT!$1:12)<=COUNTIF(GPS_IMPORT!$A$2:$A$10000,$B$5),INDEX(GPS_IMPORT!$2:$10000,MATCH($B$5,(GPS_IMPORT!$A$2:$A$10000),0)+ROWS($1:12)-1,COLUMN()-1),0)","v":"SV5"},{"$f":"IF(ROWS(GPS_IMPORT!$1:12)<=COUNTIF(GPS_IMPORT!$A$2:$A$10000,$B$5),INDEX(GPS_IMPORT!$2:$10000,MATCH($B$5,(GPS_IMPORT!$A$2:$A$10000),0)+ROWS($1:12)-1,COLUMN()-1),0)","v":" 3.10.2019"},{"$f":"IF(ROWS(GPS_IMPORT!$1:12)<=COUNTIF(GPS_IMPORT!$A$2:$A$10000,$B$5),INDEX(GPS_IMPORT!$2:$10000,MATCH($B$5,(GPS_IMPORT!$A$2:$A$10000),0)+ROWS($1:12)-1,COLUMN()-1),0)","v":"00:57:41.700"},{"$f":"IF(ROWS(GPS_IMPORT!$1:12)<=COUNTIF(GPS_IMPORT!$A$2:$A$10000,$B$5),INDEX(GPS_IMPORT!$2:$10000,MATCH($B$5,(GPS_IMPORT!$A$2:$A$10000),0)+ROWS($1:12)-1,COLUMN()-1),0)","v":372152.44910000003},{"$f":"IF(ROWS(GPS_IMPORT!$1:12)<=COUNTIF(GPS_IMPORT!$A$2:$A$10000,$B$5),INDEX(GPS_IMPORT!$2:$10000,MATCH($B$5,(GPS_IMPORT!$A$2:$A$10000),0)+ROWS($1:12)-1,COLUMN()-1),0)","v":2457046.1949999998},{"$f":"IF(ROWS(GPS_IMPORT!$1:12)<=COUNTIF(GPS_IMPORT!$A$2:$A$10000,$B$5),INDEX(GPS_IMPORT!$2:$10000,MATCH($B$5,(GPS_IMPORT!$A$2:$A$10000),0)+ROWS($1:12)-1,COLUMN()-1),0)","v":1086.156129},9.9999946542084217E-5,-8.4999995306134224E-3,-4.2901916666778561E-2,true]
[13,{"$f":"IF(ROWS(GPS_IMPORT!$1:13)<=COUNTIF(GPS_IMPORT!$A$2:$A$10000,$B$5),INDEX(GPS_IMPORT!$2:$10000,MATCH($B$5,(GPS_IMPORT!$A$2:$A$10000),0)+ROWS($1:13)-1,COLUMN()-1),0)","v":0},{"$f":"IF(ROWS(GPS_IMPORT!$1:13)<=COUNTIF(GPS_IMPORT!$A$2:$A$10000,$B$5),INDEX(GPS_IMPORT!$2:$10000,MATCH($B$5,(GPS_IMPORT!$A$2:$A$10000),0)+ROWS($1:13)-1,COLUMN()-1),0)","v":"00:00:00"},{"$f":"IF(ROWS(GPS_IMPORT!$1:13)<=COUNTIF(GPS_IMPORT!$A$2:$A$10000,$B$5),INDEX(GPS_IMPORT!$2:$10000,MATCH($B$5,(GPS_IMPORT!$A$2:$A$10000),0)+ROWS($1:13)-1,COLUMN()-1),0)","v":"00:00:00"},{"$f":"IF(ROWS(GPS_IMPORT!$1:13)<=COUNTIF(GPS_IMPORT!$A$2:$A$10000,$B$5),INDEX(GPS_IMPORT!$2:$10000,MATCH($B$5,(GPS_IMPORT!$A$2:$A$10000),0)+ROWS($1:13)-1,COLUMN()-1),0)","v":0},{"$f":"IF(ROWS(GPS_IMPORT!$1:13)<=COUNTIF(GPS_IMPORT!$A$2:$A$10000,$B$5),INDEX(GPS_IMPORT!$2:$10000,MATCH($B$5,(GPS_IMPORT!$A$2:$A$10000),0)+ROWS($1:13)-1,COLUMN()-1),0)","v":0},{"$f":"IF(ROWS(GPS_IMPORT!$1:13)<=COUNTIF(GPS_IMPORT!$A$2:$A$10000,$B$5),INDEX(GPS_IMPORT!$2:$10000,MATCH($B$5,(GPS_IMPORT!$A$2:$A$10000),0)+ROWS($1:13)-1,COLUMN()-1),0)","v":0},{"$f":"IF(E19>0,E$22-E19,0)","v":0},0,0,false]
[14,{"$f":"IF(ROWS(GPS_IMPORT!$1:14)<=COUNTIF(GPS_IMPORT!$A$2:$A$10000,$B$5),INDEX(GPS_IMPORT!$2:$10000,MATCH($B$5,(GPS_IMPORT!$A$2:$A$10000),0)+ROWS($1:14)-1,COLUMN()-1),0)","v":0},{"$f":"IF(ROWS(GPS_IMPORT!$1:14)<=COUNTIF(GPS_IMPORT!$A$2:$A$10000,$B$5),INDEX(GPS_IMPORT!$2:$10000,MATCH($B$5,(GPS_IMPORT!$A$2:$A$10000),0)+ROWS($1:14)-1,COLUMN()-1),0)","v":"00:00:00"},{"$f":"IF(ROWS(GPS_IMPORT!$1:14)<=COUNTIF(GPS_IMPORT!$A$2:$A$10000,$B$5),INDEX(GPS_IMPORT!$2:$10000,MATCH($B$5,(GPS_IMPORT!$A$2:$A$10000),0)+ROWS($1:14)-1,COLUMN()-1),0)","v":"00:00:00"},{"$f":"IF(ROWS(GPS_IMPORT!$1:14)<=COUNTIF(GPS_IMPORT!$A$2:$A$10000,$B$5),INDEX(GPS_IMPORT!$2:$10000,MATCH($B$5,(GPS_IMPORT!$A$2:$A$10000),0)+ROWS($1:14)-1,COLUMN()-1),0)","v":0},{"$f":"IF(ROWS(GPS_IMPORT!$1:14)<=COUNTIF(GPS_IMPORT!$A$2:$A$10000,$B$5),INDEX(GPS_IMPORT!$2:$10000,MATCH($B$5,(GPS_IMPORT!$A$2:$A$10000),0)+ROWS($1:14)-1,COLUMN()-1),0)","v":0},{"$f":"IF(ROWS(GPS_IMPORT!$1:14)<=COUNTIF(GPS_IMPORT!$A$2:$A$10000,$B$5),INDEX(GPS_IMPORT!$2:$10000,MATCH($B$5,(GPS_IMPORT!$A$2:$A$10000),0)+ROWS($1:14)-1,COLUMN()-1),0)","v":0},0,0,0,false]
[15,{"$f":"IF(ROWS(GPS_IMPORT!$1:15)<=COUNTIF(GPS_IMPORT!$A$2:$A$10000,$B$5),INDEX(GPS_IMPORT!$2:$10000,MATCH($B$5,(GPS_IMPORT!$A$2:$A$10000),0)+ROWS($1:15)-1,COLUMN()-1),0)","v":0},{"$f":"IF(ROWS(GPS_IMPORT!$1:15)<=COUNTIF(GPS_IMPORT!$A$2:$A$10000,$B$5),INDEX(GPS_IMPORT!$2:$10000,MATCH($B$5,(GPS_IMPORT!$A$2:$A$10000),0)+ROWS($1:15)-1,COLUMN()-1),0)","v":"00:00:00"},{"$f":"IF(ROWS(GPS_IMPORT!$1:15)<=COUNTIF(GPS_IMPORT!$A$2:$A$10000,$B$5),INDEX(GPS_IMPORT!$2:$10000,MATCH($B$5,(GPS_IMPORT!$A$2:$A$10000),0)+ROWS($1:15)-1,COLUMN()-1),0)","v":"00:00:00"},{"$f":"IF(ROWS(GPS_IMPORT!$1:15)<=COUNTIF(GPS_IMPORT!$A$2:$A$10000,$B$5),INDEX(GPS_IMPORT!$2:$10000,MATCH($B$5,(GPS_IMPORT!$A$2:$A$10000),0)+ROWS($1:15)-1,COLUMN()-1),0)","v":0},{"$f":"IF(ROWS(GPS_IMPORT!$1:15)<=COUNTIF(GPS_IMPORT!$A$2:$A$10000,$B$5),INDEX(GPS_IMPORT!$2:$10000,MATCH($B$5,(GPS_IMPORT!$A$2:$A$10000),0)+ROWS($1:15)-1,COLUMN()-1),0)","v":0},{"$f":"IF(ROWS(GPS_IMPORT!$1:15)<=COUNTIF(GPS_IMPORT!$A$2:$A$10000,$B$5),INDEX(GPS_IMPORT!$2:$10000,MATCH($B$5,(GPS_IMPORT!$A$2:$A$10000),0)+ROWS($1:15)-1,COLUMN()-1),0)","v":0},0,0,0,false]
[null,null,null,"AVERAGE",{"$f":"(IF($K$7=TRUE,E7,0)+IF($K$8=TRUE,E8,0)+IF($K$9=TRUE,E9,0)+IF($K$10=TRUE,E10,0)+IF($K$11=TRUE,E11,0)+IF($K$12=TRUE,E12,0)+IF($K$13=TRUE,E13,0)+IF($K$14=TRUE,E14,0)+IF($K$15=TRUE,E15,0)+IF($K$16=TRUE,E16,0)+IF($K$17=TRUE,E17,0)+IF($K$18=TRUE,E18,0)+IF($K$19=TRUE,E19,0)+IF($K$20=TRUE,E20,0)+IF($K$21=TRUE,E21,0))/(IF($K$7=TRUE,1,0)+IF($K$8=TRUE,1,0)+IF($K$9=TRUE,1,0)+IF($K$10=TRUE,1,0)+IF($K$11=TRUE,1,0)+IF($K$12=TRUE,1,0)+IF($K$13=TRUE,1,0)+IF($K$14=TRUE,1,0)+IF($K$15=TRUE,1,0)+IF($K$16=TRUE,1,0)+IF($K$17=TRUE,1,0)+IF($K$18=TRUE,1,0)+IF($K$19=TRUE,1,0)+IF($K$20=TRUE,1,0)+IF($K$21=TRUE,1,0))","v":372152.44919999997},{"$f":"(IF($K$7=TRUE,F7,0)+IF($K$8=TRUE,F8,0)+IF($K$9=TRUE,F9,0)+IF($K$10=TRUE,F10,0)+IF($K$11=TRUE,F11,0)+IF($K$12=TRUE,F12,0)+IF($K$13=TRUE,F13,0)+IF($K$14=TRUE,F14,0)+IF($K$15=TRUE,F15,0)+IF($K$16=TRUE,F16,0)+IF($K$17=TRUE,F17,0)+IF($K$18=TRUE,F18,0)+IF($K$19=TRUE,F19,0)+IF($K$20=TRUE,F20,0)+IF($K$21=TRUE,F21,0))/(IF($K$7=TRUE,1,0)+IF($K$8=TRUE,1,0)+IF($K$9=TRUE,1,0)+IF($K$10=TRUE,1,0)+IF($K$11=TRUE,1,0)+IF($K$12=TRUE,1,0)+IF($K$13=TRUE,1,0)+IF($K$14=TRUE,1,0)+IF($K$15=TRUE,1,0)+IF($K$16=TRUE,1,0)+IF($K$17=TRUE,1,0)+IF($K$18=TRUE,1,0)+IF($K$19=TRUE,1,0)+IF($K$20=TRUE,1,0)+IF($K$21=TRUE,1,0))","v":2457046.1865000003},{"$f":"(IF($K$7=TRUE,G7,0)+IF($K$8=TRUE,G8,0)+IF($K$9=TRUE,G9,0)+IF($K$10=TRUE,G10,0)+IF($K$11=TRUE,G11,0)+IF($K$12=TRUE,G12,0)+IF($K$13=TRUE,G13,0)+IF($K$14=TRUE,G14,0)+IF($K$15=TRUE,G15,0)+IF($K$16=TRUE,G16,0)+IF($K$17=TRUE,G17,0)+IF($K$18=TRUE,G18,0)+IF($K$19=TRUE,G19,0)+IF($K$20=TRUE,G20,0)+IF($K$21=TRUE,G21,0))/\n(IF($K$7=TRUE,1,0)+IF($K$8=TRUE,1,0)+IF($K$9=TRUE,1,0)+IF($K$10=TRUE,1,0)+IF($K$11=TRUE,1,0)+IF($K$12=TRUE,1,0)+IF($K$13=TRUE,1,0)+IF($K$14=TRUE,1,0)+IF($K$15=TRUE,1,0)+IF($K$16=TRUE,1,0)+IF($K$17=TRUE,1,0)+IF($K$18=TRUE,1,0)+IF($K$19=TRUE,1,0)+IF($K$20=TRUE,1,0)+IF($K$21=TRUE,1,0))","v":1086.1132270833332},"RMSE:","RMSE:","RMSE:"]
[null,null,null,null,null,null,"RMSE IN US SURVEY FEET:",{"$f":"SQRT((\n(IF($K$7=TRUE,H7^2,0))+(IF($K$8=TRUE,H8^2,0))+(IF($K$9=TRUE,H9^2,0))+(IF($K$10=TRUE,H10^2,0))+(IF($K$11=TRUE,H11^2,0))+(IF($K$12=TRUE,H12^2,0))+(IF($K$13=TRUE,H13^2,0))+(IF($K$14=TRUE,H14^2,0))+(IF($K$15=TRUE,H15^2,0))+(IF($K$16=TRUE,H16^2,0))+(IF($K$17=TRUE,H17^2,0))+(IF($K$18=TRUE,H18^2,0))+(IF($K$19=TRUE,H19^2,0))+(IF($K$20=TRUE,H20^2,0))+(IF($K$21=TRUE,H21^2,0)))/\n(IF($K$7=TRUE,1,0)+IF($K$8=TRUE,1,0)+IF($K$9=TRUE,1,0)+IF($K$10=TRUE,1,0)+IF($K$11=TRUE,1,0)+IF($K$12=TRUE,1,0)+IF($K$13=TRUE,1,0)+IF($K$14=TRUE,1,0)+IF($K$15=TRUE,1,0)+IF($K$16=TRUE,1,0)+IF($K$17=TRUE,1,0)+IF($K$18=TRUE,1,0)+IF($K$19=TRUE,1,0)+IF($K$20=TRUE,1,0)+IF($K$21=TRUE,1,0)))","v":6.3797857840735177E-3},{"$f":"SQRT((\n(IF($K$7=TRUE,I7^2,0))+(IF($K$8=TRUE,I8^2,0))+(IF($K$9=TRUE,I9^2,0))+(IF($K$10=TRUE,I10^2,0))+(IF($K$11=TRUE,I11^2,0))+(IF($K$12=TRUE,I12^2,0))+(IF($K$13=TRUE,I13^2,0))+(IF($K$14=TRUE,I14^2,0))+(IF($K$15=TRUE,I15^2,0))+(IF($K$16=TRUE,I16^2,0))+(IF($K$17=TRUE,I17^2,0))+(IF($K$18=TRUE,I18^2,0))+(IF($K$19=TRUE,I19^2,0))+(IF($K$20=TRUE,I20^2,0))+(IF($K$21=TRUE,I21^2,0)))/\n(IF($K$7=TRUE,1,0)+IF($K$8=TRUE,1,0)+IF($K$9=TRUE,1,0)+IF($K$10=TRUE,1,0)+IF($K$11=TRUE,1,0)+IF($K$12=TRUE,1,0)+IF($K$13=TRUE,1,0)+IF($K$14=TRUE,1,0)+IF($K$15=TRUE,1,0)+IF($K$16=TRUE,1,0)+IF($K$17=TRUE,1,0)+IF($K$18=TRUE,1,0)+IF($K$19=TRUE,1,0)+IF($K$20=TRUE,1,0)+IF($K$21=TRUE,1,0)))","v":5.5302199458178696E-3},{"$f":"SQRT((\n(IF($K$7=TRUE,J7^2,0))+(IF($K$8=TRUE,J8^2,0))+(IF($K$9=TRUE,J9^2,0))+(IF($K$10=TRUE,J10^2,0))+(IF($K$11=TRUE,J11^2,0))+(IF($K$12=TRUE,J12^2,0))+(IF($K$13=TRUE,J13^2,0))+(IF($K$14=TRUE,J14^2,0))+(IF($K$15=TRUE,J15^2,0))+(IF($K$16=TRUE,J16^2,0))+(IF($K$17=TRUE,J17^2,0))+(IF($K$18=TRUE,J18^2,0))+(IF($K$19=TRUE,J19^2,0))+(IF($K$20=TRUE,J20^2,0))+(IF($K$21=TRUE,J21^2,0)))/\n(IF($K$7=TRUE,1,0)+IF($K$8=TRUE,1,0)+IF($K$9=TRUE,1,0)+IF($K$10=TRUE,1,0)+IF($K$11=TRUE,1,0)+IF($K$12=TRUE,1,0)+IF($K$13=TRUE,1,0)+IF($K$14=TRUE,1,0)+IF($K$15=TRUE,1,0)+IF($K$16=TRUE,1,0)+IF($K$17=TRUE,1,0)+IF($K$18=TRUE,1,0)+IF($K$19=TRUE,1,0)+IF($K$20=TRUE,1,0)+IF($K$21=TRUE,1,0)))","v":3.0729189639625419E-2}]
[null,null,null,1]
[null,null,"UNITLESS GRID TO GROUND MULTIPLIER",{"$f":"IF(REPORT!C13=\"n/a\",\"0.00000000\",REPORT!C13)","v":1.0000901799999999},null,null,null,{"$f":"IF(H23<=0.029,\"PASS\",\"FAIL\")","v":"PASS"},{"$f":"IF(I23<=0.029,\"PASS\",\"FAIL\")","v":"PASS"},{"$f":"IF(J23<=0.039,\"PASS\",\"FAIL\")","v":"PASS"}]
[]
["AVERAGED GPS-DERIVED POSITION",null,null,null,null,null,null,null,"Notes:"]
[null,"MONUMENT COORDINATES",null,"NORTHING","EASTING","ORTHO HEIGHT"]
[null,"US Survey Feet (GRID)",null,{"$f":"$E$22","v":372152.44919999997},{"$f":"$F$22","v":2457046.1865000003},{"$f":"$G$22","v":1086.1132270833332}]
[]
["LEVELED ELEVATION"]
["US SURVEY FEET",null,{"$f":"IFERROR(VLOOKUP(B5,'LEVEL RUN'!A8:I59,9,FALSE),\"N/A\")","v":"N/A"},"(Type the leveled elevation or N/A if no leveled elevation is available)"]
["MONUMENT HELD",null,null,"(Type the monument name from which leveling originated)"]
["LEVELED ELEVATION - GPS DERIVED ELEVATION   = ",null,null,null,{"$f":"IF(C32=\"N/A\",\"N/A\",C32-(F29*D24))","v":"N/A"}]
[]
["FINAL MONUMENT COORDINATES"]
[null,"MONUMENT COORDINATES",null,"NORTHING","EASTING","ELEVATION","FEATURE CODE"]
[null,"US SURVEY FEET (GRID)",null,{"$f":"$E$22*$D$24","v":372152.44919999997},{"$f":"$F$22*$D$24","v":2457046.1865000003},{"$f":"IF($C$32=\"N/A\",($G$22*$D$24),$C$32)","v":1086.1132270833332},{"$f":"VLOOKUP($B$5,GPS_IMPORT!$A$2:$G$2000,7,FALSE)","v":"AERTAR"}]
[null,"US SURVEY FEET (GROUND)",null,{"$f":"$D$38*$D$25","v":372186.00990786881},{"$f":"$E$38*$D$25","v":2457267.7629250987},{"$f":"IF($C$32=\"N/A\",($G$22*$D$24),$C$32)","v":1086.1132270833332},{"$f":"G38","v":"AERTAR"}]
[]
["∆ North,  ∆ East, and ∆ Ht. are the difference between the average northing, easting, and height for each observation.",null,null,null,null,null,null,null,"Mask Angle:","10°"]

{"sheet":"CNTL1","index":12,"n_rows":41,"n_cols":11,"rows_kept":41,"cut":false,"hidden":false,"merged":[[0,0,0,10],[26,0,26,6],[27,1,27,2],[27,8,38,10],[28,1,28,2],[30,0,30,6],[35,0,35,6],[36,1,36,2],[37,1,37,2],[38,1,38,2]]}
["VRS GNSS Project Control Monument Coordinate Analysis"]
[]
["Project:",{"$f":"REPORT!B2","v":"FRA-71-29.4"},"GPS Antenna:","LEICA GS14",null,null,null,null,null,"Report Date:",{"$f":"REPORT!C49","v":"2019-04-25"}]
["PID:",{"$f":"REPORT!E2","v":106471},"VRS Network:","ODOT VRS",null,null,null,null,null,"Prepared By:",{"$f":"REPORT!C48","v":"Kolton Wilson"}]
["Point ID:","CNTL1","No. of Sessions:",{"$f":"COUNTIF(GPS_IMPORT!A2:A1000,$B$5)","v":12},null,null,null,null,null,"Checked By:",{"$f":"REPORT!C52","v":"David Ogden"}]
["SESSION #","Point","Observation Date","Start Time","Northing(sft)","Easting(sft)","Height(sft)","∆ Northing(sft)","∆ Easting(sft)","∆ Height(sft)","Include in Solution?"]
[1,{"$f":"IF(ROWS(GPS_IMPORT!$1:1)<=COUNTIF(GPS_IMPORT!$A$2:$A$10000,$B$5),INDEX(GPS_IMPORT!$2:$10000,MATCH($B$5,(GPS_IMPORT!$A$2:$A$10000),0)+ROWS($1:1)-1,COLUMN()-1),0)","v":"CNTL1"},{"$f":"IF(ROWS(GPS_IMPORT!$1:1)<=COUNTIF(GPS_IMPORT!$A$2:$A$10000,$B$5),INDEX(GPS_IMPORT!$2:$10000,MATCH($B$5,(GPS_IMPORT!$A$2:$A$10000),0)+ROWS($1:1)-1,COLUMN()-1),0)","v":" 3.10.2019"},{"$f":"IF(ROWS(GPS_IMPORT!$1:1)<=COUNTIF(GPS_IMPORT!$A$2:$A$10000,$B$5),INDEX(GPS_IMPORT!$2:$10000,MATCH($B$5,(GPS_IMPORT!$A$2:$A$10000),0)+ROWS($1:1)-1,COLUMN()-1),0)","v":"00:37:16.500"},{"$f":"IF(ROWS(GPS_IMPORT!$1:1)<=COUNTIF(GPS_IMPORT!$A$2:$A$10000,$B$5),INDEX(GPS_IMPORT!$2:$10000,MATCH($B$5,(GPS_IMPORT!$A$2:$A$10000),0)+ROWS($1:1)-1,COLUMN()-1),0)","v":376931.96470000001},{"$f":"IF(ROWS(GPS_IMPORT!$1:1)<=COUNTIF(GPS_IMPORT!$A$2:$A$10000,$B$5),INDEX(GPS_IMPORT!$2:$10000,MATCH($B$5,(GPS_IMPORT!$A$2:$A$10000),0)+ROWS($1:1)-1,COLUMN()-1),0)","v":2458075.6030000001},{"$f":"IF(ROWS(GPS_IMPORT!$1:1)<=COUNTIF(GPS_IMPORT!$A$2:$A$10000,$B$5),INDEX(GPS_IMPORT!$2:$10000,MATCH($B$5,(GPS_IMPORT!$A$2:$A$10000),0)+ROWS($1:1)-1,COLUMN()-1),0)","v":1021.869206},{"$f":"IF(E7>0,E$22-E7,0)","v":3.9583333418704569E-3},-4.8333331942558289E-3,-1.5799083333376984E-2,true]
[2,{"$f":"IF(ROWS(GPS_IMPORT!$1:2)<=COUNTIF(GPS_IMPORT!$A$2:$A$10000,$B$5),INDEX(GPS_IMPORT!$2:$10000,MATCH($B$5,(GPS_IMPORT!$A$2:$A$10000),0)+ROWS($1:2)-1,COLUMN()-1),0)","v":"CNTL1"},{"$f":"IF(ROWS(GPS_IMPORT!$1:2)<=COUNTIF(GPS_IMPORT!$A$2:$A$10000,$B$5),INDEX(GPS_IMPORT!$2:$10000,MATCH($B$5,(GPS_IMPORT!$A$2:$A$10000),0)+ROWS($1:2)-1,COLUMN()-1),0)","v":" 3.10.2019"},{"$f":"IF(ROWS(GPS_IMPORT!$1:2)<=COUNTIF(GPS_IMPORT!$A$2:$A$10000,$B$5),INDEX(GPS_IMPORT!$2:$10000,MATCH($B$5,(GPS_IMPORT!$A$2:$A$10000),0)+ROWS($1:2)-1,COLUMN()-1),0)","v":"00:37:25.100"},{"$f":"IF(ROWS(GPS_IMPORT!$1:2)<=COUNTIF(GPS_IMPORT!$A$2:$A$10000,$B$5),INDEX(GPS_IMPORT!$2:$10000,MATCH($B$5,(GPS_IMPORT!$A$2:$A$10000),0)+ROWS($1:2)-1,COLUMN()-1),0)","v":376931.96639999998},{"$f":"IF(ROWS(GPS_IMPORT!$1:2)<=COUNTIF(GPS_IMPORT!$A$2:$A$10000,$B$5),INDEX(GPS_IMPORT!$2:$10000,MATCH($B$5,(GPS_IMPORT!$A$2:$A$10000),0)+ROWS($1:2)-1,COLUMN()-1),0)","v":2458075.5959999999},{"$f":"IF(ROWS(GPS_IMPORT!$1:2)<=COUNTIF(GPS_IMPORT!$A$2:$A$10000,$B$5),INDEX(GPS_IMPORT!$2:$10000,MATCH($B$5,(GPS_IMPORT!$A$2:$A$10000),0)+ROWS($1:2)-1,COLUMN()-1),0)","v":1021.86035},2.2583333775401115E-3,2.1666670218110085E-3,-6.9430833334536146E-3,true]
[3,{"$f":"IF(ROWS(GPS_IMPORT!$1:3)<=COUNTIF(GPS_IMPORT!$A$2:$A$10000,$B$5),INDEX(GPS_IMPORT!$2:$10000,MATCH($B$5,(GPS_IMPORT!$A$2:$A$10000),0)+ROWS($1:3)-1,COLUMN()-1),0)","v":"CNTL1"},{"$f":"IF(ROWS(GPS_IMPORT!$1:3)<=COUNTIF(GPS_IMPORT!$A$2:$A$10000,$B$5),INDEX(GPS_IMPORT!$2:$10000,MATCH($B$5,(GPS_IMPORT!$A$2:$A$10000),0)+ROWS($1:3)-1,COLUMN()-1),0)","v":" 3.10.2019"},{"$f":"IF(ROWS(GPS_IMPORT!$1:3)<=COUNTIF(GPS_IMPORT!$A$2:$A$10000,$B$5),INDEX(GPS_IMPORT!$2:$10000,MATCH($B$5,(GPS_IMPORT!$A$2:$A$10000),0)+ROWS($1:3)-1,COLUMN()-1),0)","v":"00:37:34.200"},{"$f":"IF(ROWS(GPS_IMPORT!$1:3)<=COUNTIF(GPS_IMPORT!$A$2:$A$10000,$B$5),INDEX(GPS_IMPORT!$2:$10000,MATCH($B$5,(GPS_IMPORT!$A$2:$A$10000),0)+ROWS($1:3)-1,COLUMN()-1),0)","v":376931.96919999999},{"$f":"IF(ROWS(GPS_IMPORT!$1:3)<=COUNTIF(GPS_IMPORT!$A$2:$A$10000,$B$5),INDEX(GPS_IMPORT!$2:$10000,MATCH($B$5,(GPS_IMPORT!$A$2:$A$10000),0)+ROWS($1:3)-1,COLUMN()-1),0)","v":2458075.5980000002},{"$f":"IF(ROWS(GPS_IMPORT!$1:3)<=COUNTIF(GPS_IMPORT!$A$2:$A$10000,$B$5),INDEX(GPS_IMPORT!$2:$10000,MATCH($B$5,(GPS_IMPORT!$A$2:$A$10000),0)+ROWS($1:3)-1,COLUMN()-1),0)","v":1021.865102},-5.4166663903743029E-4,1.6666669398546219E-4,-1.1695083333393086E-2,true]
[4,{"$f":"IF(ROWS(GPS_IMPORT!$1:4)<=COUNTIF(GPS_IMPORT!$A$2:$A$10000,$B$5),INDEX(GPS_IMPORT!$2:$10000,MATCH($B$5,(GPS_IMPORT!$A$2:$A$10000),0)+ROWS($1:4)-1,COLUMN()-1),0)","v":"CNTL1"},{"$f":"IF(ROWS(GPS_IMPORT!$1:4)<=COUNTIF(GPS_IMPORT!$A$2:$A$10000,$B$5),INDEX(GPS_IMPORT!$2:$10000,MATCH($B$5,(GPS_IMPORT!$A$2:$A$10000),0)+ROWS($1:4)-1,COLUMN()-1),0)","v":" 3.10.2019"},{"$f":"IF(ROWS(GPS_IMPORT!$1:4)<=COUNTIF(GPS_IMPORT!$A$2:$A$10000,$B$5),INDEX(GPS_IMPORT!$2:$10000,MATCH($B$5,(GPS_IMPORT!$A$2:$A$10000),0)+ROWS($1:4)-1,COLUMN()-1),0)","v":"00:37:45.100"},{"$f":"IF(ROWS(GPS_IMPORT!$1:4)<=COUNTIF(GPS_IMPORT!$A$2:$A$10000,$B$5),INDEX(GPS_IMPORT!$2:$10000,MATCH($B$5,(GPS_IMPORT!$A$2:$A$10000),0)+ROWS($1:4)-1,COLUMN()-1),0)","v":376931.96779999998},{"$f":"IF(ROWS(GPS_IMPORT!$1:4)<=COUNTIF(GPS_IMPORT!$A$2:$A$10000,$B$5),INDEX(GPS_IMPORT!$2:$10000,MATCH($B$5,(GPS_IMPORT!$A$2:$A$10000),0)+ROWS($1:4)-1,COLUMN()-1),0)","v":2458075.5989999999},{"$f":"IF(ROWS(GPS_IMPORT!$1:4)<=COUNTIF(GPS_IMPORT!$A$2:$A$10000,$B$5),INDEX(GPS_IMPORT!$2:$10000,MATCH($B$5,(GPS_IMPORT!$A$2:$A$10000),0)+ROWS($1:4)-1,COLUMN()-1),0)","v":1021.866611},8.5833336925134063E-4,-8.3333300426602364E-4,-1.320408333344858E-2,true]
[5,{"$f":"IF(ROWS(GPS_IMPORT!$1:5)<=COUNTIF(GPS_IMPORT!$A$2:$A$10000,$B$5),INDEX(GPS_IMPORT!$2:$10000,MATCH($B$5,(GPS_IMPORT!$A$2:$A$10000),0)+ROWS($1:5)-1,COLUMN()-1),0)","v":"CNTL1"},{"$f":"IF(ROWS(GPS_IMPORT!$1:5)<=COUNTIF(GPS_IMPORT!$A$2:$A$10000,$B$5),INDEX(GPS_IMPORT!$2:$10000,MATCH($B$5,(GPS_IMPORT!$A$2:$A$10000),0)+ROWS($1:5)-1,COLUMN()-1),0)","v":" 3.10.2019"},{"$f":"IF(ROWS(GPS_IMPORT!$1:5)<=COUNTIF(GPS_IMPORT!$A$2:$A$10000,$B$5),INDEX(GPS_IMPORT!$2:$10000,MATCH($B$5,(GPS_IMPORT!$A$2:$A$10000),0)+ROWS($1:5)-1,COLUMN()-1),0)","v":"00:38:03.100"},{"$f":"IF(ROWS(GPS_IMPORT!$1:5)<=COUNTIF(GPS_IMPORT!$A$2:$A$10000,$B$5),INDEX(GPS_IMPORT!$2:$10000,MATCH($B$5,(GPS_IMPORT!$A$2:$A$10000),0)+ROWS($1:5)-1,COLUMN()-1),0)","v":376931.96950000001},{"$f":"IF(ROWS(GPS_IMPORT!$1:5)<=COUNTIF(GPS_IMPORT!$A$2:$A$10000,$B$5),INDEX(GPS_IMPORT!$2:$10000,MATCH($B$5,(GPS_IMPORT!$A$2:$A$10000),0)+ROWS($1:5)-1,COLUMN()-1),0)","v":2458075.591},{"$f":"IF(ROWS(GPS_IMPORT!$1:5)<=COUNTIF(GPS_IMPORT!$A$2:$A$10000,$B$5),INDEX(GPS_IMPORT!$2:$10000,MATCH($B$5,(GPS_IMPORT!$A$2:$A$10000),0)+ROWS($1:5)-1,COLUMN()-1),0)","v":1021.868127},-8.4166665328666568E-4,7.1666669100522995E-3,-1.4720083333372713E-2,true]
[6,{"$f":"IF(ROWS(GPS_IMPORT!$1:6)<=COUNTIF(GPS_IMPORT!$A$2:$A$10000,$B$5),INDEX(GPS_IMPORT!$2:$10000,MATCH($B$5,(GPS_IMPORT!$A$2:$A$10000),0)+ROWS($1:6)-1,COLUMN()-1),0)","v":"CNTL1"},{"$f":"IF(ROWS(GPS_IMPORT!$1:6)<=COUNTIF(GPS_IMPORT!$A$2:$A$10000,$B$5),INDEX(GPS_IMPORT!$2:$10000,MATCH($B$5,(GPS_IMPORT!$A$2:$A$10000),0)+ROWS($1:6)-1,COLUMN()-1),0)","v":" 3.10.2019"},{"$f":"IF(ROWS(GPS_IMPORT!$1:6)<=COUNTIF(GPS_IMPORT!$A$2:$A$10000,$B$5),INDEX(GPS_IMPORT!$2:$10000,MATCH($B$5,(GPS_IMPORT!$A$2:$A$10000),0)+ROWS($1:6)-1,COLUMN()-1),0)","v":"00:38:14"},{"$f":"IF(ROWS(GPS_IMPORT!$1:6)<=COUNTIF(GPS_IMPORT!$A$2:$A$10000,$B$5),INDEX(GPS_IMPORT!$2:$10000,MATCH($B$5,(GPS_IMPORT!$A$2:$A$10000),0)+ROWS($1:6)-1,COLUMN()-1),0)","v":376931.97259999998},{"$f":"IF(ROWS(GPS_IMPORT!$1:6)<=COUNTIF(GPS_IMPORT!$A$2:$A$10000,$B$5),INDEX(GPS_IMPORT!$2:$10000,MATCH($B$5,(GPS_IMPORT!$A$2:$A$10000),0)+ROWS($1:6)-1,COLUMN()-1),0)","v":2458075.5929999999},{"$f":"IF(ROWS(GPS_IMPORT!$1:6)<=COUNTIF(GPS_IMPORT!$A$2:$A$10000,$B$5),INDEX(GPS_IMPORT!$2:$10000,MATCH($B$5,(GPS_IMPORT!$A$2:$A$10000),0)+ROWS($1:6)-1,COLUMN()-1),0)","v":1021.854132},-3.941666625905782E-3,5.1666670478880405E-3,-7.2508333346377185E-4,true]
[7,{"$f":"IF(ROWS(GPS_IMPORT!$1:7)<=COUNTIF(GPS_IMPORT!$A$2:$A$10000,$B$5),INDEX(GPS_IMPORT!$2:$10000,MATCH($B$5,(GPS_IMPORT!$A$2:$A$10000),0)+ROWS($1:7)-1,COLUMN()-1),0)","v":"CNTL1"},{"$f":"IF(ROWS(GPS_IMPORT!$1:7)<=COUNTIF(GPS_IMPORT!$A$2:$A$10000,$B$5),INDEX(GPS_IMPORT!$2:$10000,MATCH($B$5,(GPS_IMPORT!$A$2:$A$10000),0)+ROWS($1:7)-1,COLUMN()-1),0)","v":" 3.10.2019"},{"$f":"IF(ROWS(GPS_IMPORT!$1:7)<=COUNTIF(GPS_IMPORT!$A$2:$A$10000,$B$5),INDEX(GPS_IMPORT!$2:$10000,MATCH($B$5,(GPS_IMPORT!$A$2:$A$10000),0)+ROWS($1:7)-1,COLUMN()-1),0)","v":"00:38:25"},{"$f":"IF(ROWS(GPS_IMPORT!$1:7)<=COUNTIF(GPS_IMPORT!$A$2:$A$10000,$B$5),INDEX(GPS_IMPORT!$2:$10000,MATCH($B$5,(GPS_IMPORT!$A$2:$A$10000),0)+ROWS($1:7)-1,COLUMN()-1),0)","v":376931.96649999998},{"$f":"IF(ROWS(GPS_IMPORT!$1:7)<=COUNTIF(GPS_IMPORT!$A$2:$A$10000,$B$5),INDEX(GPS_IMPORT!$2:$10000,MATCH($B$5,(GPS_IMPORT!$A$2:$A$10000),0)+ROWS($1:7)-1,COLUMN()-1),0)","v":2458075.5959999999},{"$f":"IF(ROWS(GPS_IMPORT!$1:7)<=COUNTIF(GPS_IMPORT!$A$2:$A$10000,$B$5),INDEX(GPS_IMPORT!$2:$10000,MATCH($B$5,(GPS_IMPORT!$A$2:$A$10000),0)+ROWS($1:7)-1,COLUMN()-1),0)","v":1021.851454},2.1583333727903664E-3,2.1666670218110085E-3,1.9529166665961384E-3,true]
[8,{"$f":"IF(ROWS(GPS_IMPORT!$1:8)<=COUNTIF(GPS_IMPORT!$A$2:$A$10000,$B$5),INDEX(GPS_IMPORT!$2:$10000,MATCH($B$5,(GPS_IMPORT!$A$2:$A$10000),0)+ROWS($1:8)-1,COLUMN()-1),0)","v":"CNTL1"},{"$f":"IF(ROWS(GPS_IMPORT!$1:8)<=COUNTIF(GPS_IMPORT!$A$2:$A$10000,$B$5),INDEX(GPS_IMPORT!$2:$10000,MATCH($B$5,(GPS_IMPORT!$A$2:$A$10000),0)+ROWS($1:8)-1,COLUMN()-1),0)","v":" 3.10.2019"},{"$f":"IF(ROWS(GPS_IMPORT!$1:8)<=COUNTIF(GPS_IMPORT!$A$2:$A$10000,$B$5),INDEX(GPS_IMPORT!$2:$10000,MATCH($B$5,(GPS_IMPORT!$A$2:$A$10000),0)+ROWS($1:8)-1,COLUMN()-1),0)","v":"00:38:35"},{"$f":"IF(ROWS(GPS_IMPORT!$1:8)<=COUNTIF(GPS_IMPORT!$A$2:$A$10000,$B$5),INDEX(GPS_IMPORT!$2:$10000,MATCH($B$5,(GPS_IMPORT!$A$2:$A$10000),0)+ROWS($1:8)-1,COLUMN()-1),0)","v":376931.96539999999},{"$f":"IF(ROWS(GPS_IMPORT!$1:8)<=COUNTIF(GPS_IMPORT!$A$2:$A$10000,$B$5),INDEX(GPS_IMPORT!$2:$10000,MATCH($B$5,(GPS_IMPORT!$A$2:$A$10000),0)+ROWS($1:8)-1,COLUMN()-1),0)","v":2458075.5980000002},{"$f":"IF(ROWS(GPS_IMPORT!$1:8)<=COUNTIF(GPS_IMPORT!$A$2:$A$10000,$B$5),INDEX(GPS_IMPORT!$2:$10000,MATCH($B$5,(GPS_IMPORT!$A$2:$A$10000),0)+ROWS($1:8)-1,COLUMN()-1),0)","v":1021.848056},3.2583333668299019E-3,1.6666669398546219E-4,5.3509166665435259E-3,true]
[9,{"$f":"IF(ROWS(GPS_IMPORT!$1:9)<=COUNTIF(GPS_IMPORT!$A$2:$A$10000,$B$5),INDEX(GPS_IMPORT!$2:$10000,MATCH($B$5,(GPS_IMPORT!$A$2:$A$10000),0)+ROWS($1:9)-1,COLUMN()-1),0)","v":"CNTL1"},{"$f":"IF(ROWS(GPS_IMPORT!$1:9)<=COUNTIF(GPS_IMPORT!$A$2:$A$10000,$B$5),INDEX(GPS_IMPORT!$2:$10000,MATCH($B$5,(GPS_IMPORT!$A$2:$A$10000),0)+ROWS($1:9)-1,COLUMN()-1),0)","v":" 3.10.2019"},{"$f":"IF(ROWS(GPS_IMPORT!$1:9)<=COUNTIF(GPS_IMPORT!$A$2:$A$10000,$B$5),INDEX(GPS_IMPORT!$2:$10000,MATCH($B$5,(GPS_IMPORT!$A$2:$A$10000),0)+ROWS($1:9)-1,COLUMN()-1),0)","v":"00:38:50"},{"$f":"IF(ROWS(GPS_IMPORT!$1:9)<=COUNTIF(GPS_IMPORT!$A$2:$A$10000,$B$5),INDEX(GPS_IMPORT!$2:$10000,MATCH($B$5,(GPS_IMPORT!$A$2:$A$10000),0)+ROWS($1:9)-1,COLUMN()-1),0)","v":376931.97090000001},{"$f":"IF(ROWS(GPS_IMPORT!$1:9)<=COUNTIF(GPS_IMPORT!$A$2:$A$10000,$B$5),INDEX(GPS_IMPORT!$2:$10000,MATCH($B$5,(GPS_IMPORT!$A$2:$A$10000),0)+ROWS($1:9)-1,COLUMN()-1),0)","v":2458075.6009999998},{"$f":"IF(ROWS(GPS_IMPORT!$1:9)<=COUNTIF(GPS_IMPORT!$A$2:$A$10000,$B$5),INDEX(GPS_IMPORT!$2:$10000,MATCH($B$5,(GPS_IMPORT!$A$2:$A$10000),0)+ROWS($1:9)-1,COLUMN()-1),0)","v":1021.834984},-2.2416666615754366E-3,-2.8333328664302826E-3,1.8422916666622768E-2,true]
[10,{"$f":"IF(ROWS(GPS_IMPORT!$1:10)<=COUNTIF(GPS_IMPORT!$A$2:$A$10000,$B$5),INDEX(GPS_IMPORT!$2:$10000,MATCH($B$5,(GPS_IMPORT!$A$2:$A$10000),0)+ROWS($1:10)-1,COLUMN()-1),0)","v":"CNTL1"},{"$f":"IF(ROWS(GPS_IMPORT!$1:10)<=COUNTIF(GPS_IMPORT!$A$2:$A$10000,$B$5),INDEX(GPS_IMPORT!$2:$10000,MATCH($B$5,(GPS_IMPORT!$A$2:$A$10000),0)+ROWS($1:10)-1,COLUMN()-1),0)","v":" 3.10.2019"},{"$f":"IF(ROWS(GPS_IMPORT!$1:10)<=COUNTIF(GPS_IMPORT!$A$2:$A$10000,$B$5),INDEX(GPS_IMPORT!$2:$10000,MATCH($B$5,(GPS_IMPORT!$A$2:$A$10000),0)+ROWS($1:10)-1,COLUMN()-1),0)","v":"00:39:00"},{"$f":"IF(ROWS(GPS_IMPORT!$1:10)<=COUNTIF(GPS_IMPORT!$A$2:$A$10000,$B$5),INDEX(GPS_IMPORT!$2:$10000,MATCH($B$5,(GPS_IMPORT!$A$2:$A$10000),0)+ROWS($1:10)-1,COLUMN()-1),0)","v":376931.97139999998},{"$f":"IF(ROWS(GPS_IMPORT!$1:10)<=COUNTIF(GPS_IMPORT!$A$2:$A$10000,$B$5),INDEX(GPS_IMPORT!$2:$10000,MATCH($B$5,(GPS_IMPORT!$A$2:$A$10000),0)+ROWS($1:10)-1,COLUMN()-1),0)","v":2458075.6},{"$f":"IF(ROWS(GPS_IMPORT!$1:10)<=COUNTIF(GPS_IMPORT!$A$2:$A$10000,$B$5),INDEX(GPS_IMPORT!$2:$10000,MATCH($B$5,(GPS_IMPORT!$A$2:$A$10000),0)+ROWS($1:10)-1,COLUMN()-1),0)","v":1021.838636},-2.7416666271165013E-3,-1.8333331681787968E-3,1.4770916666634548E-2,true]
[11,{"$f":"IF(ROWS(GPS_IMPORT!$1:11)<=COUNTIF(GPS_IMPORT!$A$2:$A$10000,$B$5),INDEX(GPS_IMPORT!$2:$10000,MATCH($B$5,(GPS_IMPORT!$A$2:$A$10000),0)+ROWS($1:11)-1,COLUMN()-1),0)","v":"CNTL1"},{"$f":"IF(ROWS(GPS_IMPORT!$1:11)<=COUNTIF(GPS_IMPORT!$A$2:$A$10000,$B$5),INDEX(GPS_IMPORT!$2:$10000,MATCH($B$5,(GPS_IMPORT!$A$2:$A$10000),0)+ROWS($1:11)-1,COLUMN()-1),0)","v":" 3.10.2019"},{"$f":"IF(ROWS(GPS_IMPORT!$1:11)<=COUNTIF(GPS_IMPORT!$A$2:$A$10000,$B$5),INDEX(GPS_IMPORT!$2:$10000,MATCH($B$5,(GPS_IMPORT!$A$2:$A$10000),0)+ROWS($1:11)-1,COLUMN()-1),0)","v":"00:39:11.200"},{"$f":"IF(ROWS(GPS_IMPORT!$1:11)<=COUNTIF(GPS_IMPORT!$A$2:$A$10000,$B$5),INDEX(GPS_IMPORT!$2:$10000,MATCH($B$5,(GPS_IMPORT!$A$2:$A$10000),0)+ROWS($1:11)-1,COLUMN()-1),0)","v":376931.97090000001},{"$f":"IF(ROWS(GPS_IMPORT!$1:11)<=COUNTIF(GPS_IMPORT!$A$2:$A$10000,$B$5),INDEX(GPS_IMPORT!$2:$10000,MATCH($B$5,(GPS_IMPORT!$A$2:$A$10000),0)+ROWS($1:11)-1,COLUMN()-1),0)","v":2458075.6009999998},{"$f":"IF(ROWS(GPS_IMPORT!$1:11)<=COUNTIF(GPS_IMPORT!$A$2:$A$10000,$B$5),INDEX(GPS_IMPORT!$2:$10000,MATCH($B$5,(GPS_IMPORT!$A$2:$A$10000),0)+ROWS($1:11)-1,COLUMN()-1),0)","v":1021.840596},-2.2416666615754366E-3,-2.8333328664302826E-3,1.2810916666580852E-2,true]
[12,{"$f":"IF(ROWS(GPS_IMPORT!$1:12)<=COUNTIF(GPS_IMPORT!$A$2:$A$10000,$B$5),INDEX(GPS_IMPORT!$2:$10000,MATCH($B$5,(GPS_IMPORT!$A$2:$A$10000),0)+ROWS($1:12)-1,COLUMN()-1),0)","v":"CNTL1"},{"$f":"IF(ROWS(GPS_IMPORT!$1:12)<=COUNTIF(GPS_IMPORT!$A$2:$A$10000,$B$5),INDEX(GPS_IMPORT!$2:$10000,MATCH($B$5,(GPS_IMPORT!$A$2:$A$10000),0)+ROWS($1:12)-1,COLUMN()-1),0)","v":" 3.10.2019"},{"$f":"IF(ROWS(GPS_IMPORT!$1:12)<=COUNTIF(GPS_IMPORT!$A$2:$A$10000,$B$5),INDEX(GPS_IMPORT!$2:$10000,MATCH($B$5,(GPS_IMPORT!$A$2:$A$10000),0)+ROWS($1:12)-1,COLUMN()-1),0)","v":"00:39:23.900"},{"$f":"IF(ROWS(GPS_IMPORT!$1:12)<=COUNTIF(GPS_IMPORT!$A$2:$A$10000,$B$5),INDEX(GPS_IMPORT!$2:$10000,MATCH($B$5,(GPS_IMPORT!$A$2:$A$10000),0)+ROWS($1:12)-1,COLUMN()-1),0)","v":376931.96860000002},{"$f":"IF(ROWS(GPS_IMPORT!$1:12)<=COUNTIF(GPS_IMPORT!$A$2:$A$10000,$B$5),INDEX(GPS_IMPORT!$2:$10000,MATCH($B$5,(GPS_IMPORT!$A$2:$A$10000),0)+ROWS($1:12)-1,COLUMN()-1),0)","v":2458075.602},{"$f":"IF(ROWS(GPS_IMPORT!$1:12)<=COUNTIF(GPS_IMPORT!$A$2:$A$10000,$B$5),INDEX(GPS_IMPORT!$2:$10000,MATCH($B$5,(GPS_IMPORT!$A$2:$A$10000),0)+ROWS($1:12)-1,COLUMN()-1),0)","v":1021.843629},5.8333331253379583E-5,-3.8333330303430557E-3,9.7779166666214223E-3,true]
[13,{"$f":"IF(ROWS(GPS_IMPORT!$1:13)<=COUNTIF(GPS_IMPORT!$A$2:$A$10000,$B$5),INDEX(GPS_IMPORT!$2:$10000,MATCH($B$5,(GPS_IMPORT!$A$2:$A$10000),0)+ROWS($1:13)-1,COLUMN()-1),0)","v":0},{"$f":"IF(ROWS(GPS_IMPORT!$1:13)<=COUNTIF(GPS_IMPORT!$A$2:$A$10000,$B$5),INDEX(GPS_IMPORT!$2:$10000,MATCH($B$5,(GPS_IMPORT!$A$2:$A$10000),0)+ROWS($1:13)-1,COLUMN()-1),0)","v":"00:00:00"},{"$f":"IF(ROWS(GPS_IMPORT!$1:13)<=COUNTIF(GPS_IMPORT!$A$2:$A$10000,$B$5),INDEX(GPS_IMPORT!$2:$10000,MATCH($B$5,(GPS_IMPORT!$A$2:$A$10000),0)+ROWS($1:13)-1,COLUMN()-1),0)","v":"00:00:00"},{"$f":"IF(ROWS(GPS_IMPORT!$1:13)<=COUNTIF(GPS_IMPORT!$A$2:$A$10000,$B$5),INDEX(GPS_IMPORT!$2:$10000,MATCH($B$5,(GPS_IMPORT!$A$2:$A$10000),0)+ROWS($1:13)-1,COLUMN()-1),0)","v":0},{"$f":"IF(ROWS(GPS_IMPORT!$1:13)<=COUNTIF(GPS_IMPORT!$A$2:$A$10000,$B$5),INDEX(GPS_IMPORT!$2:$10000,MATCH($B$5,(GPS_IMPORT!$A$2:$A$10000),0)+ROWS($1:13)-1,COLUMN()-1),0)","v":0},{"$f":"IF(ROWS(GPS_IMPORT!$1:13)<=COUNTIF(GPS_IMPORT!$A$2:$A$10000,$B$5),INDEX(GPS_IMPORT!$2:$10000,MATCH($B$5,(GPS_IMPORT!$A$2:$A$10000),0)+ROWS($1:13)-1,COLUMN()-1),0)","v":0},{"$f":"IF(E19>0,E$22-E19,0)","v":0},0,0,false]
[14,{"$f":"IF(ROWS(GPS_IMPORT!$1:14)<=COUNTIF(GPS_IMPORT!$A$2:$A$10000,$B$5),INDEX(GPS_IMPORT!$2:$10000,MATCH($B$5,(GPS_IMPORT!$A$2:$A$10000),0)+ROWS($1:14)-1,COLUMN()-1),0)","v":0},{"$f":"IF(ROWS(GPS_IMPORT!$1:14)<=COUNTIF(GPS_IMPORT!$A$2:$A$10000,$B$5),INDEX(GPS_IMPORT!$2:$10000,MATCH($B$5,(GPS_IMPORT!$A$2:$A$10000),0)+ROWS($1:14)-1,COLUMN()-1),0)","v":"00:00:00"},{"$f":"IF(ROWS(GPS_IMPORT!$1:14)<=COUNTIF(GPS_IMPORT!$A$2:$A$10000,$B$5),INDEX(GPS_IMPORT!$2:$10000,MATCH($B$5,(GPS_IMPORT!$A$2:$A$10000),0)+ROWS($1:14)-1,COLUMN()-1),0)","v":"00:00:00"},{"$f":"IF(ROWS(GPS_IMPORT!$1:14)<=COUNTIF(GPS_IMPORT!$A$2:$A$10000,$B$5),INDEX(GPS_IMPORT!$2:$10000,MATCH($B$5,(GPS_IMPORT!$A$2:$A$10000),0)+ROWS($1:14)-1,COLUMN()-1),0)","v":0},{"$f":"IF(ROWS(GPS_IMPORT!$1:14)<=COUNTIF(GPS_IMPORT!$A$2:$A$10000,$B$5),INDEX(GPS_IMPORT!$2:$10000,MATCH($B$5,(GPS_IMPORT!$A$2:$A$10000),0)+ROWS($1:14)-1,COLUMN()-1),0)","v":0},{"$f":"IF(ROWS(GPS_IMPORT!$1:14)<=COUNTIF(GPS_IMPORT!$A$2:$A$10000,$B$5),INDEX(GPS_IMPORT!$2:$10000,MATCH($B$5,(GPS_IMPORT!$A$2:$A$10000),0)+ROWS($1:14)-1,COLUMN()-1),0)","v":0},0,0,0,false]
[15,{"$f":"IF(ROWS(GPS_IMPORT!$1:15)<=COUNTIF(GPS_IMPORT!$A$2:$A$10000,$B$5),INDEX(GPS_IMPORT!$2:$10000,MATCH($B$5,(GPS_IMPORT!$A$2:$A$10000),0)+ROWS($1:15)-1,COLUMN()-1),0)","v":0},{"$f":"IF(ROWS(GPS_IMPORT!$1:15)<=COUNTIF(GPS_IMPORT!$A$2:$A$10000,$B$5),INDEX(GPS_IMPORT!$2:$10000,MATCH($B$5,(GPS_IMPORT!$A$2:$A$10000),0)+ROWS($1:15)-1,COLUMN()-1),0)","v":"00:00:00"},{"$f":"IF(ROWS(GPS_IMPORT!$1:15)<=COUNTIF(GPS_IMPORT!$A$2:$A$10000,$B$5),INDEX(GPS_IMPORT!$2:$10000,MATCH($B$5,(GPS_IMPORT!$A$2:$A$10000),0)+ROWS($1:15)-1,COLUMN()-1),0)","v":"00:00:00"},{"$f":"IF(ROWS(GPS_IMPORT!$1:15)<=COUNTIF(GPS_IMPORT!$A$2:$A$10000,$B$5),INDEX(GPS_IMPORT!$2:$10000,MATCH($B$5,(GPS_IMPORT!$A$2:$A$10000),0)+ROWS($1:15)-1,COLUMN()-1),0)","v":0},{"$f":"IF(ROWS(GPS_IMPORT!$1:15)<=COUNTIF(GPS_IMPORT!$A$2:$A$10000,$B$5),INDEX(GPS_IMPORT!$2:$10000,MATCH($B$5,(GPS_IMPORT!$A$2:$A$10000),0)+ROWS($1:15)-1,COLUMN()-1),0)","v":0},{"$f":"IF(ROWS(GPS_IMPORT!$1:15)<=COUNTIF(GPS_IMPORT!$A$2:$A$10000,$B$5),INDEX(GPS_IMPORT!$2:$10000,MATCH($B$5,(GPS_IMPORT!$A$2:$A$10000),0)+ROWS($1:15)-1,COLUMN()-1),0)","v":0},0,0,0,false]
[null,null,null,"AVERAGE",{"$f":"(IF($K$7=TRUE,E7,0)+IF($K$8=TRUE,E8,0)+IF($K$9=TRUE,E9,0)+IF($K$10=TRUE,E10,0)+IF($K$11=TRUE,E11,0)+IF($K$12=TRUE,E12,0)+IF($K$13=TRUE,E13,0)+IF($K$14=TRUE,E14,0)+IF($K$15=TRUE,E15,0)+IF($K$16=TRUE,E16,0)+IF($K$17=TRUE,E17,0)+IF($K$18=TRUE,E18,0)+IF($K$19=TRUE,E19,0)+IF($K$20=TRUE,E20,0)+IF($K$21=TRUE,E21,0))/(IF($K$7=TRUE,1,0)+IF($K$8=TRUE,1,0)+IF($K$9=TRUE,1,0)+IF($K$10=TRUE,1,0)+IF($K$11=TRUE,1,0)+IF($K$12=TRUE,1,0)+IF($K$13=TRUE,1,0)+IF($K$14=TRUE,1,0)+IF($K$15=TRUE,1,0)+IF($K$16=TRUE,1,0)+IF($K$17=TRUE,1,0)+IF($K$18=TRUE,1,0)+IF($K$19=TRUE,1,0)+IF($K$20=TRUE,1,0)+IF($K$21=TRUE,1,0))","v":376931.96865833335},{"$f":"(IF($K$7=TRUE,F7,0)+IF($K$8=TRUE,F8,0)+IF($K$9=TRUE,F9,0)+IF($K$10=TRUE,F10,0)+IF($K$11=TRUE,F11,0)+IF($K$12=TRUE,F12,0)+IF($K$13=TRUE,F13,0)+IF($K$14=TRUE,F14,0)+IF($K$15=TRUE,F15,0)+IF($K$16=TRUE,F16,0)+IF($K$17=TRUE,F17,0)+IF($K$18=TRUE,F18,0)+IF($K$19=TRUE,F19,0)+IF($K$20=TRUE,F20,0)+IF($K$21=TRUE,F21,0))/(IF($K$7=TRUE,1,0)+IF($K$8=TRUE,1,0)+IF($K$9=TRUE,1,0)+IF($K$10=TRUE,1,0)+IF($K$11=TRUE,1,0)+IF($K$12=TRUE,1,0)+IF($K$13=TRUE,1,0)+IF($K$14=TRUE,1,0)+IF($K$15=TRUE,1,0)+IF($K$16=TRUE,1,0)+IF($K$17=TRUE,1,0)+IF($K$18=TRUE,1,0)+IF($K$19=TRUE,1,0)+IF($K$20=TRUE,1,0)+IF($K$21=TRUE,1,0))","v":2458075.5981666669},{"$f":"(IF($K$7=TRUE,G7,0)+IF($K$8=TRUE,G8,0)+IF($K$9=TRUE,G9,0)+IF($K$10=TRUE,G10,0)+IF($K$11=TRUE,G11,0)+IF($K$12=TRUE,G12,0)+IF($K$13=TRUE,G13,0)+IF($K$14=TRUE,G14,0)+IF($K$15=TRUE,G15,0)+IF($K$16=TRUE,G16,0)+IF($K$17=TRUE,G17,0)+IF($K$18=TRUE,G18,0)+IF($K$19=TRUE,G19,0)+IF($K$20=TRUE,G20,0)+IF($K$21=TRUE,G21,0))/\n(IF($K$7=TRUE,1,0)+IF($K$8=TRUE,1,0)+IF($K$9=TRUE,1,0)+IF($K$10=TRUE,1,0)+IF($K$11=TRUE,1,0)+IF($K$12=TRUE,1,0)+IF($K$13=TRUE,1,0)+IF($K$14=TRUE,1,0)+IF($K$15=TRUE,1,0)+IF($K$16=TRUE,1,0)+IF($K$17=TRUE,1,0)+IF($K$18=TRUE,1,0)+IF($K$19=TRUE,1,0)+IF($K$20=TRUE,1,0)+IF($K$21=TRUE,1,0))","v":1021.8534069166666},"RMSE:","RMSE:","RMSE:"]
[null,null,null,null,null,null,"RMSE IN US SURVEY FEET:",{"$f":"SQRT((\n(IF($K$7=TRUE,H7^2,0))+(IF($K$8=TRUE,H8^2,0))+(IF($K$9=TRUE,H9^2,0))+(IF($K$10=TRUE,H10^2,0))+(IF($K$11=TRUE,H11^2,0))+(IF($K$12=TRUE,H12^2,0))+(IF($K$13=TRUE,H13^2,0))+(IF($K$14=TRUE,H14^2,0))+(IF($K$15=TRUE,H15^2,0))+(IF($K$16=TRUE,H16^2,0))+(IF($K$17=TRUE,H17^2,0))+(IF($K$18=TRUE,H18^2,0))+(IF($K$19=TRUE,H19^2,0))+(IF($K$20=TRUE,H20^2,0))+(IF($K$21=TRUE,H21^2,0)))/\n(IF($K$7=TRUE,1,0)+IF($K$8=TRUE,1,0)+IF($K$9=TRUE,1,0)+IF($K$10=TRUE,1,0)+IF($K$11=TRUE,1,0)+IF($K$12=TRUE,1,0)+IF($K$13=TRUE,1,0)+IF($K$14=TRUE,1,0)+IF($K$15=TRUE,1,0)+IF($K$16=TRUE,1,0)+IF($K$17=TRUE,1,0)+IF($K$18=TRUE,1,0)+IF($K$19=TRUE,1,0)+IF($K$20=TRUE,1,0)+IF($K$21=TRUE,1,0)))","v":2.4305206360579158E-3},{"$f":"SQRT((\n(IF($K$7=TRUE,I7^2,0))+(IF($K$8=TRUE,I8^2,0))+(IF($K$9=TRUE,I9^2,0))+(IF($K$10=TRUE,I10^2,0))+(IF($K$11=TRUE,I11^2,0))+(IF($K$12=TRUE,I12^2,0))+(IF($K$13=TRUE,I13^2,0))+(IF($K$14=TRUE,I14^2,0))+(IF($K$15=TRUE,I15^2,0))+(IF($K$16=TRUE,I16^2,0))+(IF($K$17=TRUE,I17^2,0))+(IF($K$18=TRUE,I18^2,0))+(IF($K$19=TRUE,I19^2,0))+(IF($K$20=TRUE,I20^2,0))+(IF($K$21=TRUE,I21^2,0)))/\n(IF($K$7=TRUE,1,0)+IF($K$8=TRUE,1,0)+IF($K$9=TRUE,1,0)+IF($K$10=TRUE,1,0)+IF($K$11=TRUE,1,0)+IF($K$12=TRUE,1,0)+IF($K$13=TRUE,1,0)+IF($K$14=TRUE,1,0)+IF($K$15=TRUE,1,0)+IF($K$16=TRUE,1,0)+IF($K$17=TRUE,1,0)+IF($K$18=TRUE,1,0)+IF($K$19=TRUE,1,0)+IF($K$20=TRUE,1,0)+IF($K$21=TRUE,1,0)))","v":3.4840908316433081E-3},{"$f":"SQRT((\n(IF($K$7=TRUE,J7^2,0))+(IF($K$8=TRUE,J8^2,0))+(IF($K$9=TRUE,J9^2,0))+(IF($K$10=TRUE,J10^2,0))+(IF($K$11=TRUE,J11^2,0))+(IF($K$12=TRUE,J12^2,0))+(IF($K$13=TRUE,J13^2,0))+(IF($K$14=TRUE,J14^2,0))+(IF($K$15=TRUE,J15^2,0))+(IF($K$16=TRUE,J16^2,0))+(IF($K$17=TRUE,J17^2,0))+(IF($K$18=TRUE,J18^2,0))+(IF($K$19=TRUE,J19^2,0))+(IF($K$20=TRUE,J20^2,0))+(IF($K$21=TRUE,J21^2,0)))/\n(IF($K$7=TRUE,1,0)+IF($K$8=TRUE,1,0)+IF($K$9=TRUE,1,0)+IF($K$10=TRUE,1,0)+IF($K$11=TRUE,1,0)+IF($K$12=TRUE,1,0)+IF($K$13=TRUE,1,0)+IF($K$14=TRUE,1,0)+IF($K$15=TRUE,1,0)+IF($K$16=TRUE,1,0)+IF($K$17=TRUE,1,0)+IF($K$18=TRUE,1,0)+IF($K$19=TRUE,1,0)+IF($K$20=TRUE,1,0)+IF($K$21=TRUE,1,0)))","v":1.181772715358253E-2}]
[null,null,null,1]
[null,null,"UNITLESS GRID TO GROUND MULTIPLIER",{"$f":"IF(REPORT!C13=\"n/a\",\"0.00000000\",REPORT!C13)","v":1.0000901799999999},null,null,null,{"$f":"IF(H23<=0.029,\"PASS\",\"FAIL\")","v":"PASS"},{"$f":"IF(I23<=0.029,\"PASS\",\"FAIL\")","v":"PASS"},{"$f":"IF(J23<=0.039,\"PASS\",\"FAIL\")","v":"PASS"}]
[]
["AVERAGED GPS-DERIVED POSITION",null,null,null,null,null,null,null,"Notes:"]
[null,"MONUMENT COORDINATES",null,"NORTHING","EASTING","ORTHO HEIGHT"]
[null,"US Survey Feet (GRID)",null,{"$f":"$E$22","v":376931.96865833335},{"$f":"$F$22","v":2458075.5981666669},{"$f":"$G$22","v":1021.8534069166666}]
[]
["LEVELED ELEVATION"]
["US SURVEY FEET",null,{"$f":"IFERROR(VLOOKUP(B5,'LEVEL RUN'!A8:I59,9,FALSE),\"N/A\")","v":1021.853},"(Type the leveled elevation or N/A if no leveled elevation is available)"]
["MONUMENT HELD",null,null,"(Type the monument name from which leveling originated)"]
["LEVELED ELEVATION - GPS DERIVED ELEVATION   = ",null,null,null,{"$f":"IF(C32=\"N/A\",\"N/A\",C32-(F29*D24))","v":-4.0691666663406068E-4}]
[]
["FINAL MONUMENT COORDINATES"]
[null,"MONUMENT COORDINATES",null,"NORTHING","EASTING","ELEVATION","FEATURE CODE"]
[null,"US SURVEY FEET (GRID)",null,{"$f":"$E$22*$D$24","v":376931.96865833335},{"$f":"$F$22*$D$24","v":2458075.5981666669},{"$f":"IF($C$32=\"N/A\",($G$22*$D$24),$C$32)","v":1021.853},{"$f":"VLOOKUP($B$5,GPS_IMPORT!$A$2:$G$2000,7,FALSE)","v":"IPINS"}]
[null,"US SURVEY FEET (GROUND)",null,{"$f":"$D$38*$D$25","v":376965.96038326697},{"$f":"$E$38*$D$25","v":2458297.2674241094},{"$f":"IF($C$32=\"N/A\",($G$22*$D$24),$C$32)","v":1021.853},{"$f":"G38","v":"IPINS"}]
[]
["∆ North,  ∆ East, and ∆ Ht. are the difference between the average northing, easting, and height for each observation.",null,null,null,null,null,null,null,"Mask Angle:","10°"]

{"sheet":"CNTL2","index":13,"n_rows":41,"n_cols":11,"rows_kept":41,"cut":false,"hidden":false,"merged":[[0,0,0,10],[26,0,26,6],[27,1,27,2],[27,8,38,10],[28,1,28,2],[30,0,30,6],[35,0,35,6],[36,1,36,2],[37,1,37,2],[38,1,38,2]]}
["VRS GNSS Project Control Monument Coordinate Analysis"]
[]
["Project:",{"$f":"REPORT!B2","v":"FRA-71-29.4"},"GPS Antenna:","LEICA GS14",null,null,null,null,null,"Report Date:",{"$f":"REPORT!C49","v":"2019-04-25"}]
["PID:",{"$f":"REPORT!E2","v":106471},"VRS Network:","ODOT VRS",null,null,null,null,null,"Prepared By:",{"$f":"REPORT!C48","v":"Kolton Wilson"}]
["Point ID:","CNTL2","No. of Sessions:",{"$f":"COUNTIF(GPS_IMPORT!A2:A1000,$B$5)","v":12},null,null,null,null,null,"Checked By:",{"$f":"REPORT!C52","v":"David Ogden"}]
["SESSION #","Point","Observation Date","Start Time","Northing(sft)","Easting(sft)","Height(sft)","∆ Northing(sft)","∆ Easting(sft)","∆ Height(sft)","Include in Solution?"]
[1,{"$f":"IF(ROWS(GPS_IMPORT!$1:1)<=COUNTIF(GPS_IMPORT!$A$2:$A$10000,$B$5),INDEX(GPS_IMPORT!$2:$10000,MATCH($B$5,(GPS_IMPORT!$A$2:$A$10000),0)+ROWS($1:1)-1,COLUMN()-1),0)","v":"CNTL2"},{"$f":"IF(ROWS(GPS_IMPORT!$1:1)<=COUNTIF(GPS_IMPORT!$A$2:$A$10000,$B$5),INDEX(GPS_IMPORT!$2:$10000,MATCH($B$5,(GPS_IMPORT!$A$2:$A$10000),0)+ROWS($1:1)-1,COLUMN()-1),0)","v":" 3.10.2019"},{"$f":"IF(ROWS(GPS_IMPORT!$1:1)<=COUNTIF(GPS_IMPORT!$A$2:$A$10000,$B$5),INDEX(GPS_IMPORT!$2:$10000,MATCH($B$5,(GPS_IMPORT!$A$2:$A$10000),0)+ROWS($1:1)-1,COLUMN()-1),0)","v":"00:41:43.100"},{"$f":"IF(ROWS(GPS_IMPORT!$1:1)<=COUNTIF(GPS_IMPORT!$A$2:$A$10000,$B$5),INDEX(GPS_IMPORT!$2:$10000,MATCH($B$5,(GPS_IMPORT!$A$2:$A$10000),0)+ROWS($1:1)-1,COLUMN()-1),0)","v":376988.95510000002},{"$f":"IF(ROWS(GPS_IMPORT!$1:1)<=COUNTIF(GPS_IMPORT!$A$2:$A$10000,$B$5),INDEX(GPS_IMPORT!$2:$10000,MATCH($B$5,(GPS_IMPORT!$A$2:$A$10000),0)+ROWS($1:1)-1,COLUMN()-1),0)","v":2458323.44},{"$f":"IF(ROWS(GPS_IMPORT!$1:1)<=COUNTIF(GPS_IMPORT!$A$2:$A$10000,$B$5),INDEX(GPS_IMPORT!$2:$10000,MATCH($B$5,(GPS_IMPORT!$A$2:$A$10000),0)+ROWS($1:1)-1,COLUMN()-1),0)","v":1012.8453919999999},{"$f":"IF(E7>0,E$22-E7,0)","v":2.3750000400468707E-3},7.4166669510304928E-3,3.0995083333323237E-2,true]
[2,{"$f":"IF(ROWS(GPS_IMPORT!$1:2)<=COUNTIF(GPS_IMPORT!$A$2:$A$10000,$B$5),INDEX(GPS_IMPORT!$2:$10000,MATCH($B$5,(GPS_IMPORT!$A$2:$A$10000),0)+ROWS($1:2)-1,COLUMN()-1),0)","v":"CNTL2"},{"$f":"IF(ROWS(GPS_IMPORT!$1:2)<=COUNTIF(GPS_IMPORT!$A$2:$A$10000,$B$5),INDEX(GPS_IMPORT!$2:$10000,MATCH($B$5,(GPS_IMPORT!$A$2:$A$10000),0)+ROWS($1:2)-1,COLUMN()-1),0)","v":" 3.10.2019"},{"$f":"IF(ROWS(GPS_IMPORT!$1:2)<=COUNTIF(GPS_IMPORT!$A$2:$A$10000,$B$5),INDEX(GPS_IMPORT!$2:$10000,MATCH($B$5,(GPS_IMPORT!$A$2:$A$10000),0)+ROWS($1:2)-1,COLUMN()-1),0)","v":"00:41:56.400"},{"$f":"IF(ROWS(GPS_IMPORT!$1:2)<=COUNTIF(GPS_IMPORT!$A$2:$A$10000,$B$5),INDEX(GPS_IMPORT!$2:$10000,MATCH($B$5,(GPS_IMPORT!$A$2:$A$10000),0)+ROWS($1:2)-1,COLUMN()-1),0)","v":376988.95870000002},{"$f":"IF(ROWS(GPS_IMPORT!$1:2)<=COUNTIF(GPS_IMPORT!$A$2:$A$10000,$B$5),INDEX(GPS_IMPORT!$2:$10000,MATCH($B$5,(GPS_IMPORT!$A$2:$A$10000),0)+ROWS($1:2)-1,COLUMN()-1),0)","v":2458323.446},{"$f":"IF(ROWS(GPS_IMPORT!$1:2)<=COUNTIF(GPS_IMPORT!$A$2:$A$10000,$B$5),INDEX(GPS_IMPORT!$2:$10000,MATCH($B$5,(GPS_IMPORT!$A$2:$A$10000),0)+ROWS($1:2)-1,COLUMN()-1),0)","v":1012.862208},-1.2249999563209713E-3,1.4166668988764286E-3,1.4179083333260678E-2,true]
[3,{"$f":"IF(ROWS(GPS_IMPORT!$1:3)<=COUNTIF(GPS_IMPORT!$A$2:$A$10000,$B$5),INDEX(GPS_IMPORT!$2:$10000,MATCH($B$5,(GPS_IMPORT!$A$2:$A$10000),0)+ROWS($1:3)-1,COLUMN()-1),0)","v":"CNTL2"},{"$f":"IF(ROWS(GPS_IMPORT!$1:3)<=COUNTIF(GPS_IMPORT!$A$2:$A$10000,$B$5),INDEX(GPS_IMPORT!$2:$10000,MATCH($B$5,(GPS_IMPORT!$A$2:$A$10000),0)+ROWS($1:3)-1,COLUMN()-1),0)","v":" 3.10.2019"},{"$f":"IF(ROWS(GPS_IMPORT!$1:3)<=COUNTIF(GPS_IMPORT!$A$2:$A$10000,$B$5),INDEX(GPS_IMPORT!$2:$10000,MATCH($B$5,(GPS_IMPORT!$A$2:$A$10000),0)+ROWS($1:3)-1,COLUMN()-1),0)","v":"00:42:08.100"},{"$f":"IF(ROWS(GPS_IMPORT!$1:3)<=COUNTIF(GPS_IMPORT!$A$2:$A$10000,$B$5),INDEX(GPS_IMPORT!$2:$10000,MATCH($B$5,(GPS_IMPORT!$A$2:$A$10000),0)+ROWS($1:3)-1,COLUMN()-1),0)","v":376988.95649999997},{"$f":"IF(ROWS(GPS_IMPORT!$1:3)<=COUNTIF(GPS_IMPORT!$A$2:$A$10000,$B$5),INDEX(GPS_IMPORT!$2:$10000,MATCH($B$5,(GPS_IMPORT!$A$2:$A$10000),0)+ROWS($1:3)-1,COLUMN()-1),0)","v":2458323.449},{"$f":"IF(ROWS(GPS_IMPORT!$1:3)<=COUNTIF(GPS_IMPORT!$A$2:$A$10000,$B$5),INDEX(GPS_IMPORT!$2:$10000,MATCH($B$5,(GPS_IMPORT!$A$2:$A$10000),0)+ROWS($1:3)-1,COLUMN()-1),0)","v":1012.877662},9.7500008996576071E-4,-1.5833331272006035E-3,-1.2749166667163081E-3,true]
[4,{"$f":"IF(ROWS(GPS_IMPORT!$1:4)<=COUNTIF(GPS_IMPORT!$A$2:$A$10000,$B$5),INDEX(GPS_IMPORT!$2:$10000,MATCH($B$5,(GPS_IMPORT!$A$2:$A$10000),0)+ROWS($1:4)-1,COLUMN()-1),0)","v":"CNTL2"},{"$f":"IF(ROWS(GPS_IMPORT!$1:4)<=COUNTIF(GPS_IMPORT!$A$2:$A$10000,$B$5),INDEX(GPS_IMPORT!$2:$10000,MATCH($B$5,(GPS_IMPORT!$A$2:$A$10000),0)+ROWS($1:4)-1,COLUMN()-1),0)","v":" 3.10.2019"},{"$f":"IF(ROWS(GPS_IMPORT!$1:4)<=COUNTIF(GPS_IMPORT!$A$2:$A$10000,$B$5),INDEX(GPS_IMPORT!$2:$10000,MATCH($B$5,(GPS_IMPORT!$A$2:$A$10000),0)+ROWS($1:4)-1,COLUMN()-1),0)","v":"00:42:19.200"},{"$f":"IF(ROWS(GPS_IMPORT!$1:4)<=COUNTIF(GPS_IMPORT!$A$2:$A$10000,$B$5),INDEX(GPS_IMPORT!$2:$10000,MATCH($B$5,(GPS_IMPORT!$A$2:$A$10000),0)+ROWS($1:4)-1,COLUMN()-1),0)","v":376988.951},{"$f":"IF(ROWS(GPS_IMPORT!$1:4)<=COUNTIF(GPS_IMPORT!$A$2:$A$10000,$B$5),INDEX(GPS_IMPORT!$2:$10000,MATCH($B$5,(GPS_IMPORT!$A$2:$A$10000),0)+ROWS($1:4)-1,COLUMN()-1),0)","v":2458323.4539999999},{"$f":"IF(ROWS(GPS_IMPORT!$1:4)<=COUNTIF(GPS_IMPORT!$A$2:$A$10000,$B$5),INDEX(GPS_IMPORT!$2:$10000,MATCH($B$5,(GPS_IMPORT!$A$2:$A$10000),0)+ROWS($1:4)-1,COLUMN()-1),0)","v":1012.872436},6.4750000601634383E-3,-6.5833330154418945E-3,3.9510833332769835E-3,true]
[5,{"$f":"IF(ROWS(GPS_IMPORT!$1:5)<=COUNTIF(GPS_IMPORT!$A$2:$A$10000,$B$5),INDEX(GPS_IMPORT!$2:$10000,MATCH($B$5,(GPS_IMPORT!$A$2:$A$10000),0)+ROWS($1:5)-1,COLUMN()-1),0)","v":"CNTL2"},{"$f":"IF(ROWS(GPS_IMPORT!$1:5)<=COUNTIF(GPS_IMPORT!$A$2:$A$10000,$B$5),INDEX(GPS_IMPORT!$2:$10000,MATCH($B$5,(GPS_IMPORT!$A$2:$A$10000),0)+ROWS($1:5)-1,COLUMN()-1),0)","v":" 3.10.2019"},{"$f":"IF(ROWS(GPS_IMPORT!$1:5)<=COUNTIF(GPS_IMPORT!$A$2:$A$10000,$B$5),INDEX(GPS_IMPORT!$2:$10000,MATCH($B$5,(GPS_IMPORT!$A$2:$A$10000),0)+ROWS($1:5)-1,COLUMN()-1),0)","v":"00:42:34.200"},{"$f":"IF(ROWS(GPS_IMPORT!$1:5)<=COUNTIF(GPS_IMPORT!$A$2:$A$10000,$B$5),INDEX(GPS_IMPORT!$2:$10000,MATCH($B$5,(GPS_IMPORT!$A$2:$A$10000),0)+ROWS($1:5)-1,COLUMN()-1),0)","v":376988.9547},{"$f":"IF(ROWS(GPS_IMPORT!$1:5)<=COUNTIF(GPS_IMPORT!$A$2:$A$10000,$B$5),INDEX(GPS_IMPORT!$2:$10000,MATCH($B$5,(GPS_IMPORT!$A$2:$A$10000),0)+ROWS($1:5)-1,COLUMN()-1),0)","v":2458323.4530000002},{"$f":"IF(ROWS(GPS_IMPORT!$1:5)<=COUNTIF(GPS_IMPORT!$A$2:$A$10000,$B$5),INDEX(GPS_IMPORT!$2:$10000,MATCH($B$5,(GPS_IMPORT!$A$2:$A$10000),0)+ROWS($1:5)-1,COLUMN()-1),0)","v":1012.89104},2.7750000590458512E-3,-5.5833333171904087E-3,-1.4652916666705096E-2,true]
[6,{"$f":"IF(ROWS(GPS_IMPORT!$1:6)<=COUNTIF(GPS_IMPORT!$A$2:$A$10000,$B$5),INDEX(GPS_IMPORT!$2:$10000,MATCH($B$5,(GPS_IMPORT!$A$2:$A$10000),0)+ROWS($1:6)-1,COLUMN()-1),0)","v":"CNTL2"},{"$f":"IF(ROWS(GPS_IMPORT!$1:6)<=COUNTIF(GPS_IMPORT!$A$2:$A$10000,$B$5),INDEX(GPS_IMPORT!$2:$10000,MATCH($B$5,(GPS_IMPORT!$A$2:$A$10000),0)+ROWS($1:6)-1,COLUMN()-1),0)","v":" 3.10.2019"},{"$f":"IF(ROWS(GPS_IMPORT!$1:6)<=COUNTIF(GPS_IMPORT!$A$2:$A$10000,$B$5),INDEX(GPS_IMPORT!$2:$10000,MATCH($B$5,(GPS_IMPORT!$A$2:$A$10000),0)+ROWS($1:6)-1,COLUMN()-1),0)","v":"00:42:45.100"},{"$f":"IF(ROWS(GPS_IMPORT!$1:6)<=COUNTIF(GPS_IMPORT!$A$2:$A$10000,$B$5),INDEX(GPS_IMPORT!$2:$10000,MATCH($B$5,(GPS_IMPORT!$A$2:$A$10000),0)+ROWS($1:6)-1,COLUMN()-1),0)","v":376988.95110000001},{"$f":"IF(ROWS(GPS_IMPORT!$1:6)<=COUNTIF(GPS_IMPORT!$A$2:$A$10000,$B$5),INDEX(GPS_IMPORT!$2:$10000,MATCH($B$5,(GPS_IMPORT!$A$2:$A$10000),0)+ROWS($1:6)-1,COLUMN()-1),0)","v":2458323.452},{"$f":"IF(ROWS(GPS_IMPORT!$1:6)<=COUNTIF(GPS_IMPORT!$A$2:$A$10000,$B$5),INDEX(GPS_IMPORT!$2:$10000,MATCH($B$5,(GPS_IMPORT!$A$2:$A$10000),0)+ROWS($1:6)-1,COLUMN()-1),0)","v":1012.887639},6.3750000554136932E-3,-4.5833331532776356E-3,-1.1251916666765283E-2,true]
[7,{"$f":"IF(ROWS(GPS_IMPORT!$1:7)<=COUNTIF(GPS_IMPORT!$A$2:$A$10000,$B$5),INDEX(GPS_IMPORT!$2:$10000,MATCH($B$5,(GPS_IMPORT!$A$2:$A$10000),0)+ROWS($1:7)-1,COLUMN()-1),0)","v":"CNTL2"},{"$f":"IF(ROWS(GPS_IMPORT!$1:7)<=COUNTIF(GPS_IMPORT!$A$2:$A$10000,$B$5),INDEX(GPS_IMPORT!$2:$10000,MATCH($B$5,(GPS_IMPORT!$A$2:$A$10000),0)+ROWS($1:7)-1,COLUMN()-1),0)","v":" 3.10.2019"},{"$f":"IF(ROWS(GPS_IMPORT!$1:7)<=COUNTIF(GPS_IMPORT!$A$2:$A$10000,$B$5),INDEX(GPS_IMPORT!$2:$10000,MATCH($B$5,(GPS_IMPORT!$A$2:$A$10000),0)+ROWS($1:7)-1,COLUMN()-1),0)","v":"00:42:56.200"},{"$f":"IF(ROWS(GPS_IMPORT!$1:7)<=COUNTIF(GPS_IMPORT!$A$2:$A$10000,$B$5),INDEX(GPS_IMPORT!$2:$10000,MATCH($B$5,(GPS_IMPORT!$A$2:$A$10000),0)+ROWS($1:7)-1,COLUMN()-1),0)","v":376988.9535},{"$f":"IF(ROWS(GPS_IMPORT!$1:7)<=COUNTIF(GPS_IMPORT!$A$2:$A$10000,$B$5),INDEX(GPS_IMPORT!$2:$10000,MATCH($B$5,(GPS_IMPORT!$A$2:$A$10000),0)+ROWS($1:7)-1,COLUMN()-1),0)","v":2458323.4440000001},{"$f":"IF(ROWS(GPS_IMPORT!$1:7)<=COUNTIF(GPS_IMPORT!$A$2:$A$10000,$B$5),INDEX(GPS_IMPORT!$2:$10000,MATCH($B$5,(GPS_IMPORT!$A$2:$A$10000),0)+ROWS($1:7)-1,COLUMN()-1),0)","v":1012.879321},3.9750000578351319E-3,3.4166667610406876E-3,-2.9339166667341487E-3,true]
[8,{"$f":"IF(ROWS(GPS_IMPORT!$1:8)<=COUNTIF(GPS_IMPORT!$A$2:$A$10000,$B$5),INDEX(GPS_IMPORT!$2:$10000,MATCH($B$5,(GPS_IMPORT!$A$2:$A$10000),0)+ROWS($1:8)-1,COLUMN()-1),0)","v":"CNTL2"},{"$f":"IF(ROWS(GPS_IMPORT!$1:8)<=COUNTIF(GPS_IMPORT!$A$2:$A$10000,$B$5),INDEX(GPS_IMPORT!$2:$10000,MATCH($B$5,(GPS_IMPORT!$A$2:$A$10000),0)+ROWS($1:8)-1,COLUMN()-1),0)","v":" 3.10.2019"},{"$f":"IF(ROWS(GPS_IMPORT!$1:8)<=COUNTIF(GPS_IMPORT!$A$2:$A$10000,$B$5),INDEX(GPS_IMPORT!$2:$10000,MATCH($B$5,(GPS_IMPORT!$A$2:$A$10000),0)+ROWS($1:8)-1,COLUMN()-1),0)","v":"00:43:07"},{"$f":"IF(ROWS(GPS_IMPORT!$1:8)<=COUNTIF(GPS_IMPORT!$A$2:$A$10000,$B$5),INDEX(GPS_IMPORT!$2:$10000,MATCH($B$5,(GPS_IMPORT!$A$2:$A$10000),0)+ROWS($1:8)-1,COLUMN()-1),0)","v":376988.9523},{"$f":"IF(ROWS(GPS_IMPORT!$1:8)<=COUNTIF(GPS_IMPORT!$A$2:$A$10000,$B$5),INDEX(GPS_IMPORT!$2:$10000,MATCH($B$5,(GPS_IMPORT!$A$2:$A$10000),0)+ROWS($1:8)-1,COLUMN()-1),0)","v":2458323.446},{"$f":"IF(ROWS(GPS_IMPORT!$1:8)<=COUNTIF(GPS_IMPORT!$A$2:$A$10000,$B$5),INDEX(GPS_IMPORT!$2:$10000,MATCH($B$5,(GPS_IMPORT!$A$2:$A$10000),0)+ROWS($1:8)-1,COLUMN()-1),0)","v":1012.8859210000001},5.1750000566244125E-3,1.4166668988764286E-3,-9.5339166667827158E-3,true]
[9,{"$f":"IF(ROWS(GPS_IMPORT!$1:9)<=COUNTIF(GPS_IMPORT!$A$2:$A$10000,$B$5),INDEX(GPS_IMPORT!$2:$10000,MATCH($B$5,(GPS_IMPORT!$A$2:$A$10000),0)+ROWS($1:9)-1,COLUMN()-1),0)","v":"CNTL2"},{"$f":"IF(ROWS(GPS_IMPORT!$1:9)<=COUNTIF(GPS_IMPORT!$A$2:$A$10000,$B$5),INDEX(GPS_IMPORT!$2:$10000,MATCH($B$5,(GPS_IMPORT!$A$2:$A$10000),0)+ROWS($1:9)-1,COLUMN()-1),0)","v":" 3.10.2019"},{"$f":"IF(ROWS(GPS_IMPORT!$1:9)<=COUNTIF(GPS_IMPORT!$A$2:$A$10000,$B$5),INDEX(GPS_IMPORT!$2:$10000,MATCH($B$5,(GPS_IMPORT!$A$2:$A$10000),0)+ROWS($1:9)-1,COLUMN()-1),0)","v":"00:43:23.200"},{"$f":"IF(ROWS(GPS_IMPORT!$1:9)<=COUNTIF(GPS_IMPORT!$A$2:$A$10000,$B$5),INDEX(GPS_IMPORT!$2:$10000,MATCH($B$5,(GPS_IMPORT!$A$2:$A$10000),0)+ROWS($1:9)-1,COLUMN()-1),0)","v":376988.96159999998},{"$f":"IF(ROWS(GPS_IMPORT!$1:9)<=COUNTIF(GPS_IMPORT!$A$2:$A$10000,$B$5),INDEX(GPS_IMPORT!$2:$10000,MATCH($B$5,(GPS_IMPORT!$A$2:$A$10000),0)+ROWS($1:9)-1,COLUMN()-1),0)","v":2458323.4449999998},{"$f":"IF(ROWS(GPS_IMPORT!$1:9)<=COUNTIF(GPS_IMPORT!$A$2:$A$10000,$B$5),INDEX(GPS_IMPORT!$2:$10000,MATCH($B$5,(GPS_IMPORT!$A$2:$A$10000),0)+ROWS($1:9)-1,COLUMN()-1),0)","v":1012.862546},-4.1249999194405973E-3,2.4166670627892017E-3,1.3841083333318238E-2,true]
[10,{"$f":"IF(ROWS(GPS_IMPORT!$1:10)<=COUNTIF(GPS_IMPORT!$A$2:$A$10000,$B$5),INDEX(GPS_IMPORT!$2:$10000,MATCH($B$5,(GPS_IMPORT!$A$2:$A$10000),0)+ROWS($1:10)-1,COLUMN()-1),0)","v":"CNTL2"},{"$f":"IF(ROWS(GPS_IMPORT!$1:10)<=COUNTIF(GPS_IMPORT!$A$2:$A$10000,$B$5),INDEX(GPS_IMPORT!$2:$10000,MATCH($B$5,(GPS_IMPORT!$A$2:$A$10000),0)+ROWS($1:10)-1,COLUMN()-1),0)","v":" 3.10.2019"},{"$f":"IF(ROWS(GPS_IMPORT!$1:10)<=COUNTIF(GPS_IMPORT!$A$2:$A$10000,$B$5),INDEX(GPS_IMPORT!$2:$10000,MATCH($B$5,(GPS_IMPORT!$A$2:$A$10000),0)+ROWS($1:10)-1,COLUMN()-1),0)","v":"00:43:36.300"},{"$f":"IF(ROWS(GPS_IMPORT!$1:10)<=COUNTIF(GPS_IMPORT!$A$2:$A$10000,$B$5),INDEX(GPS_IMPORT!$2:$10000,MATCH($B$5,(GPS_IMPORT!$A$2:$A$10000),0)+ROWS($1:10)-1,COLUMN()-1),0)","v":376988.95939999999},{"$f":"IF(ROWS(GPS_IMPORT!$1:10)<=COUNTIF(GPS_IMPORT!$A$2:$A$10000,$B$5),INDEX(GPS_IMPORT!$2:$10000,MATCH($B$5,(GPS_IMPORT!$A$2:$A$10000),0)+ROWS($1:10)-1,COLUMN()-1),0)","v":2458323.4470000002},{"$f":"IF(ROWS(GPS_IMPORT!$1:10)<=COUNTIF(GPS_IMPORT!$A$2:$A$10000,$B$5),INDEX(GPS_IMPORT!$2:$10000,MATCH($B$5,(GPS_IMPORT!$A$2:$A$10000),0)+ROWS($1:10)-1,COLUMN()-1),0)","v":1012.867202},-1.9249999313615263E-3,4.1666673496365547E-4,9.185083333250077E-3,true]
[11,{"$f":"IF(ROWS(GPS_IMPORT!$1:11)<=COUNTIF(GPS_IMPORT!$A$2:$A$10000,$B$5),INDEX(GPS_IMPORT!$2:$10000,MATCH($B$5,(GPS_IMPORT!$A$2:$A$10000),0)+ROWS($1:11)-1,COLUMN()-1),0)","v":"CNTL2"},{"$f":"IF(ROWS(GPS_IMPORT!$1:11)<=COUNTIF(GPS_IMPORT!$A$2:$A$10000,$B$5),INDEX(GPS_IMPORT!$2:$10000,MATCH($B$5,(GPS_IMPORT!$A$2:$A$10000),0)+ROWS($1:11)-1,COLUMN()-1),0)","v":" 3.10.2019"},{"$f":"IF(ROWS(GPS_IMPORT!$1:11)<=COUNTIF(GPS_IMPORT!$A$2:$A$10000,$B$5),INDEX(GPS_IMPORT!$2:$10000,MATCH($B$5,(GPS_IMPORT!$A$2:$A$10000),0)+ROWS($1:11)-1,COLUMN()-1),0)","v":"00:43:47.600"},{"$f":"IF(ROWS(GPS_IMPORT!$1:11)<=COUNTIF(GPS_IMPORT!$A$2:$A$10000,$B$5),INDEX(GPS_IMPORT!$2:$10000,MATCH($B$5,(GPS_IMPORT!$A$2:$A$10000),0)+ROWS($1:11)-1,COLUMN()-1),0)","v":376988.96840000001},{"$f":"IF(ROWS(GPS_IMPORT!$1:11)<=COUNTIF(GPS_IMPORT!$A$2:$A$10000,$B$5),INDEX(GPS_IMPORT!$2:$10000,MATCH($B$5,(GPS_IMPORT!$A$2:$A$10000),0)+ROWS($1:11)-1,COLUMN()-1),0)","v":2458323.449},{"$f":"IF(ROWS(GPS_IMPORT!$1:11)<=COUNTIF(GPS_IMPORT!$A$2:$A$10000,$B$5),INDEX(GPS_IMPORT!$2:$10000,MATCH($B$5,(GPS_IMPORT!$A$2:$A$10000),0)+ROWS($1:11)-1,COLUMN()-1),0)","v":1012.88205},-1.0924999951384962E-2,-1.5833331272006035E-3,-5.6629166667789832E-3,true]
[12,{"$f":"IF(ROWS(GPS_IMPORT!$1:12)<=COUNTIF(GPS_IMPORT!$A$2:$A$10000,$B$5),INDEX(GPS_IMPORT!$2:$10000,MATCH($B$5,(GPS_IMPORT!$A$2:$A$10000),0)+ROWS($1:12)-1,COLUMN()-1),0)","v":"CNTL2"},{"$f":"IF(ROWS(GPS_IMPORT!$1:12)<=COUNTIF(GPS_IMPORT!$A$2:$A$10000,$B$5),INDEX(GPS_IMPORT!$2:$10000,MATCH($B$5,(GPS_IMPORT!$A$2:$A$10000),0)+ROWS($1:12)-1,COLUMN()-1),0)","v":" 3.10.2019"},{"$f":"IF(ROWS(GPS_IMPORT!$1:12)<=COUNTIF(GPS_IMPORT!$A$2:$A$10000,$B$5),INDEX(GPS_IMPORT!$2:$10000,MATCH($B$5,(GPS_IMPORT!$A$2:$A$10000),0)+ROWS($1:12)-1,COLUMN()-1),0)","v":"00:43:58.900"},{"$f":"IF(ROWS(GPS_IMPORT!$1:12)<=COUNTIF(GPS_IMPORT!$A$2:$A$10000,$B$5),INDEX(GPS_IMPORT!$2:$10000,MATCH($B$5,(GPS_IMPORT!$A$2:$A$10000),0)+ROWS($1:12)-1,COLUMN()-1),0)","v":376988.96740000002},{"$f":"IF(ROWS(GPS_IMPORT!$1:12)<=COUNTIF(GPS_IMPORT!$A$2:$A$10000,$B$5),INDEX(GPS_IMPORT!$2:$10000,MATCH($B$5,(GPS_IMPORT!$A$2:$A$10000),0)+ROWS($1:12)-1,COLUMN()-1),0)","v":2458323.4440000001},{"$f":"IF(ROWS(GPS_IMPORT!$1:12)<=COUNTIF(GPS_IMPORT!$A$2:$A$10000,$B$5),INDEX(GPS_IMPORT!$2:$10000,MATCH($B$5,(GPS_IMPORT!$A$2:$A$10000),0)+ROWS($1:12)-1,COLUMN()-1),0)","v":1012.903228},-9.9249999620951712E-3,3.4166667610406876E-3,-2.6840916666742487E-2,true]
[13,{"$f":"IF(ROWS(GPS_IMPORT!$1:13)<=COUNTIF(GPS_IMPORT!$A$2:$A$10000,$B$5),INDEX(GPS_IMPORT!$2:$10000,MATCH($B$5,(GPS_IMPORT!$A$2:$A$10000),0)+ROWS($1:13)-1,COLUMN()-1),0)","v":0},{"$f":"IF(ROWS(GPS_IMPORT!$1:13)<=COUNTIF(GPS_IMPORT!$A$2:$A$10000,$B$5),INDEX(GPS_IMPORT!$2:$10000,MATCH($B$5,(GPS_IMPORT!$A$2:$A$10000),0)+ROWS($1:13)-1,COLUMN()-1),0)","v":"00:00:00"},{"$f":"IF(ROWS(GPS_IMPORT!$1:13)<=COUNTIF(GPS_IMPORT!$A$2:$A$10000,$B$5),INDEX(GPS_IMPORT!$2:$10000,MATCH($B$5,(GPS_IMPORT!$A$2:$A$10000),0)+ROWS($1:13)-1,COLUMN()-1),0)","v":"00:00:00"},{"$f":"IF(ROWS(GPS_IMPORT!$1:13)<=COUNTIF(GPS_IMPORT!$A$2:$A$10000,$B$5),INDEX(GPS_IMPORT!$2:$10000,MATCH($B$5,(GPS_IMPORT!$A$2:$A$10000),0)+ROWS($1:13)-1,COLUMN()-1),0)","v":0},{"$f":"IF(ROWS(GPS_IMPORT!$1:13)<=COUNTIF(GPS_IMPORT!$A$2:$A$10000,$B$5),INDEX(GPS_IMPORT!$2:$10000,MATCH($B$5,(GPS_IMPORT!$A$2:$A$10000),0)+ROWS($1:13)-1,COLUMN()-1),0)","v":0},{"$f":"IF(ROWS(GPS_IMPORT!$1:13)<=COUNTIF(GPS_IMPORT!$A$2:$A$10000,$B$5),INDEX(GPS_IMPORT!$2:$10000,MATCH($B$5,(GPS_IMPORT!$A$2:$A$10000),0)+ROWS($1:13)-1,COLUMN()-1),0)","v":0},{"$f":"IF(E19>0,E$22-E19,0)","v":0},0,0,false]
[14,{"$f":"IF(ROWS(GPS_IMPORT!$1:14)<=COUNTIF(GPS_IMPORT!$A$2:$A$10000,$B$5),INDEX(GPS_IMPORT!$2:$10000,MATCH($B$5,(GPS_IMPORT!$A$2:$A$10000),0)+ROWS($1:14)-1,COLUMN()-1),0)","v":0},{"$f":"IF(ROWS(GPS_IMPORT!$1:14)<=COUNTIF(GPS_IMPORT!$A$2:$A$10000,$B$5),INDEX(GPS_IMPORT!$2:$10000,MATCH($B$5,(GPS_IMPORT!$A$2:$A$10000),0)+ROWS($1:14)-1,COLUMN()-1),0)","v":"00:00:00"},{"$f":"IF(ROWS(GPS_IMPORT!$1:14)<=COUNTIF(GPS_IMPORT!$A$2:$A$10000,$B$5),INDEX(GPS_IMPORT!$2:$10000,MATCH($B$5,(GPS_IMPORT!$A$2:$A$10000),0)+ROWS($1:14)-1,COLUMN()-1),0)","v":"00:00:00"},{"$f":"IF(ROWS(GPS_IMPORT!$1:14)<=COUNTIF(GPS_IMPORT!$A$2:$A$10000,$B$5),INDEX(GPS_IMPORT!$2:$10000,MATCH($B$5,(GPS_IMPORT!$A$2:$A$10000),0)+ROWS($1:14)-1,COLUMN()-1),0)","v":0},{"$f":"IF(ROWS(GPS_IMPORT!$1:14)<=COUNTIF(GPS_IMPORT!$A$2:$A$10000,$B$5),INDEX(GPS_IMPORT!$2:$10000,MATCH($B$5,(GPS_IMPORT!$A$2:$A$10000),0)+ROWS($1:14)-1,COLUMN()-1),0)","v":0},{"$f":"IF(ROWS(GPS_IMPORT!$1:14)<=COUNTIF(GPS_IMPORT!$A$2:$A$10000,$B$5),INDEX(GPS_IMPORT!$2:$10000,MATCH($B$5,(GPS_IMPORT!$A$2:$A$10000),0)+ROWS($1:14)-1,COLUMN()-1),0)","v":0},0,{"$f":"IF(F20>0,F$22-F20,0)","v":0},0,false]
[15,{"$f":"IF(ROWS(GPS_IMPORT!$1:15)<=COUNTIF(GPS_IMPORT!$A$2:$A$10000,$B$5),INDEX(GPS_IMPORT!$2:$10000,MATCH($B$5,(GPS_IMPORT!$A$2:$A$10000),0)+ROWS($1:15)-1,COLUMN()-1),0)","v":0},{"$f":"IF(ROWS(GPS_IMPORT!$1:15)<=COUNTIF(GPS_IMPORT!$A$2:$A$10000,$B$5),INDEX(GPS_IMPORT!$2:$10000,MATCH($B$5,(GPS_IMPORT!$A$2:$A$10000),0)+ROWS($1:15)-1,COLUMN()-1),0)","v":"00:00:00"},{"$f":"IF(ROWS(GPS_IMPORT!$1:15)<=COUNTIF(GPS_IMPORT!$A$2:$A$10000,$B$5),INDEX(GPS_IMPORT!$2:$10000,MATCH($B$5,(GPS_IMPORT!$A$2:$A$10000),0)+ROWS($1:15)-1,COLUMN()-1),0)","v":"00:00:00"},{"$f":"IF(ROWS(GPS_IMPORT!$1:15)<=COUNTIF(GPS_IMPORT!$A$2:$A$10000,$B$5),INDEX(GPS_IMPORT!$2:$10000,MATCH($B$5,(GPS_IMPORT!$A$2:$A$10000),0)+ROWS($1:15)-1,COLUMN()-1),0)","v":0},{"$f":"IF(ROWS(GPS_IMPORT!$1:15)<=COUNTIF(GPS_IMPORT!$A$2:$A$10000,$B$5),INDEX(GPS_IMPORT!$2:$10000,MATCH($B$5,(GPS_IMPORT!$A$2:$A$10000),0)+ROWS($1:15)-1,COLUMN()-1),0)","v":0},{"$f":"IF(ROWS(GPS_IMPORT!$1:15)<=COUNTIF(GPS_IMPORT!$A$2:$A$10000,$B$5),INDEX(GPS_IMPORT!$2:$10000,MATCH($B$5,(GPS_IMPORT!$A$2:$A$10000),0)+ROWS($1:15)-1,COLUMN()-1),0)","v":0},0,0,0,false]
[null,null,null,"AVERAGE",{"$f":"(IF($K$7=TRUE,E7,0)+IF($K$8=TRUE,E8,0)+IF($K$9=TRUE,E9,0)+IF($K$10=TRUE,E10,0)+IF($K$11=TRUE,E11,0)+IF($K$12=TRUE,E12,0)+IF($K$13=TRUE,E13,0)+IF($K$14=TRUE,E14,0)+IF($K$15=TRUE,E15,0)+IF($K$16=TRUE,E16,0)+IF($K$17=TRUE,E17,0)+IF($K$18=TRUE,E18,0)+IF($K$19=TRUE,E19,0)+IF($K$20=TRUE,E20,0)+IF($K$21=TRUE,E21,0))/(IF($K$7=TRUE,1,0)+IF($K$8=TRUE,1,0)+IF($K$9=TRUE,1,0)+IF($K$10=TRUE,1,0)+IF($K$11=TRUE,1,0)+IF($K$12=TRUE,1,0)+IF($K$13=TRUE,1,0)+IF($K$14=TRUE,1,0)+IF($K$15=TRUE,1,0)+IF($K$16=TRUE,1,0)+IF($K$17=TRUE,1,0)+IF($K$18=TRUE,1,0)+IF($K$19=TRUE,1,0)+IF($K$20=TRUE,1,0)+IF($K$21=TRUE,1,0))","v":376988.95747500006},{"$f":"(IF($K$7=TRUE,F7,0)+IF($K$8=TRUE,F8,0)+IF($K$9=TRUE,F9,0)+IF($K$10=TRUE,F10,0)+IF($K$11=TRUE,F11,0)+IF($K$12=TRUE,F12,0)+IF($K$13=TRUE,F13,0)+IF($K$14=TRUE,F14,0)+IF($K$15=TRUE,F15,0)+IF($K$16=TRUE,F16,0)+IF($K$17=TRUE,F17,0)+IF($K$18=TRUE,F18,0)+IF($K$19=TRUE,F19,0)+IF($K$20=TRUE,F20,0)+IF($K$21=TRUE,F21,0))/(IF($K$7=TRUE,1,0)+IF($K$8=TRUE,1,0)+IF($K$9=TRUE,1,0)+IF($K$10=TRUE,1,0)+IF($K$11=TRUE,1,0)+IF($K$12=TRUE,1,0)+IF($K$13=TRUE,1,0)+IF($K$14=TRUE,1,0)+IF($K$15=TRUE,1,0)+IF($K$16=TRUE,1,0)+IF($K$17=TRUE,1,0)+IF($K$18=TRUE,1,0)+IF($K$19=TRUE,1,0)+IF($K$20=TRUE,1,0)+IF($K$21=TRUE,1,0))","v":2458323.4474166669},{"$f":"(IF($K$7=TRUE,G7,0)+IF($K$8=TRUE,G8,0)+IF($K$9=TRUE,G9,0)+IF($K$10=TRUE,G10,0)+IF($K$11=TRUE,G11,0)+IF($K$12=TRUE,G12,0)+IF($K$13=TRUE,G13,0)+IF($K$14=TRUE,G14,0)+IF($K$15=TRUE,G15,0)+IF($K$16=TRUE,G16,0)+IF($K$17=TRUE,G17,0)+IF($K$18=TRUE,G18,0)+IF($K$19=TRUE,G19,0)+IF($K$20=TRUE,G20,0)+IF($K$21=TRUE,G21,0))/\n(IF($K$7=TRUE,1,0)+IF($K$8=TRUE,1,0)+IF($K$9=TRUE,1,0)+IF($K$10=TRUE,1,0)+IF($K$11=TRUE,1,0)+IF($K$12=TRUE,1,0)+IF($K$13=TRUE,1,0)+IF($K$14=TRUE,1,0)+IF($K$15=TRUE,1,0)+IF($K$16=TRUE,1,0)+IF($K$17=TRUE,1,0)+IF($K$18=TRUE,1,0)+IF($K$19=TRUE,1,0)+IF($K$20=TRUE,1,0)+IF($K$21=TRUE,1,0))","v":1012.8763870833333},"RMSE:","RMSE:","RMSE:"]
[null,null,null,null,null,null,"RMSE IN US SURVEY FEET:",{"$f":"SQRT((\n(IF($K$7=TRUE,H7^2,0))+(IF($K$8=TRUE,H8^2,0))+(IF($K$9=TRUE,H9^2,0))+(IF($K$10=TRUE,H10^2,0))+(IF($K$11=TRUE,H11^2,0))+(IF($K$12=TRUE,H12^2,0))+(IF($K$13=TRUE,H13^2,0))+(IF($K$14=TRUE,H14^2,0))+(IF($K$15=TRUE,H15^2,0))+(IF($K$16=TRUE,H16^2,0))+(IF($K$17=TRUE,H17^2,0))+(IF($K$18=TRUE,H18^2,0))+(IF($K$19=TRUE,H19^2,0))+(IF($K$20=TRUE,H20^2,0))+(IF($K$21=TRUE,H21^2,0)))/\n(IF($K$7=TRUE,1,0)+IF($K$8=TRUE,1,0)+IF($K$9=TRUE,1,0)+IF($K$10=TRUE,1,0)+IF($K$11=TRUE,1,0)+IF($K$12=TRUE,1,0)+IF($K$13=TRUE,1,0)+IF($K$14=TRUE,1,0)+IF($K$15=TRUE,1,0)+IF($K$16=TRUE,1,0)+IF($K$17=TRUE,1,0)+IF($K$18=TRUE,1,0)+IF($K$19=TRUE,1,0)+IF($K$20=TRUE,1,0)+IF($K$21=TRUE,1,0)))","v":5.6237776477376039E-3},{"$f":"SQRT((\n(IF($K$7=TRUE,I7^2,0))+(IF($K$8=TRUE,I8^2,0))+(IF($K$9=TRUE,I9^2,0))+(IF($K$10=TRUE,I10^2,0))+(IF($K$11=TRUE,I11^2,0))+(IF($K$12=TRUE,I12^2,0))+(IF($K$13=TRUE,I13^2,0))+(IF($K$14=TRUE,I14^2,0))+(IF($K$15=TRUE,I15^2,0))+(IF($K$16=TRUE,I16^2,0))+(IF($K$17=TRUE,I17^2,0))+(IF($K$18=TRUE,I18^2,0))+(IF($K$19=TRUE,I19^2,0))+(IF($K$20=TRUE,I20^2,0))+(IF($K$21=TRUE,I21^2,0)))/\n(IF($K$7=TRUE,1,0)+IF($K$8=TRUE,1,0)+IF($K$9=TRUE,1,0)+IF($K$10=TRUE,1,0)+IF($K$11=TRUE,1,0)+IF($K$12=TRUE,1,0)+IF($K$13=TRUE,1,0)+IF($K$14=TRUE,1,0)+IF($K$15=TRUE,1,0)+IF($K$16=TRUE,1,0)+IF($K$17=TRUE,1,0)+IF($K$18=TRUE,1,0)+IF($K$19=TRUE,1,0)+IF($K$20=TRUE,1,0)+IF($K$21=TRUE,1,0)))","v":3.9677519678446337E-3},{"$f":"SQRT((\n(IF($K$7=TRUE,J7^2,0))+(IF($K$8=TRUE,J8^2,0))+(IF($K$9=TRUE,J9^2,0))+(IF($K$10=TRUE,J10^2,0))+(IF($K$11=TRUE,J11^2,0))+(IF($K$12=TRUE,J12^2,0))+(IF($K$13=TRUE,J13^2,0))+(IF($K$14=TRUE,J14^2,0))+(IF($K$15=TRUE,J15^2,0))+(IF($K$16=TRUE,J16^2,0))+(IF($K$17=TRUE,J17^2,0))+(IF($K$18=TRUE,J18^2,0))+(IF($K$19=TRUE,J19^2,0))+(IF($K$20=TRUE,J20^2,0))+(IF($K$21=TRUE,J21^2,0)))/\n(IF($K$7=TRUE,1,0)+IF($K$8=TRUE,1,0)+IF($K$9=TRUE,1,0)+IF($K$10=TRUE,1,0)+IF($K$11=TRUE,1,0)+IF($K$12=TRUE,1,0)+IF($K$13=TRUE,1,0)+IF($K$14=TRUE,1,0)+IF($K$15=TRUE,1,0)+IF($K$16=TRUE,1,0)+IF($K$17=TRUE,1,0)+IF($K$18=TRUE,1,0)+IF($K$19=TRUE,1,0)+IF($K$20=TRUE,1,0)+IF($K$21=TRUE,1,0)))","v":1.485552611242421E-2}]
[null,null,null,1]
[null,null,"UNITLESS GRID TO GROUND MULTIPLIER",{"$f":"IF(REPORT!C13=\"n/a\",\"0.00000000\",REPORT!C13)","v":1.0000901799999999},null,null,null,{"$f":"IF(H23<=0.029,\"PASS\",\"FAIL\")","v":"PASS"},{"$f":"IF(I23<=0.029,\"PASS\",\"FAIL\")","v":"PASS"},{"$f":"IF(J23<=0.039,\"PASS\",\"FAIL\")","v":"PASS"}]
[]
["AVERAGED GPS-DERIVED POSITION",null,null,null,null,null,null,null,"Notes:"]
[null,"MONUMENT COORDINATES",null,"NORTHING","EASTING","ORTHO HEIGHT"]
[null,"US Survey Feet (GRID)",null,{"$f":"$E$22","v":376988.95747500006},{"$f":"$F$22","v":2458323.4474166669},{"$f":"$G$22","v":1012.8763870833333}]
[]
["LEVELED ELEVATION"]
["US SURVEY FEET",null,{"$f":"IFERROR(VLOOKUP(B5,'LEVEL RUN'!A8:I59,9,FALSE),\"N/A\")","v":1012.7933333333332},"(Type the leveled elevation or N/A if no leveled elevation is available)"]
["MONUMENT HELD",null,null,"(Type the monument name from which leveling originated)"]
["LEVELED ELEVATION - GPS DERIVED ELEVATION   = ",null,null,null,{"$f":"IF(C32=\"N/A\",\"N/A\",C32-(F29*D24))","v":-8.3053750000090076E-2}]
[]
["FINAL MONUMENT COORDINATES"]
[null,"MONUMENT COORDINATES",null,"NORTHING","EASTING","ELEVATION","FEATURE CODE"]
[null,"US SURVEY FEET (GRID)",null,{"$f":"$E$22*$D$24","v":376988.95747500006},{"$f":"$F$22*$D$24","v":2458323.4474166669},{"$f":"IF($C$32=\"N/A\",($G$22*$D$24),$C$32)","v":1012.7933333333332},{"$f":"VLOOKUP($B$5,GPS_IMPORT!$A$2:$G$2000,7,FALSE)","v":"IPINS"}]
[null,"US SURVEY FEET (GROUND)",null,{"$f":"$D$38*$D$25","v":377022.95433918515},{"$f":"$E$38*$D$25","v":2458545.139025155},{"$f":"IF($C$32=\"N/A\",($G$22*$D$24),$C$32)","v":1012.7933333333332},{"$f":"G38","v":"IPINS"}]
[]
["∆ North,  ∆ East, and ∆ Ht. are the difference between the average northing, easting, and height for each observation.",null,null,null,null,null,null,null,"Mask Angle:","10°"]

{"sheet":"CNTL3","index":14,"n_rows":41,"n_cols":11,"rows_kept":41,"cut":false,"hidden":false,"merged":[[0,0,0,10],[26,0,26,6],[27,1,27,2],[27,8,38,10],[28,1,28,2],[30,0,30,6],[35,0,35,6],[36,1,36,2],[37,1,37,2],[38,1,38,2]]}
["VRS GNSS Project Control Monument Coordinate Analysis"]
[]
["Project:",{"$f":"REPORT!B2","v":"FRA-71-29.4"},"GPS Antenna:","LEICA GS14",null,null,null,null,null,"Report Date:",{"$f":"REPORT!C49","v":"2019-04-25"}]
["PID:",{"$f":"REPORT!E2","v":106471},"VRS Network:","ODOT VRS",null,null,null,null,null,"Prepared By:",{"$f":"REPORT!C48","v":"Kolton Wilson"}]
["Point ID:","CNTL3","No. of Sessions:",{"$f":"COUNTIF(GPS_IMPORT!A2:A1000,$B$5)","v":12},null,null,null,null,null,"Checked By:",{"$f":"REPORT!C52","v":"David Ogden"}]
["SESSION #","Point","Observation Date","Start Time","Northing(sft)","Easting(sft)","Height(sft)","∆ Northing(sft)","∆ Easting(sft)","∆ Height(sft)","Include in Solution?"]
[1,{"$f":"IF(ROWS(GPS_IMPORT!$1:1)<=COUNTIF(GPS_IMPORT!$A$2:$A$10000,$B$5),INDEX(GPS_IMPORT!$2:$10000,MATCH($B$5,(GPS_IMPORT!$A$2:$A$10000),0)+ROWS($1:1)-1,COLUMN()-1),0)","v":"CNTL3"},{"$f":"IF(ROWS(GPS_IMPORT!$1:1)<=COUNTIF(GPS_IMPORT!$A$2:$A$10000,$B$5),INDEX(GPS_IMPORT!$2:$10000,MATCH($B$5,(GPS_IMPORT!$A$2:$A$10000),0)+ROWS($1:1)-1,COLUMN()-1),0)","v":" 3.10.2019"},{"$f":"IF(ROWS(GPS_IMPORT!$1:1)<=COUNTIF(GPS_IMPORT!$A$2:$A$10000,$B$5),INDEX(GPS_IMPORT!$2:$10000,MATCH($B$5,(GPS_IMPORT!$A$2:$A$10000),0)+ROWS($1:1)-1,COLUMN()-1),0)","v":"00:46:28.100"},{"$f":"IF(ROWS(GPS_IMPORT!$1:1)<=COUNTIF(GPS_IMPORT!$A$2:$A$10000,$B$5),INDEX(GPS_IMPORT!$2:$10000,MATCH($B$5,(GPS_IMPORT!$A$2:$A$10000),0)+ROWS($1:1)-1,COLUMN()-1),0)","v":376669.8652},{"$f":"IF(ROWS(GPS_IMPORT!$1:1)<=COUNTIF(GPS_IMPORT!$A$2:$A$10000,$B$5),INDEX(GPS_IMPORT!$2:$10000,MATCH($B$5,(GPS_IMPORT!$A$2:$A$10000),0)+ROWS($1:1)-1,COLUMN()-1),0)","v":2458138.111},{"$f":"IF(ROWS(GPS_IMPORT!$1:1)<=COUNTIF(GPS_IMPORT!$A$2:$A$10000,$B$5),INDEX(GPS_IMPORT!$2:$10000,MATCH($B$5,(GPS_IMPORT!$A$2:$A$10000),0)+ROWS($1:1)-1,COLUMN()-1),0)","v":1034.830856},{"$f":"IF(E7>0,E$22-E7,0)","v":-7.3833333444781601E-3},6.7499997094273567E-3,-5.9679916666709687E-2,true]
[2,{"$f":"IF(ROWS(GPS_IMPORT!$1:2)<=COUNTIF(GPS_IMPORT!$A$2:$A$10000,$B$5),INDEX(GPS_IMPORT!$2:$10000,MATCH($B$5,(GPS_IMPORT!$A$2:$A$10000),0)+ROWS($1:2)-1,COLUMN()-1),0)","v":"CNTL3"},{"$f":"IF(ROWS(GPS_IMPORT!$1:2)<=COUNTIF(GPS_IMPORT!$A$2:$A$10000,$B$5),INDEX(GPS_IMPORT!$2:$10000,MATCH($B$5,(GPS_IMPORT!$A$2:$A$10000),0)+ROWS($1:2)-1,COLUMN()-1),0)","v":" 3.10.2019"},{"$f":"IF(ROWS(GPS_IMPORT!$1:2)<=COUNTIF(GPS_IMPORT!$A$2:$A$10000,$B$5),INDEX(GPS_IMPORT!$2:$10000,MATCH($B$5,(GPS_IMPORT!$A$2:$A$10000),0)+ROWS($1:2)-1,COLUMN()-1),0)","v":"00:46:39.100"},{"$f":"IF(ROWS(GPS_IMPORT!$1:2)<=COUNTIF(GPS_IMPORT!$A$2:$A$10000,$B$5),INDEX(GPS_IMPORT!$2:$10000,MATCH($B$5,(GPS_IMPORT!$A$2:$A$10000),0)+ROWS($1:2)-1,COLUMN()-1),0)","v":376669.86849999998},{"$f":"IF(ROWS(GPS_IMPORT!$1:2)<=COUNTIF(GPS_IMPORT!$A$2:$A$10000,$B$5),INDEX(GPS_IMPORT!$2:$10000,MATCH($B$5,(GPS_IMPORT!$A$2:$A$10000),0)+ROWS($1:2)-1,COLUMN()-1),0)","v":2458138.1129999999},{"$f":"IF(ROWS(GPS_IMPORT!$1:2)<=COUNTIF(GPS_IMPORT!$A$2:$A$10000,$B$5),INDEX(GPS_IMPORT!$2:$10000,MATCH($B$5,(GPS_IMPORT!$A$2:$A$10000),0)+ROWS($1:2)-1,COLUMN()-1),0)","v":1034.813615},-1.0683333326596767E-2,4.7499998472630978E-3,-4.2438916666696969E-2,true]
[3,{"$f":"IF(ROWS(GPS_IMPORT!$1:3)<=COUNTIF(GPS_IMPORT!$A$2:$A$10000,$B$5),INDEX(GPS_IMPORT!$2:$10000,MATCH($B$5,(GPS_IMPORT!$A$2:$A$10000),0)+ROWS($1:3)-1,COLUMN()-1),0)","v":"CNTL3"},{"$f":"IF(ROWS(GPS_IMPORT!$1:3)<=COUNTIF(GPS_IMPORT!$A$2:$A$10000,$B$5),INDEX(GPS_IMPORT!$2:$10000,MATCH($B$5,(GPS_IMPORT!$A$2:$A$10000),0)+ROWS($1:3)-1,COLUMN()-1),0)","v":" 3.10.2019"},{"$f":"IF(ROWS(GPS_IMPORT!$1:3)<=COUNTIF(GPS_IMPORT!$A$2:$A$10000,$B$5),INDEX(GPS_IMPORT!$2:$10000,MATCH($B$5,(GPS_IMPORT!$A$2:$A$10000),0)+ROWS($1:3)-1,COLUMN()-1),0)","v":"00:46:50.200"},{"$f":"IF(ROWS(GPS_IMPORT!$1:3)<=COUNTIF(GPS_IMPORT!$A$2:$A$10000,$B$5),INDEX(GPS_IMPORT!$2:$10000,MATCH($B$5,(GPS_IMPORT!$A$2:$A$10000),0)+ROWS($1:3)-1,COLUMN()-1),0)","v":376669.8664},{"$f":"IF(ROWS(GPS_IMPORT!$1:3)<=COUNTIF(GPS_IMPORT!$A$2:$A$10000,$B$5),INDEX(GPS_IMPORT!$2:$10000,MATCH($B$5,(GPS_IMPORT!$A$2:$A$10000),0)+ROWS($1:3)-1,COLUMN()-1),0)","v":2458138.1120000002},{"$f":"IF(ROWS(GPS_IMPORT!$1:3)<=COUNTIF(GPS_IMPORT!$A$2:$A$10000,$B$5),INDEX(GPS_IMPORT!$2:$10000,MATCH($B$5,(GPS_IMPORT!$A$2:$A$10000),0)+ROWS($1:3)-1,COLUMN()-1),0)","v":1034.8022470000001},-8.5833333432674408E-3,5.7499995455145836E-3,-3.1070916666749326E-2,true]
[4,{"$f":"IF(ROWS(GPS_IMPORT!$1:4)<=COUNTIF(GPS_IMPORT!$A$2:$A$10000,$B$5),INDEX(GPS_IMPORT!$2:$10000,MATCH($B$5,(GPS_IMPORT!$A$2:$A$10000),0)+ROWS($1:4)-1,COLUMN()-1),0)","v":"CNTL3"},{"$f":"IF(ROWS(GPS_IMPORT!$1:4)<=COUNTIF(GPS_IMPORT!$A$2:$A$10000,$B$5),INDEX(GPS_IMPORT!$2:$10000,MATCH($B$5,(GPS_IMPORT!$A$2:$A$10000),0)+ROWS($1:4)-1,COLUMN()-1),0)","v":" 3.10.2019"},{"$f":"IF(ROWS(GPS_IMPORT!$1:4)<=COUNTIF(GPS_IMPORT!$A$2:$A$10000,$B$5),INDEX(GPS_IMPORT!$2:$10000,MATCH($B$5,(GPS_IMPORT!$A$2:$A$10000),0)+ROWS($1:4)-1,COLUMN()-1),0)","v":"00:47:02"},{"$f":"IF(ROWS(GPS_IMPORT!$1:4)<=COUNTIF(GPS_IMPORT!$A$2:$A$10000,$B$5),INDEX(GPS_IMPORT!$2:$10000,MATCH($B$5,(GPS_IMPORT!$A$2:$A$10000),0)+ROWS($1:4)-1,COLUMN()-1),0)","v":376669.86499999999},{"$f":"IF(ROWS(GPS_IMPORT!$1:4)<=COUNTIF(GPS_IMPORT!$A$2:$A$10000,$B$5),INDEX(GPS_IMPORT!$2:$10000,MATCH($B$5,(GPS_IMPORT!$A$2:$A$10000),0)+ROWS($1:4)-1,COLUMN()-1),0)","v":2458138.1090000002},{"$f":"IF(ROWS(GPS_IMPORT!$1:4)<=COUNTIF(GPS_IMPORT!$A$2:$A$10000,$B$5),INDEX(GPS_IMPORT!$2:$10000,MATCH($B$5,(GPS_IMPORT!$A$2:$A$10000),0)+ROWS($1:4)-1,COLUMN()-1),0)","v":1034.7938340000001},-7.1833333349786699E-3,8.7499995715916157E-3,-2.2657916666730671E-2,true]
[5,{"$f":"IF(ROWS(GPS_IMPORT!$1:5)<=COUNTIF(GPS_IMPORT!$A$2:$A$10000,$B$5),INDEX(GPS_IMPORT!$2:$10000,MATCH($B$5,(GPS_IMPORT!$A$2:$A$10000),0)+ROWS($1:5)-1,COLUMN()-1),0)","v":"CNTL3"},{"$f":"IF(ROWS(GPS_IMPORT!$1:5)<=COUNTIF(GPS_IMPORT!$A$2:$A$10000,$B$5),INDEX(GPS_IMPORT!$2:$10000,MATCH($B$5,(GPS_IMPORT!$A$2:$A$10000),0)+ROWS($1:5)-1,COLUMN()-1),0)","v":" 3.10.2019"},{"$f":"IF(ROWS(GPS_IMPORT!$1:5)<=COUNTIF(GPS_IMPORT!$A$2:$A$10000,$B$5),INDEX(GPS_IMPORT!$2:$10000,MATCH($B$5,(GPS_IMPORT!$A$2:$A$10000),0)+ROWS($1:5)-1,COLUMN()-1),0)","v":"00:47:19.200"},{"$f":"IF(ROWS(GPS_IMPORT!$1:5)<=COUNTIF(GPS_IMPORT!$A$2:$A$10000,$B$5),INDEX(GPS_IMPORT!$2:$10000,MATCH($B$5,(GPS_IMPORT!$A$2:$A$10000),0)+ROWS($1:5)-1,COLUMN()-1),0)","v":376669.84980000003},{"$f":"IF(ROWS(GPS_IMPORT!$1:5)<=COUNTIF(GPS_IMPORT!$A$2:$A$10000,$B$5),INDEX(GPS_IMPORT!$2:$10000,MATCH($B$5,(GPS_IMPORT!$A$2:$A$10000),0)+ROWS($1:5)-1,COLUMN()-1),0)","v":2458138.1159999999},{"$f":"IF(ROWS(GPS_IMPORT!$1:5)<=COUNTIF(GPS_IMPORT!$A$2:$A$10000,$B$5),INDEX(GPS_IMPORT!$2:$10000,MATCH($B$5,(GPS_IMPORT!$A$2:$A$10000),0)+ROWS($1:5)-1,COLUMN()-1),0)","v":1034.7696739999999},8.0166666302829981E-3,1.7499998211860657E-3,1.5020833334347117E-3,true]
[6,{"$f":"IF(ROWS(GPS_IMPORT!$1:6)<=COUNTIF(GPS_IMPORT!$A$2:$A$10000,$B$5),INDEX(GPS_IMPORT!$2:$10000,MATCH($B$5,(GPS_IMPORT!$A$2:$A$10000),0)+ROWS($1:6)-1,COLUMN()-1),0)","v":"CNTL3"},{"$f":"IF(ROWS(GPS_IMPORT!$1:6)<=COUNTIF(GPS_IMPORT!$A$2:$A$10000,$B$5),INDEX(GPS_IMPORT!$2:$10000,MATCH($B$5,(GPS_IMPORT!$A$2:$A$10000),0)+ROWS($1:6)-1,COLUMN()-1),0)","v":" 3.10.2019"},{"$f":"IF(ROWS(GPS_IMPORT!$1:6)<=COUNTIF(GPS_IMPORT!$A$2:$A$10000,$B$5),INDEX(GPS_IMPORT!$2:$10000,MATCH($B$5,(GPS_IMPORT!$A$2:$A$10000),0)+ROWS($1:6)-1,COLUMN()-1),0)","v":"00:47:30.100"},{"$f":"IF(ROWS(GPS_IMPORT!$1:6)<=COUNTIF(GPS_IMPORT!$A$2:$A$10000,$B$5),INDEX(GPS_IMPORT!$2:$10000,MATCH($B$5,(GPS_IMPORT!$A$2:$A$10000),0)+ROWS($1:6)-1,COLUMN()-1),0)","v":376669.85210000002},{"$f":"IF(ROWS(GPS_IMPORT!$1:6)<=COUNTIF(GPS_IMPORT!$A$2:$A$10000,$B$5),INDEX(GPS_IMPORT!$2:$10000,MATCH($B$5,(GPS_IMPORT!$A$2:$A$10000),0)+ROWS($1:6)-1,COLUMN()-1),0)","v":2458138.1140000001},{"$f":"IF(ROWS(GPS_IMPORT!$1:6)<=COUNTIF(GPS_IMPORT!$A$2:$A$10000,$B$5),INDEX(GPS_IMPORT!$2:$10000,MATCH($B$5,(GPS_IMPORT!$A$2:$A$10000),0)+ROWS($1:6)-1,COLUMN()-1),0)","v":1034.771191},5.7166666374541819E-3,3.7499996833503246E-3,-1.4916666714270832E-5,true]
[7,{"$f":"IF(ROWS(GPS_IMPORT!$1:7)<=COUNTIF(GPS_IMPORT!$A$2:$A$10000,$B$5),INDEX(GPS_IMPORT!$2:$10000,MATCH($B$5,(GPS_IMPORT!$A$2:$A$10000),0)+ROWS($1:7)-1,COLUMN()-1),0)","v":"CNTL3"},{"$f":"IF(ROWS(GPS_IMPORT!$1:7)<=COUNTIF(GPS_IMPORT!$A$2:$A$10000,$B$5),INDEX(GPS_IMPORT!$2:$10000,MATCH($B$5,(GPS_IMPORT!$A$2:$A$10000),0)+ROWS($1:7)-1,COLUMN()-1),0)","v":" 3.10.2019"},{"$f":"IF(ROWS(GPS_IMPORT!$1:7)<=COUNTIF(GPS_IMPORT!$A$2:$A$10000,$B$5),INDEX(GPS_IMPORT!$2:$10000,MATCH($B$5,(GPS_IMPORT!$A$2:$A$10000),0)+ROWS($1:7)-1,COLUMN()-1),0)","v":"00:47:41.300"},{"$f":"IF(ROWS(GPS_IMPORT!$1:7)<=COUNTIF(GPS_IMPORT!$A$2:$A$10000,$B$5),INDEX(GPS_IMPORT!$2:$10000,MATCH($B$5,(GPS_IMPORT!$A$2:$A$10000),0)+ROWS($1:7)-1,COLUMN()-1),0)","v":376669.85499999998},{"$f":"IF(ROWS(GPS_IMPORT!$1:7)<=COUNTIF(GPS_IMPORT!$A$2:$A$10000,$B$5),INDEX(GPS_IMPORT!$2:$10000,MATCH($B$5,(GPS_IMPORT!$A$2:$A$10000),0)+ROWS($1:7)-1,COLUMN()-1),0)","v":2458138.1189999999},{"$f":"IF(ROWS(GPS_IMPORT!$1:7)<=COUNTIF(GPS_IMPORT!$A$2:$A$10000,$B$5),INDEX(GPS_IMPORT!$2:$10000,MATCH($B$5,(GPS_IMPORT!$A$2:$A$10000),0)+ROWS($1:7)-1,COLUMN()-1),0)","v":1034.7681319999999},2.8166666743345559E-3,-1.2500002048909664E-3,3.0440833334068884E-3,true]
[8,{"$f":"IF(ROWS(GPS_IMPORT!$1:8)<=COUNTIF(GPS_IMPORT!$A$2:$A$10000,$B$5),INDEX(GPS_IMPORT!$2:$10000,MATCH($B$5,(GPS_IMPORT!$A$2:$A$10000),0)+ROWS($1:8)-1,COLUMN()-1),0)","v":"CNTL3"},{"$f":"IF(ROWS(GPS_IMPORT!$1:8)<=COUNTIF(GPS_IMPORT!$A$2:$A$10000,$B$5),INDEX(GPS_IMPORT!$2:$10000,MATCH($B$5,(GPS_IMPORT!$A$2:$A$10000),0)+ROWS($1:8)-1,COLUMN()-1),0)","v":" 3.10.2019"},{"$f":"IF(ROWS(GPS_IMPORT!$1:8)<=COUNTIF(GPS_IMPORT!$A$2:$A$10000,$B$5),INDEX(GPS_IMPORT!$2:$10000,MATCH($B$5,(GPS_IMPORT!$A$2:$A$10000),0)+ROWS($1:8)-1,COLUMN()-1),0)","v":"00:47:52"},{"$f":"IF(ROWS(GPS_IMPORT!$1:8)<=COUNTIF(GPS_IMPORT!$A$2:$A$10000,$B$5),INDEX(GPS_IMPORT!$2:$10000,MATCH($B$5,(GPS_IMPORT!$A$2:$A$10000),0)+ROWS($1:8)-1,COLUMN()-1),0)","v":376669.85019999999},{"$f":"IF(ROWS(GPS_IMPORT!$1:8)<=COUNTIF(GPS_IMPORT!$A$2:$A$10000,$B$5),INDEX(GPS_IMPORT!$2:$10000,MATCH($B$5,(GPS_IMPORT!$A$2:$A$10000),0)+ROWS($1:8)-1,COLUMN()-1),0)","v":2458138.1179999998},{"$f":"IF(ROWS(GPS_IMPORT!$1:8)<=COUNTIF(GPS_IMPORT!$A$2:$A$10000,$B$5),INDEX(GPS_IMPORT!$2:$10000,MATCH($B$5,(GPS_IMPORT!$A$2:$A$10000),0)+ROWS($1:8)-1,COLUMN()-1),0)","v":1034.76109},7.6166666694916785E-3,-2.5000004097819328E-4,1.0086083333362694E-2,true]
[9,{"$f":"IF(ROWS(GPS_IMPORT!$1:9)<=COUNTIF(GPS_IMPORT!$A$2:$A$10000,$B$5),INDEX(GPS_IMPORT!$2:$10000,MATCH($B$5,(GPS_IMPORT!$A$2:$A$10000),0)+ROWS($1:9)-1,COLUMN()-1),0)","v":"CNTL3"},{"$f":"IF(ROWS(GPS_IMPORT!$1:9)<=COUNTIF(GPS_IMPORT!$A$2:$A$10000,$B$5),INDEX(GPS_IMPORT!$2:$10000,MATCH($B$5,(GPS_IMPORT!$A$2:$A$10000),0)+ROWS($1:9)-1,COLUMN()-1),0)","v":" 3.10.2019"},{"$f":"IF(ROWS(GPS_IMPORT!$1:9)<=COUNTIF(GPS_IMPORT!$A$2:$A$10000,$B$5),INDEX(GPS_IMPORT!$2:$10000,MATCH($B$5,(GPS_IMPORT!$A$2:$A$10000),0)+ROWS($1:9)-1,COLUMN()-1),0)","v":"00:48:09"},{"$f":"IF(ROWS(GPS_IMPORT!$1:9)<=COUNTIF(GPS_IMPORT!$A$2:$A$10000,$B$5),INDEX(GPS_IMPORT!$2:$10000,MATCH($B$5,(GPS_IMPORT!$A$2:$A$10000),0)+ROWS($1:9)-1,COLUMN()-1),0)","v":376669.85570000001},{"$f":"IF(ROWS(GPS_IMPORT!$1:9)<=COUNTIF(GPS_IMPORT!$A$2:$A$10000,$B$5),INDEX(GPS_IMPORT!$2:$10000,MATCH($B$5,(GPS_IMPORT!$A$2:$A$10000),0)+ROWS($1:9)-1,COLUMN()-1),0)","v":2458138.1230000001},{"$f":"IF(ROWS(GPS_IMPORT!$1:9)<=COUNTIF(GPS_IMPORT!$A$2:$A$10000,$B$5),INDEX(GPS_IMPORT!$2:$10000,MATCH($B$5,(GPS_IMPORT!$A$2:$A$10000),0)+ROWS($1:9)-1,COLUMN()-1),0)","v":1034.738589},2.11666664108634E-3,-5.2500003948807716E-3,3.2587083333282862E-2,true]
[10,{"$f":"IF(ROWS(GPS_IMPORT!$1:10)<=COUNTIF(GPS_IMPORT!$A$2:$A$10000,$B$5),INDEX(GPS_IMPORT!$2:$10000,MATCH($B$5,(GPS_IMPORT!$A$2:$A$10000),0)+ROWS($1:10)-1,COLUMN()-1),0)","v":"CNTL3"},{"$f":"IF(ROWS(GPS_IMPORT!$1:10)<=COUNTIF(GPS_IMPORT!$A$2:$A$10000,$B$5),INDEX(GPS_IMPORT!$2:$10000,MATCH($B$5,(GPS_IMPORT!$A$2:$A$10000),0)+ROWS($1:10)-1,COLUMN()-1),0)","v":" 3.10.2019"},{"$f":"IF(ROWS(GPS_IMPORT!$1:10)<=COUNTIF(GPS_IMPORT!$A$2:$A$10000,$B$5),INDEX(GPS_IMPORT!$2:$10000,MATCH($B$5,(GPS_IMPORT!$A$2:$A$10000),0)+ROWS($1:10)-1,COLUMN()-1),0)","v":"00:48:20.100"},{"$f":"IF(ROWS(GPS_IMPORT!$1:10)<=COUNTIF(GPS_IMPORT!$A$2:$A$10000,$B$5),INDEX(GPS_IMPORT!$2:$10000,MATCH($B$5,(GPS_IMPORT!$A$2:$A$10000),0)+ROWS($1:10)-1,COLUMN()-1),0)","v":376669.85920000001},{"$f":"IF(ROWS(GPS_IMPORT!$1:10)<=COUNTIF(GPS_IMPORT!$A$2:$A$10000,$B$5),INDEX(GPS_IMPORT!$2:$10000,MATCH($B$5,(GPS_IMPORT!$A$2:$A$10000),0)+ROWS($1:10)-1,COLUMN()-1),0)","v":2458138.125},{"$f":"IF(ROWS(GPS_IMPORT!$1:10)<=COUNTIF(GPS_IMPORT!$A$2:$A$10000,$B$5),INDEX(GPS_IMPORT!$2:$10000,MATCH($B$5,(GPS_IMPORT!$A$2:$A$10000),0)+ROWS($1:10)-1,COLUMN()-1),0)","v":1034.7312959999999},-1.3833333505317569E-3,-7.2500002570450306E-3,3.9880083333400762E-2,true]
[11,{"$f":"IF(ROWS(GPS_IMPORT!$1:11)<=COUNTIF(GPS_IMPORT!$A$2:$A$10000,$B$5),INDEX(GPS_IMPORT!$2:$10000,MATCH($B$5,(GPS_IMPORT!$A$2:$A$10000),0)+ROWS($1:11)-1,COLUMN()-1),0)","v":"CNTL3"},{"$f":"IF(ROWS(GPS_IMPORT!$1:11)<=COUNTIF(GPS_IMPORT!$A$2:$A$10000,$B$5),INDEX(GPS_IMPORT!$2:$10000,MATCH($B$5,(GPS_IMPORT!$A$2:$A$10000),0)+ROWS($1:11)-1,COLUMN()-1),0)","v":" 3.10.2019"},{"$f":"IF(ROWS(GPS_IMPORT!$1:11)<=COUNTIF(GPS_IMPORT!$A$2:$A$10000,$B$5),INDEX(GPS_IMPORT!$2:$10000,MATCH($B$5,(GPS_IMPORT!$A$2:$A$10000),0)+ROWS($1:11)-1,COLUMN()-1),0)","v":"00:48:32.200"},{"$f":"IF(ROWS(GPS_IMPORT!$1:11)<=COUNTIF(GPS_IMPORT!$A$2:$A$10000,$B$5),INDEX(GPS_IMPORT!$2:$10000,MATCH($B$5,(GPS_IMPORT!$A$2:$A$10000),0)+ROWS($1:11)-1,COLUMN()-1),0)","v":376669.85379999998},{"$f":"IF(ROWS(GPS_IMPORT!$1:11)<=COUNTIF(GPS_IMPORT!$A$2:$A$10000,$B$5),INDEX(GPS_IMPORT!$2:$10000,MATCH($B$5,(GPS_IMPORT!$A$2:$A$10000),0)+ROWS($1:11)-1,COLUMN()-1),0)","v":2458138.1260000002},{"$f":"IF(ROWS(GPS_IMPORT!$1:11)<=COUNTIF(GPS_IMPORT!$A$2:$A$10000,$B$5),INDEX(GPS_IMPORT!$2:$10000,MATCH($B$5,(GPS_IMPORT!$A$2:$A$10000),0)+ROWS($1:11)-1,COLUMN()-1),0)","v":1034.740121},4.0166666731238365E-3,-8.2500004209578037E-3,3.1055083333285438E-2,true]
[12,{"$f":"IF(ROWS(GPS_IMPORT!$1:12)<=COUNTIF(GPS_IMPORT!$A$2:$A$10000,$B$5),INDEX(GPS_IMPORT!$2:$10000,MATCH($B$5,(GPS_IMPORT!$A$2:$A$10000),0)+ROWS($1:12)-1,COLUMN()-1),0)","v":"CNTL3"},{"$f":"IF(ROWS(GPS_IMPORT!$1:12)<=COUNTIF(GPS_IMPORT!$A$2:$A$10000,$B$5),INDEX(GPS_IMPORT!$2:$10000,MATCH($B$5,(GPS_IMPORT!$A$2:$A$10000),0)+ROWS($1:12)-1,COLUMN()-1),0)","v":" 3.10.2019"},{"$f":"IF(ROWS(GPS_IMPORT!$1:12)<=COUNTIF(GPS_IMPORT!$A$2:$A$10000,$B$5),INDEX(GPS_IMPORT!$2:$10000,MATCH($B$5,(GPS_IMPORT!$A$2:$A$10000),0)+ROWS($1:12)-1,COLUMN()-1),0)","v":"00:48:44.100"},{"$f":"IF(ROWS(GPS_IMPORT!$1:12)<=COUNTIF(GPS_IMPORT!$A$2:$A$10000,$B$5),INDEX(GPS_IMPORT!$2:$10000,MATCH($B$5,(GPS_IMPORT!$A$2:$A$10000),0)+ROWS($1:12)-1,COLUMN()-1),0)","v":376669.8529},{"$f":"IF(ROWS(GPS_IMPORT!$1:12)<=COUNTIF(GPS_IMPORT!$A$2:$A$10000,$B$5),INDEX(GPS_IMPORT!$2:$10000,MATCH($B$5,(GPS_IMPORT!$A$2:$A$10000),0)+ROWS($1:12)-1,COLUMN()-1),0)","v":2458138.1269999999},{"$f":"IF(ROWS(GPS_IMPORT!$1:12)<=COUNTIF(GPS_IMPORT!$A$2:$A$10000,$B$5),INDEX(GPS_IMPORT!$2:$10000,MATCH($B$5,(GPS_IMPORT!$A$2:$A$10000),0)+ROWS($1:12)-1,COLUMN()-1),0)","v":1034.7334679999999},4.9166666576638818E-3,-9.2500001192092896E-3,3.7708083333427567E-2,true]
[13,{"$f":"IF(ROWS(GPS_IMPORT!$1:13)<=COUNTIF(GPS_IMPORT!$A$2:$A$10000,$B$5),INDEX(GPS_IMPORT!$2:$10000,MATCH($B$5,(GPS_IMPORT!$A$2:$A$10000),0)+ROWS($1:13)-1,COLUMN()-1),0)","v":0},{"$f":"IF(ROWS(GPS_IMPORT!$1:13)<=COUNTIF(GPS_IMPORT!$A$2:$A$10000,$B$5),INDEX(GPS_IMPORT!$2:$10000,MATCH($B$5,(GPS_IMPORT!$A$2:$A$10000),0)+ROWS($1:13)-1,COLUMN()-1),0)","v":"00:00:00"},{"$f":"IF(ROWS(GPS_IMPORT!$1:13)<=COUNTIF(GPS_IMPORT!$A$2:$A$10000,$B$5),INDEX(GPS_IMPORT!$2:$10000,MATCH($B$5,(GPS_IMPORT!$A$2:$A$10000),0)+ROWS($1:13)-1,COLUMN()-1),0)","v":"00:00:00"},{"$f":"IF(ROWS(GPS_IMPORT!$1:13)<=COUNTIF(GPS_IMPORT!$A$2:$A$10000,$B$5),INDEX(GPS_IMPORT!$2:$10000,MATCH($B$5,(GPS_IMPORT!$A$2:$A$10000),0)+ROWS($1:13)-1,COLUMN()-1),0)","v":0},{"$f":"IF(ROWS(GPS_IMPORT!$1:13)<=COUNTIF(GPS_IMPORT!$A$2:$A$10000,$B$5),INDEX(GPS_IMPORT!$2:$10000,MATCH($B$5,(GPS_IMPORT!$A$2:$A$10000),0)+ROWS($1:13)-1,COLUMN()-1),0)","v":0},{"$f":"IF(ROWS(GPS_IMPORT!$1:13)<=COUNTIF(GPS_IMPORT!$A$2:$A$10000,$B$5),INDEX(GPS_IMPORT!$2:$10000,MATCH($B$5,(GPS_IMPORT!$A$2:$A$10000),0)+ROWS($1:13)-1,COLUMN()-1),0)","v":0},{"$f":"IF(E19>0,E$22-E19,0)","v":0},0,0,false]
[14,{"$f":"IF(ROWS(GPS_IMPORT!$1:14)<=COUNTIF(GPS_IMPORT!$A$2:$A$10000,$B$5),INDEX(GPS_IMPORT!$2:$10000,MATCH($B$5,(GPS_IMPORT!$A$2:$A$10000),0)+ROWS($1:14)-1,COLUMN()-1),0)","v":0},{"$f":"IF(ROWS(GPS_IMPORT!$1:14)<=COUNTIF(GPS_IMPORT!$A$2:$A$10000,$B$5),INDEX(GPS_IMPORT!$2:$10000,MATCH($B$5,(GPS_IMPORT!$A$2:$A$10000),0)+ROWS($1:14)-1,COLUMN()-1),0)","v":"00:00:00"},{"$f":"IF(ROWS(GPS_IMPORT!$1:14)<=COUNTIF(GPS_IMPORT!$A$2:$A$10000,$B$5),INDEX(GPS_IMPORT!$2:$10000,MATCH($B$5,(GPS_IMPORT!$A$2:$A$10000),0)+ROWS($1:14)-1,COLUMN()-1),0)","v":"00:00:00"},{"$f":"IF(ROWS(GPS_IMPORT!$1:14)<=COUNTIF(GPS_IMPORT!$A$2:$A$10000,$B$5),INDEX(GPS_IMPORT!$2:$10000,MATCH($B$5,(GPS_IMPORT!$A$2:$A$10000),0)+ROWS($1:14)-1,COLUMN()-1),0)","v":0},{"$f":"IF(ROWS(GPS_IMPORT!$1:14)<=COUNTIF(GPS_IMPORT!$A$2:$A$10000,$B$5),INDEX(GPS_IMPORT!$2:$10000,MATCH($B$5,(GPS_IMPORT!$A$2:$A$10000),0)+ROWS($1:14)-1,COLUMN()-1),0)","v":0},{"$f":"IF(ROWS(GPS_IMPORT!$1:14)<=COUNTIF(GPS_IMPORT!$A$2:$A$10000,$B$5),INDEX(GPS_IMPORT!$2:$10000,MATCH($B$5,(GPS_IMPORT!$A$2:$A$10000),0)+ROWS($1:14)-1,COLUMN()-1),0)","v":0},0,{"$f":"IF(F20>0,F$22-F20,0)","v":0},0,false]
[15,{"$f":"IF(ROWS(GPS_IMPORT!$1:15)<=COUNTIF(GPS_IMPORT!$A$2:$A$10000,$B$5),INDEX(GPS_IMPORT!$2:$10000,MATCH($B$5,(GPS_IMPORT!$A$2:$A$10000),0)+ROWS($1:15)-1,COLUMN()-1),0)","v":0},{"$f":"IF(ROWS(GPS_IMPORT!$1:15)<=COUNTIF(GPS_IMPORT!$A$2:$A$10000,$B$5),INDEX(GPS_IMPORT!$2:$10000,MATCH($B$5,(GPS_IMPORT!$A$2:$A$10000),0)+ROWS($1:15)-1,COLUMN()-1),0)","v":"00:00:00"},{"$f":"IF(ROWS(GPS_IMPORT!$1:15)<=COUNTIF(GPS_IMPORT!$A$2:$A$10000,$B$5),INDEX(GPS_IMPORT!$2:$10000,MATCH($B$5,(GPS_IMPORT!$A$2:$A$10000),0)+ROWS($1:15)-1,COLUMN()-1),0)","v":"00:00:00"},{"$f":"IF(ROWS(GPS_IMPORT!$1:15)<=COUNTIF(GPS_IMPORT!$A$2:$A$10000,$B$5),INDEX(GPS_IMPORT!$2:$10000,MATCH($B$5,(GPS_IMPORT!$A$2:$A$10000),0)+ROWS($1:15)-1,COLUMN()-1),0)","v":0},{"$f":"IF(ROWS(GPS_IMPORT!$1:15)<=COUNTIF(GPS_IMPORT!$A$2:$A$10000,$B$5),INDEX(GPS_IMPORT!$2:$10000,MATCH($B$5,(GPS_IMPORT!$A$2:$A$10000),0)+ROWS($1:15)-1,COLUMN()-1),0)","v":0},{"$f":"IF(ROWS(GPS_IMPORT!$1:15)<=COUNTIF(GPS_IMPORT!$A$2:$A$10000,$B$5),INDEX(GPS_IMPORT!$2:$10000,MATCH($B$5,(GPS_IMPORT!$A$2:$A$10000),0)+ROWS($1:15)-1,COLUMN()-1),0)","v":0},0,0,0,false]
[null,null,null,"AVERAGE",{"$f":"(IF($K$7=TRUE,E7,0)+IF($K$8=TRUE,E8,0)+IF($K$9=TRUE,E9,0)+IF($K$10=TRUE,E10,0)+IF($K$11=TRUE,E11,0)+IF($K$12=TRUE,E12,0)+IF($K$13=TRUE,E13,0)+IF($K$14=TRUE,E14,0)+IF($K$15=TRUE,E15,0)+IF($K$16=TRUE,E16,0)+IF($K$17=TRUE,E17,0)+IF($K$18=TRUE,E18,0)+IF($K$19=TRUE,E19,0)+IF($K$20=TRUE,E20,0)+IF($K$21=TRUE,E21,0))/(IF($K$7=TRUE,1,0)+IF($K$8=TRUE,1,0)+IF($K$9=TRUE,1,0)+IF($K$10=TRUE,1,0)+IF($K$11=TRUE,1,0)+IF($K$12=TRUE,1,0)+IF($K$13=TRUE,1,0)+IF($K$14=TRUE,1,0)+IF($K$15=TRUE,1,0)+IF($K$16=TRUE,1,0)+IF($K$17=TRUE,1,0)+IF($K$18=TRUE,1,0)+IF($K$19=TRUE,1,0)+IF($K$20=TRUE,1,0)+IF($K$21=TRUE,1,0))","v":376669.85781666666},{"$f":"(IF($K$7=TRUE,F7,0)+IF($K$8=TRUE,F8,0)+IF($K$9=TRUE,F9,0)+IF($K$10=TRUE,F10,0)+IF($K$11=TRUE,F11,0)+IF($K$12=TRUE,F12,0)+IF($K$13=TRUE,F13,0)+IF($K$14=TRUE,F14,0)+IF($K$15=TRUE,F15,0)+IF($K$16=TRUE,F16,0)+IF($K$17=TRUE,F17,0)+IF($K$18=TRUE,F18,0)+IF($K$19=TRUE,F19,0)+IF($K$20=TRUE,F20,0)+IF($K$21=TRUE,F21,0))/(IF($K$7=TRUE,1,0)+IF($K$8=TRUE,1,0)+IF($K$9=TRUE,1,0)+IF($K$10=TRUE,1,0)+IF($K$11=TRUE,1,0)+IF($K$12=TRUE,1,0)+IF($K$13=TRUE,1,0)+IF($K$14=TRUE,1,0)+IF($K$15=TRUE,1,0)+IF($K$16=TRUE,1,0)+IF($K$17=TRUE,1,0)+IF($K$18=TRUE,1,0)+IF($K$19=TRUE,1,0)+IF($K$20=TRUE,1,0)+IF($K$21=TRUE,1,0))","v":2458138.1177499997},{"$f":"(IF($K$7=TRUE,G7,0)+IF($K$8=TRUE,G8,0)+IF($K$9=TRUE,G9,0)+IF($K$10=TRUE,G10,0)+IF($K$11=TRUE,G11,0)+IF($K$12=TRUE,G12,0)+IF($K$13=TRUE,G13,0)+IF($K$14=TRUE,G14,0)+IF($K$15=TRUE,G15,0)+IF($K$16=TRUE,G16,0)+IF($K$17=TRUE,G17,0)+IF($K$18=TRUE,G18,0)+IF($K$19=TRUE,G19,0)+IF($K$20=TRUE,G20,0)+IF($K$21=TRUE,G21,0))/\n(IF($K$7=TRUE,1,0)+IF($K$8=TRUE,1,0)+IF($K$9=TRUE,1,0)+IF($K$10=TRUE,1,0)+IF($K$11=TRUE,1,0)+IF($K$12=TRUE,1,0)+IF($K$13=TRUE,1,0)+IF($K$14=TRUE,1,0)+IF($K$15=TRUE,1,0)+IF($K$16=TRUE,1,0)+IF($K$17=TRUE,1,0)+IF($K$18=TRUE,1,0)+IF($K$19=TRUE,1,0)+IF($K$20=TRUE,1,0)+IF($K$21=TRUE,1,0))","v":1034.7711760833333},"RMSE:","RMSE:","RMSE:"]
[null,null,null,null,null,null,"RMSE IN US SURVEY FEET:",{"$f":"SQRT((\n(IF($K$7=TRUE,H7^2,0))+(IF($K$8=TRUE,H8^2,0))+(IF($K$9=TRUE,H9^2,0))+(IF($K$10=TRUE,H10^2,0))+(IF($K$11=TRUE,H11^2,0))+(IF($K$12=TRUE,H12^2,0))+(IF($K$13=TRUE,H13^2,0))+(IF($K$14=TRUE,H14^2,0))+(IF($K$15=TRUE,H15^2,0))+(IF($K$16=TRUE,H16^2,0))+(IF($K$17=TRUE,H17^2,0))+(IF($K$18=TRUE,H18^2,0))+(IF($K$19=TRUE,H19^2,0))+(IF($K$20=TRUE,H20^2,0))+(IF($K$21=TRUE,H21^2,0)))/\n(IF($K$7=TRUE,1,0)+IF($K$8=TRUE,1,0)+IF($K$9=TRUE,1,0)+IF($K$10=TRUE,1,0)+IF($K$11=TRUE,1,0)+IF($K$12=TRUE,1,0)+IF($K$13=TRUE,1,0)+IF($K$14=TRUE,1,0)+IF($K$15=TRUE,1,0)+IF($K$16=TRUE,1,0)+IF($K$17=TRUE,1,0)+IF($K$18=TRUE,1,0)+IF($K$19=TRUE,1,0)+IF($K$20=TRUE,1,0)+IF($K$21=TRUE,1,0)))","v":6.4776324504211809E-3},{"$f":"SQRT((\n(IF($K$7=TRUE,I7^2,0))+(IF($K$8=TRUE,I8^2,0))+(IF($K$9=TRUE,I9^2,0))+(IF($K$10=TRUE,I10^2,0))+(IF($K$11=TRUE,I11^2,0))+(IF($K$12=TRUE,I12^2,0))+(IF($K$13=TRUE,I13^2,0))+(IF($K$14=TRUE,I14^2,0))+(IF($K$15=TRUE,I15^2,0))+(IF($K$16=TRUE,I16^2,0))+(IF($K$17=TRUE,I17^2,0))+(IF($K$18=TRUE,I18^2,0))+(IF($K$19=TRUE,I19^2,0))+(IF($K$20=TRUE,I20^2,0))+(IF($K$21=TRUE,I21^2,0)))/\n(IF($K$7=TRUE,1,0)+IF($K$8=TRUE,1,0)+IF($K$9=TRUE,1,0)+IF($K$10=TRUE,1,0)+IF($K$11=TRUE,1,0)+IF($K$12=TRUE,1,0)+IF($K$13=TRUE,1,0)+IF($K$14=TRUE,1,0)+IF($K$15=TRUE,1,0)+IF($K$16=TRUE,1,0)+IF($K$17=TRUE,1,0)+IF($K$18=TRUE,1,0)+IF($K$19=TRUE,1,0)+IF($K$20=TRUE,1,0)+IF($K$21=TRUE,1,0)))","v":5.9878348650904464E-3},{"$f":"SQRT((\n(IF($K$7=TRUE,J7^2,0))+(IF($K$8=TRUE,J8^2,0))+(IF($K$9=TRUE,J9^2,0))+(IF($K$10=TRUE,J10^2,0))+(IF($K$11=TRUE,J11^2,0))+(IF($K$12=TRUE,J12^2,0))+(IF($K$13=TRUE,J13^2,0))+(IF($K$14=TRUE,J14^2,0))+(IF($K$15=TRUE,J15^2,0))+(IF($K$16=TRUE,J16^2,0))+(IF($K$17=TRUE,J17^2,0))+(IF($K$18=TRUE,J18^2,0))+(IF($K$19=TRUE,J19^2,0))+(IF($K$20=TRUE,J20^2,0))+(IF($K$21=TRUE,J21^2,0)))/\n(IF($K$7=TRUE,1,0)+IF($K$8=TRUE,1,0)+IF($K$9=TRUE,1,0)+IF($K$10=TRUE,1,0)+IF($K$11=TRUE,1,0)+IF($K$12=TRUE,1,0)+IF($K$13=TRUE,1,0)+IF($K$14=TRUE,1,0)+IF($K$15=TRUE,1,0)+IF($K$16=TRUE,1,0)+IF($K$17=TRUE,1,0)+IF($K$18=TRUE,1,0)+IF($K$19=TRUE,1,0)+IF($K$20=TRUE,1,0)+IF($K$21=TRUE,1,0)))","v":3.1614139696423786E-2}]
[null,null,null,1]
[null,null,"UNITLESS GRID TO GROUND MULTIPLIER",{"$f":"IF(REPORT!C13=\"n/a\",\"0.00000000\",REPORT!C13)","v":1.0000901799999999},null,null,null,{"$f":"IF(H23<=0.029,\"PASS\",\"FAIL\")","v":"PASS"},{"$f":"IF(I23<=0.029,\"PASS\",\"FAIL\")","v":"PASS"},{"$f":"IF(J23<=0.039,\"PASS\",\"FAIL\")","v":"PASS"}]
[]
["AVERAGED GPS-DERIVED POSITION",null,null,null,null,null,null,null,"Notes:"]
[null,"MONUMENT COORDINATES",null,"NORTHING","EASTING","ORTHO HEIGHT"]
[null,"US Survey Feet (GRID)",null,{"$f":"$E$22","v":376669.85781666666},{"$f":"$F$22","v":2458138.1177499997},{"$f":"$G$22","v":1034.7711760833333}]
[]
["LEVELED ELEVATION"]
["US SURVEY FEET",null,{"$f":"IFERROR(VLOOKUP(B5,'LEVEL RUN'!A8:I59,9,FALSE),\"N/A\")","v":1034.7279999999998},"(Type the leveled elevation or N/A if no leveled elevation is available)"]
["MONUMENT HELD",null,null,"(Type the monument name from which leveling originated)"]
["LEVELED ELEVATION - GPS DERIVED ELEVATION   = ",null,null,null,{"$f":"IF(C32=\"N/A\",\"N/A\",C32-(F29*D24))","v":-4.3176083333491988E-2}]
[]
["FINAL MONUMENT COORDINATES"]
[null,"MONUMENT COORDINATES",null,"NORTHING","EASTING","ELEVATION","FEATURE CODE"]
[null,"US SURVEY FEET (GRID)",null,{"$f":"$E$22*$D$24","v":376669.85781666666},{"$f":"$F$22*$D$24","v":2458138.1177499997},{"$f":"IF($C$32=\"N/A\",($G$22*$D$24),$C$32)","v":1034.7279999999998},{"$f":"VLOOKUP($B$5,GPS_IMPORT!$A$2:$G$2000,7,FALSE)","v":"IPINS"}]
[null,"US SURVEY FEET (GROUND)",null,{"$f":"$D$38*$D$25","v":376703.82590444456},{"$f":"$E$38*$D$25","v":2458359.7926454581},{"$f":"IF($C$32=\"N/A\",($G$22*$D$24),$C$32)","v":1034.7279999999998},{"$f":"G38","v":"IPINS"}]
[]
["∆ North,  ∆ East, and ∆ Ht. are the difference between the average northing, easting, and height for each observation.",null,null,null,null,null,null,null,"Mask Angle:","10°"]

{"sheet":"LEVEL RUN","index":15,"n_rows":200,"n_cols":13,"rows_kept":200,"cut":false,"hidden":false,"merged":[[196,9,196,12],[197,9,197,12],[198,9,198,12],[191,9,191,12],[192,9,192,12],[193,9,193,12],[194,9,194,12],[195,9,195,12],[186,9,186,12],[187,9,187,12],[188,9,188,12],[189,9,189,12],[190,9,190,12],[181,9,181,12],[182,9,182,12],[183,9,183,12],[184,9,184,12],[185,9,185,12],[176,9,176,12],[177,9,177,12],[178,9,178,12],[179,9,179,12],[180,9,180,12],[171,9,171,12],[172,9,172,12],[173,9,173,12],[174,9,174,12],[175,9,175,12],[166,9,166,12],[167,9,167,12],[168,9,168,12],[169,9,169,12],[170,9,170,12],[161,9,161,12],[162,9,162,12],[163,9,163,12],[164,9,164,12],[165,9,165,12],[156,9,156,12],[157,9,157,12],[158,9,158,12],[159,9,159,12],[160,9,160,12],[151,9,151,12],[152,9,152,12],[153,9,153,12],[154,9,154,12],[155,9,155,12],[146,9,146,12],[147,9,147,12],[148,9,148,12],[149,9,149,12],[150,9,150,12],[141,9,141,12],[142,9,142,12],[143,9,143,12],[144,9,144,12],[145,9,145,12],[136,9,136,12],[137,9,137,12],[138,9,138,12],[139,9,139,12],[140,9,140,12],[131,9,131,12],[132,9,132,12],[133,9,133,12],[134,9,134,12],[135,9,135,12],[126,9,126,12],[127,9,127,12],[128,9,128,12],[129,9,129,12],[130,9,130,12],[121,9,121,12],[122,9,122,12],[123,9,123,12],[124,9,124,12],[125,9,125,12],[116,9,116,12],[117,9,117,12],[118,9,118,12],[119,9,119,12],[120,9,120,12],[111,9,111,12],[112,9,112,12],[113,9,113,12],[114,9,114,12],[115,9,115,12],[106,9,106,12],[107,9,107,12],[108,9,108,12],[109,9,109,12],[110,9,110,12],[101,9,101,12],[102,9,102,12],[103,9,103,12],[104,9,104,12],[105,9,105,12],[96,9,96,12],[97,9,97,12],[98,9,98,12],[99,9,99,12],[100,9,100,12],[91,9,91,12],[92,9,92,12],[93,9,93,12],[94,9,94,12],[95,9,95,12],[86,9,86,12],[87,9,87,12],[88,9,88,12],[89,9,89,12],[90,9,90,12],[81,9,81,12],[82,9,82,12],[83,9,83,12],[84,9,84,12],[85,9,85,12],[76,9,76,12],[77,9,77,12],[78,9,78,12],[79,9,79,12],[80,9,80,12],[71,9,71,12],[72,9,72,12],[73,9,73,12],[74,9,74,12],[75,9,75,12],[66,9,66,12],[67,9,67,12],[68,9,68,12],[69,9,69,12],[70,9,70,12],[61,9,61,12],[62,9,62,12],[63,9,63,12],[64,9,64,12],[65,9,65,12],[56,9,56,12],[57,9,57,12],[58,9,58,12],[59,9,59,12],[60,9,60,12],[51,9,51,12],[52,9,52,12],[53,9,53,12],[54,9,54,12],[55,9,55,12],[46,9,46,12],[47,9,47,12],[48,9,48,12],[49,9,49,12],[50,9,50,12],[41,9,41,12],[42,9,42,12],[43,9,43,12],[44,9,44,12],[45,9,45,12],[36,9,36,12],[37,9,37,12],[38,9,38,12],[39,9,39,12],[40,9,40,12],[31,9,31,12],[32,9,32,12],[33,9,33,12],[34,9,34,12],[35,9,35,12],[26,9,26,12],[27,9,27,12],[28,9,28,12],[29,9,29,12],[30,9,30,12],[22,9,22,12],[23,9,23,12],[24,9,24,12],[25,9,25,12],[16,9,16,12],[17,9,17,12],[18,9,18,12],[19,9,19,12],[20,9,20,12],[21,9,21,12],[13,9,13,12],[14,9,14,12],[15,9,15,12],[6,9,6,12],[7,9,7,12],[8,9,8,12],[9,9,9,12],[10,9,10,12],[0,0,0,10],[5,9,5,12],[1,4,1,5],[2,4,2,5],[1,6,1,7],[2,6,2,7],[3,6,3,7],[11,9,11,12],[12,9,12,12]]}
[{"$f":"REPORT!B2","v":"FRA-71-29.4"},null,null,null,null,null,null,null,null,null,null,"PID:",{"$f":"REPORT!E2","v":106471}]
["Adjustment factor only works for closed level loops.",null,null,null,"Instrument Used:",null,"Length in Miles:",null,0,"Instrument:",null,"Date:"]
["SUM BS:",{"$f":"SUM(B7:B200)","v":38.323},"SUM FS:",{"$f":"SUM(E8:E200)","v":38.325000000000003},"Topcon DL-503",null,"Misclosure:",null,{"$f":"B3-D3","v":-2.0000000000024443E-3},"Notes:",null,"Weather:"]
["Misclosure must not exceed 0.04 ft x √E where E=Length of loop (miles)",null,null,null,null,null,"Adj Factor:",null,{"$f":"(I3/(COUNTA(B7:B200)))*-1","v":3.3333333333374071E-4},"Rod:",null,"Temperature:"]
["Please DELETE unused rows before printing!"]
["POINT","BS","HI","FS","SUMFS","ELEV","REC ELEV","ADJ","ADJ ELEV","DESCRIPTION"]
["CNTL1",2.556,{"$f":"F7+B7","v":1024.4089999999999},null,{"$f":"IF(D7>0,IF(B7>0,D7,0),\" \")","v":" "},1021.853,null,null,"-"]
["CNTL2",11.936,{"$f":"IF(D8<>\"\",IF(OR(B8<>\"\",INDIRECT(\"D9\")=0),IF(B7<>\"\",F7+B7,VLOOKUP(INDEX($B$7:B7,MATCH(9.99999999999999E+307,$B$7:B7)),$B$7:F7,5,FALSE)+INDEX($B$7:B7,MATCH(9.99999999999999E+307,$B$7:B7))),(VLOOKUP(INDEX($B$7:B7,MATCH(9.99999999999999E+307,$B$7:B7)),$B$7:F7,5,FALSE))+(INDEX($B$7:B7,MATCH(9.99999999999999E+307,$B$7:B7)))),\"\")","v":1024.4089999999999},11.616,{"$f":"IF(D8<>\"\",IF(OR(B8<>\"\",INDIRECT(\"D9\")=0),D8,0),\"\")","v":11.616},{"$f":"IF(D8<>\"\",C8-D8,\"\")","v":1012.7929999999999},null,{"$f":"IF(D8<>\"\",IF(AND(B8<>\"\",B7<>\"\"),$I$4+H7,VLOOKUP(INDEX($B$7:B7,MATCH(9.99999999999999E+307,$B$7:B7)),$B$7:H7,7,FALSE)+$I$4),\"\")","v":3.3333333333374071E-4},{"$f":"IF(D8<>\"\",(F8+H8),\"\")","v":1012.7933333333332}]
["TP1",11.143000000000001,{"$f":"IF(D9<>\"\",IF(OR(B9<>\"\",INDIRECT(\"D10\")=0),IF(B8<>\"\",F8+B8,VLOOKUP(INDEX($B$7:B8,MATCH(9.99999999999999E+307,$B$7:B8)),$B$7:F8,5,FALSE)+INDEX($B$7:B8,MATCH(9.99999999999999E+307,$B$7:B8))),(VLOOKUP(INDEX($B$7:B8,MATCH(9.99999999999999E+307,$B$7:B8)),$B$7:F8,5,FALSE))+(INDEX($B$7:B8,MATCH(9.99999999999999E+307,$B$7:B8)))),\"\")","v":1024.7289999999998},0.11,{"$f":"IF(D9<>\"\",IF(OR(B9<>\"\",INDIRECT(\"D10\")=0),D9,0),\"\")","v":0.11},{"$f":"IF(D9<>\"\",C9-D9,\"\")","v":1024.6189999999999},null,{"$f":"IF(D9<>\"\",IF(AND(B9<>\"\",B8<>\"\"),$I$4+H8,VLOOKUP(INDEX($B$7:B8,MATCH(9.99999999999999E+307,$B$7:B8)),$B$7:H8,7,FALSE)+$I$4),\"\")","v":6.6666666666748142E-4},{"$f":"IF(D9<>\"\",(F9+H9),\"\")","v":1024.6196666666665}]
["CNTL3",0.77700000000000002,{"$f":"IF(D10<>\"\",IF(OR(B10<>\"\",INDIRECT(\"D11\")=0),IF(B9<>\"\",F9+B9,VLOOKUP(INDEX($B$7:B9,MATCH(9.99999999999999E+307,$B$7:B9)),$B$7:F9,5,FALSE)+INDEX($B$7:B9,MATCH(9.99999999999999E+307,$B$7:B9))),(VLOOKUP(INDEX($B$7:B9,MATCH(9.99999999999999E+307,$B$7:B9)),$B$7:F9,5,FALSE))+(INDEX($B$7:B9,MATCH(9.99999999999999E+307,$B$7:B9)))),\"\")","v":1035.7619999999999},1.0349999999999999,{"$f":"IF(D10<>\"\",IF(OR(B10<>\"\",INDIRECT(\"D11\")=0),D10,0),\"\")","v":1.0349999999999999},1034.7269999999999,null,{"$f":"IF(D10<>\"\",IF(AND(B10<>\"\",B9<>\"\"),$I$4+H9,VLOOKUP(INDEX($B$7:B9,MATCH(9.99999999999999E+307,$B$7:B9)),$B$7:H9,7,FALSE)+$I$4),\"\")","v":1.0000000000012221E-3},1034.7279999999998]
["TP2",6.7000000000000004E-2,{"$f":"IF(D11<>\"\",IF(OR(B11<>\"\",INDIRECT(\"D12\")=0),IF(B10<>\"\",F10+B10,VLOOKUP(INDEX($B$7:B10,MATCH(9.99999999999999E+307,$B$7:B10)),$B$7:F10,5,FALSE)+INDEX($B$7:B10,MATCH(9.99999999999999E+307,$B$7:B10))),(VLOOKUP(INDEX($B$7:B10,MATCH(9.99999999999999E+307,$B$7:B10)),$B$7:F10,5,FALSE))+(INDEX($B$7:B10,MATCH(9.99999999999999E+307,$B$7:B10)))),\"\")","v":1035.5039999999999},10.885,{"$f":"IF(D11<>\"\",IF(OR(B11<>\"\",INDIRECT(\"D12\")=0),D11,0),\"\")","v":10.885},1024.6189999999999,null,{"$f":"IF(D11<>\"\",IF(AND(B11<>\"\",B10<>\"\"),$I$4+H10,VLOOKUP(INDEX($B$7:B10,MATCH(9.99999999999999E+307,$B$7:B10)),$B$7:H10,7,FALSE)+$I$4),\"\")","v":1.3333333333349628E-3},1024.6203333333333]
["CNTL2",11.843999999999999,{"$f":"IF(D12<>\"\",IF(OR(B12<>\"\",INDIRECT(\"D13\")=0),IF(B11<>\"\",F11+B11,VLOOKUP(INDEX($B$7:B11,MATCH(9.99999999999999E+307,$B$7:B11)),$B$7:F11,5,FALSE)+INDEX($B$7:B11,MATCH(9.99999999999999E+307,$B$7:B11))),(VLOOKUP(INDEX($B$7:B11,MATCH(9.99999999999999E+307,$B$7:B11)),$B$7:F11,5,FALSE))+(INDEX($B$7:B11,MATCH(9.99999999999999E+307,$B$7:B11)))),\"\")","v":1024.6859999999999},11.896000000000001,{"$f":"IF(D12<>\"\",IF(OR(B12<>\"\",INDIRECT(\"D13\")=0),D12,0),\"\")","v":11.896000000000001},1012.79,null,{"$f":"IF(D12<>\"\",IF(AND(B12<>\"\",B11<>\"\"),$I$4+H11,VLOOKUP(INDEX($B$7:B11,MATCH(9.99999999999999E+307,$B$7:B11)),$B$7:H11,7,FALSE)+$I$4),\"\")","v":1.6666666666687036E-3},1012.7916666666666]
["CNTL1",null,{"$f":"IF(D13<>\"\",IF(OR(B13<>\"\",INDIRECT(\"D14\")=0),IF(B12<>\"\",F12+B12,VLOOKUP(INDEX($B$7:B12,MATCH(9.99999999999999E+307,$B$7:B12)),$B$7:F12,5,FALSE)+INDEX($B$7:B12,MATCH(9.99999999999999E+307,$B$7:B12))),(VLOOKUP(INDEX($B$7:B12,MATCH(9.99999999999999E+307,$B$7:B12)),$B$7:F12,5,FALSE))+(INDEX($B$7:B12,MATCH(9.99999999999999E+307,$B$7:B12)))),\"\")","v":1024.634},2.7829999999999999,{"$f":"IF(D13<>\"\",IF(OR(B13<>\"\",INDIRECT(\"D14\")=0),D13,0),\"\")","v":2.7829999999999999},1021.851,null,{"$f":"IF(D13<>\"\",IF(AND(B13<>\"\",B12<>\"\"),$I$4+H12,VLOOKUP(INDEX($B$7:B12,MATCH(9.99999999999999E+307,$B$7:B12)),$B$7:H12,7,FALSE)+$I$4),\"\")","v":2.0000000000024443E-3},1021.853]
[null,null,{"$f":"IF(D14<>\"\",IF(OR(B14<>\"\",INDIRECT(\"D15\")=0),IF(B13<>\"\",F13+B13,VLOOKUP(INDEX($B$7:B13,MATCH(9.99999999999999E+307,$B$7:B13)),$B$7:F13,5,FALSE)+INDEX($B$7:B13,MATCH(9.99999999999999E+307,$B$7:B13))),(VLOOKUP(INDEX($B$7:B13,MATCH(9.99999999999999E+307,$B$7:B13)),$B$7:F13,5,FALSE))+(INDEX($B$7:B13,MATCH(9.99999999999999E+307,$B$7:B13)))),\"\")","v":""},null,{"$f":"IF(D14<>\"\",IF(OR(B14<>\"\",INDIRECT(\"D15\")=0),D14,0),\"\")","v":""},"",null,{"$f":"IF(D14<>\"\",IF(AND(B14<>\"\",B13<>\"\"),$I$4+H13,VLOOKUP(INDEX($B$7:B13,MATCH(9.99999999999999E+307,$B$7:B13)),$B$7:H13,7,FALSE)+$I$4),\"\")","v":""},""]
[null,null,{"$f":"IF(D15<>\"\",IF(OR(B15<>\"\",INDIRECT(\"D16\")=0),IF(B14<>\"\",F14+B14,VLOOKUP(INDEX($B$7:B14,MATCH(9.99999999999999E+307,$B$7:B14)),$B$7:F14,5,FALSE)+INDEX($B$7:B14,MATCH(9.99999999999999E+307,$B$7:B14))),(VLOOKUP(INDEX($B$7:B14,MATCH(9.99999999999999E+307,$B$7:B14)),$B$7:F14,5,FALSE))+(INDEX($B$7:B14,MATCH(9.99999999999999E+307,$B$7:B14)))),\"\")","v":""},null,{"$f":"IF(D15<>\"\",IF(OR(B15<>\"\",INDIRECT(\"D16\")=0),D15,0),\"\")","v":""},"",null,{"$f":"IF(D15<>\"\",IF(AND(B15<>\"\",B14<>\"\"),$I$4+H14,VLOOKUP(INDEX($B$7:B14,MATCH(9.99999999999999E+307,$B$7:B14)),$B$7:H14,7,FALSE)+$I$4),\"\")","v":""},""]
[null,null,{"$f":"IF(D16<>\"\",IF(OR(B16<>\"\",INDIRECT(\"D17\")=0),IF(B15<>\"\",F15+B15,VLOOKUP(INDEX($B$7:B15,MATCH(9.99999999999999E+307,$B$7:B15)),$B$7:F15,5,FALSE)+INDEX($B$7:B15,MATCH(9.99999999999999E+307,$B$7:B15))),(VLOOKUP(INDEX($B$7:B15,MATCH(9.99999999999999E+307,$B$7:B15)),$B$7:F15,5,FALSE))+(INDEX($B$7:B15,MATCH(9.99999999999999E+307,$B$7:B15)))),\"\")","v":""},null,{"$f":"IF(D16<>\"\",IF(OR(B16<>\"\",INDIRECT(\"D17\")=0),D16,0),\"\")","v":""},"",null,{"$f":"IF(D16<>\"\",IF(AND(B16<>\"\",B15<>\"\"),$I$4+H15,VLOOKUP(INDEX($B$7:B15,MATCH(9.99999999999999E+307,$B$7:B15)),$B$7:H15,7,FALSE)+$I$4),\"\")","v":""},""]
[null,null,{"$f":"IF(D17<>\"\",IF(OR(B17<>\"\",INDIRECT(\"D18\")=0),IF(B16<>\"\",F16+B16,VLOOKUP(INDEX($B$7:B16,MATCH(9.99999999999999E+307,$B$7:B16)),$B$7:F16,5,FALSE)+INDEX($B$7:B16,MATCH(9.99999999999999E+307,$B$7:B16))),(VLOOKUP(INDEX($B$7:B16,MATCH(9.99999999999999E+307,$B$7:B16)),$B$7:F16,5,FALSE))+(INDEX($B$7:B16,MATCH(9.99999999999999E+307,$B$7:B16)))),\"\")","v":""},null,{"$f":"IF(D17<>\"\",IF(OR(B17<>\"\",INDIRECT(\"D18\")=0),D17,0),\"\")","v":""},"",null,{"$f":"IF(D17<>\"\",IF(AND(B17<>\"\",B16<>\"\"),$I$4+H16,VLOOKUP(INDEX($B$7:B16,MATCH(9.99999999999999E+307,$B$7:B16)),$B$7:H16,7,FALSE)+$I$4),\"\")","v":""},""]
[null,null,{"$f":"IF(D18<>\"\",IF(OR(B18<>\"\",INDIRECT(\"D19\")=0),IF(B17<>\"\",F17+B17,VLOOKUP(INDEX($B$7:B17,MATCH(9.99999999999999E+307,$B$7:B17)),$B$7:F17,5,FALSE)+INDEX($B$7:B17,MATCH(9.99999999999999E+307,$B$7:B17))),(VLOOKUP(INDEX($B$7:B17,MATCH(9.99999999999999E+307,$B$7:B17)),$B$7:F17,5,FALSE))+(INDEX($B$7:B17,MATCH(9.99999999999999E+307,$B$7:B17)))),\"\")","v":""},null,{"$f":"IF(D18<>\"\",IF(OR(B18<>\"\",INDIRECT(\"D19\")=0),D18,0),\"\")","v":""},"",null,{"$f":"IF(D18<>\"\",IF(AND(B18<>\"\",B17<>\"\"),$I$4+H17,VLOOKUP(INDEX($B$7:B17,MATCH(9.99999999999999E+307,$B$7:B17)),$B$7:H17,7,FALSE)+$I$4),\"\")","v":""},""]
[null,null,{"$f":"IF(D19<>\"\",IF(OR(B19<>\"\",INDIRECT(\"D20\")=0),IF(B18<>\"\",F18+B18,VLOOKUP(INDEX($B$7:B18,MATCH(9.99999999999999E+307,$B$7:B18)),$B$7:F18,5,FALSE)+INDEX($B$7:B18,MATCH(9.99999999999999E+307,$B$7:B18))),(VLOOKUP(INDEX($B$7:B18,MATCH(9.99999999999999E+307,$B$7:B18)),$B$7:F18,5,FALSE))+(INDEX($B$7:B18,MATCH(9.99999999999999E+307,$B$7:B18)))),\"\")","v":""},null,{"$f":"IF(D19<>\"\",IF(OR(B19<>\"\",INDIRECT(\"D20\")=0),D19,0),\"\")","v":""},"",null,{"$f":"IF(D19<>\"\",IF(AND(B19<>\"\",B18<>\"\"),$I$4+H18,VLOOKUP(INDEX($B$7:B18,MATCH(9.99999999999999E+307,$B$7:B18)),$B$7:H18,7,FALSE)+$I$4),\"\")","v":""},""]
[null,null,{"$f":"IF(D20<>\"\",IF(OR(B20<>\"\",INDIRECT(\"D21\")=0),IF(B19<>\"\",F19+B19,VLOOKUP(INDEX($B$7:B19,MATCH(9.99999999999999E+307,$B$7:B19)),$B$7:F19,5,FALSE)+INDEX($B$7:B19,MATCH(9.99999999999999E+307,$B$7:B19))),(VLOOKUP(INDEX($B$7:B19,MATCH(9.99999999999999E+307,$B$7:B19)),$B$7:F19,5,FALSE))+(INDEX($B$7:B19,MATCH(9.99999999999999E+307,$B$7:B19)))),\"\")","v":""},null,{"$f":"IF(D20<>\"\",IF(OR(B20<>\"\",INDIRECT(\"D21\")=0),D20,0),\"\")","v":""},"",null,{"$f":"IF(D20<>\"\",IF(AND(B20<>\"\",B19<>\"\"),$I$4+H19,VLOOKUP(INDEX($B$7:B19,MATCH(9.99999999999999E+307,$B$7:B19)),$B$7:H19,7,FALSE)+$I$4),\"\")","v":""},""]
[null,null,{"$f":"IF(D21<>\"\",IF(OR(B21<>\"\",INDIRECT(\"D22\")=0),IF(B20<>\"\",F20+B20,VLOOKUP(INDEX($B$7:B20,MATCH(9.99999999999999E+307,$B$7:B20)),$B$7:F20,5,FALSE)+INDEX($B$7:B20,MATCH(9.99999999999999E+307,$B$7:B20))),(VLOOKUP(INDEX($B$7:B20,MATCH(9.99999999999999E+307,$B$7:B20)),$B$7:F20,5,FALSE))+(INDEX($B$7:B20,MATCH(9.99999999999999E+307,$B$7:B20)))),\"\")","v":""},null,{"$f":"IF(D21<>\"\",IF(OR(B21<>\"\",INDIRECT(\"D22\")=0),D21,0),\"\")","v":""},"",null,{"$f":"IF(D21<>\"\",IF(AND(B21<>\"\",B20<>\"\"),$I$4+H20,VLOOKUP(INDEX($B$7:B20,MATCH(9.99999999999999E+307,$B$7:B20)),$B$7:H20,7,FALSE)+$I$4),\"\")","v":""},""]
[null,null,{"$f":"IF(D22<>\"\",IF(OR(B22<>\"\",INDIRECT(\"D23\")=0),IF(B21<>\"\",F21+B21,VLOOKUP(INDEX($B$7:B21,MATCH(9.99999999999999E+307,$B$7:B21)),$B$7:F21,5,FALSE)+INDEX($B$7:B21,MATCH(9.99999999999999E+307,$B$7:B21))),(VLOOKUP(INDEX($B$7:B21,MATCH(9.99999999999999E+307,$B$7:B21)),$B$7:F21,5,FALSE))+(INDEX($B$7:B21,MATCH(9.99999999999999E+307,$B$7:B21)))),\"\")","v":""},null,{"$f":"IF(D22<>\"\",IF(OR(B22<>\"\",INDIRECT(\"D23\")=0),D22,0),\"\")","v":""},"",null,{"$f":"IF(D22<>\"\",IF(AND(B22<>\"\",B21<>\"\"),$I$4+H21,VLOOKUP(INDEX($B$7:B21,MATCH(9.99999999999999E+307,$B$7:B21)),$B$7:H21,7,FALSE)+$I$4),\"\")","v":""},""]
[null,null,{"$f":"IF(D23<>\"\",IF(OR(B23<>\"\",INDIRECT(\"D24\")=0),IF(B22<>\"\",F22+B22,VLOOKUP(INDEX($B$7:B22,MATCH(9.99999999999999E+307,$B$7:B22)),$B$7:F22,5,FALSE)+INDEX($B$7:B22,MATCH(9.99999999999999E+307,$B$7:B22))),(VLOOKUP(INDEX($B$7:B22,MATCH(9.99999999999999E+307,$B$7:B22)),$B$7:F22,5,FALSE))+(INDEX($B$7:B22,MATCH(9.99999999999999E+307,$B$7:B22)))),\"\")","v":""},null,{"$f":"IF(D23<>\"\",IF(OR(B23<>\"\",INDIRECT(\"D24\")=0),D23,0),\"\")","v":""},"",null,{"$f":"IF(D23<>\"\",IF(AND(B23<>\"\",B22<>\"\"),$I$4+H22,VLOOKUP(INDEX($B$7:B22,MATCH(9.99999999999999E+307,$B$7:B22)),$B$7:H22,7,FALSE)+$I$4),\"\")","v":""},""]
[null,null,{"$f":"IF(D24<>\"\",IF(OR(B24<>\"\",INDIRECT(\"D25\")=0),IF(B23<>\"\",F23+B23,VLOOKUP(INDEX($B$7:B23,MATCH(9.99999999999999E+307,$B$7:B23)),$B$7:F23,5,FALSE)+INDEX($B$7:B23,MATCH(9.99999999999999E+307,$B$7:B23))),(VLOOKUP(INDEX($B$7:B23,MATCH(9.99999999999999E+307,$B$7:B23)),$B$7:F23,5,FALSE))+(INDEX($B$7:B23,MATCH(9.99999999999999E+307,$B$7:B23)))),\"\")","v":""},null,{"$f":"IF(D24<>\"\",IF(OR(B24<>\"\",INDIRECT(\"D25\")=0),D24,0),\"\")","v":""},"",null,{"$f":"IF(D24<>\"\",IF(AND(B24<>\"\",B23<>\"\"),$I$4+H23,VLOOKUP(INDEX($B$7:B23,MATCH(9.99999999999999E+307,$B$7:B23)),$B$7:H23,7,FALSE)+$I$4),\"\")","v":""},""]
[null,null,{"$f":"IF(D25<>\"\",IF(OR(B25<>\"\",INDIRECT(\"D26\")=0),IF(B24<>\"\",F24+B24,VLOOKUP(INDEX($B$7:B24,MATCH(9.99999999999999E+307,$B$7:B24)),$B$7:F24,5,FALSE)+INDEX($B$7:B24,MATCH(9.99999999999999E+307,$B$7:B24))),(VLOOKUP(INDEX($B$7:B24,MATCH(9.99999999999999E+307,$B$7:B24)),$B$7:F24,5,FALSE))+(INDEX($B$7:B24,MATCH(9.99999999999999E+307,$B$7:B24)))),\"\")","v":""},null,{"$f":"IF(D25<>\"\",IF(OR(B25<>\"\",INDIRECT(\"D26\")=0),D25,0),\"\")","v":""},"",null,{"$f":"IF(D25<>\"\",IF(AND(B25<>\"\",B24<>\"\"),$I$4+H24,VLOOKUP(INDEX($B$7:B24,MATCH(9.99999999999999E+307,$B$7:B24)),$B$7:H24,7,FALSE)+$I$4),\"\")","v":""},""]
[null,null,{"$f":"IF(D26<>\"\",IF(OR(B26<>\"\",INDIRECT(\"D27\")=0),IF(B25<>\"\",F25+B25,VLOOKUP(INDEX($B$7:B25,MATCH(9.99999999999999E+307,$B$7:B25)),$B$7:F25,5,FALSE)+INDEX($B$7:B25,MATCH(9.99999999999999E+307,$B$7:B25))),(VLOOKUP(INDEX($B$7:B25,MATCH(9.99999999999999E+307,$B$7:B25)),$B$7:F25,5,FALSE))+(INDEX($B$7:B25,MATCH(9.99999999999999E+307,$B$7:B25)))),\"\")","v":""},null,{"$f":"IF(D26<>\"\",IF(OR(B26<>\"\",INDIRECT(\"D27\")=0),D26,0),\"\")","v":""},"",null,{"$f":"IF(D26<>\"\",IF(AND(B26<>\"\",B25<>\"\"),$I$4+H25,VLOOKUP(INDEX($B$7:B25,MATCH(9.99999999999999E+307,$B$7:B25)),$B$7:H25,7,FALSE)+$I$4),\"\")","v":""},""]
[null,null,{"$f":"IF(D27<>\"\",IF(OR(B27<>\"\",INDIRECT(\"D28\")=0),IF(B26<>\"\",F26+B26,VLOOKUP(INDEX($B$7:B26,MATCH(9.99999999999999E+307,$B$7:B26)),$B$7:F26,5,FALSE)+INDEX($B$7:B26,MATCH(9.99999999999999E+307,$B$7:B26))),(VLOOKUP(INDEX($B$7:B26,MATCH(9.99999999999999E+307,$B$7:B26)),$B$7:F26,5,FALSE))+(INDEX($B$7:B26,MATCH(9.99999999999999E+307,$B$7:B26)))),\"\")","v":""},null,{"$f":"IF(D27<>\"\",IF(OR(B27<>\"\",INDIRECT(\"D28\")=0),D27,0),\"\")","v":""},"",null,{"$f":"IF(D27<>\"\",IF(AND(B27<>\"\",B26<>\"\"),$I$4+H26,VLOOKUP(INDEX($B$7:B26,MATCH(9.99999999999999E+307,$B$7:B26)),$B$7:H26,7,FALSE)+$I$4),\"\")","v":""},""]
[null,null,{"$f":"IF(D28<>\"\",IF(OR(B28<>\"\",INDIRECT(\"D29\")=0),IF(B27<>\"\",F27+B27,VLOOKUP(INDEX($B$7:B27,MATCH(9.99999999999999E+307,$B$7:B27)),$B$7:F27,5,FALSE)+INDEX($B$7:B27,MATCH(9.99999999999999E+307,$B$7:B27))),(VLOOKUP(INDEX($B$7:B27,MATCH(9.99999999999999E+307,$B$7:B27)),$B$7:F27,5,FALSE))+(INDEX($B$7:B27,MATCH(9.99999999999999E+307,$B$7:B27)))),\"\")","v":""},null,{"$f":"IF(D28<>\"\",IF(OR(B28<>\"\",INDIRECT(\"D29\")=0),D28,0),\"\")","v":""},"",null,{"$f":"IF(D28<>\"\",IF(AND(B28<>\"\",B27<>\"\"),$I$4+H27,VLOOKUP(INDEX($B$7:B27,MATCH(9.99999999999999E+307,$B$7:B27)),$B$7:H27,7,FALSE)+$I$4),\"\")","v":""},""]
[null,null,{"$f":"IF(D29<>\"\",IF(OR(B29<>\"\",INDIRECT(\"D30\")=0),IF(B28<>\"\",F28+B28,VLOOKUP(INDEX($B$7:B28,MATCH(9.99999999999999E+307,$B$7:B28)),$B$7:F28,5,FALSE)+INDEX($B$7:B28,MATCH(9.99999999999999E+307,$B$7:B28))),(VLOOKUP(INDEX($B$7:B28,MATCH(9.99999999999999E+307,$B$7:B28)),$B$7:F28,5,FALSE))+(INDEX($B$7:B28,MATCH(9.99999999999999E+307,$B$7:B28)))),\"\")","v":""},null,{"$f":"IF(D29<>\"\",IF(OR(B29<>\"\",INDIRECT(\"D30\")=0),D29,0),\"\")","v":""},"",null,{"$f":"IF(D29<>\"\",IF(AND(B29<>\"\",B28<>\"\"),$I$4+H28,VLOOKUP(INDEX($B$7:B28,MATCH(9.99999999999999E+307,$B$7:B28)),$B$7:H28,7,FALSE)+$I$4),\"\")","v":""},""]
[null,null,{"$f":"IF(D30<>\"\",IF(OR(B30<>\"\",INDIRECT(\"D31\")=0),IF(B29<>\"\",F29+B29,VLOOKUP(INDEX($B$7:B29,MATCH(9.99999999999999E+307,$B$7:B29)),$B$7:F29,5,FALSE)+INDEX($B$7:B29,MATCH(9.99999999999999E+307,$B$7:B29))),(VLOOKUP(INDEX($B$7:B29,MATCH(9.99999999999999E+307,$B$7:B29)),$B$7:F29,5,FALSE))+(INDEX($B$7:B29,MATCH(9.99999999999999E+307,$B$7:B29)))),\"\")","v":""},null,{"$f":"IF(D30<>\"\",IF(OR(B30<>\"\",INDIRECT(\"D31\")=0),D30,0),\"\")","v":""},"",null,{"$f":"IF(D30<>\"\",IF(AND(B30<>\"\",B29<>\"\"),$I$4+H29,VLOOKUP(INDEX($B$7:B29,MATCH(9.99999999999999E+307,$B$7:B29)),$B$7:H29,7,FALSE)+$I$4),\"\")","v":""},""]
[null,null,{"$f":"IF(D31<>\"\",IF(OR(B31<>\"\",INDIRECT(\"D32\")=0),IF(B30<>\"\",F30+B30,VLOOKUP(INDEX($B$7:B30,MATCH(9.99999999999999E+307,$B$7:B30)),$B$7:F30,5,FALSE)+INDEX($B$7:B30,MATCH(9.99999999999999E+307,$B$7:B30))),(VLOOKUP(INDEX($B$7:B30,MATCH(9.99999999999999E+307,$B$7:B30)),$B$7:F30,5,FALSE))+(INDEX($B$7:B30,MATCH(9.99999999999999E+307,$B$7:B30)))),\"\")","v":""},null,{"$f":"IF(D31<>\"\",IF(OR(B31<>\"\",INDIRECT(\"D32\")=0),D31,0),\"\")","v":""},"",null,{"$f":"IF(D31<>\"\",IF(AND(B31<>\"\",B30<>\"\"),$I$4+H30,VLOOKUP(INDEX($B$7:B30,MATCH(9.99999999999999E+307,$B$7:B30)),$B$7:H30,7,FALSE)+$I$4),\"\")","v":""},""]
[null,null,{"$f":"IF(D32<>\"\",IF(OR(B32<>\"\",INDIRECT(\"D33\")=0),IF(B31<>\"\",F31+B31,VLOOKUP(INDEX($B$7:B31,MATCH(9.99999999999999E+307,$B$7:B31)),$B$7:F31,5,FALSE)+INDEX($B$7:B31,MATCH(9.99999999999999E+307,$B$7:B31))),(VLOOKUP(INDEX($B$7:B31,MATCH(9.99999999999999E+307,$B$7:B31)),$B$7:F31,5,FALSE))+(INDEX($B$7:B31,MATCH(9.99999999999999E+307,$B$7:B31)))),\"\")","v":""},null,{"$f":"IF(D32<>\"\",IF(OR(B32<>\"\",INDIRECT(\"D33\")=0),D32,0),\"\")","v":""},"",null,{"$f":"IF(D32<>\"\",IF(AND(B32<>\"\",B31<>\"\"),$I$4+H31,VLOOKUP(INDEX($B$7:B31,MATCH(9.99999999999999E+307,$B$7:B31)),$B$7:H31,7,FALSE)+$I$4),\"\")","v":""},""]
[null,null,{"$f":"IF(D33<>\"\",IF(OR(B33<>\"\",INDIRECT(\"D34\")=0),IF(B32<>\"\",F32+B32,VLOOKUP(INDEX($B$7:B32,MATCH(9.99999999999999E+307,$B$7:B32)),$B$7:F32,5,FALSE)+INDEX($B$7:B32,MATCH(9.99999999999999E+307,$B$7:B32))),(VLOOKUP(INDEX($B$7:B32,MATCH(9.99999999999999E+307,$B$7:B32)),$B$7:F32,5,FALSE))+(INDEX($B$7:B32,MATCH(9.99999999999999E+307,$B$7:B32)))),\"\")","v":""},null,{"$f":"IF(D33<>\"\",IF(OR(B33<>\"\",INDIRECT(\"D34\")=0),D33,0),\"\")","v":""},"",null,{"$f":"IF(D33<>\"\",IF(AND(B33<>\"\",B32<>\"\"),$I$4+H32,VLOOKUP(INDEX($B$7:B32,MATCH(9.99999999999999E+307,$B$7:B32)),$B$7:H32,7,FALSE)+$I$4),\"\")","v":""},""]
[null,null,{"$f":"IF(D34<>\"\",IF(OR(B34<>\"\",INDIRECT(\"D35\")=0),IF(B33<>\"\",F33+B33,VLOOKUP(INDEX($B$7:B33,MATCH(9.99999999999999E+307,$B$7:B33)),$B$7:F33,5,FALSE)+INDEX($B$7:B33,MATCH(9.99999999999999E+307,$B$7:B33))),(VLOOKUP(INDEX($B$7:B33,MATCH(9.99999999999999E+307,$B$7:B33)),$B$7:F33,5,FALSE))+(INDEX($B$7:B33,MATCH(9.99999999999999E+307,$B$7:B33)))),\"\")","v":""},null,{"$f":"IF(D34<>\"\",IF(OR(B34<>\"\",INDIRECT(\"D35\")=0),D34,0),\"\")","v":""},"",null,{"$f":"IF(D34<>\"\",IF(AND(B34<>\"\",B33<>\"\"),$I$4+H33,VLOOKUP(INDEX($B$7:B33,MATCH(9.99999999999999E+307,$B$7:B33)),$B$7:H33,7,FALSE)+$I$4),\"\")","v":""},""]
[null,null,{"$f":"IF(D35<>\"\",IF(OR(B35<>\"\",INDIRECT(\"D36\")=0),IF(B34<>\"\",F34+B34,VLOOKUP(INDEX($B$7:B34,MATCH(9.99999999999999E+307,$B$7:B34)),$B$7:F34,5,FALSE)+INDEX($B$7:B34,MATCH(9.99999999999999E+307,$B$7:B34))),(VLOOKUP(INDEX($B$7:B34,MATCH(9.99999999999999E+307,$B$7:B34)),$B$7:F34,5,FALSE))+(INDEX($B$7:B34,MATCH(9.99999999999999E+307,$B$7:B34)))),\"\")","v":""},null,{"$f":"IF(D35<>\"\",IF(OR(B35<>\"\",INDIRECT(\"D36\")=0),D35,0),\"\")","v":""},"",null,{"$f":"IF(D35<>\"\",IF(AND(B35<>\"\",B34<>\"\"),$I$4+H34,VLOOKUP(INDEX($B$7:B34,MATCH(9.99999999999999E+307,$B$7:B34)),$B$7:H34,7,FALSE)+$I$4),\"\")","v":""},""]
[null,null,{"$f":"IF(D36<>\"\",IF(OR(B36<>\"\",INDIRECT(\"D37\")=0),IF(B35<>\"\",F35+B35,VLOOKUP(INDEX($B$7:B35,MATCH(9.99999999999999E+307,$B$7:B35)),$B$7:F35,5,FALSE)+INDEX($B$7:B35,MATCH(9.99999999999999E+307,$B$7:B35))),(VLOOKUP(INDEX($B$7:B35,MATCH(9.99999999999999E+307,$B$7:B35)),$B$7:F35,5,FALSE))+(INDEX($B$7:B35,MATCH(9.99999999999999E+307,$B$7:B35)))),\"\")","v":""},null,{"$f":"IF(D36<>\"\",IF(OR(B36<>\"\",INDIRECT(\"D37\")=0),D36,0),\"\")","v":""},"",null,{"$f":"IF(D36<>\"\",IF(AND(B36<>\"\",B35<>\"\"),$I$4+H35,VLOOKUP(INDEX($B$7:B35,MATCH(9.99999999999999E+307,$B$7:B35)),$B$7:H35,7,FALSE)+$I$4),\"\")","v":""},""]
[null,null,{"$f":"IF(D37<>\"\",IF(OR(B37<>\"\",INDIRECT(\"D38\")=0),IF(B36<>\"\",F36+B36,VLOOKUP(INDEX($B$7:B36,MATCH(9.99999999999999E+307,$B$7:B36)),$B$7:F36,5,FALSE)+INDEX($B$7:B36,MATCH(9.99999999999999E+307,$B$7:B36))),(VLOOKUP(INDEX($B$7:B36,MATCH(9.99999999999999E+307,$B$7:B36)),$B$7:F36,5,FALSE))+(INDEX($B$7:B36,MATCH(9.99999999999999E+307,$B$7:B36)))),\"\")","v":""},null,{"$f":"IF(D37<>\"\",IF(OR(B37<>\"\",INDIRECT(\"D38\")=0),D37,0),\"\")","v":""},"",null,{"$f":"IF(D37<>\"\",IF(AND(B37<>\"\",B36<>\"\"),$I$4+H36,VLOOKUP(INDEX($B$7:B36,MATCH(9.99999999999999E+307,$B$7:B36)),$B$7:H36,7,FALSE)+$I$4),\"\")","v":""},""]
[null,null,{"$f":"IF(D38<>\"\",IF(OR(B38<>\"\",INDIRECT(\"D39\")=0),IF(B37<>\"\",F37+B37,VLOOKUP(INDEX($B$7:B37,MATCH(9.99999999999999E+307,$B$7:B37)),$B$7:F37,5,FALSE)+INDEX($B$7:B37,MATCH(9.99999999999999E+307,$B$7:B37))),(VLOOKUP(INDEX($B$7:B37,MATCH(9.99999999999999E+307,$B$7:B37)),$B$7:F37,5,FALSE))+(INDEX($B$7:B37,MATCH(9.99999999999999E+307,$B$7:B37)))),\"\")","v":""},null,{"$f":"IF(D38<>\"\",IF(OR(B38<>\"\",INDIRECT(\"D39\")=0),D38,0),\"\")","v":""},"",null,{"$f":"IF(D38<>\"\",IF(AND(B38<>\"\",B37<>\"\"),$I$4+H37,VLOOKUP(INDEX($B$7:B37,MATCH(9.99999999999999E+307,$B$7:B37)),$B$7:H37,7,FALSE)+$I$4),\"\")","v":""},""]
[null,null,{"$f":"IF(D39<>\"\",IF(OR(B39<>\"\",INDIRECT(\"D40\")=0),IF(B38<>\"\",F38+B38,VLOOKUP(INDEX($B$7:B38,MATCH(9.99999999999999E+307,$B$7:B38)),$B$7:F38,5,FALSE)+INDEX($B$7:B38,MATCH(9.99999999999999E+307,$B$7:B38))),(VLOOKUP(INDEX($B$7:B38,MATCH(9.99999999999999E+307,$B$7:B38)),$B$7:F38,5,FALSE))+(INDEX($B$7:B38,MATCH(9.99999999999999E+307,$B$7:B38)))),\"\")","v":""},null,{"$f":"IF(D39<>\"\",IF(OR(B39<>\"\",INDIRECT(\"D40\")=0),D39,0),\"\")","v":""},"",null,{"$f":"IF(D39<>\"\",IF(AND(B39<>\"\",B38<>\"\"),$I$4+H38,VLOOKUP(INDEX($B$7:B38,MATCH(9.99999999999999E+307,$B$7:B38)),$B$7:H38,7,FALSE)+$I$4),\"\")","v":""},""]
[null,null,{"$f":"IF(D40<>\"\",IF(OR(B40<>\"\",INDIRECT(\"D41\")=0),IF(B39<>\"\",F39+B39,VLOOKUP(INDEX($B$7:B39,MATCH(9.99999999999999E+307,$B$7:B39)),$B$7:F39,5,FALSE)+INDEX($B$7:B39,MATCH(9.99999999999999E+307,$B$7:B39))),(VLOOKUP(INDEX($B$7:B39,MATCH(9.99999999999999E+307,$B$7:B39)),$B$7:F39,5,FALSE))+(INDEX($B$7:B39,MATCH(9.99999999999999E+307,$B$7:B39)))),\"\")","v":""},null,{"$f":"IF(D40<>\"\",IF(OR(B40<>\"\",INDIRECT(\"D41\")=0),D40,0),\"\")","v":""},"",null,{"$f":"IF(D40<>\"\",IF(AND(B40<>\"\",B39<>\"\"),$I$4+H39,VLOOKUP(INDEX($B$7:B39,MATCH(9.99999999999999E+307,$B$7:B39)),$B$7:H39,7,FALSE)+$I$4),\"\")","v":""},""]
[null,null,{"$f":"IF(D41<>\"\",IF(OR(B41<>\"\",INDIRECT(\"D42\")=0),IF(B40<>\"\",F40+B40,VLOOKUP(INDEX($B$7:B40,MATCH(9.99999999999999E+307,$B$7:B40)),$B$7:F40,5,FALSE)+INDEX($B$7:B40,MATCH(9.99999999999999E+307,$B$7:B40))),(VLOOKUP(INDEX($B$7:B40,MATCH(9.99999999999999E+307,$B$7:B40)),$B$7:F40,5,FALSE))+(INDEX($B$7:B40,MATCH(9.99999999999999E+307,$B$7:B40)))),\"\")","v":""},null,{"$f":"IF(D41<>\"\",IF(OR(B41<>\"\",INDIRECT(\"D42\")=0),D41,0),\"\")","v":""},"",null,{"$f":"IF(D41<>\"\",IF(AND(B41<>\"\",B40<>\"\"),$I$4+H40,VLOOKUP(INDEX($B$7:B40,MATCH(9.99999999999999E+307,$B$7:B40)),$B$7:H40,7,FALSE)+$I$4),\"\")","v":""},""]
[null,null,{"$f":"IF(D42<>\"\",IF(OR(B42<>\"\",INDIRECT(\"D43\")=0),IF(B41<>\"\",F41+B41,VLOOKUP(INDEX($B$7:B41,MATCH(9.99999999999999E+307,$B$7:B41)),$B$7:F41,5,FALSE)+INDEX($B$7:B41,MATCH(9.99999999999999E+307,$B$7:B41))),(VLOOKUP(INDEX($B$7:B41,MATCH(9.99999999999999E+307,$B$7:B41)),$B$7:F41,5,FALSE))+(INDEX($B$7:B41,MATCH(9.99999999999999E+307,$B$7:B41)))),\"\")","v":""},null,{"$f":"IF(D42<>\"\",IF(OR(B42<>\"\",INDIRECT(\"D43\")=0),D42,0),\"\")","v":""},"",null,{"$f":"IF(D42<>\"\",IF(AND(B42<>\"\",B41<>\"\"),$I$4+H41,VLOOKUP(INDEX($B$7:B41,MATCH(9.99999999999999E+307,$B$7:B41)),$B$7:H41,7,FALSE)+$I$4),\"\")","v":""},""]
[null,null,{"$f":"IF(D43<>\"\",IF(OR(B43<>\"\",INDIRECT(\"D44\")=0),IF(B42<>\"\",F42+B42,VLOOKUP(INDEX($B$7:B42,MATCH(9.99999999999999E+307,$B$7:B42)),$B$7:F42,5,FALSE)+INDEX($B$7:B42,MATCH(9.99999999999999E+307,$B$7:B42))),(VLOOKUP(INDEX($B$7:B42,MATCH(9.99999999999999E+307,$B$7:B42)),$B$7:F42,5,FALSE))+(INDEX($B$7:B42,MATCH(9.99999999999999E+307,$B$7:B42)))),\"\")","v":""},null,{"$f":"IF(D43<>\"\",IF(OR(B43<>\"\",INDIRECT(\"D44\")=0),D43,0),\"\")","v":""},"",null,{"$f":"IF(D43<>\"\",IF(AND(B43<>\"\",B42<>\"\"),$I$4+H42,VLOOKUP(INDEX($B$7:B42,MATCH(9.99999999999999E+307,$B$7:B42)),$B$7:H42,7,FALSE)+$I$4),\"\")","v":""},""]
[null,null,{"$f":"IF(D44<>\"\",IF(OR(B44<>\"\",INDIRECT(\"D45\")=0),IF(B43<>\"\",F43+B43,VLOOKUP(INDEX($B$7:B43,MATCH(9.99999999999999E+307,$B$7:B43)),$B$7:F43,5,FALSE)+INDEX($B$7:B43,MATCH(9.99999999999999E+307,$B$7:B43))),(VLOOKUP(INDEX($B$7:B43,MATCH(9.99999999999999E+307,$B$7:B43)),$B$7:F43,5,FALSE))+(INDEX($B$7:B43,MATCH(9.99999999999999E+307,$B$7:B43)))),\"\")","v":""},null,{"$f":"IF(D44<>\"\",IF(OR(B44<>\"\",INDIRECT(\"D45\")=0),D44,0),\"\")","v":""},"",null,{"$f":"IF(D44<>\"\",IF(AND(B44<>\"\",B43<>\"\"),$I$4+H43,VLOOKUP(INDEX($B$7:B43,MATCH(9.99999999999999E+307,$B$7:B43)),$B$7:H43,7,FALSE)+$I$4),\"\")","v":""},""]
[null,null,{"$f":"IF(D45<>\"\",IF(OR(B45<>\"\",INDIRECT(\"D46\")=0),IF(B44<>\"\",F44+B44,VLOOKUP(INDEX($B$7:B44,MATCH(9.99999999999999E+307,$B$7:B44)),$B$7:F44,5,FALSE)+INDEX($B$7:B44,MATCH(9.99999999999999E+307,$B$7:B44))),(VLOOKUP(INDEX($B$7:B44,MATCH(9.99999999999999E+307,$B$7:B44)),$B$7:F44,5,FALSE))+(INDEX($B$7:B44,MATCH(9.99999999999999E+307,$B$7:B44)))),\"\")","v":""},null,{"$f":"IF(D45<>\"\",IF(OR(B45<>\"\",INDIRECT(\"D46\")=0),D45,0),\"\")","v":""},"",null,{"$f":"IF(D45<>\"\",IF(AND(B45<>\"\",B44<>\"\"),$I$4+H44,VLOOKUP(INDEX($B$7:B44,MATCH(9.99999999999999E+307,$B$7:B44)),$B$7:H44,7,FALSE)+$I$4),\"\")","v":""},""]
[null,null,{"$f":"IF(D46<>\"\",IF(OR(B46<>\"\",INDIRECT(\"D47\")=0),IF(B45<>\"\",F45+B45,VLOOKUP(INDEX($B$7:B45,MATCH(9.99999999999999E+307,$B$7:B45)),$B$7:F45,5,FALSE)+INDEX($B$7:B45,MATCH(9.99999999999999E+307,$B$7:B45))),(VLOOKUP(INDEX($B$7:B45,MATCH(9.99999999999999E+307,$B$7:B45)),$B$7:F45,5,FALSE))+(INDEX($B$7:B45,MATCH(9.99999999999999E+307,$B$7:B45)))),\"\")","v":""},null,{"$f":"IF(D46<>\"\",IF(OR(B46<>\"\",INDIRECT(\"D47\")=0),D46,0),\"\")","v":""},"",null,{"$f":"IF(D46<>\"\",IF(AND(B46<>\"\",B45<>\"\"),$I$4+H45,VLOOKUP(INDEX($B$7:B45,MATCH(9.99999999999999E+307,$B$7:B45)),$B$7:H45,7,FALSE)+$I$4),\"\")","v":""},""]
[null,null,{"$f":"IF(D47<>\"\",IF(OR(B47<>\"\",INDIRECT(\"D48\")=0),IF(B46<>\"\",F46+B46,VLOOKUP(INDEX($B$7:B46,MATCH(9.99999999999999E+307,$B$7:B46)),$B$7:F46,5,FALSE)+INDEX($B$7:B46,MATCH(9.99999999999999E+307,$B$7:B46))),(VLOOKUP(INDEX($B$7:B46,MATCH(9.99999999999999E+307,$B$7:B46)),$B$7:F46,5,FALSE))+(INDEX($B$7:B46,MATCH(9.99999999999999E+307,$B$7:B46)))),\"\")","v":""},null,{"$f":"IF(D47<>\"\",IF(OR(B47<>\"\",INDIRECT(\"D48\")=0),D47,0),\"\")","v":""},"",null,{"$f":"IF(D47<>\"\",IF(AND(B47<>\"\",B46<>\"\"),$I$4+H46,VLOOKUP(INDEX($B$7:B46,MATCH(9.99999999999999E+307,$B$7:B46)),$B$7:H46,7,FALSE)+$I$4),\"\")","v":""},""]
[null,null,{"$f":"IF(D48<>\"\",IF(OR(B48<>\"\",INDIRECT(\"D49\")=0),IF(B47<>\"\",F47+B47,VLOOKUP(INDEX($B$7:B47,MATCH(9.99999999999999E+307,$B$7:B47)),$B$7:F47,5,FALSE)+INDEX($B$7:B47,MATCH(9.99999999999999E+307,$B$7:B47))),(VLOOKUP(INDEX($B$7:B47,MATCH(9.99999999999999E+307,$B$7:B47)),$B$7:F47,5,FALSE))+(INDEX($B$7:B47,MATCH(9.99999999999999E+307,$B$7:B47)))),\"\")","v":""},null,{"$f":"IF(D48<>\"\",IF(OR(B48<>\"\",INDIRECT(\"D49\")=0),D48,0),\"\")","v":""},"",null,{"$f":"IF(D48<>\"\",IF(AND(B48<>\"\",B47<>\"\"),$I$4+H47,VLOOKUP(INDEX($B$7:B47,MATCH(9.99999999999999E+307,$B$7:B47)),$B$7:H47,7,FALSE)+$I$4),\"\")","v":""},""]
[null,null,{"$f":"IF(D49<>\"\",IF(OR(B49<>\"\",INDIRECT(\"D50\")=0),IF(B48<>\"\",F48+B48,VLOOKUP(INDEX($B$7:B48,MATCH(9.99999999999999E+307,$B$7:B48)),$B$7:F48,5,FALSE)+INDEX($B$7:B48,MATCH(9.99999999999999E+307,$B$7:B48))),(VLOOKUP(INDEX($B$7:B48,MATCH(9.99999999999999E+307,$B$7:B48)),$B$7:F48,5,FALSE))+(INDEX($B$7:B48,MATCH(9.99999999999999E+307,$B$7:B48)))),\"\")","v":""},null,{"$f":"IF(D49<>\"\",IF(OR(B49<>\"\",INDIRECT(\"D50\")=0),D49,0),\"\")","v":""},"",null,{"$f":"IF(D49<>\"\",IF(AND(B49<>\"\",B48<>\"\"),$I$4+H48,VLOOKUP(INDEX($B$7:B48,MATCH(9.99999999999999E+307,$B$7:B48)),$B$7:H48,7,FALSE)+$I$4),\"\")","v":""},""]
[null,null,{"$f":"IF(D50<>\"\",IF(OR(B50<>\"\",INDIRECT(\"D51\")=0),IF(B49<>\"\",F49+B49,VLOOKUP(INDEX($B$7:B49,MATCH(9.99999999999999E+307,$B$7:B49)),$B$7:F49,5,FALSE)+INDEX($B$7:B49,MATCH(9.99999999999999E+307,$B$7:B49))),(VLOOKUP(INDEX($B$7:B49,MATCH(9.99999999999999E+307,$B$7:B49)),$B$7:F49,5,FALSE))+(INDEX($B$7:B49,MATCH(9.99999999999999E+307,$B$7:B49)))),\"\")","v":""},null,{"$f":"IF(D50<>\"\",IF(OR(B50<>\"\",INDIRECT(\"D51\")=0),D50,0),\"\")","v":""},"",null,{"$f":"IF(D50<>\"\",IF(AND(B50<>\"\",B49<>\"\"),$I$4+H49,VLOOKUP(INDEX($B$7:B49,MATCH(9.99999999999999E+307,$B$7:B49)),$B$7:H49,7,FALSE)+$I$4),\"\")","v":""},""]
[null,null,{"$f":"IF(D51<>\"\",IF(OR(B51<>\"\",INDIRECT(\"D52\")=0),IF(B50<>\"\",F50+B50,VLOOKUP(INDEX($B$7:B50,MATCH(9.99999999999999E+307,$B$7:B50)),$B$7:F50,5,FALSE)+INDEX($B$7:B50,MATCH(9.99999999999999E+307,$B$7:B50))),(VLOOKUP(INDEX($B$7:B50,MATCH(9.99999999999999E+307,$B$7:B50)),$B$7:F50,5,FALSE))+(INDEX($B$7:B50,MATCH(9.99999999999999E+307,$B$7:B50)))),\"\")","v":""},null,{"$f":"IF(D51<>\"\",IF(OR(B51<>\"\",INDIRECT(\"D52\")=0),D51,0),\"\")","v":""},"",null,{"$f":"IF(D51<>\"\",IF(AND(B51<>\"\",B50<>\"\"),$I$4+H50,VLOOKUP(INDEX($B$7:B50,MATCH(9.99999999999999E+307,$B$7:B50)),$B$7:H50,7,FALSE)+$I$4),\"\")","v":""},""]
[null,null,{"$f":"IF(D52<>\"\",IF(OR(B52<>\"\",INDIRECT(\"D53\")=0),IF(B51<>\"\",F51+B51,VLOOKUP(INDEX($B$7:B51,MATCH(9.99999999999999E+307,$B$7:B51)),$B$7:F51,5,FALSE)+INDEX($B$7:B51,MATCH(9.99999999999999E+307,$B$7:B51))),(VLOOKUP(INDEX($B$7:B51,MATCH(9.99999999999999E+307,$B$7:B51)),$B$7:F51,5,FALSE))+(INDEX($B$7:B51,MATCH(9.99999999999999E+307,$B$7:B51)))),\"\")","v":""},null,{"$f":"IF(D52<>\"\",IF(OR(B52<>\"\",INDIRECT(\"D53\")=0),D52,0),\"\")","v":""},"",null,{"$f":"IF(D52<>\"\",IF(AND(B52<>\"\",B51<>\"\"),$I$4+H51,VLOOKUP(INDEX($B$7:B51,MATCH(9.99999999999999E+307,$B$7:B51)),$B$7:H51,7,FALSE)+$I$4),\"\")","v":""},""]
[null,null,{"$f":"IF(D53<>\"\",IF(OR(B53<>\"\",INDIRECT(\"D54\")=0),IF(B52<>\"\",F52+B52,VLOOKUP(INDEX($B$7:B52,MATCH(9.99999999999999E+307,$B$7:B52)),$B$7:F52,5,FALSE)+INDEX($B$7:B52,MATCH(9.99999999999999E+307,$B$7:B52))),(VLOOKUP(INDEX($B$7:B52,MATCH(9.99999999999999E+307,$B$7:B52)),$B$7:F52,5,FALSE))+(INDEX($B$7:B52,MATCH(9.99999999999999E+307,$B$7:B52)))),\"\")","v":""},null,{"$f":"IF(D53<>\"\",IF(OR(B53<>\"\",INDIRECT(\"D54\")=0),D53,0),\"\")","v":""},"",null,{"$f":"IF(D53<>\"\",IF(AND(B53<>\"\",B52<>\"\"),$I$4+H52,VLOOKUP(INDEX($B$7:B52,MATCH(9.99999999999999E+307,$B$7:B52)),$B$7:H52,7,FALSE)+$I$4),\"\")","v":""},""]
[null,null,{"$f":"IF(D54<>\"\",IF(OR(B54<>\"\",INDIRECT(\"D55\")=0),IF(B53<>\"\",F53+B53,VLOOKUP(INDEX($B$7:B53,MATCH(9.99999999999999E+307,$B$7:B53)),$B$7:F53,5,FALSE)+INDEX($B$7:B53,MATCH(9.99999999999999E+307,$B$7:B53))),(VLOOKUP(INDEX($B$7:B53,MATCH(9.99999999999999E+307,$B$7:B53)),$B$7:F53,5,FALSE))+(INDEX($B$7:B53,MATCH(9.99999999999999E+307,$B$7:B53)))),\"\")","v":""},null,{"$f":"IF(D54<>\"\",IF(OR(B54<>\"\",INDIRECT(\"D55\")=0),D54,0),\"\")","v":""},"",null,{"$f":"IF(D54<>\"\",IF(AND(B54<>\"\",B53<>\"\"),$I$4+H53,VLOOKUP(INDEX($B$7:B53,MATCH(9.99999999999999E+307,$B$7:B53)),$B$7:H53,7,FALSE)+$I$4),\"\")","v":""},""]
[null,null,{"$f":"IF(D55<>\"\",IF(OR(B55<>\"\",INDIRECT(\"D56\")=0),IF(B54<>\"\",F54+B54,VLOOKUP(INDEX($B$7:B54,MATCH(9.99999999999999E+307,$B$7:B54)),$B$7:F54,5,FALSE)+INDEX($B$7:B54,MATCH(9.99999999999999E+307,$B$7:B54))),(VLOOKUP(INDEX($B$7:B54,MATCH(9.99999999999999E+307,$B$7:B54)),$B$7:F54,5,FALSE))+(INDEX($B$7:B54,MATCH(9.99999999999999E+307,$B$7:B54)))),\"\")","v":""},null,{"$f":"IF(D55<>\"\",IF(OR(B55<>\"\",INDIRECT(\"D56\")=0),D55,0),\"\")","v":""},"",null,{"$f":"IF(D55<>\"\",IF(AND(B55<>\"\",B54<>\"\"),$I$4+H54,VLOOKUP(INDEX($B$7:B54,MATCH(9.99999999999999E+307,$B$7:B54)),$B$7:H54,7,FALSE)+$I$4),\"\")","v":""},""]
[null,null,{"$f":"IF(D56<>\"\",IF(OR(B56<>\"\",INDIRECT(\"D57\")=0),IF(B55<>\"\",F55+B55,VLOOKUP(INDEX($B$7:B55,MATCH(9.99999999999999E+307,$B$7:B55)),$B$7:F55,5,FALSE)+INDEX($B$7:B55,MATCH(9.99999999999999E+307,$B$7:B55))),(VLOOKUP(INDEX($B$7:B55,MATCH(9.99999999999999E+307,$B$7:B55)),$B$7:F55,5,FALSE))+(INDEX($B$7:B55,MATCH(9.99999999999999E+307,$B$7:B55)))),\"\")","v":""},null,{"$f":"IF(D56<>\"\",IF(OR(B56<>\"\",INDIRECT(\"D57\")=0),D56,0),\"\")","v":""},"",null,{"$f":"IF(D56<>\"\",IF(AND(B56<>\"\",B55<>\"\"),$I$4+H55,VLOOKUP(INDEX($B$7:B55,MATCH(9.99999999999999E+307,$B$7:B55)),$B$7:H55,7,FALSE)+$I$4),\"\")","v":""},""]
[null,null,{"$f":"IF(D57<>\"\",IF(OR(B57<>\"\",INDIRECT(\"D58\")=0),IF(B56<>\"\",F56+B56,VLOOKUP(INDEX($B$7:B56,MATCH(9.99999999999999E+307,$B$7:B56)),$B$7:F56,5,FALSE)+INDEX($B$7:B56,MATCH(9.99999999999999E+307,$B$7:B56))),(VLOOKUP(INDEX($B$7:B56,MATCH(9.99999999999999E+307,$B$7:B56)),$B$7:F56,5,FALSE))+(INDEX($B$7:B56,MATCH(9.99999999999999E+307,$B$7:B56)))),\"\")","v":""},null,{"$f":"IF(D57<>\"\",IF(OR(B57<>\"\",INDIRECT(\"D58\")=0),D57,0),\"\")","v":""},"",null,{"$f":"IF(D57<>\"\",IF(AND(B57<>\"\",B56<>\"\"),$I$4+H56,VLOOKUP(INDEX($B$7:B56,MATCH(9.99999999999999E+307,$B$7:B56)),$B$7:H56,7,FALSE)+$I$4),\"\")","v":""},""]
[null,null,{"$f":"IF(D58<>\"\",IF(OR(B58<>\"\",INDIRECT(\"D59\")=0),IF(B57<>\"\",F57+B57,VLOOKUP(INDEX($B$7:B57,MATCH(9.99999999999999E+307,$B$7:B57)),$B$7:F57,5,FALSE)+INDEX($B$7:B57,MATCH(9.99999999999999E+307,$B$7:B57))),(VLOOKUP(INDEX($B$7:B57,MATCH(9.99999999999999E+307,$B$7:B57)),$B$7:F57,5,FALSE))+(INDEX($B$7:B57,MATCH(9.99999999999999E+307,$B$7:B57)))),\"\")","v":""},null,{"$f":"IF(D58<>\"\",IF(OR(B58<>\"\",INDIRECT(\"D59\")=0),D58,0),\"\")","v":""},"",null,{"$f":"IF(D58<>\"\",IF(AND(B58<>\"\",B57<>\"\"),$I$4+H57,VLOOKUP(INDEX($B$7:B57,MATCH(9.99999999999999E+307,$B$7:B57)),$B$7:H57,7,FALSE)+$I$4),\"\")","v":""},""]
[null,null,{"$f":"IF(D59<>\"\",IF(OR(B59<>\"\",INDIRECT(\"D60\")=0),IF(B58<>\"\",F58+B58,VLOOKUP(INDEX($B$7:B58,MATCH(9.99999999999999E+307,$B$7:B58)),$B$7:F58,5,FALSE)+INDEX($B$7:B58,MATCH(9.99999999999999E+307,$B$7:B58))),(VLOOKUP(INDEX($B$7:B58,MATCH(9.99999999999999E+307,$B$7:B58)),$B$7:F58,5,FALSE))+(INDEX($B$7:B58,MATCH(9.99999999999999E+307,$B$7:B58)))),\"\")","v":""},null,{"$f":"IF(D59<>\"\",IF(OR(B59<>\"\",INDIRECT(\"D60\")=0),D59,0),\"\")","v":""},"",null,{"$f":"IF(D59<>\"\",IF(AND(B59<>\"\",B58<>\"\"),$I$4+H58,VLOOKUP(INDEX($B$7:B58,MATCH(9.99999999999999E+307,$B$7:B58)),$B$7:H58,7,FALSE)+$I$4),\"\")","v":""},""]
[null,null,{"$f":"IF(D60<>\"\",IF(OR(B60<>\"\",INDIRECT(\"D61\")=0),IF(B59<>\"\",F59+B59,VLOOKUP(INDEX($B$7:B59,MATCH(9.99999999999999E+307,$B$7:B59)),$B$7:F59,5,FALSE)+INDEX($B$7:B59,MATCH(9.99999999999999E+307,$B$7:B59))),(VLOOKUP(INDEX($B$7:B59,MATCH(9.99999999999999E+307,$B$7:B59)),$B$7:F59,5,FALSE))+(INDEX($B$7:B59,MATCH(9.99999999999999E+307,$B$7:B59)))),\"\")","v":""},null,{"$f":"IF(D60<>\"\",IF(OR(B60<>\"\",INDIRECT(\"D61\")=0),D60,0),\"\")","v":""},"",null,{"$f":"IF(D60<>\"\",IF(AND(B60<>\"\",B59<>\"\"),$I$4+H59,VLOOKUP(INDEX($B$7:B59,MATCH(9.99999999999999E+307,$B$7:B59)),$B$7:H59,7,FALSE)+$I$4),\"\")","v":""},""]
[null,null,{"$f":"IF(D61<>\"\",IF(OR(B61<>\"\",INDIRECT(\"D62\")=0),IF(B60<>\"\",F60+B60,VLOOKUP(INDEX($B$7:B60,MATCH(9.99999999999999E+307,$B$7:B60)),$B$7:F60,5,FALSE)+INDEX($B$7:B60,MATCH(9.99999999999999E+307,$B$7:B60))),(VLOOKUP(INDEX($B$7:B60,MATCH(9.99999999999999E+307,$B$7:B60)),$B$7:F60,5,FALSE))+(INDEX($B$7:B60,MATCH(9.99999999999999E+307,$B$7:B60)))),\"\")","v":""},null,{"$f":"IF(D61<>\"\",IF(OR(B61<>\"\",INDIRECT(\"D62\")=0),D61,0),\"\")","v":""},"",null,{"$f":"IF(D61<>\"\",IF(AND(B61<>\"\",B60<>\"\"),$I$4+H60,VLOOKUP(INDEX($B$7:B60,MATCH(9.99999999999999E+307,$B$7:B60)),$B$7:H60,7,FALSE)+$I$4),\"\")","v":""},""]
[null,null,{"$f":"IF(D62<>\"\",IF(OR(B62<>\"\",INDIRECT(\"D63\")=0),IF(B61<>\"\",F61+B61,VLOOKUP(INDEX($B$7:B61,MATCH(9.99999999999999E+307,$B$7:B61)),$B$7:F61,5,FALSE)+INDEX($B$7:B61,MATCH(9.99999999999999E+307,$B$7:B61))),(VLOOKUP(INDEX($B$7:B61,MATCH(9.99999999999999E+307,$B$7:B61)),$B$7:F61,5,FALSE))+(INDEX($B$7:B61,MATCH(9.99999999999999E+307,$B$7:B61)))),\"\")","v":""},null,{"$f":"IF(D62<>\"\",IF(OR(B62<>\"\",INDIRECT(\"D63\")=0),D62,0),\"\")","v":""},"",null,{"$f":"IF(D62<>\"\",IF(AND(B62<>\"\",B61<>\"\"),$I$4+H61,VLOOKUP(INDEX($B$7:B61,MATCH(9.99999999999999E+307,$B$7:B61)),$B$7:H61,7,FALSE)+$I$4),\"\")","v":""},""]
[null,null,{"$f":"IF(D63<>\"\",IF(OR(B63<>\"\",INDIRECT(\"D64\")=0),IF(B62<>\"\",F62+B62,VLOOKUP(INDEX($B$7:B62,MATCH(9.99999999999999E+307,$B$7:B62)),$B$7:F62,5,FALSE)+INDEX($B$7:B62,MATCH(9.99999999999999E+307,$B$7:B62))),(VLOOKUP(INDEX($B$7:B62,MATCH(9.99999999999999E+307,$B$7:B62)),$B$7:F62,5,FALSE))+(INDEX($B$7:B62,MATCH(9.99999999999999E+307,$B$7:B62)))),\"\")","v":""},null,{"$f":"IF(D63<>\"\",IF(OR(B63<>\"\",INDIRECT(\"D64\")=0),D63,0),\"\")","v":""},"",null,{"$f":"IF(D63<>\"\",IF(AND(B63<>\"\",B62<>\"\"),$I$4+H62,VLOOKUP(INDEX($B$7:B62,MATCH(9.99999999999999E+307,$B$7:B62)),$B$7:H62,7,FALSE)+$I$4),\"\")","v":""},""]
[null,null,{"$f":"IF(D64<>\"\",IF(OR(B64<>\"\",INDIRECT(\"D65\")=0),IF(B63<>\"\",F63+B63,VLOOKUP(INDEX($B$7:B63,MATCH(9.99999999999999E+307,$B$7:B63)),$B$7:F63,5,FALSE)+INDEX($B$7:B63,MATCH(9.99999999999999E+307,$B$7:B63))),(VLOOKUP(INDEX($B$7:B63,MATCH(9.99999999999999E+307,$B$7:B63)),$B$7:F63,5,FALSE))+(INDEX($B$7:B63,MATCH(9.99999999999999E+307,$B$7:B63)))),\"\")","v":""},null,{"$f":"IF(D64<>\"\",IF(OR(B64<>\"\",INDIRECT(\"D65\")=0),D64,0),\"\")","v":""},"",null,{"$f":"IF(D64<>\"\",IF(AND(B64<>\"\",B63<>\"\"),$I$4+H63,VLOOKUP(INDEX($B$7:B63,MATCH(9.99999999999999E+307,$B$7:B63)),$B$7:H63,7,FALSE)+$I$4),\"\")","v":""},""]
[null,null,{"$f":"IF(D65<>\"\",IF(OR(B65<>\"\",INDIRECT(\"D66\")=0),IF(B64<>\"\",F64+B64,VLOOKUP(INDEX($B$7:B64,MATCH(9.99999999999999E+307,$B$7:B64)),$B$7:F64,5,FALSE)+INDEX($B$7:B64,MATCH(9.99999999999999E+307,$B$7:B64))),(VLOOKUP(INDEX($B$7:B64,MATCH(9.99999999999999E+307,$B$7:B64)),$B$7:F64,5,FALSE))+(INDEX($B$7:B64,MATCH(9.99999999999999E+307,$B$7:B64)))),\"\")","v":""},null,{"$f":"IF(D65<>\"\",IF(OR(B65<>\"\",INDIRECT(\"D66\")=0),D65,0),\"\")","v":""},"",null,{"$f":"IF(D65<>\"\",IF(AND(B65<>\"\",B64<>\"\"),$I$4+H64,VLOOKUP(INDEX($B$7:B64,MATCH(9.99999999999999E+307,$B$7:B64)),$B$7:H64,7,FALSE)+$I$4),\"\")","v":""},""]
[null,null,{"$f":"IF(D66<>\"\",IF(OR(B66<>\"\",INDIRECT(\"D67\")=0),IF(B65<>\"\",F65+B65,VLOOKUP(INDEX($B$7:B65,MATCH(9.99999999999999E+307,$B$7:B65)),$B$7:F65,5,FALSE)+INDEX($B$7:B65,MATCH(9.99999999999999E+307,$B$7:B65))),(VLOOKUP(INDEX($B$7:B65,MATCH(9.99999999999999E+307,$B$7:B65)),$B$7:F65,5,FALSE))+(INDEX($B$7:B65,MATCH(9.99999999999999E+307,$B$7:B65)))),\"\")","v":""},null,{"$f":"IF(D66<>\"\",IF(OR(B66<>\"\",INDIRECT(\"D67\")=0),D66,0),\"\")","v":""},"",null,{"$f":"IF(D66<>\"\",IF(AND(B66<>\"\",B65<>\"\"),$I$4+H65,VLOOKUP(INDEX($B$7:B65,MATCH(9.99999999999999E+307,$B$7:B65)),$B$7:H65,7,FALSE)+$I$4),\"\")","v":""},""]
[null,null,{"$f":"IF(D67<>\"\",IF(OR(B67<>\"\",INDIRECT(\"D68\")=0),IF(B66<>\"\",F66+B66,VLOOKUP(INDEX($B$7:B66,MATCH(9.99999999999999E+307,$B$7:B66)),$B$7:F66,5,FALSE)+INDEX($B$7:B66,MATCH(9.99999999999999E+307,$B$7:B66))),(VLOOKUP(INDEX($B$7:B66,MATCH(9.99999999999999E+307,$B$7:B66)),$B$7:F66,5,FALSE))+(INDEX($B$7:B66,MATCH(9.99999999999999E+307,$B$7:B66)))),\"\")","v":""},null,{"$f":"IF(D67<>\"\",IF(OR(B67<>\"\",INDIRECT(\"D68\")=0),D67,0),\"\")","v":""},"",null,{"$f":"IF(D67<>\"\",IF(AND(B67<>\"\",B66<>\"\"),$I$4+H66,VLOOKUP(INDEX($B$7:B66,MATCH(9.99999999999999E+307,$B$7:B66)),$B$7:H66,7,FALSE)+$I$4),\"\")","v":""},""]
[null,null,{"$f":"IF(D68<>\"\",IF(OR(B68<>\"\",INDIRECT(\"D69\")=0),IF(B67<>\"\",F67+B67,VLOOKUP(INDEX($B$7:B67,MATCH(9.99999999999999E+307,$B$7:B67)),$B$7:F67,5,FALSE)+INDEX($B$7:B67,MATCH(9.99999999999999E+307,$B$7:B67))),(VLOOKUP(INDEX($B$7:B67,MATCH(9.99999999999999E+307,$B$7:B67)),$B$7:F67,5,FALSE))+(INDEX($B$7:B67,MATCH(9.99999999999999E+307,$B$7:B67)))),\"\")","v":""},null,{"$f":"IF(D68<>\"\",IF(OR(B68<>\"\",INDIRECT(\"D69\")=0),D68,0),\"\")","v":""},"",null,{"$f":"IF(D68<>\"\",IF(AND(B68<>\"\",B67<>\"\"),$I$4+H67,VLOOKUP(INDEX($B$7:B67,MATCH(9.99999999999999E+307,$B$7:B67)),$B$7:H67,7,FALSE)+$I$4),\"\")","v":""},""]
[null,null,{"$f":"IF(D69<>\"\",IF(OR(B69<>\"\",INDIRECT(\"D70\")=0),IF(B68<>\"\",F68+B68,VLOOKUP(INDEX($B$7:B68,MATCH(9.99999999999999E+307,$B$7:B68)),$B$7:F68,5,FALSE)+INDEX($B$7:B68,MATCH(9.99999999999999E+307,$B$7:B68))),(VLOOKUP(INDEX($B$7:B68,MATCH(9.99999999999999E+307,$B$7:B68)),$B$7:F68,5,FALSE))+(INDEX($B$7:B68,MATCH(9.99999999999999E+307,$B$7:B68)))),\"\")","v":""},null,{"$f":"IF(D69<>\"\",IF(OR(B69<>\"\",INDIRECT(\"D70\")=0),D69,0),\"\")","v":""},"",null,{"$f":"IF(D69<>\"\",IF(AND(B69<>\"\",B68<>\"\"),$I$4+H68,VLOOKUP(INDEX($B$7:B68,MATCH(9.99999999999999E+307,$B$7:B68)),$B$7:H68,7,FALSE)+$I$4),\"\")","v":""},""]
[null,null,{"$f":"IF(D70<>\"\",IF(OR(B70<>\"\",INDIRECT(\"D71\")=0),IF(B69<>\"\",F69+B69,VLOOKUP(INDEX($B$7:B69,MATCH(9.99999999999999E+307,$B$7:B69)),$B$7:F69,5,FALSE)+INDEX($B$7:B69,MATCH(9.99999999999999E+307,$B$7:B69))),(VLOOKUP(INDEX($B$7:B69,MATCH(9.99999999999999E+307,$B$7:B69)),$B$7:F69,5,FALSE))+(INDEX($B$7:B69,MATCH(9.99999999999999E+307,$B$7:B69)))),\"\")","v":""},null,{"$f":"IF(D70<>\"\",IF(OR(B70<>\"\",INDIRECT(\"D71\")=0),D70,0),\"\")","v":""},"",null,{"$f":"IF(D70<>\"\",IF(AND(B70<>\"\",B69<>\"\"),$I$4+H69,VLOOKUP(INDEX($B$7:B69,MATCH(9.99999999999999E+307,$B$7:B69)),$B$7:H69,7,FALSE)+$I$4),\"\")","v":""},""]
[null,null,{"$f":"IF(D71<>\"\",IF(OR(B71<>\"\",INDIRECT(\"D72\")=0),IF(B70<>\"\",F70+B70,VLOOKUP(INDEX($B$7:B70,MATCH(9.99999999999999E+307,$B$7:B70)),$B$7:F70,5,FALSE)+INDEX($B$7:B70,MATCH(9.99999999999999E+307,$B$7:B70))),(VLOOKUP(INDEX($B$7:B70,MATCH(9.99999999999999E+307,$B$7:B70)),$B$7:F70,5,FALSE))+(INDEX($B$7:B70,MATCH(9.99999999999999E+307,$B$7:B70)))),\"\")","v":""},null,{"$f":"IF(D71<>\"\",IF(OR(B71<>\"\",INDIRECT(\"D72\")=0),D71,0),\"\")","v":""},"",null,{"$f":"IF(D71<>\"\",IF(AND(B71<>\"\",B70<>\"\"),$I$4+H70,VLOOKUP(INDEX($B$7:B70,MATCH(9.99999999999999E+307,$B$7:B70)),$B$7:H70,7,FALSE)+$I$4),\"\")","v":""},""]
[null,null,{"$f":"IF(D72<>\"\",IF(OR(B72<>\"\",INDIRECT(\"D73\")=0),IF(B71<>\"\",F71+B71,VLOOKUP(INDEX($B$7:B71,MATCH(9.99999999999999E+307,$B$7:B71)),$B$7:F71,5,FALSE)+INDEX($B$7:B71,MATCH(9.99999999999999E+307,$B$7:B71))),(VLOOKUP(INDEX($B$7:B71,MATCH(9.99999999999999E+307,$B$7:B71)),$B$7:F71,5,FALSE))+(INDEX($B$7:B71,MATCH(9.99999999999999E+307,$B$7:B71)))),\"\")","v":""},null,{"$f":"IF(D72<>\"\",IF(OR(B72<>\"\",INDIRECT(\"D73\")=0),D72,0),\"\")","v":""},"",null,{"$f":"IF(D72<>\"\",IF(AND(B72<>\"\",B71<>\"\"),$I$4+H71,VLOOKUP(INDEX($B$7:B71,MATCH(9.99999999999999E+307,$B$7:B71)),$B$7:H71,7,FALSE)+$I$4),\"\")","v":""},""]
[null,null,{"$f":"IF(D73<>\"\",IF(OR(B73<>\"\",INDIRECT(\"D74\")=0),IF(B72<>\"\",F72+B72,VLOOKUP(INDEX($B$7:B72,MATCH(9.99999999999999E+307,$B$7:B72)),$B$7:F72,5,FALSE)+INDEX($B$7:B72,MATCH(9.99999999999999E+307,$B$7:B72))),(VLOOKUP(INDEX($B$7:B72,MATCH(9.99999999999999E+307,$B$7:B72)),$B$7:F72,5,FALSE))+(INDEX($B$7:B72,MATCH(9.99999999999999E+307,$B$7:B72)))),\"\")","v":""},null,{"$f":"IF(D73<>\"\",IF(OR(B73<>\"\",INDIRECT(\"D74\")=0),D73,0),\"\")","v":""},{"$f":"IF(D73<>\"\",C73-D73,\"\")","v":""},null,{"$f":"IF(D73<>\"\",IF(AND(B73<>\"\",B72<>\"\"),$I$4+H72,VLOOKUP(INDEX($B$7:B72,MATCH(9.99999999999999E+307,$B$7:B72)),$B$7:H72,7,FALSE)+$I$4),\"\")","v":""},{"$f":"IF(D73<>\"\",(F73+H73),\"\")","v":""}]
[null,null,{"$f":"IF(D74<>\"\",IF(OR(B74<>\"\",INDIRECT(\"D75\")=0),IF(B73<>\"\",F73+B73,VLOOKUP(INDEX($B$7:B73,MATCH(9.99999999999999E+307,$B$7:B73)),$B$7:F73,5,FALSE)+INDEX($B$7:B73,MATCH(9.99999999999999E+307,$B$7:B73))),(VLOOKUP(INDEX($B$7:B73,MATCH(9.99999999999999E+307,$B$7:B73)),$B$7:F73,5,FALSE))+(INDEX($B$7:B73,MATCH(9.99999999999999E+307,$B$7:B73)))),\"\")","v":""},null,{"$f":"IF(D74<>\"\",IF(OR(B74<>\"\",INDIRECT(\"D75\")=0),D74,0),\"\")","v":""},"",null,{"$f":"IF(D74<>\"\",IF(AND(B74<>\"\",B73<>\"\"),$I$4+H73,VLOOKUP(INDEX($B$7:B73,MATCH(9.99999999999999E+307,$B$7:B73)),$B$7:H73,7,FALSE)+$I$4),\"\")","v":""},""]
[null,null,{"$f":"IF(D75<>\"\",IF(OR(B75<>\"\",INDIRECT(\"D76\")=0),IF(B74<>\"\",F74+B74,VLOOKUP(INDEX($B$7:B74,MATCH(9.99999999999999E+307,$B$7:B74)),$B$7:F74,5,FALSE)+INDEX($B$7:B74,MATCH(9.99999999999999E+307,$B$7:B74))),(VLOOKUP(INDEX($B$7:B74,MATCH(9.99999999999999E+307,$B$7:B74)),$B$7:F74,5,FALSE))+(INDEX($B$7:B74,MATCH(9.99999999999999E+307,$B$7:B74)))),\"\")","v":""},null,{"$f":"IF(D75<>\"\",IF(OR(B75<>\"\",INDIRECT(\"D76\")=0),D75,0),\"\")","v":""},"",null,{"$f":"IF(D75<>\"\",IF(AND(B75<>\"\",B74<>\"\"),$I$4+H74,VLOOKUP(INDEX($B$7:B74,MATCH(9.99999999999999E+307,$B$7:B74)),$B$7:H74,7,FALSE)+$I$4),\"\")","v":""},""]
[null,null,{"$f":"IF(D76<>\"\",IF(OR(B76<>\"\",INDIRECT(\"D77\")=0),IF(B75<>\"\",F75+B75,VLOOKUP(INDEX($B$7:B75,MATCH(9.99999999999999E+307,$B$7:B75)),$B$7:F75,5,FALSE)+INDEX($B$7:B75,MATCH(9.99999999999999E+307,$B$7:B75))),(VLOOKUP(INDEX($B$7:B75,MATCH(9.99999999999999E+307,$B$7:B75)),$B$7:F75,5,FALSE))+(INDEX($B$7:B75,MATCH(9.99999999999999E+307,$B$7:B75)))),\"\")","v":""},null,{"$f":"IF(D76<>\"\",IF(OR(B76<>\"\",INDIRECT(\"D77\")=0),D76,0),\"\")","v":""},"",null,{"$f":"IF(D76<>\"\",IF(AND(B76<>\"\",B75<>\"\"),$I$4+H75,VLOOKUP(INDEX($B$7:B75,MATCH(9.99999999999999E+307,$B$7:B75)),$B$7:H75,7,FALSE)+$I$4),\"\")","v":""},""]
[null,null,{"$f":"IF(D77<>\"\",IF(OR(B77<>\"\",INDIRECT(\"D78\")=0),IF(B76<>\"\",F76+B76,VLOOKUP(INDEX($B$7:B76,MATCH(9.99999999999999E+307,$B$7:B76)),$B$7:F76,5,FALSE)+INDEX($B$7:B76,MATCH(9.99999999999999E+307,$B$7:B76))),(VLOOKUP(INDEX($B$7:B76,MATCH(9.99999999999999E+307,$B$7:B76)),$B$7:F76,5,FALSE))+(INDEX($B$7:B76,MATCH(9.99999999999999E+307,$B$7:B76)))),\"\")","v":""},null,{"$f":"IF(D77<>\"\",IF(OR(B77<>\"\",INDIRECT(\"D78\")=0),D77,0),\"\")","v":""},"",null,{"$f":"IF(D77<>\"\",IF(AND(B77<>\"\",B76<>\"\"),$I$4+H76,VLOOKUP(INDEX($B$7:B76,MATCH(9.99999999999999E+307,$B$7:B76)),$B$7:H76,7,FALSE)+$I$4),\"\")","v":""},""]
[null,null,{"$f":"IF(D78<>\"\",IF(OR(B78<>\"\",INDIRECT(\"D79\")=0),IF(B77<>\"\",F77+B77,VLOOKUP(INDEX($B$7:B77,MATCH(9.99999999999999E+307,$B$7:B77)),$B$7:F77,5,FALSE)+INDEX($B$7:B77,MATCH(9.99999999999999E+307,$B$7:B77))),(VLOOKUP(INDEX($B$7:B77,MATCH(9.99999999999999E+307,$B$7:B77)),$B$7:F77,5,FALSE))+(INDEX($B$7:B77,MATCH(9.99999999999999E+307,$B$7:B77)))),\"\")","v":""},null,{"$f":"IF(D78<>\"\",IF(OR(B78<>\"\",INDIRECT(\"D79\")=0),D78,0),\"\")","v":""},"",null,{"$f":"IF(D78<>\"\",IF(AND(B78<>\"\",B77<>\"\"),$I$4+H77,VLOOKUP(INDEX($B$7:B77,MATCH(9.99999999999999E+307,$B$7:B77)),$B$7:H77,7,FALSE)+$I$4),\"\")","v":""},""]
[null,null,{"$f":"IF(D79<>\"\",IF(OR(B79<>\"\",INDIRECT(\"D80\")=0),IF(B78<>\"\",F78+B78,VLOOKUP(INDEX($B$7:B78,MATCH(9.99999999999999E+307,$B$7:B78)),$B$7:F78,5,FALSE)+INDEX($B$7:B78,MATCH(9.99999999999999E+307,$B$7:B78))),(VLOOKUP(INDEX($B$7:B78,MATCH(9.99999999999999E+307,$B$7:B78)),$B$7:F78,5,FALSE))+(INDEX($B$7:B78,MATCH(9.99999999999999E+307,$B$7:B78)))),\"\")","v":""},null,{"$f":"IF(D79<>\"\",IF(OR(B79<>\"\",INDIRECT(\"D80\")=0),D79,0),\"\")","v":""},"",null,{"$f":"IF(D79<>\"\",IF(AND(B79<>\"\",B78<>\"\"),$I$4+H78,VLOOKUP(INDEX($B$7:B78,MATCH(9.99999999999999E+307,$B$7:B78)),$B$7:H78,7,FALSE)+$I$4),\"\")","v":""},""]
[null,null,{"$f":"IF(D80<>\"\",IF(OR(B80<>\"\",INDIRECT(\"D81\")=0),IF(B79<>\"\",F79+B79,VLOOKUP(INDEX($B$7:B79,MATCH(9.99999999999999E+307,$B$7:B79)),$B$7:F79,5,FALSE)+INDEX($B$7:B79,MATCH(9.99999999999999E+307,$B$7:B79))),(VLOOKUP(INDEX($B$7:B79,MATCH(9.99999999999999E+307,$B$7:B79)),$B$7:F79,5,FALSE))+(INDEX($B$7:B79,MATCH(9.99999999999999E+307,$B$7:B79)))),\"\")","v":""},null,{"$f":"IF(D80<>\"\",IF(OR(B80<>\"\",INDIRECT(\"D81\")=0),D80,0),\"\")","v":""},"",null,{"$f":"IF(D80<>\"\",IF(AND(B80<>\"\",B79<>\"\"),$I$4+H79,VLOOKUP(INDEX($B$7:B79,MATCH(9.99999999999999E+307,$B$7:B79)),$B$7:H79,7,FALSE)+$I$4),\"\")","v":""},""]
[null,null,{"$f":"IF(D81<>\"\",IF(OR(B81<>\"\",INDIRECT(\"D82\")=0),IF(B80<>\"\",F80+B80,VLOOKUP(INDEX($B$7:B80,MATCH(9.99999999999999E+307,$B$7:B80)),$B$7:F80,5,FALSE)+INDEX($B$7:B80,MATCH(9.99999999999999E+307,$B$7:B80))),(VLOOKUP(INDEX($B$7:B80,MATCH(9.99999999999999E+307,$B$7:B80)),$B$7:F80,5,FALSE))+(INDEX($B$7:B80,MATCH(9.99999999999999E+307,$B$7:B80)))),\"\")","v":""},null,{"$f":"IF(D81<>\"\",IF(OR(B81<>\"\",INDIRECT(\"D82\")=0),D81,0),\"\")","v":""},"",null,{"$f":"IF(D81<>\"\",IF(AND(B81<>\"\",B80<>\"\"),$I$4+H80,VLOOKUP(INDEX($B$7:B80,MATCH(9.99999999999999E+307,$B$7:B80)),$B$7:H80,7,FALSE)+$I$4),\"\")","v":""},""]
[null,null,{"$f":"IF(D82<>\"\",IF(OR(B82<>\"\",INDIRECT(\"D83\")=0),IF(B81<>\"\",F81+B81,VLOOKUP(INDEX($B$7:B81,MATCH(9.99999999999999E+307,$B$7:B81)),$B$7:F81,5,FALSE)+INDEX($B$7:B81,MATCH(9.99999999999999E+307,$B$7:B81))),(VLOOKUP(INDEX($B$7:B81,MATCH(9.99999999999999E+307,$B$7:B81)),$B$7:F81,5,FALSE))+(INDEX($B$7:B81,MATCH(9.99999999999999E+307,$B$7:B81)))),\"\")","v":""},null,{"$f":"IF(D82<>\"\",IF(OR(B82<>\"\",INDIRECT(\"D83\")=0),D82,0),\"\")","v":""},"",null,{"$f":"IF(D82<>\"\",IF(AND(B82<>\"\",B81<>\"\"),$I$4+H81,VLOOKUP(INDEX($B$7:B81,MATCH(9.99999999999999E+307,$B$7:B81)),$B$7:H81,7,FALSE)+$I$4),\"\")","v":""},""]
[null,null,{"$f":"IF(D83<>\"\",IF(OR(B83<>\"\",INDIRECT(\"D84\")=0),IF(B82<>\"\",F82+B82,VLOOKUP(INDEX($B$7:B82,MATCH(9.99999999999999E+307,$B$7:B82)),$B$7:F82,5,FALSE)+INDEX($B$7:B82,MATCH(9.99999999999999E+307,$B$7:B82))),(VLOOKUP(INDEX($B$7:B82,MATCH(9.99999999999999E+307,$B$7:B82)),$B$7:F82,5,FALSE))+(INDEX($B$7:B82,MATCH(9.99999999999999E+307,$B$7:B82)))),\"\")","v":""},null,{"$f":"IF(D83<>\"\",IF(OR(B83<>\"\",INDIRECT(\"D84\")=0),D83,0),\"\")","v":""},"",null,{"$f":"IF(D83<>\"\",IF(AND(B83<>\"\",B82<>\"\"),$I$4+H82,VLOOKUP(INDEX($B$7:B82,MATCH(9.99999999999999E+307,$B$7:B82)),$B$7:H82,7,FALSE)+$I$4),\"\")","v":""},""]
[null,null,{"$f":"IF(D84<>\"\",IF(OR(B84<>\"\",INDIRECT(\"D85\")=0),IF(B83<>\"\",F83+B83,VLOOKUP(INDEX($B$7:B83,MATCH(9.99999999999999E+307,$B$7:B83)),$B$7:F83,5,FALSE)+INDEX($B$7:B83,MATCH(9.99999999999999E+307,$B$7:B83))),(VLOOKUP(INDEX($B$7:B83,MATCH(9.99999999999999E+307,$B$7:B83)),$B$7:F83,5,FALSE))+(INDEX($B$7:B83,MATCH(9.99999999999999E+307,$B$7:B83)))),\"\")","v":""},null,{"$f":"IF(D84<>\"\",IF(OR(B84<>\"\",INDIRECT(\"D85\")=0),D84,0),\"\")","v":""},"",null,{"$f":"IF(D84<>\"\",IF(AND(B84<>\"\",B83<>\"\"),$I$4+H83,VLOOKUP(INDEX($B$7:B83,MATCH(9.99999999999999E+307,$B$7:B83)),$B$7:H83,7,FALSE)+$I$4),\"\")","v":""},""]
[null,null,{"$f":"IF(D85<>\"\",IF(OR(B85<>\"\",INDIRECT(\"D86\")=0),IF(B84<>\"\",F84+B84,VLOOKUP(INDEX($B$7:B84,MATCH(9.99999999999999E+307,$B$7:B84)),$B$7:F84,5,FALSE)+INDEX($B$7:B84,MATCH(9.99999999999999E+307,$B$7:B84))),(VLOOKUP(INDEX($B$7:B84,MATCH(9.99999999999999E+307,$B$7:B84)),$B$7:F84,5,FALSE))+(INDEX($B$7:B84,MATCH(9.99999999999999E+307,$B$7:B84)))),\"\")","v":""},null,{"$f":"IF(D85<>\"\",IF(OR(B85<>\"\",INDIRECT(\"D86\")=0),D85,0),\"\")","v":""},"",null,{"$f":"IF(D85<>\"\",IF(AND(B85<>\"\",B84<>\"\"),$I$4+H84,VLOOKUP(INDEX($B$7:B84,MATCH(9.99999999999999E+307,$B$7:B84)),$B$7:H84,7,FALSE)+$I$4),\"\")","v":""},""]
[null,null,{"$f":"IF(D86<>\"\",IF(OR(B86<>\"\",INDIRECT(\"D87\")=0),IF(B85<>\"\",F85+B85,VLOOKUP(INDEX($B$7:B85,MATCH(9.99999999999999E+307,$B$7:B85)),$B$7:F85,5,FALSE)+INDEX($B$7:B85,MATCH(9.99999999999999E+307,$B$7:B85))),(VLOOKUP(INDEX($B$7:B85,MATCH(9.99999999999999E+307,$B$7:B85)),$B$7:F85,5,FALSE))+(INDEX($B$7:B85,MATCH(9.99999999999999E+307,$B$7:B85)))),\"\")","v":""},null,{"$f":"IF(D86<>\"\",IF(OR(B86<>\"\",INDIRECT(\"D87\")=0),D86,0),\"\")","v":""},"",null,{"$f":"IF(D86<>\"\",IF(AND(B86<>\"\",B85<>\"\"),$I$4+H85,VLOOKUP(INDEX($B$7:B85,MATCH(9.99999999999999E+307,$B$7:B85)),$B$7:H85,7,FALSE)+$I$4),\"\")","v":""},""]
[null,null,{"$f":"IF(D87<>\"\",IF(OR(B87<>\"\",INDIRECT(\"D88\")=0),IF(B86<>\"\",F86+B86,VLOOKUP(INDEX($B$7:B86,MATCH(9.99999999999999E+307,$B$7:B86)),$B$7:F86,5,FALSE)+INDEX($B$7:B86,MATCH(9.99999999999999E+307,$B$7:B86))),(VLOOKUP(INDEX($B$7:B86,MATCH(9.99999999999999E+307,$B$7:B86)),$B$7:F86,5,FALSE))+(INDEX($B$7:B86,MATCH(9.99999999999999E+307,$B$7:B86)))),\"\")","v":""},null,{"$f":"IF(D87<>\"\",IF(OR(B87<>\"\",INDIRECT(\"D88\")=0),D87,0),\"\")","v":""},"",null,{"$f":"IF(D87<>\"\",IF(AND(B87<>\"\",B86<>\"\"),$I$4+H86,VLOOKUP(INDEX($B$7:B86,MATCH(9.99999999999999E+307,$B$7:B86)),$B$7:H86,7,FALSE)+$I$4),\"\")","v":""},""]
[null,null,{"$f":"IF(D88<>\"\",IF(OR(B88<>\"\",INDIRECT(\"D89\")=0),IF(B87<>\"\",F87+B87,VLOOKUP(INDEX($B$7:B87,MATCH(9.99999999999999E+307,$B$7:B87)),$B$7:F87,5,FALSE)+INDEX($B$7:B87,MATCH(9.99999999999999E+307,$B$7:B87))),(VLOOKUP(INDEX($B$7:B87,MATCH(9.99999999999999E+307,$B$7:B87)),$B$7:F87,5,FALSE))+(INDEX($B$7:B87,MATCH(9.99999999999999E+307,$B$7:B87)))),\"\")","v":""},null,{"$f":"IF(D88<>\"\",IF(OR(B88<>\"\",INDIRECT(\"D89\")=0),D88,0),\"\")","v":""},"",null,{"$f":"IF(D88<>\"\",IF(AND(B88<>\"\",B87<>\"\"),$I$4+H87,VLOOKUP(INDEX($B$7:B87,MATCH(9.99999999999999E+307,$B$7:B87)),$B$7:H87,7,FALSE)+$I$4),\"\")","v":""},""]
[null,null,{"$f":"IF(D89<>\"\",IF(OR(B89<>\"\",INDIRECT(\"D90\")=0),IF(B88<>\"\",F88+B88,VLOOKUP(INDEX($B$7:B88,MATCH(9.99999999999999E+307,$B$7:B88)),$B$7:F88,5,FALSE)+INDEX($B$7:B88,MATCH(9.99999999999999E+307,$B$7:B88))),(VLOOKUP(INDEX($B$7:B88,MATCH(9.99999999999999E+307,$B$7:B88)),$B$7:F88,5,FALSE))+(INDEX($B$7:B88,MATCH(9.99999999999999E+307,$B$7:B88)))),\"\")","v":""},null,{"$f":"IF(D89<>\"\",IF(OR(B89<>\"\",INDIRECT(\"D90\")=0),D89,0),\"\")","v":""},"",null,{"$f":"IF(D89<>\"\",IF(AND(B89<>\"\",B88<>\"\"),$I$4+H88,VLOOKUP(INDEX($B$7:B88,MATCH(9.99999999999999E+307,$B$7:B88)),$B$7:H88,7,FALSE)+$I$4),\"\")","v":""},""]
[null,null,{"$f":"IF(D90<>\"\",IF(OR(B90<>\"\",INDIRECT(\"D91\")=0),IF(B89<>\"\",F89+B89,VLOOKUP(INDEX($B$7:B89,MATCH(9.99999999999999E+307,$B$7:B89)),$B$7:F89,5,FALSE)+INDEX($B$7:B89,MATCH(9.99999999999999E+307,$B$7:B89))),(VLOOKUP(INDEX($B$7:B89,MATCH(9.99999999999999E+307,$B$7:B89)),$B$7:F89,5,FALSE))+(INDEX($B$7:B89,MATCH(9.99999999999999E+307,$B$7:B89)))),\"\")","v":""},null,{"$f":"IF(D90<>\"\",IF(OR(B90<>\"\",INDIRECT(\"D91\")=0),D90,0),\"\")","v":""},"",null,{"$f":"IF(D90<>\"\",IF(AND(B90<>\"\",B89<>\"\"),$I$4+H89,VLOOKUP(INDEX($B$7:B89,MATCH(9.99999999999999E+307,$B$7:B89)),$B$7:H89,7,FALSE)+$I$4),\"\")","v":""},""]
[null,null,{"$f":"IF(D91<>\"\",IF(OR(B91<>\"\",INDIRECT(\"D92\")=0),IF(B90<>\"\",F90+B90,VLOOKUP(INDEX($B$7:B90,MATCH(9.99999999999999E+307,$B$7:B90)),$B$7:F90,5,FALSE)+INDEX($B$7:B90,MATCH(9.99999999999999E+307,$B$7:B90))),(VLOOKUP(INDEX($B$7:B90,MATCH(9.99999999999999E+307,$B$7:B90)),$B$7:F90,5,FALSE))+(INDEX($B$7:B90,MATCH(9.99999999999999E+307,$B$7:B90)))),\"\")","v":""},null,{"$f":"IF(D91<>\"\",IF(OR(B91<>\"\",INDIRECT(\"D92\")=0),D91,0),\"\")","v":""},"",null,{"$f":"IF(D91<>\"\",IF(AND(B91<>\"\",B90<>\"\"),$I$4+H90,VLOOKUP(INDEX($B$7:B90,MATCH(9.99999999999999E+307,$B$7:B90)),$B$7:H90,7,FALSE)+$I$4),\"\")","v":""},""]
[null,null,{"$f":"IF(D92<>\"\",IF(OR(B92<>\"\",INDIRECT(\"D93\")=0),IF(B91<>\"\",F91+B91,VLOOKUP(INDEX($B$7:B91,MATCH(9.99999999999999E+307,$B$7:B91)),$B$7:F91,5,FALSE)+INDEX($B$7:B91,MATCH(9.99999999999999E+307,$B$7:B91))),(VLOOKUP(INDEX($B$7:B91,MATCH(9.99999999999999E+307,$B$7:B91)),$B$7:F91,5,FALSE))+(INDEX($B$7:B91,MATCH(9.99999999999999E+307,$B$7:B91)))),\"\")","v":""},null,{"$f":"IF(D92<>\"\",IF(OR(B92<>\"\",INDIRECT(\"D93\")=0),D92,0),\"\")","v":""},"",null,{"$f":"IF(D92<>\"\",IF(AND(B92<>\"\",B91<>\"\"),$I$4+H91,VLOOKUP(INDEX($B$7:B91,MATCH(9.99999999999999E+307,$B$7:B91)),$B$7:H91,7,FALSE)+$I$4),\"\")","v":""},""]
[null,null,{"$f":"IF(D93<>\"\",IF(OR(B93<>\"\",INDIRECT(\"D94\")=0),IF(B92<>\"\",F92+B92,VLOOKUP(INDEX($B$7:B92,MATCH(9.99999999999999E+307,$B$7:B92)),$B$7:F92,5,FALSE)+INDEX($B$7:B92,MATCH(9.99999999999999E+307,$B$7:B92))),(VLOOKUP(INDEX($B$7:B92,MATCH(9.99999999999999E+307,$B$7:B92)),$B$7:F92,5,FALSE))+(INDEX($B$7:B92,MATCH(9.99999999999999E+307,$B$7:B92)))),\"\")","v":""},null,{"$f":"IF(D93<>\"\",IF(OR(B93<>\"\",INDIRECT(\"D94\")=0),D93,0),\"\")","v":""},"",null,{"$f":"IF(D93<>\"\",IF(AND(B93<>\"\",B92<>\"\"),$I$4+H92,VLOOKUP(INDEX($B$7:B92,MATCH(9.99999999999999E+307,$B$7:B92)),$B$7:H92,7,FALSE)+$I$4),\"\")","v":""},""]
[null,null,{"$f":"IF(D94<>\"\",IF(OR(B94<>\"\",INDIRECT(\"D95\")=0),IF(B93<>\"\",F93+B93,VLOOKUP(INDEX($B$7:B93,MATCH(9.99999999999999E+307,$B$7:B93)),$B$7:F93,5,FALSE)+INDEX($B$7:B93,MATCH(9.99999999999999E+307,$B$7:B93))),(VLOOKUP(INDEX($B$7:B93,MATCH(9.99999999999999E+307,$B$7:B93)),$B$7:F93,5,FALSE))+(INDEX($B$7:B93,MATCH(9.99999999999999E+307,$B$7:B93)))),\"\")","v":""},null,{"$f":"IF(D94<>\"\",IF(OR(B94<>\"\",INDIRECT(\"D95\")=0),D94,0),\"\")","v":""},"",null,{"$f":"IF(D94<>\"\",IF(AND(B94<>\"\",B93<>\"\"),$I$4+H93,VLOOKUP(INDEX($B$7:B93,MATCH(9.99999999999999E+307,$B$7:B93)),$B$7:H93,7,FALSE)+$I$4),\"\")","v":""},""]
[null,null,{"$f":"IF(D95<>\"\",IF(OR(B95<>\"\",INDIRECT(\"D96\")=0),IF(B94<>\"\",F94+B94,VLOOKUP(INDEX($B$7:B94,MATCH(9.99999999999999E+307,$B$7:B94)),$B$7:F94,5,FALSE)+INDEX($B$7:B94,MATCH(9.99999999999999E+307,$B$7:B94))),(VLOOKUP(INDEX($B$7:B94,MATCH(9.99999999999999E+307,$B$7:B94)),$B$7:F94,5,FALSE))+(INDEX($B$7:B94,MATCH(9.99999999999999E+307,$B$7:B94)))),\"\")","v":""},null,{"$f":"IF(D95<>\"\",IF(OR(B95<>\"\",INDIRECT(\"D96\")=0),D95,0),\"\")","v":""},"",null,{"$f":"IF(D95<>\"\",IF(AND(B95<>\"\",B94<>\"\"),$I$4+H94,VLOOKUP(INDEX($B$7:B94,MATCH(9.99999999999999E+307,$B$7:B94)),$B$7:H94,7,FALSE)+$I$4),\"\")","v":""},""]
[null,null,{"$f":"IF(D96<>\"\",IF(OR(B96<>\"\",INDIRECT(\"D97\")=0),IF(B95<>\"\",F95+B95,VLOOKUP(INDEX($B$7:B95,MATCH(9.99999999999999E+307,$B$7:B95)),$B$7:F95,5,FALSE)+INDEX($B$7:B95,MATCH(9.99999999999999E+307,$B$7:B95))),(VLOOKUP(INDEX($B$7:B95,MATCH(9.99999999999999E+307,$B$7:B95)),$B$7:F95,5,FALSE))+(INDEX($B$7:B95,MATCH(9.99999999999999E+307,$B$7:B95)))),\"\")","v":""},null,{"$f":"IF(D96<>\"\",IF(OR(B96<>\"\",INDIRECT(\"D97\")=0),D96,0),\"\")","v":""},"",null,{"$f":"IF(D96<>\"\",IF(AND(B96<>\"\",B95<>\"\"),$I$4+H95,VLOOKUP(INDEX($B$7:B95,MATCH(9.99999999999999E+307,$B$7:B95)),$B$7:H95,7,FALSE)+$I$4),\"\")","v":""},""]
[null,null,{"$f":"IF(D97<>\"\",IF(OR(B97<>\"\",INDIRECT(\"D98\")=0),IF(B96<>\"\",F96+B96,VLOOKUP(INDEX($B$7:B96,MATCH(9.99999999999999E+307,$B$7:B96)),$B$7:F96,5,FALSE)+INDEX($B$7:B96,MATCH(9.99999999999999E+307,$B$7:B96))),(VLOOKUP(INDEX($B$7:B96,MATCH(9.99999999999999E+307,$B$7:B96)),$B$7:F96,5,FALSE))+(INDEX($B$7:B96,MATCH(9.99999999999999E+307,$B$7:B96)))),\"\")","v":""},null,{"$f":"IF(D97<>\"\",IF(OR(B97<>\"\",INDIRECT(\"D98\")=0),D97,0),\"\")","v":""},"",null,{"$f":"IF(D97<>\"\",IF(AND(B97<>\"\",B96<>\"\"),$I$4+H96,VLOOKUP(INDEX($B$7:B96,MATCH(9.99999999999999E+307,$B$7:B96)),$B$7:H96,7,FALSE)+$I$4),\"\")","v":""},""]
[null,null,{"$f":"IF(D98<>\"\",IF(OR(B98<>\"\",INDIRECT(\"D99\")=0),IF(B97<>\"\",F97+B97,VLOOKUP(INDEX($B$7:B97,MATCH(9.99999999999999E+307,$B$7:B97)),$B$7:F97,5,FALSE)+INDEX($B$7:B97,MATCH(9.99999999999999E+307,$B$7:B97))),(VLOOKUP(INDEX($B$7:B97,MATCH(9.99999999999999E+307,$B$7:B97)),$B$7:F97,5,FALSE))+(INDEX($B$7:B97,MATCH(9.99999999999999E+307,$B$7:B97)))),\"\")","v":""},null,{"$f":"IF(D98<>\"\",IF(OR(B98<>\"\",INDIRECT(\"D99\")=0),D98,0),\"\")","v":""},"",null,{"$f":"IF(D98<>\"\",IF(AND(B98<>\"\",B97<>\"\"),$I$4+H97,VLOOKUP(INDEX($B$7:B97,MATCH(9.99999999999999E+307,$B$7:B97)),$B$7:H97,7,FALSE)+$I$4),\"\")","v":""},""]
[null,null,{"$f":"IF(D99<>\"\",IF(OR(B99<>\"\",INDIRECT(\"D100\")=0),IF(B98<>\"\",F98+B98,VLOOKUP(INDEX($B$7:B98,MATCH(9.99999999999999E+307,$B$7:B98)),$B$7:F98,5,FALSE)+INDEX($B$7:B98,MATCH(9.99999999999999E+307,$B$7:B98))),(VLOOKUP(INDEX($B$7:B98,MATCH(9.99999999999999E+307,$B$7:B98)),$B$7:F98,5,FALSE))+(INDEX($B$7:B98,MATCH(9.99999999999999E+307,$B$7:B98)))),\"\")","v":""},null,{"$f":"IF(D99<>\"\",IF(OR(B99<>\"\",INDIRECT(\"D100\")=0),D99,0),\"\")","v":""},"",null,{"$f":"IF(D99<>\"\",IF(AND(B99<>\"\",B98<>\"\"),$I$4+H98,VLOOKUP(INDEX($B$7:B98,MATCH(9.99999999999999E+307,$B$7:B98)),$B$7:H98,7,FALSE)+$I$4),\"\")","v":""},""]
[null,null,{"$f":"IF(D100<>\"\",IF(OR(B100<>\"\",INDIRECT(\"D101\")=0),IF(B99<>\"\",F99+B99,VLOOKUP(INDEX($B$7:B99,MATCH(9.99999999999999E+307,$B$7:B99)),$B$7:F99,5,FALSE)+INDEX($B$7:B99,MATCH(9.99999999999999E+307,$B$7:B99))),(VLOOKUP(INDEX($B$7:B99,MATCH(9.99999999999999E+307,$B$7:B99)),$B$7:F99,5,FALSE))+(INDEX($B$7:B99,MATCH(9.99999999999999E+307,$B$7:B99)))),\"\")","v":""},null,{"$f":"IF(D100<>\"\",IF(OR(B100<>\"\",INDIRECT(\"D101\")=0),D100,0),\"\")","v":""},"",null,{"$f":"IF(D100<>\"\",IF(AND(B100<>\"\",B99<>\"\"),$I$4+H99,VLOOKUP(INDEX($B$7:B99,MATCH(9.99999999999999E+307,$B$7:B99)),$B$7:H99,7,FALSE)+$I$4),\"\")","v":""},""]
[null,null,{"$f":"IF(D101<>\"\",IF(OR(B101<>\"\",INDIRECT(\"D102\")=0),IF(B100<>\"\",F100+B100,VLOOKUP(INDEX($B$7:B100,MATCH(9.99999999999999E+307,$B$7:B100)),$B$7:F100,5,FALSE)+INDEX($B$7:B100,MATCH(9.99999999999999E+307,$B$7:B100))),(VLOOKUP(INDEX($B$7:B100,MATCH(9.99999999999999E+307,$B$7:B100)),$B$7:F100,5,FALSE))+(INDEX($B$7:B100,MATCH(9.99999999999999E+307,$B$7:B100)))),\"\")","v":""},null,{"$f":"IF(D101<>\"\",IF(OR(B101<>\"\",INDIRECT(\"D102\")=0),D101,0),\"\")","v":""},"",null,{"$f":"IF(D101<>\"\",IF(AND(B101<>\"\",B100<>\"\"),$I$4+H100,VLOOKUP(INDEX($B$7:B100,MATCH(9.99999999999999E+307,$B$7:B100)),$B$7:H100,7,FALSE)+$I$4),\"\")","v":""},""]
[null,null,{"$f":"IF(D102<>\"\",IF(OR(B102<>\"\",INDIRECT(\"D103\")=0),IF(B101<>\"\",F101+B101,VLOOKUP(INDEX($B$7:B101,MATCH(9.99999999999999E+307,$B$7:B101)),$B$7:F101,5,FALSE)+INDEX($B$7:B101,MATCH(9.99999999999999E+307,$B$7:B101))),(VLOOKUP(INDEX($B$7:B101,MATCH(9.99999999999999E+307,$B$7:B101)),$B$7:F101,5,FALSE))+(INDEX($B$7:B101,MATCH(9.99999999999999E+307,$B$7:B101)))),\"\")","v":""},null,{"$f":"IF(D102<>\"\",IF(OR(B102<>\"\",INDIRECT(\"D103\")=0),D102,0),\"\")","v":""},"",null,{"$f":"IF(D102<>\"\",IF(AND(B102<>\"\",B101<>\"\"),$I$4+H101,VLOOKUP(INDEX($B$7:B101,MATCH(9.99999999999999E+307,$B$7:B101)),$B$7:H101,7,FALSE)+$I$4),\"\")","v":""},""]
[null,null,{"$f":"IF(D103<>\"\",IF(OR(B103<>\"\",INDIRECT(\"D104\")=0),IF(B102<>\"\",F102+B102,VLOOKUP(INDEX($B$7:B102,MATCH(9.99999999999999E+307,$B$7:B102)),$B$7:F102,5,FALSE)+INDEX($B$7:B102,MATCH(9.99999999999999E+307,$B$7:B102))),(VLOOKUP(INDEX($B$7:B102,MATCH(9.99999999999999E+307,$B$7:B102)),$B$7:F102,5,FALSE))+(INDEX($B$7:B102,MATCH(9.99999999999999E+307,$B$7:B102)))),\"\")","v":""},null,{"$f":"IF(D103<>\"\",IF(OR(B103<>\"\",INDIRECT(\"D104\")=0),D103,0),\"\")","v":""},"",null,{"$f":"IF(D103<>\"\",IF(AND(B103<>\"\",B102<>\"\"),$I$4+H102,VLOOKUP(INDEX($B$7:B102,MATCH(9.99999999999999E+307,$B$7:B102)),$B$7:H102,7,FALSE)+$I$4),\"\")","v":""},""]
[null,null,{"$f":"IF(D104<>\"\",IF(OR(B104<>\"\",INDIRECT(\"D105\")=0),IF(B103<>\"\",F103+B103,VLOOKUP(INDEX($B$7:B103,MATCH(9.99999999999999E+307,$B$7:B103)),$B$7:F103,5,FALSE)+INDEX($B$7:B103,MATCH(9.99999999999999E+307,$B$7:B103))),(VLOOKUP(INDEX($B$7:B103,MATCH(9.99999999999999E+307,$B$7:B103)),$B$7:F103,5,FALSE))+(INDEX($B$7:B103,MATCH(9.99999999999999E+307,$B$7:B103)))),\"\")","v":""},null,{"$f":"IF(D104<>\"\",IF(OR(B104<>\"\",INDIRECT(\"D105\")=0),D104,0),\"\")","v":""},"",null,{"$f":"IF(D104<>\"\",IF(AND(B104<>\"\",B103<>\"\"),$I$4+H103,VLOOKUP(INDEX($B$7:B103,MATCH(9.99999999999999E+307,$B$7:B103)),$B$7:H103,7,FALSE)+$I$4),\"\")","v":""},""]
[null,null,{"$f":"IF(D105<>\"\",IF(OR(B105<>\"\",INDIRECT(\"D106\")=0),IF(B104<>\"\",F104+B104,VLOOKUP(INDEX($B$7:B104,MATCH(9.99999999999999E+307,$B$7:B104)),$B$7:F104,5,FALSE)+INDEX($B$7:B104,MATCH(9.99999999999999E+307,$B$7:B104))),(VLOOKUP(INDEX($B$7:B104,MATCH(9.99999999999999E+307,$B$7:B104)),$B$7:F104,5,FALSE))+(INDEX($B$7:B104,MATCH(9.99999999999999E+307,$B$7:B104)))),\"\")","v":""},null,{"$f":"IF(D105<>\"\",IF(OR(B105<>\"\",INDIRECT(\"D106\")=0),D105,0),\"\")","v":""},"",null,{"$f":"IF(D105<>\"\",IF(AND(B105<>\"\",B104<>\"\"),$I$4+H104,VLOOKUP(INDEX($B$7:B104,MATCH(9.99999999999999E+307,$B$7:B104)),$B$7:H104,7,FALSE)+$I$4),\"\")","v":""},""]
[null,null,{"$f":"IF(D106<>\"\",IF(OR(B106<>\"\",INDIRECT(\"D107\")=0),IF(B105<>\"\",F105+B105,VLOOKUP(INDEX($B$7:B105,MATCH(9.99999999999999E+307,$B$7:B105)),$B$7:F105,5,FALSE)+INDEX($B$7:B105,MATCH(9.99999999999999E+307,$B$7:B105))),(VLOOKUP(INDEX($B$7:B105,MATCH(9.99999999999999E+307,$B$7:B105)),$B$7:F105,5,FALSE))+(INDEX($B$7:B105,MATCH(9.99999999999999E+307,$B$7:B105)))),\"\")","v":""},null,{"$f":"IF(D106<>\"\",IF(OR(B106<>\"\",INDIRECT(\"D107\")=0),D106,0),\"\")","v":""},"",null,{"$f":"IF(D106<>\"\",IF(AND(B106<>\"\",B105<>\"\"),$I$4+H105,VLOOKUP(INDEX($B$7:B105,MATCH(9.99999999999999E+307,$B$7:B105)),$B$7:H105,7,FALSE)+$I$4),\"\")","v":""},""]
[null,null,{"$f":"IF(D107<>\"\",IF(OR(B107<>\"\",INDIRECT(\"D108\")=0),IF(B106<>\"\",F106+B106,VLOOKUP(INDEX($B$7:B106,MATCH(9.99999999999999E+307,$B$7:B106)),$B$7:F106,5,FALSE)+INDEX($B$7:B106,MATCH(9.99999999999999E+307,$B$7:B106))),(VLOOKUP(INDEX($B$7:B106,MATCH(9.99999999999999E+307,$B$7:B106)),$B$7:F106,5,FALSE))+(INDEX($B$7:B106,MATCH(9.99999999999999E+307,$B$7:B106)))),\"\")","v":""},null,{"$f":"IF(D107<>\"\",IF(OR(B107<>\"\",INDIRECT(\"D108\")=0),D107,0),\"\")","v":""},"",null,{"$f":"IF(D107<>\"\",IF(AND(B107<>\"\",B106<>\"\"),$I$4+H106,VLOOKUP(INDEX($B$7:B106,MATCH(9.99999999999999E+307,$B$7:B106)),$B$7:H106,7,FALSE)+$I$4),\"\")","v":""},""]
[null,null,{"$f":"IF(D108<>\"\",IF(OR(B108<>\"\",INDIRECT(\"D109\")=0),IF(B107<>\"\",F107+B107,VLOOKUP(INDEX($B$7:B107,MATCH(9.99999999999999E+307,$B$7:B107)),$B$7:F107,5,FALSE)+INDEX($B$7:B107,MATCH(9.99999999999999E+307,$B$7:B107))),(VLOOKUP(INDEX($B$7:B107,MATCH(9.99999999999999E+307,$B$7:B107)),$B$7:F107,5,FALSE))+(INDEX($B$7:B107,MATCH(9.99999999999999E+307,$B$7:B107)))),\"\")","v":""},null,{"$f":"IF(D108<>\"\",IF(OR(B108<>\"\",INDIRECT(\"D109\")=0),D108,0),\"\")","v":""},"",null,{"$f":"IF(D108<>\"\",IF(AND(B108<>\"\",B107<>\"\"),$I$4+H107,VLOOKUP(INDEX($B$7:B107,MATCH(9.99999999999999E+307,$B$7:B107)),$B$7:H107,7,FALSE)+$I$4),\"\")","v":""},""]
[null,null,{"$f":"IF(D109<>\"\",IF(OR(B109<>\"\",INDIRECT(\"D110\")=0),IF(B108<>\"\",F108+B108,VLOOKUP(INDEX($B$7:B108,MATCH(9.99999999999999E+307,$B$7:B108)),$B$7:F108,5,FALSE)+INDEX($B$7:B108,MATCH(9.99999999999999E+307,$B$7:B108))),(VLOOKUP(INDEX($B$7:B108,MATCH(9.99999999999999E+307,$B$7:B108)),$B$7:F108,5,FALSE))+(INDEX($B$7:B108,MATCH(9.99999999999999E+307,$B$7:B108)))),\"\")","v":""},null,{"$f":"IF(D109<>\"\",IF(OR(B109<>\"\",INDIRECT(\"D110\")=0),D109,0),\"\")","v":""},"",null,{"$f":"IF(D109<>\"\",IF(AND(B109<>\"\",B108<>\"\"),$I$4+H108,VLOOKUP(INDEX($B$7:B108,MATCH(9.99999999999999E+307,$B$7:B108)),$B$7:H108,7,FALSE)+$I$4),\"\")","v":""},""]
[null,null,{"$f":"IF(D110<>\"\",IF(OR(B110<>\"\",INDIRECT(\"D111\")=0),IF(B109<>\"\",F109+B109,VLOOKUP(INDEX($B$7:B109,MATCH(9.99999999999999E+307,$B$7:B109)),$B$7:F109,5,FALSE)+INDEX($B$7:B109,MATCH(9.99999999999999E+307,$B$7:B109))),(VLOOKUP(INDEX($B$7:B109,MATCH(9.99999999999999E+307,$B$7:B109)),$B$7:F109,5,FALSE))+(INDEX($B$7:B109,MATCH(9.99999999999999E+307,$B$7:B109)))),\"\")","v":""},null,{"$f":"IF(D110<>\"\",IF(OR(B110<>\"\",INDIRECT(\"D111\")=0),D110,0),\"\")","v":""},"",null,{"$f":"IF(D110<>\"\",IF(AND(B110<>\"\",B109<>\"\"),$I$4+H109,VLOOKUP(INDEX($B$7:B109,MATCH(9.99999999999999E+307,$B$7:B109)),$B$7:H109,7,FALSE)+$I$4),\"\")","v":""},""]
[null,null,{"$f":"IF(D111<>\"\",IF(OR(B111<>\"\",INDIRECT(\"D112\")=0),IF(B110<>\"\",F110+B110,VLOOKUP(INDEX($B$7:B110,MATCH(9.99999999999999E+307,$B$7:B110)),$B$7:F110,5,FALSE)+INDEX($B$7:B110,MATCH(9.99999999999999E+307,$B$7:B110))),(VLOOKUP(INDEX($B$7:B110,MATCH(9.99999999999999E+307,$B$7:B110)),$B$7:F110,5,FALSE))+(INDEX($B$7:B110,MATCH(9.99999999999999E+307,$B$7:B110)))),\"\")","v":""},null,{"$f":"IF(D111<>\"\",IF(OR(B111<>\"\",INDIRECT(\"D112\")=0),D111,0),\"\")","v":""},"",null,{"$f":"IF(D111<>\"\",IF(AND(B111<>\"\",B110<>\"\"),$I$4+H110,VLOOKUP(INDEX($B$7:B110,MATCH(9.99999999999999E+307,$B$7:B110)),$B$7:H110,7,FALSE)+$I$4),\"\")","v":""},""]
[null,null,{"$f":"IF(D112<>\"\",IF(OR(B112<>\"\",INDIRECT(\"D113\")=0),IF(B111<>\"\",F111+B111,VLOOKUP(INDEX($B$7:B111,MATCH(9.99999999999999E+307,$B$7:B111)),$B$7:F111,5,FALSE)+INDEX($B$7:B111,MATCH(9.99999999999999E+307,$B$7:B111))),(VLOOKUP(INDEX($B$7:B111,MATCH(9.99999999999999E+307,$B$7:B111)),$B$7:F111,5,FALSE))+(INDEX($B$7:B111,MATCH(9.99999999999999E+307,$B$7:B111)))),\"\")","v":""},null,{"$f":"IF(D112<>\"\",IF(OR(B112<>\"\",INDIRECT(\"D113\")=0),D112,0),\"\")","v":""},"",null,{"$f":"IF(D112<>\"\",IF(AND(B112<>\"\",B111<>\"\"),$I$4+H111,VLOOKUP(INDEX($B$7:B111,MATCH(9.99999999999999E+307,$B$7:B111)),$B$7:H111,7,FALSE)+$I$4),\"\")","v":""},""]
[null,null,{"$f":"IF(D113<>\"\",IF(OR(B113<>\"\",INDIRECT(\"D114\")=0),IF(B112<>\"\",F112+B112,VLOOKUP(INDEX($B$7:B112,MATCH(9.99999999999999E+307,$B$7:B112)),$B$7:F112,5,FALSE)+INDEX($B$7:B112,MATCH(9.99999999999999E+307,$B$7:B112))),(VLOOKUP(INDEX($B$7:B112,MATCH(9.99999999999999E+307,$B$7:B112)),$B$7:F112,5,FALSE))+(INDEX($B$7:B112,MATCH(9.99999999999999E+307,$B$7:B112)))),\"\")","v":""},null,{"$f":"IF(D113<>\"\",IF(OR(B113<>\"\",INDIRECT(\"D114\")=0),D113,0),\"\")","v":""},"",null,{"$f":"IF(D113<>\"\",IF(AND(B113<>\"\",B112<>\"\"),$I$4+H112,VLOOKUP(INDEX($B$7:B112,MATCH(9.99999999999999E+307,$B$7:B112)),$B$7:H112,7,FALSE)+$I$4),\"\")","v":""},""]
[null,null,{"$f":"IF(D114<>\"\",IF(OR(B114<>\"\",INDIRECT(\"D115\")=0),IF(B113<>\"\",F113+B113,VLOOKUP(INDEX($B$7:B113,MATCH(9.99999999999999E+307,$B$7:B113)),$B$7:F113,5,FALSE)+INDEX($B$7:B113,MATCH(9.99999999999999E+307,$B$7:B113))),(VLOOKUP(INDEX($B$7:B113,MATCH(9.99999999999999E+307,$B$7:B113)),$B$7:F113,5,FALSE))+(INDEX($B$7:B113,MATCH(9.99999999999999E+307,$B$7:B113)))),\"\")","v":""},null,{"$f":"IF(D114<>\"\",IF(OR(B114<>\"\",INDIRECT(\"D115\")=0),D114,0),\"\")","v":""},"",null,{"$f":"IF(D114<>\"\",IF(AND(B114<>\"\",B113<>\"\"),$I$4+H113,VLOOKUP(INDEX($B$7:B113,MATCH(9.99999999999999E+307,$B$7:B113)),$B$7:H113,7,FALSE)+$I$4),\"\")","v":""},""]
[null,null,{"$f":"IF(D115<>\"\",IF(OR(B115<>\"\",INDIRECT(\"D116\")=0),IF(B114<>\"\",F114+B114,VLOOKUP(INDEX($B$7:B114,MATCH(9.99999999999999E+307,$B$7:B114)),$B$7:F114,5,FALSE)+INDEX($B$7:B114,MATCH(9.99999999999999E+307,$B$7:B114))),(VLOOKUP(INDEX($B$7:B114,MATCH(9.99999999999999E+307,$B$7:B114)),$B$7:F114,5,FALSE))+(INDEX($B$7:B114,MATCH(9.99999999999999E+307,$B$7:B114)))),\"\")","v":""},null,{"$f":"IF(D115<>\"\",IF(OR(B115<>\"\",INDIRECT(\"D116\")=0),D115,0),\"\")","v":""},"",null,{"$f":"IF(D115<>\"\",IF(AND(B115<>\"\",B114<>\"\"),$I$4+H114,VLOOKUP(INDEX($B$7:B114,MATCH(9.99999999999999E+307,$B$7:B114)),$B$7:H114,7,FALSE)+$I$4),\"\")","v":""},""]
[null,null,{"$f":"IF(D116<>\"\",IF(OR(B116<>\"\",INDIRECT(\"D117\")=0),IF(B115<>\"\",F115+B115,VLOOKUP(INDEX($B$7:B115,MATCH(9.99999999999999E+307,$B$7:B115)),$B$7:F115,5,FALSE)+INDEX($B$7:B115,MATCH(9.99999999999999E+307,$B$7:B115))),(VLOOKUP(INDEX($B$7:B115,MATCH(9.99999999999999E+307,$B$7:B115)),$B$7:F115,5,FALSE))+(INDEX($B$7:B115,MATCH(9.99999999999999E+307,$B$7:B115)))),\"\")","v":""},null,{"$f":"IF(D116<>\"\",IF(OR(B116<>\"\",INDIRECT(\"D117\")=0),D116,0),\"\")","v":""},"",null,{"$f":"IF(D116<>\"\",IF(AND(B116<>\"\",B115<>\"\"),$I$4+H115,VLOOKUP(INDEX($B$7:B115,MATCH(9.99999999999999E+307,$B$7:B115)),$B$7:H115,7,FALSE)+$I$4),\"\")","v":""},""]
[null,null,{"$f":"IF(D117<>\"\",IF(OR(B117<>\"\",INDIRECT(\"D118\")=0),IF(B116<>\"\",F116+B116,VLOOKUP(INDEX($B$7:B116,MATCH(9.99999999999999E+307,$B$7:B116)),$B$7:F116,5,FALSE)+INDEX($B$7:B116,MATCH(9.99999999999999E+307,$B$7:B116))),(VLOOKUP(INDEX($B$7:B116,MATCH(9.99999999999999E+307,$B$7:B116)),$B$7:F116,5,FALSE))+(INDEX($B$7:B116,MATCH(9.99999999999999E+307,$B$7:B116)))),\"\")","v":""},null,{"$f":"IF(D117<>\"\",IF(OR(B117<>\"\",INDIRECT(\"D118\")=0),D117,0),\"\")","v":""},"",null,{"$f":"IF(D117<>\"\",IF(AND(B117<>\"\",B116<>\"\"),$I$4+H116,VLOOKUP(INDEX($B$7:B116,MATCH(9.99999999999999E+307,$B$7:B116)),$B$7:H116,7,FALSE)+$I$4),\"\")","v":""},""]
[null,null,{"$f":"IF(D118<>\"\",IF(OR(B118<>\"\",INDIRECT(\"D119\")=0),IF(B117<>\"\",F117+B117,VLOOKUP(INDEX($B$7:B117,MATCH(9.99999999999999E+307,$B$7:B117)),$B$7:F117,5,FALSE)+INDEX($B$7:B117,MATCH(9.99999999999999E+307,$B$7:B117))),(VLOOKUP(INDEX($B$7:B117,MATCH(9.99999999999999E+307,$B$7:B117)),$B$7:F117,5,FALSE))+(INDEX($B$7:B117,MATCH(9.99999999999999E+307,$B$7:B117)))),\"\")","v":""},null,{"$f":"IF(D118<>\"\",IF(OR(B118<>\"\",INDIRECT(\"D119\")=0),D118,0),\"\")","v":""},"",null,{"$f":"IF(D118<>\"\",IF(AND(B118<>\"\",B117<>\"\"),$I$4+H117,VLOOKUP(INDEX($B$7:B117,MATCH(9.99999999999999E+307,$B$7:B117)),$B$7:H117,7,FALSE)+$I$4),\"\")","v":""},""]
[null,null,{"$f":"IF(D119<>\"\",IF(OR(B119<>\"\",INDIRECT(\"D120\")=0),IF(B118<>\"\",F118+B118,VLOOKUP(INDEX($B$7:B118,MATCH(9.99999999999999E+307,$B$7:B118)),$B$7:F118,5,FALSE)+INDEX($B$7:B118,MATCH(9.99999999999999E+307,$B$7:B118))),(VLOOKUP(INDEX($B$7:B118,MATCH(9.99999999999999E+307,$B$7:B118)),$B$7:F118,5,FALSE))+(INDEX($B$7:B118,MATCH(9.99999999999999E+307,$B$7:B118)))),\"\")","v":""},null,{"$f":"IF(D119<>\"\",IF(OR(B119<>\"\",INDIRECT(\"D120\")=0),D119,0),\"\")","v":""},"",null,{"$f":"IF(D119<>\"\",IF(AND(B119<>\"\",B118<>\"\"),$I$4+H118,VLOOKUP(INDEX($B$7:B118,MATCH(9.99999999999999E+307,$B$7:B118)),$B$7:H118,7,FALSE)+$I$4),\"\")","v":""},""]
[null,null,{"$f":"IF(D120<>\"\",IF(OR(B120<>\"\",INDIRECT(\"D121\")=0),IF(B119<>\"\",F119+B119,VLOOKUP(INDEX($B$7:B119,MATCH(9.99999999999999E+307,$B$7:B119)),$B$7:F119,5,FALSE)+INDEX($B$7:B119,MATCH(9.99999999999999E+307,$B$7:B119))),(VLOOKUP(INDEX($B$7:B119,MATCH(9.99999999999999E+307,$B$7:B119)),$B$7:F119,5,FALSE))+(INDEX($B$7:B119,MATCH(9.99999999999999E+307,$B$7:B119)))),\"\")","v":""},null,{"$f":"IF(D120<>\"\",IF(OR(B120<>\"\",INDIRECT(\"D121\")=0),D120,0),\"\")","v":""},"",null,{"$f":"IF(D120<>\"\",IF(AND(B120<>\"\",B119<>\"\"),$I$4+H119,VLOOKUP(INDEX($B$7:B119,MATCH(9.99999999999999E+307,$B$7:B119)),$B$7:H119,7,FALSE)+$I$4),\"\")","v":""},""]
[null,null,{"$f":"IF(D121<>\"\",IF(OR(B121<>\"\",INDIRECT(\"D122\")=0),IF(B120<>\"\",F120+B120,VLOOKUP(INDEX($B$7:B120,MATCH(9.99999999999999E+307,$B$7:B120)),$B$7:F120,5,FALSE)+INDEX($B$7:B120,MATCH(9.99999999999999E+307,$B$7:B120))),(VLOOKUP(INDEX($B$7:B120,MATCH(9.99999999999999E+307,$B$7:B120)),$B$7:F120,5,FALSE))+(INDEX($B$7:B120,MATCH(9.99999999999999E+307,$B$7:B120)))),\"\")","v":""},null,{"$f":"IF(D121<>\"\",IF(OR(B121<>\"\",INDIRECT(\"D122\")=0),D121,0),\"\")","v":""},"",null,{"$f":"IF(D121<>\"\",IF(AND(B121<>\"\",B120<>\"\"),$I$4+H120,VLOOKUP(INDEX($B$7:B120,MATCH(9.99999999999999E+307,$B$7:B120)),$B$7:H120,7,FALSE)+$I$4),\"\")","v":""},""]
[null,null,{"$f":"IF(D122<>\"\",IF(OR(B122<>\"\",INDIRECT(\"D123\")=0),IF(B121<>\"\",F121+B121,VLOOKUP(INDEX($B$7:B121,MATCH(9.99999999999999E+307,$B$7:B121)),$B$7:F121,5,FALSE)+INDEX($B$7:B121,MATCH(9.99999999999999E+307,$B$7:B121))),(VLOOKUP(INDEX($B$7:B121,MATCH(9.99999999999999E+307,$B$7:B121)),$B$7:F121,5,FALSE))+(INDEX($B$7:B121,MATCH(9.99999999999999E+307,$B$7:B121)))),\"\")","v":""},null,{"$f":"IF(D122<>\"\",IF(OR(B122<>\"\",INDIRECT(\"D123\")=0),D122,0),\"\")","v":""},"",null,{"$f":"IF(D122<>\"\",IF(AND(B122<>\"\",B121<>\"\"),$I$4+H121,VLOOKUP(INDEX($B$7:B121,MATCH(9.99999999999999E+307,$B$7:B121)),$B$7:H121,7,FALSE)+$I$4),\"\")","v":""},""]
[null,null,{"$f":"IF(D123<>\"\",IF(OR(B123<>\"\",INDIRECT(\"D124\")=0),IF(B122<>\"\",F122+B122,VLOOKUP(INDEX($B$7:B122,MATCH(9.99999999999999E+307,$B$7:B122)),$B$7:F122,5,FALSE)+INDEX($B$7:B122,MATCH(9.99999999999999E+307,$B$7:B122))),(VLOOKUP(INDEX($B$7:B122,MATCH(9.99999999999999E+307,$B$7:B122)),$B$7:F122,5,FALSE))+(INDEX($B$7:B122,MATCH(9.99999999999999E+307,$B$7:B122)))),\"\")","v":""},null,{"$f":"IF(D123<>\"\",IF(OR(B123<>\"\",INDIRECT(\"D124\")=0),D123,0),\"\")","v":""},"",null,{"$f":"IF(D123<>\"\",IF(AND(B123<>\"\",B122<>\"\"),$I$4+H122,VLOOKUP(INDEX($B$7:B122,MATCH(9.99999999999999E+307,$B$7:B122)),$B$7:H122,7,FALSE)+$I$4),\"\")","v":""},""]
[null,null,{"$f":"IF(D124<>\"\",IF(OR(B124<>\"\",INDIRECT(\"D125\")=0),IF(B123<>\"\",F123+B123,VLOOKUP(INDEX($B$7:B123,MATCH(9.99999999999999E+307,$B$7:B123)),$B$7:F123,5,FALSE)+INDEX($B$7:B123,MATCH(9.99999999999999E+307,$B$7:B123))),(VLOOKUP(INDEX($B$7:B123,MATCH(9.99999999999999E+307,$B$7:B123)),$B$7:F123,5,FALSE))+(INDEX($B$7:B123,MATCH(9.99999999999999E+307,$B$7:B123)))),\"\")","v":""},null,{"$f":"IF(D124<>\"\",IF(OR(B124<>\"\",INDIRECT(\"D125\")=0),D124,0),\"\")","v":""},"",null,{"$f":"IF(D124<>\"\",IF(AND(B124<>\"\",B123<>\"\"),$I$4+H123,VLOOKUP(INDEX($B$7:B123,MATCH(9.99999999999999E+307,$B$7:B123)),$B$7:H123,7,FALSE)+$I$4),\"\")","v":""},""]
[null,null,{"$f":"IF(D125<>\"\",IF(OR(B125<>\"\",INDIRECT(\"D126\")=0),IF(B124<>\"\",F124+B124,VLOOKUP(INDEX($B$7:B124,MATCH(9.99999999999999E+307,$B$7:B124)),$B$7:F124,5,FALSE)+INDEX($B$7:B124,MATCH(9.99999999999999E+307,$B$7:B124))),(VLOOKUP(INDEX($B$7:B124,MATCH(9.99999999999999E+307,$B$7:B124)),$B$7:F124,5,FALSE))+(INDEX($B$7:B124,MATCH(9.99999999999999E+307,$B$7:B124)))),\"\")","v":""},null,{"$f":"IF(D125<>\"\",IF(OR(B125<>\"\",INDIRECT(\"D126\")=0),D125,0),\"\")","v":""},"",null,{"$f":"IF(D125<>\"\",IF(AND(B125<>\"\",B124<>\"\"),$I$4+H124,VLOOKUP(INDEX($B$7:B124,MATCH(9.99999999999999E+307,$B$7:B124)),$B$7:H124,7,FALSE)+$I$4),\"\")","v":""},""]
[null,null,{"$f":"IF(D126<>\"\",IF(OR(B126<>\"\",INDIRECT(\"D127\")=0),IF(B125<>\"\",F125+B125,VLOOKUP(INDEX($B$7:B125,MATCH(9.99999999999999E+307,$B$7:B125)),$B$7:F125,5,FALSE)+INDEX($B$7:B125,MATCH(9.99999999999999E+307,$B$7:B125))),(VLOOKUP(INDEX($B$7:B125,MATCH(9.99999999999999E+307,$B$7:B125)),$B$7:F125,5,FALSE))+(INDEX($B$7:B125,MATCH(9.99999999999999E+307,$B$7:B125)))),\"\")","v":""},null,{"$f":"IF(D126<>\"\",IF(OR(B126<>\"\",INDIRECT(\"D127\")=0),D126,0),\"\")","v":""},"",null,{"$f":"IF(D126<>\"\",IF(AND(B126<>\"\",B125<>\"\"),$I$4+H125,VLOOKUP(INDEX($B$7:B125,MATCH(9.99999999999999E+307,$B$7:B125)),$B$7:H125,7,FALSE)+$I$4),\"\")","v":""},""]
[null,null,{"$f":"IF(D127<>\"\",IF(OR(B127<>\"\",INDIRECT(\"D128\")=0),IF(B126<>\"\",F126+B126,VLOOKUP(INDEX($B$7:B126,MATCH(9.99999999999999E+307,$B$7:B126)),$B$7:F126,5,FALSE)+INDEX($B$7:B126,MATCH(9.99999999999999E+307,$B$7:B126))),(VLOOKUP(INDEX($B$7:B126,MATCH(9.99999999999999E+307,$B$7:B126)),$B$7:F126,5,FALSE))+(INDEX($B$7:B126,MATCH(9.99999999999999E+307,$B$7:B126)))),\"\")","v":""},null,{"$f":"IF(D127<>\"\",IF(OR(B127<>\"\",INDIRECT(\"D128\")=0),D127,0),\"\")","v":""},"",null,{"$f":"IF(D127<>\"\",IF(AND(B127<>\"\",B126<>\"\"),$I$4+H126,VLOOKUP(INDEX($B$7:B126,MATCH(9.99999999999999E+307,$B$7:B126)),$B$7:H126,7,FALSE)+$I$4),\"\")","v":""},""]
[null,null,{"$f":"IF(D128<>\"\",IF(OR(B128<>\"\",INDIRECT(\"D129\")=0),IF(B127<>\"\",F127+B127,VLOOKUP(INDEX($B$7:B127,MATCH(9.99999999999999E+307,$B$7:B127)),$B$7:F127,5,FALSE)+INDEX($B$7:B127,MATCH(9.99999999999999E+307,$B$7:B127))),(VLOOKUP(INDEX($B$7:B127,MATCH(9.99999999999999E+307,$B$7:B127)),$B$7:F127,5,FALSE))+(INDEX($B$7:B127,MATCH(9.99999999999999E+307,$B$7:B127)))),\"\")","v":""},null,{"$f":"IF(D128<>\"\",IF(OR(B128<>\"\",INDIRECT(\"D129\")=0),D128,0),\"\")","v":""},"",null,{"$f":"IF(D128<>\"\",IF(AND(B128<>\"\",B127<>\"\"),$I$4+H127,VLOOKUP(INDEX($B$7:B127,MATCH(9.99999999999999E+307,$B$7:B127)),$B$7:H127,7,FALSE)+$I$4),\"\")","v":""},""]
[null,null,{"$f":"IF(D129<>\"\",IF(OR(B129<>\"\",INDIRECT(\"D130\")=0),IF(B128<>\"\",F128+B128,VLOOKUP(INDEX($B$7:B128,MATCH(9.99999999999999E+307,$B$7:B128)),$B$7:F128,5,FALSE)+INDEX($B$7:B128,MATCH(9.99999999999999E+307,$B$7:B128))),(VLOOKUP(INDEX($B$7:B128,MATCH(9.99999999999999E+307,$B$7:B128)),$B$7:F128,5,FALSE))+(INDEX($B$7:B128,MATCH(9.99999999999999E+307,$B$7:B128)))),\"\")","v":""},null,{"$f":"IF(D129<>\"\",IF(OR(B129<>\"\",INDIRECT(\"D130\")=0),D129,0),\"\")","v":""},"",null,{"$f":"IF(D129<>\"\",IF(AND(B129<>\"\",B128<>\"\"),$I$4+H128,VLOOKUP(INDEX($B$7:B128,MATCH(9.99999999999999E+307,$B$7:B128)),$B$7:H128,7,FALSE)+$I$4),\"\")","v":""},""]
[null,null,{"$f":"IF(D130<>\"\",IF(OR(B130<>\"\",INDIRECT(\"D131\")=0),IF(B129<>\"\",F129+B129,VLOOKUP(INDEX($B$7:B129,MATCH(9.99999999999999E+307,$B$7:B129)),$B$7:F129,5,FALSE)+INDEX($B$7:B129,MATCH(9.99999999999999E+307,$B$7:B129))),(VLOOKUP(INDEX($B$7:B129,MATCH(9.99999999999999E+307,$B$7:B129)),$B$7:F129,5,FALSE))+(INDEX($B$7:B129,MATCH(9.99999999999999E+307,$B$7:B129)))),\"\")","v":""},null,{"$f":"IF(D130<>\"\",IF(OR(B130<>\"\",INDIRECT(\"D131\")=0),D130,0),\"\")","v":""},"",null,{"$f":"IF(D130<>\"\",IF(AND(B130<>\"\",B129<>\"\"),$I$4+H129,VLOOKUP(INDEX($B$7:B129,MATCH(9.99999999999999E+307,$B$7:B129)),$B$7:H129,7,FALSE)+$I$4),\"\")","v":""},""]
[null,null,{"$f":"IF(D131<>\"\",IF(OR(B131<>\"\",INDIRECT(\"D132\")=0),IF(B130<>\"\",F130+B130,VLOOKUP(INDEX($B$7:B130,MATCH(9.99999999999999E+307,$B$7:B130)),$B$7:F130,5,FALSE)+INDEX($B$7:B130,MATCH(9.99999999999999E+307,$B$7:B130))),(VLOOKUP(INDEX($B$7:B130,MATCH(9.99999999999999E+307,$B$7:B130)),$B$7:F130,5,FALSE))+(INDEX($B$7:B130,MATCH(9.99999999999999E+307,$B$7:B130)))),\"\")","v":""},null,{"$f":"IF(D131<>\"\",IF(OR(B131<>\"\",INDIRECT(\"D132\")=0),D131,0),\"\")","v":""},"",null,{"$f":"IF(D131<>\"\",IF(AND(B131<>\"\",B130<>\"\"),$I$4+H130,VLOOKUP(INDEX($B$7:B130,MATCH(9.99999999999999E+307,$B$7:B130)),$B$7:H130,7,FALSE)+$I$4),\"\")","v":""},""]
[null,null,{"$f":"IF(D132<>\"\",IF(OR(B132<>\"\",INDIRECT(\"D133\")=0),IF(B131<>\"\",F131+B131,VLOOKUP(INDEX($B$7:B131,MATCH(9.99999999999999E+307,$B$7:B131)),$B$7:F131,5,FALSE)+INDEX($B$7:B131,MATCH(9.99999999999999E+307,$B$7:B131))),(VLOOKUP(INDEX($B$7:B131,MATCH(9.99999999999999E+307,$B$7:B131)),$B$7:F131,5,FALSE))+(INDEX($B$7:B131,MATCH(9.99999999999999E+307,$B$7:B131)))),\"\")","v":""},null,{"$f":"IF(D132<>\"\",IF(OR(B132<>\"\",INDIRECT(\"D133\")=0),D132,0),\"\")","v":""},"",null,{"$f":"IF(D132<>\"\",IF(AND(B132<>\"\",B131<>\"\"),$I$4+H131,VLOOKUP(INDEX($B$7:B131,MATCH(9.99999999999999E+307,$B$7:B131)),$B$7:H131,7,FALSE)+$I$4),\"\")","v":""},""]
[null,null,{"$f":"IF(D133<>\"\",IF(OR(B133<>\"\",INDIRECT(\"D134\")=0),IF(B132<>\"\",F132+B132,VLOOKUP(INDEX($B$7:B132,MATCH(9.99999999999999E+307,$B$7:B132)),$B$7:F132,5,FALSE)+INDEX($B$7:B132,MATCH(9.99999999999999E+307,$B$7:B132))),(VLOOKUP(INDEX($B$7:B132,MATCH(9.99999999999999E+307,$B$7:B132)),$B$7:F132,5,FALSE))+(INDEX($B$7:B132,MATCH(9.99999999999999E+307,$B$7:B132)))),\"\")","v":""},null,{"$f":"IF(D133<>\"\",IF(OR(B133<>\"\",INDIRECT(\"D134\")=0),D133,0),\"\")","v":""},"",null,{"$f":"IF(D133<>\"\",IF(AND(B133<>\"\",B132<>\"\"),$I$4+H132,VLOOKUP(INDEX($B$7:B132,MATCH(9.99999999999999E+307,$B$7:B132)),$B$7:H132,7,FALSE)+$I$4),\"\")","v":""},""]
[null,null,{"$f":"IF(D134<>\"\",IF(OR(B134<>\"\",INDIRECT(\"D135\")=0),IF(B133<>\"\",F133+B133,VLOOKUP(INDEX($B$7:B133,MATCH(9.99999999999999E+307,$B$7:B133)),$B$7:F133,5,FALSE)+INDEX($B$7:B133,MATCH(9.99999999999999E+307,$B$7:B133))),(VLOOKUP(INDEX($B$7:B133,MATCH(9.99999999999999E+307,$B$7:B133)),$B$7:F133,5,FALSE))+(INDEX($B$7:B133,MATCH(9.99999999999999E+307,$B$7:B133)))),\"\")","v":""},null,{"$f":"IF(D134<>\"\",IF(OR(B134<>\"\",INDIRECT(\"D135\")=0),D134,0),\"\")","v":""},"",null,{"$f":"IF(D134<>\"\",IF(AND(B134<>\"\",B133<>\"\"),$I$4+H133,VLOOKUP(INDEX($B$7:B133,MATCH(9.99999999999999E+307,$B$7:B133)),$B$7:H133,7,FALSE)+$I$4),\"\")","v":""},""]
[null,null,{"$f":"IF(D135<>\"\",IF(OR(B135<>\"\",INDIRECT(\"D136\")=0),IF(B134<>\"\",F134+B134,VLOOKUP(INDEX($B$7:B134,MATCH(9.99999999999999E+307,$B$7:B134)),$B$7:F134,5,FALSE)+INDEX($B$7:B134,MATCH(9.99999999999999E+307,$B$7:B134))),(VLOOKUP(INDEX($B$7:B134,MATCH(9.99999999999999E+307,$B$7:B134)),$B$7:F134,5,FALSE))+(INDEX($B$7:B134,MATCH(9.99999999999999E+307,$B$7:B134)))),\"\")","v":""},null,{"$f":"IF(D135<>\"\",IF(OR(B135<>\"\",INDIRECT(\"D136\")=0),D135,0),\"\")","v":""},"",null,{"$f":"IF(D135<>\"\",IF(AND(B135<>\"\",B134<>\"\"),$I$4+H134,VLOOKUP(INDEX($B$7:B134,MATCH(9.99999999999999E+307,$B$7:B134)),$B$7:H134,7,FALSE)+$I$4),\"\")","v":""},""]
[null,null,{"$f":"IF(D136<>\"\",IF(OR(B136<>\"\",INDIRECT(\"D137\")=0),IF(B135<>\"\",F135+B135,VLOOKUP(INDEX($B$7:B135,MATCH(9.99999999999999E+307,$B$7:B135)),$B$7:F135,5,FALSE)+INDEX($B$7:B135,MATCH(9.99999999999999E+307,$B$7:B135))),(VLOOKUP(INDEX($B$7:B135,MATCH(9.99999999999999E+307,$B$7:B135)),$B$7:F135,5,FALSE))+(INDEX($B$7:B135,MATCH(9.99999999999999E+307,$B$7:B135)))),\"\")","v":""},null,{"$f":"IF(D136<>\"\",IF(OR(B136<>\"\",INDIRECT(\"D137\")=0),D136,0),\"\")","v":""},"",null,{"$f":"IF(D136<>\"\",IF(AND(B136<>\"\",B135<>\"\"),$I$4+H135,VLOOKUP(INDEX($B$7:B135,MATCH(9.99999999999999E+307,$B$7:B135)),$B$7:H135,7,FALSE)+$I$4),\"\")","v":""},""]
[null,null,{"$f":"IF(D137<>\"\",IF(OR(B137<>\"\",INDIRECT(\"D138\")=0),IF(B136<>\"\",F136+B136,VLOOKUP(INDEX($B$7:B136,MATCH(9.99999999999999E+307,$B$7:B136)),$B$7:F136,5,FALSE)+INDEX($B$7:B136,MATCH(9.99999999999999E+307,$B$7:B136))),(VLOOKUP(INDEX($B$7:B136,MATCH(9.99999999999999E+307,$B$7:B136)),$B$7:F136,5,FALSE))+(INDEX($B$7:B136,MATCH(9.99999999999999E+307,$B$7:B136)))),\"\")","v":""},null,{"$f":"IF(D137<>\"\",IF(OR(B137<>\"\",INDIRECT(\"D138\")=0),D137,0),\"\")","v":""},{"$f":"IF(D137<>\"\",C137-D137,\"\")","v":""},null,{"$f":"IF(D137<>\"\",IF(AND(B137<>\"\",B136<>\"\"),$I$4+H136,VLOOKUP(INDEX($B$7:B136,MATCH(9.99999999999999E+307,$B$7:B136)),$B$7:H136,7,FALSE)+$I$4),\"\")","v":""},{"$f":"IF(D137<>\"\",(F137+H137),\"\")","v":""}]
[null,null,{"$f":"IF(D138<>\"\",IF(OR(B138<>\"\",INDIRECT(\"D139\")=0),IF(B137<>\"\",F137+B137,VLOOKUP(INDEX($B$7:B137,MATCH(9.99999999999999E+307,$B$7:B137)),$B$7:F137,5,FALSE)+INDEX($B$7:B137,MATCH(9.99999999999999E+307,$B$7:B137))),(VLOOKUP(INDEX($B$7:B137,MATCH(9.99999999999999E+307,$B$7:B137)),$B$7:F137,5,FALSE))+(INDEX($B$7:B137,MATCH(9.99999999999999E+307,$B$7:B137)))),\"\")","v":""},null,{"$f":"IF(D138<>\"\",IF(OR(B138<>\"\",INDIRECT(\"D139\")=0),D138,0),\"\")","v":""},"",null,{"$f":"IF(D138<>\"\",IF(AND(B138<>\"\",B137<>\"\"),$I$4+H137,VLOOKUP(INDEX($B$7:B137,MATCH(9.99999999999999E+307,$B$7:B137)),$B$7:H137,7,FALSE)+$I$4),\"\")","v":""},""]
[null,null,{"$f":"IF(D139<>\"\",IF(OR(B139<>\"\",INDIRECT(\"D140\")=0),IF(B138<>\"\",F138+B138,VLOOKUP(INDEX($B$7:B138,MATCH(9.99999999999999E+307,$B$7:B138)),$B$7:F138,5,FALSE)+INDEX($B$7:B138,MATCH(9.99999999999999E+307,$B$7:B138))),(VLOOKUP(INDEX($B$7:B138,MATCH(9.99999999999999E+307,$B$7:B138)),$B$7:F138,5,FALSE))+(INDEX($B$7:B138,MATCH(9.99999999999999E+307,$B$7:B138)))),\"\")","v":""},null,{"$f":"IF(D139<>\"\",IF(OR(B139<>\"\",INDIRECT(\"D140\")=0),D139,0),\"\")","v":""},"",null,{"$f":"IF(D139<>\"\",IF(AND(B139<>\"\",B138<>\"\"),$I$4+H138,VLOOKUP(INDEX($B$7:B138,MATCH(9.99999999999999E+307,$B$7:B138)),$B$7:H138,7,FALSE)+$I$4),\"\")","v":""},""]
[null,null,{"$f":"IF(D140<>\"\",IF(OR(B140<>\"\",INDIRECT(\"D141\")=0),IF(B139<>\"\",F139+B139,VLOOKUP(INDEX($B$7:B139,MATCH(9.99999999999999E+307,$B$7:B139)),$B$7:F139,5,FALSE)+INDEX($B$7:B139,MATCH(9.99999999999999E+307,$B$7:B139))),(VLOOKUP(INDEX($B$7:B139,MATCH(9.99999999999999E+307,$B$7:B139)),$B$7:F139,5,FALSE))+(INDEX($B$7:B139,MATCH(9.99999999999999E+307,$B$7:B139)))),\"\")","v":""},null,{"$f":"IF(D140<>\"\",IF(OR(B140<>\"\",INDIRECT(\"D141\")=0),D140,0),\"\")","v":""},"",null,{"$f":"IF(D140<>\"\",IF(AND(B140<>\"\",B139<>\"\"),$I$4+H139,VLOOKUP(INDEX($B$7:B139,MATCH(9.99999999999999E+307,$B$7:B139)),$B$7:H139,7,FALSE)+$I$4),\"\")","v":""},""]
[null,null,{"$f":"IF(D141<>\"\",IF(OR(B141<>\"\",INDIRECT(\"D142\")=0),IF(B140<>\"\",F140+B140,VLOOKUP(INDEX($B$7:B140,MATCH(9.99999999999999E+307,$B$7:B140)),$B$7:F140,5,FALSE)+INDEX($B$7:B140,MATCH(9.99999999999999E+307,$B$7:B140))),(VLOOKUP(INDEX($B$7:B140,MATCH(9.99999999999999E+307,$B$7:B140)),$B$7:F140,5,FALSE))+(INDEX($B$7:B140,MATCH(9.99999999999999E+307,$B$7:B140)))),\"\")","v":""},null,{"$f":"IF(D141<>\"\",IF(OR(B141<>\"\",INDIRECT(\"D142\")=0),D141,0),\"\")","v":""},"",null,{"$f":"IF(D141<>\"\",IF(AND(B141<>\"\",B140<>\"\"),$I$4+H140,VLOOKUP(INDEX($B$7:B140,MATCH(9.99999999999999E+307,$B$7:B140)),$B$7:H140,7,FALSE)+$I$4),\"\")","v":""},""]
[null,null,{"$f":"IF(D142<>\"\",IF(OR(B142<>\"\",INDIRECT(\"D143\")=0),IF(B141<>\"\",F141+B141,VLOOKUP(INDEX($B$7:B141,MATCH(9.99999999999999E+307,$B$7:B141)),$B$7:F141,5,FALSE)+INDEX($B$7:B141,MATCH(9.99999999999999E+307,$B$7:B141))),(VLOOKUP(INDEX($B$7:B141,MATCH(9.99999999999999E+307,$B$7:B141)),$B$7:F141,5,FALSE))+(INDEX($B$7:B141,MATCH(9.99999999999999E+307,$B$7:B141)))),\"\")","v":""},null,{"$f":"IF(D142<>\"\",IF(OR(B142<>\"\",INDIRECT(\"D143\")=0),D142,0),\"\")","v":""},"",null,{"$f":"IF(D142<>\"\",IF(AND(B142<>\"\",B141<>\"\"),$I$4+H141,VLOOKUP(INDEX($B$7:B141,MATCH(9.99999999999999E+307,$B$7:B141)),$B$7:H141,7,FALSE)+$I$4),\"\")","v":""},""]
[null,null,{"$f":"IF(D143<>\"\",IF(OR(B143<>\"\",INDIRECT(\"D144\")=0),IF(B142<>\"\",F142+B142,VLOOKUP(INDEX($B$7:B142,MATCH(9.99999999999999E+307,$B$7:B142)),$B$7:F142,5,FALSE)+INDEX($B$7:B142,MATCH(9.99999999999999E+307,$B$7:B142))),(VLOOKUP(INDEX($B$7:B142,MATCH(9.99999999999999E+307,$B$7:B142)),$B$7:F142,5,FALSE))+(INDEX($B$7:B142,MATCH(9.99999999999999E+307,$B$7:B142)))),\"\")","v":""},null,{"$f":"IF(D143<>\"\",IF(OR(B143<>\"\",INDIRECT(\"D144\")=0),D143,0),\"\")","v":""},"",null,{"$f":"IF(D143<>\"\",IF(AND(B143<>\"\",B142<>\"\"),$I$4+H142,VLOOKUP(INDEX($B$7:B142,MATCH(9.99999999999999E+307,$B$7:B142)),$B$7:H142,7,FALSE)+$I$4),\"\")","v":""},""]
[null,null,{"$f":"IF(D144<>\"\",IF(OR(B144<>\"\",INDIRECT(\"D145\")=0),IF(B143<>\"\",F143+B143,VLOOKUP(INDEX($B$7:B143,MATCH(9.99999999999999E+307,$B$7:B143)),$B$7:F143,5,FALSE)+INDEX($B$7:B143,MATCH(9.99999999999999E+307,$B$7:B143))),(VLOOKUP(INDEX($B$7:B143,MATCH(9.99999999999999E+307,$B$7:B143)),$B$7:F143,5,FALSE))+(INDEX($B$7:B143,MATCH(9.99999999999999E+307,$B$7:B143)))),\"\")","v":""},null,{"$f":"IF(D144<>\"\",IF(OR(B144<>\"\",INDIRECT(\"D145\")=0),D144,0),\"\")","v":""},"",null,{"$f":"IF(D144<>\"\",IF(AND(B144<>\"\",B143<>\"\"),$I$4+H143,VLOOKUP(INDEX($B$7:B143,MATCH(9.99999999999999E+307,$B$7:B143)),$B$7:H143,7,FALSE)+$I$4),\"\")","v":""},""]
[null,null,{"$f":"IF(D145<>\"\",IF(OR(B145<>\"\",INDIRECT(\"D146\")=0),IF(B144<>\"\",F144+B144,VLOOKUP(INDEX($B$7:B144,MATCH(9.99999999999999E+307,$B$7:B144)),$B$7:F144,5,FALSE)+INDEX($B$7:B144,MATCH(9.99999999999999E+307,$B$7:B144))),(VLOOKUP(INDEX($B$7:B144,MATCH(9.99999999999999E+307,$B$7:B144)),$B$7:F144,5,FALSE))+(INDEX($B$7:B144,MATCH(9.99999999999999E+307,$B$7:B144)))),\"\")","v":""},null,{"$f":"IF(D145<>\"\",IF(OR(B145<>\"\",INDIRECT(\"D146\")=0),D145,0),\"\")","v":""},"",null,{"$f":"IF(D145<>\"\",IF(AND(B145<>\"\",B144<>\"\"),$I$4+H144,VLOOKUP(INDEX($B$7:B144,MATCH(9.99999999999999E+307,$B$7:B144)),$B$7:H144,7,FALSE)+$I$4),\"\")","v":""},""]
[null,null,{"$f":"IF(D146<>\"\",IF(OR(B146<>\"\",INDIRECT(\"D147\")=0),IF(B145<>\"\",F145+B145,VLOOKUP(INDEX($B$7:B145,MATCH(9.99999999999999E+307,$B$7:B145)),$B$7:F145,5,FALSE)+INDEX($B$7:B145,MATCH(9.99999999999999E+307,$B$7:B145))),(VLOOKUP(INDEX($B$7:B145,MATCH(9.99999999999999E+307,$B$7:B145)),$B$7:F145,5,FALSE))+(INDEX($B$7:B145,MATCH(9.99999999999999E+307,$B$7:B145)))),\"\")","v":""},null,{"$f":"IF(D146<>\"\",IF(OR(B146<>\"\",INDIRECT(\"D147\")=0),D146,0),\"\")","v":""},"",null,{"$f":"IF(D146<>\"\",IF(AND(B146<>\"\",B145<>\"\"),$I$4+H145,VLOOKUP(INDEX($B$7:B145,MATCH(9.99999999999999E+307,$B$7:B145)),$B$7:H145,7,FALSE)+$I$4),\"\")","v":""},""]
[null,null,{"$f":"IF(D147<>\"\",IF(OR(B147<>\"\",INDIRECT(\"D148\")=0),IF(B146<>\"\",F146+B146,VLOOKUP(INDEX($B$7:B146,MATCH(9.99999999999999E+307,$B$7:B146)),$B$7:F146,5,FALSE)+INDEX($B$7:B146,MATCH(9.99999999999999E+307,$B$7:B146))),(VLOOKUP(INDEX($B$7:B146,MATCH(9.99999999999999E+307,$B$7:B146)),$B$7:F146,5,FALSE))+(INDEX($B$7:B146,MATCH(9.99999999999999E+307,$B$7:B146)))),\"\")","v":""},null,{"$f":"IF(D147<>\"\",IF(OR(B147<>\"\",INDIRECT(\"D148\")=0),D147,0),\"\")","v":""},"",null,{"$f":"IF(D147<>\"\",IF(AND(B147<>\"\",B146<>\"\"),$I$4+H146,VLOOKUP(INDEX($B$7:B146,MATCH(9.99999999999999E+307,$B$7:B146)),$B$7:H146,7,FALSE)+$I$4),\"\")","v":""},""]
[null,null,{"$f":"IF(D148<>\"\",IF(OR(B148<>\"\",INDIRECT(\"D149\")=0),IF(B147<>\"\",F147+B147,VLOOKUP(INDEX($B$7:B147,MATCH(9.99999999999999E+307,$B$7:B147)),$B$7:F147,5,FALSE)+INDEX($B$7:B147,MATCH(9.99999999999999E+307,$B$7:B147))),(VLOOKUP(INDEX($B$7:B147,MATCH(9.99999999999999E+307,$B$7:B147)),$B$7:F147,5,FALSE))+(INDEX($B$7:B147,MATCH(9.99999999999999E+307,$B$7:B147)))),\"\")","v":""},null,{"$f":"IF(D148<>\"\",IF(OR(B148<>\"\",INDIRECT(\"D149\")=0),D148,0),\"\")","v":""},"",null,{"$f":"IF(D148<>\"\",IF(AND(B148<>\"\",B147<>\"\"),$I$4+H147,VLOOKUP(INDEX($B$7:B147,MATCH(9.99999999999999E+307,$B$7:B147)),$B$7:H147,7,FALSE)+$I$4),\"\")","v":""},""]
[null,null,{"$f":"IF(D149<>\"\",IF(OR(B149<>\"\",INDIRECT(\"D150\")=0),IF(B148<>\"\",F148+B148,VLOOKUP(INDEX($B$7:B148,MATCH(9.99999999999999E+307,$B$7:B148)),$B$7:F148,5,FALSE)+INDEX($B$7:B148,MATCH(9.99999999999999E+307,$B$7:B148))),(VLOOKUP(INDEX($B$7:B148,MATCH(9.99999999999999E+307,$B$7:B148)),$B$7:F148,5,FALSE))+(INDEX($B$7:B148,MATCH(9.99999999999999E+307,$B$7:B148)))),\"\")","v":""},null,{"$f":"IF(D149<>\"\",IF(OR(B149<>\"\",INDIRECT(\"D150\")=0),D149,0),\"\")","v":""},"",null,{"$f":"IF(D149<>\"\",IF(AND(B149<>\"\",B148<>\"\"),$I$4+H148,VLOOKUP(INDEX($B$7:B148,MATCH(9.99999999999999E+307,$B$7:B148)),$B$7:H148,7,FALSE)+$I$4),\"\")","v":""},""]
[null,null,{"$f":"IF(D150<>\"\",IF(OR(B150<>\"\",INDIRECT(\"D151\")=0),IF(B149<>\"\",F149+B149,VLOOKUP(INDEX($B$7:B149,MATCH(9.99999999999999E+307,$B$7:B149)),$B$7:F149,5,FALSE)+INDEX($B$7:B149,MATCH(9.99999999999999E+307,$B$7:B149))),(VLOOKUP(INDEX($B$7:B149,MATCH(9.99999999999999E+307,$B$7:B149)),$B$7:F149,5,FALSE))+(INDEX($B$7:B149,MATCH(9.99999999999999E+307,$B$7:B149)))),\"\")","v":""},null,{"$f":"IF(D150<>\"\",IF(OR(B150<>\"\",INDIRECT(\"D151\")=0),D150,0),\"\")","v":""},"",null,{"$f":"IF(D150<>\"\",IF(AND(B150<>\"\",B149<>\"\"),$I$4+H149,VLOOKUP(INDEX($B$7:B149,MATCH(9.99999999999999E+307,$B$7:B149)),$B$7:H149,7,FALSE)+$I$4),\"\")","v":""},""]
[null,null,{"$f":"IF(D151<>\"\",IF(OR(B151<>\"\",INDIRECT(\"D152\")=0),IF(B150<>\"\",F150+B150,VLOOKUP(INDEX($B$7:B150,MATCH(9.99999999999999E+307,$B$7:B150)),$B$7:F150,5,FALSE)+INDEX($B$7:B150,MATCH(9.99999999999999E+307,$B$7:B150))),(VLOOKUP(INDEX($B$7:B150,MATCH(9.99999999999999E+307,$B$7:B150)),$B$7:F150,5,FALSE))+(INDEX($B$7:B150,MATCH(9.99999999999999E+307,$B$7:B150)))),\"\")","v":""},null,{"$f":"IF(D151<>\"\",IF(OR(B151<>\"\",INDIRECT(\"D152\")=0),D151,0),\"\")","v":""},"",null,{"$f":"IF(D151<>\"\",IF(AND(B151<>\"\",B150<>\"\"),$I$4+H150,VLOOKUP(INDEX($B$7:B150,MATCH(9.99999999999999E+307,$B$7:B150)),$B$7:H150,7,FALSE)+$I$4),\"\")","v":""},""]
[null,null,{"$f":"IF(D152<>\"\",IF(OR(B152<>\"\",INDIRECT(\"D153\")=0),IF(B151<>\"\",F151+B151,VLOOKUP(INDEX($B$7:B151,MATCH(9.99999999999999E+307,$B$7:B151)),$B$7:F151,5,FALSE)+INDEX($B$7:B151,MATCH(9.99999999999999E+307,$B$7:B151))),(VLOOKUP(INDEX($B$7:B151,MATCH(9.99999999999999E+307,$B$7:B151)),$B$7:F151,5,FALSE))+(INDEX($B$7:B151,MATCH(9.99999999999999E+307,$B$7:B151)))),\"\")","v":""},null,{"$f":"IF(D152<>\"\",IF(OR(B152<>\"\",INDIRECT(\"D153\")=0),D152,0),\"\")","v":""},"",null,{"$f":"IF(D152<>\"\",IF(AND(B152<>\"\",B151<>\"\"),$I$4+H151,VLOOKUP(INDEX($B$7:B151,MATCH(9.99999999999999E+307,$B$7:B151)),$B$7:H151,7,FALSE)+$I$4),\"\")","v":""},""]
[null,null,{"$f":"IF(D153<>\"\",IF(OR(B153<>\"\",INDIRECT(\"D154\")=0),IF(B152<>\"\",F152+B152,VLOOKUP(INDEX($B$7:B152,MATCH(9.99999999999999E+307,$B$7:B152)),$B$7:F152,5,FALSE)+INDEX($B$7:B152,MATCH(9.99999999999999E+307,$B$7:B152))),(VLOOKUP(INDEX($B$7:B152,MATCH(9.99999999999999E+307,$B$7:B152)),$B$7:F152,5,FALSE))+(INDEX($B$7:B152,MATCH(9.99999999999999E+307,$B$7:B152)))),\"\")","v":""},null,{"$f":"IF(D153<>\"\",IF(OR(B153<>\"\",INDIRECT(\"D154\")=0),D153,0),\"\")","v":""},"",null,{"$f":"IF(D153<>\"\",IF(AND(B153<>\"\",B152<>\"\"),$I$4+H152,VLOOKUP(INDEX($B$7:B152,MATCH(9.99999999999999E+307,$B$7:B152)),$B$7:H152,7,FALSE)+$I$4),\"\")","v":""},""]
[null,null,{"$f":"IF(D154<>\"\",IF(OR(B154<>\"\",INDIRECT(\"D155\")=0),IF(B153<>\"\",F153+B153,VLOOKUP(INDEX($B$7:B153,MATCH(9.99999999999999E+307,$B$7:B153)),$B$7:F153,5,FALSE)+INDEX($B$7:B153,MATCH(9.99999999999999E+307,$B$7:B153))),(VLOOKUP(INDEX($B$7:B153,MATCH(9.99999999999999E+307,$B$7:B153)),$B$7:F153,5,FALSE))+(INDEX($B$7:B153,MATCH(9.99999999999999E+307,$B$7:B153)))),\"\")","v":""},null,{"$f":"IF(D154<>\"\",IF(OR(B154<>\"\",INDIRECT(\"D155\")=0),D154,0),\"\")","v":""},"",null,{"$f":"IF(D154<>\"\",IF(AND(B154<>\"\",B153<>\"\"),$I$4+H153,VLOOKUP(INDEX($B$7:B153,MATCH(9.99999999999999E+307,$B$7:B153)),$B$7:H153,7,FALSE)+$I$4),\"\")","v":""},""]
[null,null,{"$f":"IF(D155<>\"\",IF(OR(B155<>\"\",INDIRECT(\"D156\")=0),IF(B154<>\"\",F154+B154,VLOOKUP(INDEX($B$7:B154,MATCH(9.99999999999999E+307,$B$7:B154)),$B$7:F154,5,FALSE)+INDEX($B$7:B154,MATCH(9.99999999999999E+307,$B$7:B154))),(VLOOKUP(INDEX($B$7:B154,MATCH(9.99999999999999E+307,$B$7:B154)),$B$7:F154,5,FALSE))+(INDEX($B$7:B154,MATCH(9.99999999999999E+307,$B$7:B154)))),\"\")","v":""},null,{"$f":"IF(D155<>\"\",IF(OR(B155<>\"\",INDIRECT(\"D156\")=0),D155,0),\"\")","v":""},"",null,{"$f":"IF(D155<>\"\",IF(AND(B155<>\"\",B154<>\"\"),$I$4+H154,VLOOKUP(INDEX($B$7:B154,MATCH(9.99999999999999E+307,$B$7:B154)),$B$7:H154,7,FALSE)+$I$4),\"\")","v":""},""]
[null,null,{"$f":"IF(D156<>\"\",IF(OR(B156<>\"\",INDIRECT(\"D157\")=0),IF(B155<>\"\",F155+B155,VLOOKUP(INDEX($B$7:B155,MATCH(9.99999999999999E+307,$B$7:B155)),$B$7:F155,5,FALSE)+INDEX($B$7:B155,MATCH(9.99999999999999E+307,$B$7:B155))),(VLOOKUP(INDEX($B$7:B155,MATCH(9.99999999999999E+307,$B$7:B155)),$B$7:F155,5,FALSE))+(INDEX($B$7:B155,MATCH(9.99999999999999E+307,$B$7:B155)))),\"\")","v":""},null,{"$f":"IF(D156<>\"\",IF(OR(B156<>\"\",INDIRECT(\"D157\")=0),D156,0),\"\")","v":""},"",null,{"$f":"IF(D156<>\"\",IF(AND(B156<>\"\",B155<>\"\"),$I$4+H155,VLOOKUP(INDEX($B$7:B155,MATCH(9.99999999999999E+307,$B$7:B155)),$B$7:H155,7,FALSE)+$I$4),\"\")","v":""},""]
[null,null,{"$f":"IF(D157<>\"\",IF(OR(B157<>\"\",INDIRECT(\"D158\")=0),IF(B156<>\"\",F156+B156,VLOOKUP(INDEX($B$7:B156,MATCH(9.99999999999999E+307,$B$7:B156)),$B$7:F156,5,FALSE)+INDEX($B$7:B156,MATCH(9.99999999999999E+307,$B$7:B156))),(VLOOKUP(INDEX($B$7:B156,MATCH(9.99999999999999E+307,$B$7:B156)),$B$7:F156,5,FALSE))+(INDEX($B$7:B156,MATCH(9.99999999999999E+307,$B$7:B156)))),\"\")","v":""},null,{"$f":"IF(D157<>\"\",IF(OR(B157<>\"\",INDIRECT(\"D158\")=0),D157,0),\"\")","v":""},"",null,{"$f":"IF(D157<>\"\",IF(AND(B157<>\"\",B156<>\"\"),$I$4+H156,VLOOKUP(INDEX($B$7:B156,MATCH(9.99999999999999E+307,$B$7:B156)),$B$7:H156,7,FALSE)+$I$4),\"\")","v":""},""]
[null,null,{"$f":"IF(D158<>\"\",IF(OR(B158<>\"\",INDIRECT(\"D159\")=0),IF(B157<>\"\",F157+B157,VLOOKUP(INDEX($B$7:B157,MATCH(9.99999999999999E+307,$B$7:B157)),$B$7:F157,5,FALSE)+INDEX($B$7:B157,MATCH(9.99999999999999E+307,$B$7:B157))),(VLOOKUP(INDEX($B$7:B157,MATCH(9.99999999999999E+307,$B$7:B157)),$B$7:F157,5,FALSE))+(INDEX($B$7:B157,MATCH(9.99999999999999E+307,$B$7:B157)))),\"\")","v":""},null,{"$f":"IF(D158<>\"\",IF(OR(B158<>\"\",INDIRECT(\"D159\")=0),D158,0),\"\")","v":""},"",null,{"$f":"IF(D158<>\"\",IF(AND(B158<>\"\",B157<>\"\"),$I$4+H157,VLOOKUP(INDEX($B$7:B157,MATCH(9.99999999999999E+307,$B$7:B157)),$B$7:H157,7,FALSE)+$I$4),\"\")","v":""},""]
[null,null,{"$f":"IF(D159<>\"\",IF(OR(B159<>\"\",INDIRECT(\"D160\")=0),IF(B158<>\"\",F158+B158,VLOOKUP(INDEX($B$7:B158,MATCH(9.99999999999999E+307,$B$7:B158)),$B$7:F158,5,FALSE)+INDEX($B$7:B158,MATCH(9.99999999999999E+307,$B$7:B158))),(VLOOKUP(INDEX($B$7:B158,MATCH(9.99999999999999E+307,$B$7:B158)),$B$7:F158,5,FALSE))+(INDEX($B$7:B158,MATCH(9.99999999999999E+307,$B$7:B158)))),\"\")","v":""},null,{"$f":"IF(D159<>\"\",IF(OR(B159<>\"\",INDIRECT(\"D160\")=0),D159,0),\"\")","v":""},"",null,{"$f":"IF(D159<>\"\",IF(AND(B159<>\"\",B158<>\"\"),$I$4+H158,VLOOKUP(INDEX($B$7:B158,MATCH(9.99999999999999E+307,$B$7:B158)),$B$7:H158,7,FALSE)+$I$4),\"\")","v":""},""]
[null,null,{"$f":"IF(D160<>\"\",IF(OR(B160<>\"\",INDIRECT(\"D161\")=0),IF(B159<>\"\",F159+B159,VLOOKUP(INDEX($B$7:B159,MATCH(9.99999999999999E+307,$B$7:B159)),$B$7:F159,5,FALSE)+INDEX($B$7:B159,MATCH(9.99999999999999E+307,$B$7:B159))),(VLOOKUP(INDEX($B$7:B159,MATCH(9.99999999999999E+307,$B$7:B159)),$B$7:F159,5,FALSE))+(INDEX($B$7:B159,MATCH(9.99999999999999E+307,$B$7:B159)))),\"\")","v":""},null,{"$f":"IF(D160<>\"\",IF(OR(B160<>\"\",INDIRECT(\"D161\")=0),D160,0),\"\")","v":""},"",null,{"$f":"IF(D160<>\"\",IF(AND(B160<>\"\",B159<>\"\"),$I$4+H159,VLOOKUP(INDEX($B$7:B159,MATCH(9.99999999999999E+307,$B$7:B159)),$B$7:H159,7,FALSE)+$I$4),\"\")","v":""},""]
[null,null,{"$f":"IF(D161<>\"\",IF(OR(B161<>\"\",INDIRECT(\"D162\")=0),IF(B160<>\"\",F160+B160,VLOOKUP(INDEX($B$7:B160,MATCH(9.99999999999999E+307,$B$7:B160)),$B$7:F160,5,FALSE)+INDEX($B$7:B160,MATCH(9.99999999999999E+307,$B$7:B160))),(VLOOKUP(INDEX($B$7:B160,MATCH(9.99999999999999E+307,$B$7:B160)),$B$7:F160,5,FALSE))+(INDEX($B$7:B160,MATCH(9.99999999999999E+307,$B$7:B160)))),\"\")","v":""},null,{"$f":"IF(D161<>\"\",IF(OR(B161<>\"\",INDIRECT(\"D162\")=0),D161,0),\"\")","v":""},"",null,{"$f":"IF(D161<>\"\",IF(AND(B161<>\"\",B160<>\"\"),$I$4+H160,VLOOKUP(INDEX($B$7:B160,MATCH(9.99999999999999E+307,$B$7:B160)),$B$7:H160,7,FALSE)+$I$4),\"\")","v":""},""]
[null,null,{"$f":"IF(D162<>\"\",IF(OR(B162<>\"\",INDIRECT(\"D163\")=0),IF(B161<>\"\",F161+B161,VLOOKUP(INDEX($B$7:B161,MATCH(9.99999999999999E+307,$B$7:B161)),$B$7:F161,5,FALSE)+INDEX($B$7:B161,MATCH(9.99999999999999E+307,$B$7:B161))),(VLOOKUP(INDEX($B$7:B161,MATCH(9.99999999999999E+307,$B$7:B161)),$B$7:F161,5,FALSE))+(INDEX($B$7:B161,MATCH(9.99999999999999E+307,$B$7:B161)))),\"\")","v":""},null,{"$f":"IF(D162<>\"\",IF(OR(B162<>\"\",INDIRECT(\"D163\")=0),D162,0),\"\")","v":""},"",null,{"$f":"IF(D162<>\"\",IF(AND(B162<>\"\",B161<>\"\"),$I$4+H161,VLOOKUP(INDEX($B$7:B161,MATCH(9.99999999999999E+307,$B$7:B161)),$B$7:H161,7,FALSE)+$I$4),\"\")","v":""},""]
[null,null,{"$f":"IF(D163<>\"\",IF(OR(B163<>\"\",INDIRECT(\"D164\")=0),IF(B162<>\"\",F162+B162,VLOOKUP(INDEX($B$7:B162,MATCH(9.99999999999999E+307,$B$7:B162)),$B$7:F162,5,FALSE)+INDEX($B$7:B162,MATCH(9.99999999999999E+307,$B$7:B162))),(VLOOKUP(INDEX($B$7:B162,MATCH(9.99999999999999E+307,$B$7:B162)),$B$7:F162,5,FALSE))+(INDEX($B$7:B162,MATCH(9.99999999999999E+307,$B$7:B162)))),\"\")","v":""},null,{"$f":"IF(D163<>\"\",IF(OR(B163<>\"\",INDIRECT(\"D164\")=0),D163,0),\"\")","v":""},"",null,{"$f":"IF(D163<>\"\",IF(AND(B163<>\"\",B162<>\"\"),$I$4+H162,VLOOKUP(INDEX($B$7:B162,MATCH(9.99999999999999E+307,$B$7:B162)),$B$7:H162,7,FALSE)+$I$4),\"\")","v":""},""]
[null,null,{"$f":"IF(D164<>\"\",IF(OR(B164<>\"\",INDIRECT(\"D165\")=0),IF(B163<>\"\",F163+B163,VLOOKUP(INDEX($B$7:B163,MATCH(9.99999999999999E+307,$B$7:B163)),$B$7:F163,5,FALSE)+INDEX($B$7:B163,MATCH(9.99999999999999E+307,$B$7:B163))),(VLOOKUP(INDEX($B$7:B163,MATCH(9.99999999999999E+307,$B$7:B163)),$B$7:F163,5,FALSE))+(INDEX($B$7:B163,MATCH(9.99999999999999E+307,$B$7:B163)))),\"\")","v":""},null,{"$f":"IF(D164<>\"\",IF(OR(B164<>\"\",INDIRECT(\"D165\")=0),D164,0),\"\")","v":""},"",null,{"$f":"IF(D164<>\"\",IF(AND(B164<>\"\",B163<>\"\"),$I$4+H163,VLOOKUP(INDEX($B$7:B163,MATCH(9.99999999999999E+307,$B$7:B163)),$B$7:H163,7,FALSE)+$I$4),\"\")","v":""},""]
[null,null,{"$f":"IF(D165<>\"\",IF(OR(B165<>\"\",INDIRECT(\"D166\")=0),IF(B164<>\"\",F164+B164,VLOOKUP(INDEX($B$7:B164,MATCH(9.99999999999999E+307,$B$7:B164)),$B$7:F164,5,FALSE)+INDEX($B$7:B164,MATCH(9.99999999999999E+307,$B$7:B164))),(VLOOKUP(INDEX($B$7:B164,MATCH(9.99999999999999E+307,$B$7:B164)),$B$7:F164,5,FALSE))+(INDEX($B$7:B164,MATCH(9.99999999999999E+307,$B$7:B164)))),\"\")","v":""},null,{"$f":"IF(D165<>\"\",IF(OR(B165<>\"\",INDIRECT(\"D166\")=0),D165,0),\"\")","v":""},"",null,{"$f":"IF(D165<>\"\",IF(AND(B165<>\"\",B164<>\"\"),$I$4+H164,VLOOKUP(INDEX($B$7:B164,MATCH(9.99999999999999E+307,$B$7:B164)),$B$7:H164,7,FALSE)+$I$4),\"\")","v":""},""]
[null,null,{"$f":"IF(D166<>\"\",IF(OR(B166<>\"\",INDIRECT(\"D167\")=0),IF(B165<>\"\",F165+B165,VLOOKUP(INDEX($B$7:B165,MATCH(9.99999999999999E+307,$B$7:B165)),$B$7:F165,5,FALSE)+INDEX($B$7:B165,MATCH(9.99999999999999E+307,$B$7:B165))),(VLOOKUP(INDEX($B$7:B165,MATCH(9.99999999999999E+307,$B$7:B165)),$B$7:F165,5,FALSE))+(INDEX($B$7:B165,MATCH(9.99999999999999E+307,$B$7:B165)))),\"\")","v":""},null,{"$f":"IF(D166<>\"\",IF(OR(B166<>\"\",INDIRECT(\"D167\")=0),D166,0),\"\")","v":""},"",null,{"$f":"IF(D166<>\"\",IF(AND(B166<>\"\",B165<>\"\"),$I$4+H165,VLOOKUP(INDEX($B$7:B165,MATCH(9.99999999999999E+307,$B$7:B165)),$B$7:H165,7,FALSE)+$I$4),\"\")","v":""},""]
[null,null,{"$f":"IF(D167<>\"\",IF(OR(B167<>\"\",INDIRECT(\"D168\")=0),IF(B166<>\"\",F166+B166,VLOOKUP(INDEX($B$7:B166,MATCH(9.99999999999999E+307,$B$7:B166)),$B$7:F166,5,FALSE)+INDEX($B$7:B166,MATCH(9.99999999999999E+307,$B$7:B166))),(VLOOKUP(INDEX($B$7:B166,MATCH(9.99999999999999E+307,$B$7:B166)),$B$7:F166,5,FALSE))+(INDEX($B$7:B166,MATCH(9.99999999999999E+307,$B$7:B166)))),\"\")","v":""},null,{"$f":"IF(D167<>\"\",IF(OR(B167<>\"\",INDIRECT(\"D168\")=0),D167,0),\"\")","v":""},"",null,{"$f":"IF(D167<>\"\",IF(AND(B167<>\"\",B166<>\"\"),$I$4+H166,VLOOKUP(INDEX($B$7:B166,MATCH(9.99999999999999E+307,$B$7:B166)),$B$7:H166,7,FALSE)+$I$4),\"\")","v":""},""]
[null,null,{"$f":"IF(D168<>\"\",IF(OR(B168<>\"\",INDIRECT(\"D169\")=0),IF(B167<>\"\",F167+B167,VLOOKUP(INDEX($B$7:B167,MATCH(9.99999999999999E+307,$B$7:B167)),$B$7:F167,5,FALSE)+INDEX($B$7:B167,MATCH(9.99999999999999E+307,$B$7:B167))),(VLOOKUP(INDEX($B$7:B167,MATCH(9.99999999999999E+307,$B$7:B167)),$B$7:F167,5,FALSE))+(INDEX($B$7:B167,MATCH(9.99999999999999E+307,$B$7:B167)))),\"\")","v":""},null,{"$f":"IF(D168<>\"\",IF(OR(B168<>\"\",INDIRECT(\"D169\")=0),D168,0),\"\")","v":""},"",null,{"$f":"IF(D168<>\"\",IF(AND(B168<>\"\",B167<>\"\"),$I$4+H167,VLOOKUP(INDEX($B$7:B167,MATCH(9.99999999999999E+307,$B$7:B167)),$B$7:H167,7,FALSE)+$I$4),\"\")","v":""},""]
[null,null,{"$f":"IF(D169<>\"\",IF(OR(B169<>\"\",INDIRECT(\"D170\")=0),IF(B168<>\"\",F168+B168,VLOOKUP(INDEX($B$7:B168,MATCH(9.99999999999999E+307,$B$7:B168)),$B$7:F168,5,FALSE)+INDEX($B$7:B168,MATCH(9.99999999999999E+307,$B$7:B168))),(VLOOKUP(INDEX($B$7:B168,MATCH(9.99999999999999E+307,$B$7:B168)),$B$7:F168,5,FALSE))+(INDEX($B$7:B168,MATCH(9.99999999999999E+307,$B$7:B168)))),\"\")","v":""},null,{"$f":"IF(D169<>\"\",IF(OR(B169<>\"\",INDIRECT(\"D170\")=0),D169,0),\"\")","v":""},"",null,{"$f":"IF(D169<>\"\",IF(AND(B169<>\"\",B168<>\"\"),$I$4+H168,VLOOKUP(INDEX($B$7:B168,MATCH(9.99999999999999E+307,$B$7:B168)),$B$7:H168,7,FALSE)+$I$4),\"\")","v":""},""]
[null,null,{"$f":"IF(D170<>\"\",IF(OR(B170<>\"\",INDIRECT(\"D171\")=0),IF(B169<>\"\",F169+B169,VLOOKUP(INDEX($B$7:B169,MATCH(9.99999999999999E+307,$B$7:B169)),$B$7:F169,5,FALSE)+INDEX($B$7:B169,MATCH(9.99999999999999E+307,$B$7:B169))),(VLOOKUP(INDEX($B$7:B169,MATCH(9.99999999999999E+307,$B$7:B169)),$B$7:F169,5,FALSE))+(INDEX($B$7:B169,MATCH(9.99999999999999E+307,$B$7:B169)))),\"\")","v":""},null,{"$f":"IF(D170<>\"\",IF(OR(B170<>\"\",INDIRECT(\"D171\")=0),D170,0),\"\")","v":""},"",null,{"$f":"IF(D170<>\"\",IF(AND(B170<>\"\",B169<>\"\"),$I$4+H169,VLOOKUP(INDEX($B$7:B169,MATCH(9.99999999999999E+307,$B$7:B169)),$B$7:H169,7,FALSE)+$I$4),\"\")","v":""},""]
[null,null,{"$f":"IF(D171<>\"\",IF(OR(B171<>\"\",INDIRECT(\"D172\")=0),IF(B170<>\"\",F170+B170,VLOOKUP(INDEX($B$7:B170,MATCH(9.99999999999999E+307,$B$7:B170)),$B$7:F170,5,FALSE)+INDEX($B$7:B170,MATCH(9.99999999999999E+307,$B$7:B170))),(VLOOKUP(INDEX($B$7:B170,MATCH(9.99999999999999E+307,$B$7:B170)),$B$7:F170,5,FALSE))+(INDEX($B$7:B170,MATCH(9.99999999999999E+307,$B$7:B170)))),\"\")","v":""},null,{"$f":"IF(D171<>\"\",IF(OR(B171<>\"\",INDIRECT(\"D172\")=0),D171,0),\"\")","v":""},"",null,{"$f":"IF(D171<>\"\",IF(AND(B171<>\"\",B170<>\"\"),$I$4+H170,VLOOKUP(INDEX($B$7:B170,MATCH(9.99999999999999E+307,$B$7:B170)),$B$7:H170,7,FALSE)+$I$4),\"\")","v":""},""]
[null,null,{"$f":"IF(D172<>\"\",IF(OR(B172<>\"\",INDIRECT(\"D173\")=0),IF(B171<>\"\",F171+B171,VLOOKUP(INDEX($B$7:B171,MATCH(9.99999999999999E+307,$B$7:B171)),$B$7:F171,5,FALSE)+INDEX($B$7:B171,MATCH(9.99999999999999E+307,$B$7:B171))),(VLOOKUP(INDEX($B$7:B171,MATCH(9.99999999999999E+307,$B$7:B171)),$B$7:F171,5,FALSE))+(INDEX($B$7:B171,MATCH(9.99999999999999E+307,$B$7:B171)))),\"\")","v":""},null,{"$f":"IF(D172<>\"\",IF(OR(B172<>\"\",INDIRECT(\"D173\")=0),D172,0),\"\")","v":""},"",null,{"$f":"IF(D172<>\"\",IF(AND(B172<>\"\",B171<>\"\"),$I$4+H171,VLOOKUP(INDEX($B$7:B171,MATCH(9.99999999999999E+307,$B$7:B171)),$B$7:H171,7,FALSE)+$I$4),\"\")","v":""},""]
[null,null,{"$f":"IF(D173<>\"\",IF(OR(B173<>\"\",INDIRECT(\"D174\")=0),IF(B172<>\"\",F172+B172,VLOOKUP(INDEX($B$7:B172,MATCH(9.99999999999999E+307,$B$7:B172)),$B$7:F172,5,FALSE)+INDEX($B$7:B172,MATCH(9.99999999999999E+307,$B$7:B172))),(VLOOKUP(INDEX($B$7:B172,MATCH(9.99999999999999E+307,$B$7:B172)),$B$7:F172,5,FALSE))+(INDEX($B$7:B172,MATCH(9.99999999999999E+307,$B$7:B172)))),\"\")","v":""},null,{"$f":"IF(D173<>\"\",IF(OR(B173<>\"\",INDIRECT(\"D174\")=0),D173,0),\"\")","v":""},"",null,{"$f":"IF(D173<>\"\",IF(AND(B173<>\"\",B172<>\"\"),$I$4+H172,VLOOKUP(INDEX($B$7:B172,MATCH(9.99999999999999E+307,$B$7:B172)),$B$7:H172,7,FALSE)+$I$4),\"\")","v":""},""]
[null,null,{"$f":"IF(D174<>\"\",IF(OR(B174<>\"\",INDIRECT(\"D175\")=0),IF(B173<>\"\",F173+B173,VLOOKUP(INDEX($B$7:B173,MATCH(9.99999999999999E+307,$B$7:B173)),$B$7:F173,5,FALSE)+INDEX($B$7:B173,MATCH(9.99999999999999E+307,$B$7:B173))),(VLOOKUP(INDEX($B$7:B173,MATCH(9.99999999999999E+307,$B$7:B173)),$B$7:F173,5,FALSE))+(INDEX($B$7:B173,MATCH(9.99999999999999E+307,$B$7:B173)))),\"\")","v":""},null,{"$f":"IF(D174<>\"\",IF(OR(B174<>\"\",INDIRECT(\"D175\")=0),D174,0),\"\")","v":""},"",null,{"$f":"IF(D174<>\"\",IF(AND(B174<>\"\",B173<>\"\"),$I$4+H173,VLOOKUP(INDEX($B$7:B173,MATCH(9.99999999999999E+307,$B$7:B173)),$B$7:H173,7,FALSE)+$I$4),\"\")","v":""},""]
[null,null,{"$f":"IF(D175<>\"\",IF(OR(B175<>\"\",INDIRECT(\"D176\")=0),IF(B174<>\"\",F174+B174,VLOOKUP(INDEX($B$7:B174,MATCH(9.99999999999999E+307,$B$7:B174)),$B$7:F174,5,FALSE)+INDEX($B$7:B174,MATCH(9.99999999999999E+307,$B$7:B174))),(VLOOKUP(INDEX($B$7:B174,MATCH(9.99999999999999E+307,$B$7:B174)),$B$7:F174,5,FALSE))+(INDEX($B$7:B174,MATCH(9.99999999999999E+307,$B$7:B174)))),\"\")","v":""},null,{"$f":"IF(D175<>\"\",IF(OR(B175<>\"\",INDIRECT(\"D176\")=0),D175,0),\"\")","v":""},"",null,{"$f":"IF(D175<>\"\",IF(AND(B175<>\"\",B174<>\"\"),$I$4+H174,VLOOKUP(INDEX($B$7:B174,MATCH(9.99999999999999E+307,$B$7:B174)),$B$7:H174,7,FALSE)+$I$4),\"\")","v":""},""]
[null,null,{"$f":"IF(D176<>\"\",IF(OR(B176<>\"\",INDIRECT(\"D177\")=0),IF(B175<>\"\",F175+B175,VLOOKUP(INDEX($B$7:B175,MATCH(9.99999999999999E+307,$B$7:B175)),$B$7:F175,5,FALSE)+INDEX($B$7:B175,MATCH(9.99999999999999E+307,$B$7:B175))),(VLOOKUP(INDEX($B$7:B175,MATCH(9.99999999999999E+307,$B$7:B175)),$B$7:F175,5,FALSE))+(INDEX($B$7:B175,MATCH(9.99999999999999E+307,$B$7:B175)))),\"\")","v":""},null,{"$f":"IF(D176<>\"\",IF(OR(B176<>\"\",INDIRECT(\"D177\")=0),D176,0),\"\")","v":""},"",null,{"$f":"IF(D176<>\"\",IF(AND(B176<>\"\",B175<>\"\"),$I$4+H175,VLOOKUP(INDEX($B$7:B175,MATCH(9.99999999999999E+307,$B$7:B175)),$B$7:H175,7,FALSE)+$I$4),\"\")","v":""},""]
[null,null,{"$f":"IF(D177<>\"\",IF(OR(B177<>\"\",INDIRECT(\"D178\")=0),IF(B176<>\"\",F176+B176,VLOOKUP(INDEX($B$7:B176,MATCH(9.99999999999999E+307,$B$7:B176)),$B$7:F176,5,FALSE)+INDEX($B$7:B176,MATCH(9.99999999999999E+307,$B$7:B176))),(VLOOKUP(INDEX($B$7:B176,MATCH(9.99999999999999E+307,$B$7:B176)),$B$7:F176,5,FALSE))+(INDEX($B$7:B176,MATCH(9.99999999999999E+307,$B$7:B176)))),\"\")","v":""},null,{"$f":"IF(D177<>\"\",IF(OR(B177<>\"\",INDIRECT(\"D178\")=0),D177,0),\"\")","v":""},"",null,{"$f":"IF(D177<>\"\",IF(AND(B177<>\"\",B176<>\"\"),$I$4+H176,VLOOKUP(INDEX($B$7:B176,MATCH(9.99999999999999E+307,$B$7:B176)),$B$7:H176,7,FALSE)+$I$4),\"\")","v":""},""]
[null,null,{"$f":"IF(D178<>\"\",IF(OR(B178<>\"\",INDIRECT(\"D179\")=0),IF(B177<>\"\",F177+B177,VLOOKUP(INDEX($B$7:B177,MATCH(9.99999999999999E+307,$B$7:B177)),$B$7:F177,5,FALSE)+INDEX($B$7:B177,MATCH(9.99999999999999E+307,$B$7:B177))),(VLOOKUP(INDEX($B$7:B177,MATCH(9.99999999999999E+307,$B$7:B177)),$B$7:F177,5,FALSE))+(INDEX($B$7:B177,MATCH(9.99999999999999E+307,$B$7:B177)))),\"\")","v":""},null,{"$f":"IF(D178<>\"\",IF(OR(B178<>\"\",INDIRECT(\"D179\")=0),D178,0),\"\")","v":""},"",null,{"$f":"IF(D178<>\"\",IF(AND(B178<>\"\",B177<>\"\"),$I$4+H177,VLOOKUP(INDEX($B$7:B177,MATCH(9.99999999999999E+307,$B$7:B177)),$B$7:H177,7,FALSE)+$I$4),\"\")","v":""},""]
[null,null,{"$f":"IF(D179<>\"\",IF(OR(B179<>\"\",INDIRECT(\"D180\")=0),IF(B178<>\"\",F178+B178,VLOOKUP(INDEX($B$7:B178,MATCH(9.99999999999999E+307,$B$7:B178)),$B$7:F178,5,FALSE)+INDEX($B$7:B178,MATCH(9.99999999999999E+307,$B$7:B178))),(VLOOKUP(INDEX($B$7:B178,MATCH(9.99999999999999E+307,$B$7:B178)),$B$7:F178,5,FALSE))+(INDEX($B$7:B178,MATCH(9.99999999999999E+307,$B$7:B178)))),\"\")","v":""},null,{"$f":"IF(D179<>\"\",IF(OR(B179<>\"\",INDIRECT(\"D180\")=0),D179,0),\"\")","v":""},"",null,{"$f":"IF(D179<>\"\",IF(AND(B179<>\"\",B178<>\"\"),$I$4+H178,VLOOKUP(INDEX($B$7:B178,MATCH(9.99999999999999E+307,$B$7:B178)),$B$7:H178,7,FALSE)+$I$4),\"\")","v":""},""]
[null,null,{"$f":"IF(D180<>\"\",IF(OR(B180<>\"\",INDIRECT(\"D181\")=0),IF(B179<>\"\",F179+B179,VLOOKUP(INDEX($B$7:B179,MATCH(9.99999999999999E+307,$B$7:B179)),$B$7:F179,5,FALSE)+INDEX($B$7:B179,MATCH(9.99999999999999E+307,$B$7:B179))),(VLOOKUP(INDEX($B$7:B179,MATCH(9.99999999999999E+307,$B$7:B179)),$B$7:F179,5,FALSE))+(INDEX($B$7:B179,MATCH(9.99999999999999E+307,$B$7:B179)))),\"\")","v":""},null,{"$f":"IF(D180<>\"\",IF(OR(B180<>\"\",INDIRECT(\"D181\")=0),D180,0),\"\")","v":""},"",null,{"$f":"IF(D180<>\"\",IF(AND(B180<>\"\",B179<>\"\"),$I$4+H179,VLOOKUP(INDEX($B$7:B179,MATCH(9.99999999999999E+307,$B$7:B179)),$B$7:H179,7,FALSE)+$I$4),\"\")","v":""},""]
[null,null,{"$f":"IF(D181<>\"\",IF(OR(B181<>\"\",INDIRECT(\"D182\")=0),IF(B180<>\"\",F180+B180,VLOOKUP(INDEX($B$7:B180,MATCH(9.99999999999999E+307,$B$7:B180)),$B$7:F180,5,FALSE)+INDEX($B$7:B180,MATCH(9.99999999999999E+307,$B$7:B180))),(VLOOKUP(INDEX($B$7:B180,MATCH(9.99999999999999E+307,$B$7:B180)),$B$7:F180,5,FALSE))+(INDEX($B$7:B180,MATCH(9.99999999999999E+307,$B$7:B180)))),\"\")","v":""},null,{"$f":"IF(D181<>\"\",IF(OR(B181<>\"\",INDIRECT(\"D182\")=0),D181,0),\"\")","v":""},"",null,{"$f":"IF(D181<>\"\",IF(AND(B181<>\"\",B180<>\"\"),$I$4+H180,VLOOKUP(INDEX($B$7:B180,MATCH(9.99999999999999E+307,$B$7:B180)),$B$7:H180,7,FALSE)+$I$4),\"\")","v":""},""]
[null,null,{"$f":"IF(D182<>\"\",IF(OR(B182<>\"\",INDIRECT(\"D183\")=0),IF(B181<>\"\",F181+B181,VLOOKUP(INDEX($B$7:B181,MATCH(9.99999999999999E+307,$B$7:B181)),$B$7:F181,5,FALSE)+INDEX($B$7:B181,MATCH(9.99999999999999E+307,$B$7:B181))),(VLOOKUP(INDEX($B$7:B181,MATCH(9.99999999999999E+307,$B$7:B181)),$B$7:F181,5,FALSE))+(INDEX($B$7:B181,MATCH(9.99999999999999E+307,$B$7:B181)))),\"\")","v":""},null,{"$f":"IF(D182<>\"\",IF(OR(B182<>\"\",INDIRECT(\"D183\")=0),D182,0),\"\")","v":""},"",null,{"$f":"IF(D182<>\"\",IF(AND(B182<>\"\",B181<>\"\"),$I$4+H181,VLOOKUP(INDEX($B$7:B181,MATCH(9.99999999999999E+307,$B$7:B181)),$B$7:H181,7,FALSE)+$I$4),\"\")","v":""},""]
[null,null,{"$f":"IF(D183<>\"\",IF(OR(B183<>\"\",INDIRECT(\"D184\")=0),IF(B182<>\"\",F182+B182,VLOOKUP(INDEX($B$7:B182,MATCH(9.99999999999999E+307,$B$7:B182)),$B$7:F182,5,FALSE)+INDEX($B$7:B182,MATCH(9.99999999999999E+307,$B$7:B182))),(VLOOKUP(INDEX($B$7:B182,MATCH(9.99999999999999E+307,$B$7:B182)),$B$7:F182,5,FALSE))+(INDEX($B$7:B182,MATCH(9.99999999999999E+307,$B$7:B182)))),\"\")","v":""},null,{"$f":"IF(D183<>\"\",IF(OR(B183<>\"\",INDIRECT(\"D184\")=0),D183,0),\"\")","v":""},"",null,{"$f":"IF(D183<>\"\",IF(AND(B183<>\"\",B182<>\"\"),$I$4+H182,VLOOKUP(INDEX($B$7:B182,MATCH(9.99999999999999E+307,$B$7:B182)),$B$7:H182,7,FALSE)+$I$4),\"\")","v":""},""]
[null,null,{"$f":"IF(D184<>\"\",IF(OR(B184<>\"\",INDIRECT(\"D185\")=0),IF(B183<>\"\",F183+B183,VLOOKUP(INDEX($B$7:B183,MATCH(9.99999999999999E+307,$B$7:B183)),$B$7:F183,5,FALSE)+INDEX($B$7:B183,MATCH(9.99999999999999E+307,$B$7:B183))),(VLOOKUP(INDEX($B$7:B183,MATCH(9.99999999999999E+307,$B$7:B183)),$B$7:F183,5,FALSE))+(INDEX($B$7:B183,MATCH(9.99999999999999E+307,$B$7:B183)))),\"\")","v":""},null,{"$f":"IF(D184<>\"\",IF(OR(B184<>\"\",INDIRECT(\"D185\")=0),D184,0),\"\")","v":""},"",null,{"$f":"IF(D184<>\"\",IF(AND(B184<>\"\",B183<>\"\"),$I$4+H183,VLOOKUP(INDEX($B$7:B183,MATCH(9.99999999999999E+307,$B$7:B183)),$B$7:H183,7,FALSE)+$I$4),\"\")","v":""},""]
[null,null,{"$f":"IF(D185<>\"\",IF(OR(B185<>\"\",INDIRECT(\"D186\")=0),IF(B184<>\"\",F184+B184,VLOOKUP(INDEX($B$7:B184,MATCH(9.99999999999999E+307,$B$7:B184)),$B$7:F184,5,FALSE)+INDEX($B$7:B184,MATCH(9.99999999999999E+307,$B$7:B184))),(VLOOKUP(INDEX($B$7:B184,MATCH(9.99999999999999E+307,$B$7:B184)),$B$7:F184,5,FALSE))+(INDEX($B$7:B184,MATCH(9.99999999999999E+307,$B$7:B184)))),\"\")","v":""},null,{"$f":"IF(D185<>\"\",IF(OR(B185<>\"\",INDIRECT(\"D186\")=0),D185,0),\"\")","v":""},"",null,{"$f":"IF(D185<>\"\",IF(AND(B185<>\"\",B184<>\"\"),$I$4+H184,VLOOKUP(INDEX($B$7:B184,MATCH(9.99999999999999E+307,$B$7:B184)),$B$7:H184,7,FALSE)+$I$4),\"\")","v":""},""]
[null,null,{"$f":"IF(D186<>\"\",IF(OR(B186<>\"\",INDIRECT(\"D187\")=0),IF(B185<>\"\",F185+B185,VLOOKUP(INDEX($B$7:B185,MATCH(9.99999999999999E+307,$B$7:B185)),$B$7:F185,5,FALSE)+INDEX($B$7:B185,MATCH(9.99999999999999E+307,$B$7:B185))),(VLOOKUP(INDEX($B$7:B185,MATCH(9.99999999999999E+307,$B$7:B185)),$B$7:F185,5,FALSE))+(INDEX($B$7:B185,MATCH(9.99999999999999E+307,$B$7:B185)))),\"\")","v":""},null,{"$f":"IF(D186<>\"\",IF(OR(B186<>\"\",INDIRECT(\"D187\")=0),D186,0),\"\")","v":""},"",null,{"$f":"IF(D186<>\"\",IF(AND(B186<>\"\",B185<>\"\"),$I$4+H185,VLOOKUP(INDEX($B$7:B185,MATCH(9.99999999999999E+307,$B$7:B185)),$B$7:H185,7,FALSE)+$I$4),\"\")","v":""},""]
[null,null,{"$f":"IF(D187<>\"\",IF(OR(B187<>\"\",INDIRECT(\"D188\")=0),IF(B186<>\"\",F186+B186,VLOOKUP(INDEX($B$7:B186,MATCH(9.99999999999999E+307,$B$7:B186)),$B$7:F186,5,FALSE)+INDEX($B$7:B186,MATCH(9.99999999999999E+307,$B$7:B186))),(VLOOKUP(INDEX($B$7:B186,MATCH(9.99999999999999E+307,$B$7:B186)),$B$7:F186,5,FALSE))+(INDEX($B$7:B186,MATCH(9.99999999999999E+307,$B$7:B186)))),\"\")","v":""},null,{"$f":"IF(D187<>\"\",IF(OR(B187<>\"\",INDIRECT(\"D188\")=0),D187,0),\"\")","v":""},"",null,{"$f":"IF(D187<>\"\",IF(AND(B187<>\"\",B186<>\"\"),$I$4+H186,VLOOKUP(INDEX($B$7:B186,MATCH(9.99999999999999E+307,$B$7:B186)),$B$7:H186,7,FALSE)+$I$4),\"\")","v":""},""]
[null,null,{"$f":"IF(D188<>\"\",IF(OR(B188<>\"\",INDIRECT(\"D189\")=0),IF(B187<>\"\",F187+B187,VLOOKUP(INDEX($B$7:B187,MATCH(9.99999999999999E+307,$B$7:B187)),$B$7:F187,5,FALSE)+INDEX($B$7:B187,MATCH(9.99999999999999E+307,$B$7:B187))),(VLOOKUP(INDEX($B$7:B187,MATCH(9.99999999999999E+307,$B$7:B187)),$B$7:F187,5,FALSE))+(INDEX($B$7:B187,MATCH(9.99999999999999E+307,$B$7:B187)))),\"\")","v":""},null,{"$f":"IF(D188<>\"\",IF(OR(B188<>\"\",INDIRECT(\"D189\")=0),D188,0),\"\")","v":""},"",null,{"$f":"IF(D188<>\"\",IF(AND(B188<>\"\",B187<>\"\"),$I$4+H187,VLOOKUP(INDEX($B$7:B187,MATCH(9.99999999999999E+307,$B$7:B187)),$B$7:H187,7,FALSE)+$I$4),\"\")","v":""},""]
[null,null,{"$f":"IF(D189<>\"\",IF(OR(B189<>\"\",INDIRECT(\"D190\")=0),IF(B188<>\"\",F188+B188,VLOOKUP(INDEX($B$7:B188,MATCH(9.99999999999999E+307,$B$7:B188)),$B$7:F188,5,FALSE)+INDEX($B$7:B188,MATCH(9.99999999999999E+307,$B$7:B188))),(VLOOKUP(INDEX($B$7:B188,MATCH(9.99999999999999E+307,$B$7:B188)),$B$7:F188,5,FALSE))+(INDEX($B$7:B188,MATCH(9.99999999999999E+307,$B$7:B188)))),\"\")","v":""},null,{"$f":"IF(D189<>\"\",IF(OR(B189<>\"\",INDIRECT(\"D190\")=0),D189,0),\"\")","v":""},"",null,{"$f":"IF(D189<>\"\",IF(AND(B189<>\"\",B188<>\"\"),$I$4+H188,VLOOKUP(INDEX($B$7:B188,MATCH(9.99999999999999E+307,$B$7:B188)),$B$7:H188,7,FALSE)+$I$4),\"\")","v":""},""]
[null,null,{"$f":"IF(D190<>\"\",IF(OR(B190<>\"\",INDIRECT(\"D191\")=0),IF(B189<>\"\",F189+B189,VLOOKUP(INDEX($B$7:B189,MATCH(9.99999999999999E+307,$B$7:B189)),$B$7:F189,5,FALSE)+INDEX($B$7:B189,MATCH(9.99999999999999E+307,$B$7:B189))),(VLOOKUP(INDEX($B$7:B189,MATCH(9.99999999999999E+307,$B$7:B189)),$B$7:F189,5,FALSE))+(INDEX($B$7:B189,MATCH(9.99999999999999E+307,$B$7:B189)))),\"\")","v":""},null,{"$f":"IF(D190<>\"\",IF(OR(B190<>\"\",INDIRECT(\"D191\")=0),D190,0),\"\")","v":""},"",null,{"$f":"IF(D190<>\"\",IF(AND(B190<>\"\",B189<>\"\"),$I$4+H189,VLOOKUP(INDEX($B$7:B189,MATCH(9.99999999999999E+307,$B$7:B189)),$B$7:H189,7,FALSE)+$I$4),\"\")","v":""},""]
[null,null,{"$f":"IF(D191<>\"\",IF(OR(B191<>\"\",INDIRECT(\"D192\")=0),IF(B190<>\"\",F190+B190,VLOOKUP(INDEX($B$7:B190,MATCH(9.99999999999999E+307,$B$7:B190)),$B$7:F190,5,FALSE)+INDEX($B$7:B190,MATCH(9.99999999999999E+307,$B$7:B190))),(VLOOKUP(INDEX($B$7:B190,MATCH(9.99999999999999E+307,$B$7:B190)),$B$7:F190,5,FALSE))+(INDEX($B$7:B190,MATCH(9.99999999999999E+307,$B$7:B190)))),\"\")","v":""},null,{"$f":"IF(D191<>\"\",IF(OR(B191<>\"\",INDIRECT(\"D192\")=0),D191,0),\"\")","v":""},"",null,{"$f":"IF(D191<>\"\",IF(AND(B191<>\"\",B190<>\"\"),$I$4+H190,VLOOKUP(INDEX($B$7:B190,MATCH(9.99999999999999E+307,$B$7:B190)),$B$7:H190,7,FALSE)+$I$4),\"\")","v":""},""]
[null,null,{"$f":"IF(D192<>\"\",IF(OR(B192<>\"\",INDIRECT(\"D193\")=0),IF(B191<>\"\",F191+B191,VLOOKUP(INDEX($B$7:B191,MATCH(9.99999999999999E+307,$B$7:B191)),$B$7:F191,5,FALSE)+INDEX($B$7:B191,MATCH(9.99999999999999E+307,$B$7:B191))),(VLOOKUP(INDEX($B$7:B191,MATCH(9.99999999999999E+307,$B$7:B191)),$B$7:F191,5,FALSE))+(INDEX($B$7:B191,MATCH(9.99999999999999E+307,$B$7:B191)))),\"\")","v":""},null,{"$f":"IF(D192<>\"\",IF(OR(B192<>\"\",INDIRECT(\"D193\")=0),D192,0),\"\")","v":""},"",null,{"$f":"IF(D192<>\"\",IF(AND(B192<>\"\",B191<>\"\"),$I$4+H191,VLOOKUP(INDEX($B$7:B191,MATCH(9.99999999999999E+307,$B$7:B191)),$B$7:H191,7,FALSE)+$I$4),\"\")","v":""},""]
[null,null,{"$f":"IF(D193<>\"\",IF(OR(B193<>\"\",INDIRECT(\"D194\")=0),IF(B192<>\"\",F192+B192,VLOOKUP(INDEX($B$7:B192,MATCH(9.99999999999999E+307,$B$7:B192)),$B$7:F192,5,FALSE)+INDEX($B$7:B192,MATCH(9.99999999999999E+307,$B$7:B192))),(VLOOKUP(INDEX($B$7:B192,MATCH(9.99999999999999E+307,$B$7:B192)),$B$7:F192,5,FALSE))+(INDEX($B$7:B192,MATCH(9.99999999999999E+307,$B$7:B192)))),\"\")","v":""},null,{"$f":"IF(D193<>\"\",IF(OR(B193<>\"\",INDIRECT(\"D194\")=0),D193,0),\"\")","v":""},"",null,{"$f":"IF(D193<>\"\",IF(AND(B193<>\"\",B192<>\"\"),$I$4+H192,VLOOKUP(INDEX($B$7:B192,MATCH(9.99999999999999E+307,$B$7:B192)),$B$7:H192,7,FALSE)+$I$4),\"\")","v":""},""]
[null,null,{"$f":"IF(D194<>\"\",IF(OR(B194<>\"\",INDIRECT(\"D195\")=0),IF(B193<>\"\",F193+B193,VLOOKUP(INDEX($B$7:B193,MATCH(9.99999999999999E+307,$B$7:B193)),$B$7:F193,5,FALSE)+INDEX($B$7:B193,MATCH(9.99999999999999E+307,$B$7:B193))),(VLOOKUP(INDEX($B$7:B193,MATCH(9.99999999999999E+307,$B$7:B193)),$B$7:F193,5,FALSE))+(INDEX($B$7:B193,MATCH(9.99999999999999E+307,$B$7:B193)))),\"\")","v":""},null,{"$f":"IF(D194<>\"\",IF(OR(B194<>\"\",INDIRECT(\"D195\")=0),D194,0),\"\")","v":""},"",null,{"$f":"IF(D194<>\"\",IF(AND(B194<>\"\",B193<>\"\"),$I$4+H193,VLOOKUP(INDEX($B$7:B193,MATCH(9.99999999999999E+307,$B$7:B193)),$B$7:H193,7,FALSE)+$I$4),\"\")","v":""},""]
[null,null,{"$f":"IF(D195<>\"\",IF(OR(B195<>\"\",INDIRECT(\"D196\")=0),IF(B194<>\"\",F194+B194,VLOOKUP(INDEX($B$7:B194,MATCH(9.99999999999999E+307,$B$7:B194)),$B$7:F194,5,FALSE)+INDEX($B$7:B194,MATCH(9.99999999999999E+307,$B$7:B194))),(VLOOKUP(INDEX($B$7:B194,MATCH(9.99999999999999E+307,$B$7:B194)),$B$7:F194,5,FALSE))+(INDEX($B$7:B194,MATCH(9.99999999999999E+307,$B$7:B194)))),\"\")","v":""},null,{"$f":"IF(D195<>\"\",IF(OR(B195<>\"\",INDIRECT(\"D196\")=0),D195,0),\"\")","v":""},"",null,{"$f":"IF(D195<>\"\",IF(AND(B195<>\"\",B194<>\"\"),$I$4+H194,VLOOKUP(INDEX($B$7:B194,MATCH(9.99999999999999E+307,$B$7:B194)),$B$7:H194,7,FALSE)+$I$4),\"\")","v":""},""]
[null,null,{"$f":"IF(D196<>\"\",IF(OR(B196<>\"\",INDIRECT(\"D197\")=0),IF(B195<>\"\",F195+B195,VLOOKUP(INDEX($B$7:B195,MATCH(9.99999999999999E+307,$B$7:B195)),$B$7:F195,5,FALSE)+INDEX($B$7:B195,MATCH(9.99999999999999E+307,$B$7:B195))),(VLOOKUP(INDEX($B$7:B195,MATCH(9.99999999999999E+307,$B$7:B195)),$B$7:F195,5,FALSE))+(INDEX($B$7:B195,MATCH(9.99999999999999E+307,$B$7:B195)))),\"\")","v":""},null,{"$f":"IF(D196<>\"\",IF(OR(B196<>\"\",INDIRECT(\"D197\")=0),D196,0),\"\")","v":""},"",null,{"$f":"IF(D196<>\"\",IF(AND(B196<>\"\",B195<>\"\"),$I$4+H195,VLOOKUP(INDEX($B$7:B195,MATCH(9.99999999999999E+307,$B$7:B195)),$B$7:H195,7,FALSE)+$I$4),\"\")","v":""},""]
[null,null,{"$f":"IF(D197<>\"\",IF(OR(B197<>\"\",INDIRECT(\"D198\")=0),IF(B196<>\"\",F196+B196,VLOOKUP(INDEX($B$7:B196,MATCH(9.99999999999999E+307,$B$7:B196)),$B$7:F196,5,FALSE)+INDEX($B$7:B196,MATCH(9.99999999999999E+307,$B$7:B196))),(VLOOKUP(INDEX($B$7:B196,MATCH(9.99999999999999E+307,$B$7:B196)),$B$7:F196,5,FALSE))+(INDEX($B$7:B196,MATCH(9.99999999999999E+307,$B$7:B196)))),\"\")","v":""},null,{"$f":"IF(D197<>\"\",IF(OR(B197<>\"\",INDIRECT(\"D198\")=0),D197,0),\"\")","v":""},"",null,{"$f":"IF(D197<>\"\",IF(AND(B197<>\"\",B196<>\"\"),$I$4+H196,VLOOKUP(INDEX($B$7:B196,MATCH(9.99999999999999E+307,$B$7:B196)),$B$7:H196,7,FALSE)+$I$4),\"\")","v":""},""]
[null,null,{"$f":"IF(D198<>\"\",IF(OR(B198<>\"\",INDIRECT(\"D199\")=0),IF(B197<>\"\",F197+B197,VLOOKUP(INDEX($B$7:B197,MATCH(9.99999999999999E+307,$B$7:B197)),$B$7:F197,5,FALSE)+INDEX($B$7:B197,MATCH(9.99999999999999E+307,$B$7:B197))),(VLOOKUP(INDEX($B$7:B197,MATCH(9.99999999999999E+307,$B$7:B197)),$B$7:F197,5,FALSE))+(INDEX($B$7:B197,MATCH(9.99999999999999E+307,$B$7:B197)))),\"\")","v":""},null,{"$f":"IF(D198<>\"\",IF(OR(B198<>\"\",INDIRECT(\"D199\")=0),D198,0),\"\")","v":""},"",null,{"$f":"IF(D198<>\"\",IF(AND(B198<>\"\",B197<>\"\"),$I$4+H197,VLOOKUP(INDEX($B$7:B197,MATCH(9.99999999999999E+307,$B$7:B197)),$B$7:H197,7,FALSE)+$I$4),\"\")","v":""},""]
[null,null,{"$f":"IF(D199<>\"\",IF(OR(B199<>\"\",INDIRECT(\"D200\")=0),IF(B198<>\"\",F198+B198,VLOOKUP(INDEX($B$7:B198,MATCH(9.99999999999999E+307,$B$7:B198)),$B$7:F198,5,FALSE)+INDEX($B$7:B198,MATCH(9.99999999999999E+307,$B$7:B198))),(VLOOKUP(INDEX($B$7:B198,MATCH(9.99999999999999E+307,$B$7:B198)),$B$7:F198,5,FALSE))+(INDEX($B$7:B198,MATCH(9.99999999999999E+307,$B$7:B198)))),\"\")","v":""},null,{"$f":"IF(D199<>\"\",IF(OR(B199<>\"\",INDIRECT(\"D200\")=0),D199,0),\"\")","v":""},"",null,{"$f":"IF(D199<>\"\",IF(AND(B199<>\"\",B198<>\"\"),$I$4+H198,VLOOKUP(INDEX($B$7:B198,MATCH(9.99999999999999E+307,$B$7:B198)),$B$7:H198,7,FALSE)+$I$4),\"\")","v":""},""]
[null,null,{"$f":"IF(D200<>\"\",IF(OR(B200<>\"\",INDIRECT(\"D201\")=0),IF(B199<>\"\",F199+B199,VLOOKUP(INDEX($B$7:B199,MATCH(9.99999999999999E+307,$B$7:B199)),$B$7:F199,5,FALSE)+INDEX($B$7:B199,MATCH(9.99999999999999E+307,$B$7:B199))),(VLOOKUP(INDEX($B$7:B199,MATCH(9.99999999999999E+307,$B$7:B199)),$B$7:F199,5,FALSE))+(INDEX($B$7:B199,MATCH(9.99999999999999E+307,$B$7:B199)))),\"\")","v":""},null,{"$f":"IF(D200<>\"\",IF(OR(B200<>\"\",INDIRECT(\"D201\")=0),D200,0),\"\")","v":""},"",null,{"$f":"IF(D200<>\"\",IF(AND(B200<>\"\",B199<>\"\"),$I$4+H199,VLOOKUP(INDEX($B$7:B199,MATCH(9.99999999999999E+307,$B$7:B199)),$B$7:H199,7,FALSE)+$I$4),\"\")","v":""},""]

{"sheet":"TIN","index":16,"n_rows":107,"n_cols":7,"rows_kept":107,"cut":false,"hidden":false,"merged":[[0,0,0,6],[1,0,1,6],[2,0,2,6],[105,0,106,3]]}
["Vertical TIN Accuracy Test"]
["Example Survey Check Shot Data Compared to TIN for Accuracy Class A"]
["(Units in U.S. Survey Feet)"]
["Point ID","Easting","Northing","Check Z","TIN Z","Dz","Dz^2"]
[null,null,null,null,null,{"$f":"E5-D5","v":0},{"$f":"F5^2","v":0}]
[null,null,null,null,null,{"$f":"E6-D6","v":0},{"$f":"F6^2","v":0}]
[null,null,null,null,null,0,0]
[null,null,null,null,null,{"$f":"E8-D8","v":0},{"$f":"F8^2","v":0}]
[null,null,null,null,null,0,0]
[null,null,null,null,null,0,0]
[null,null,null,null,null,0,0]
[null,null,null,null,null,0,0]
[null,null,null,null,null,0,0]
[null,null,null,null,null,0,0]
[null,null,null,null,null,0,0]
[null,null,null,null,null,0,0]
[null,null,null,null,null,0,0]
[null,null,null,null,null,0,0]
[null,null,null,null,null,0,0]
[null,null,null,null,null,0,0]
[null,null,null,null,null,0,0]
[null,null,null,null,null,0,0]
[null,null,null,null,null,0,0]
[null,null,null,null,null,0,0]
[null,null,null,null,null,0,0]
[null,null,null,null,null,0,0]
[null,null,null,null,null,0,0]
[null,null,null,null,null,0,0]
[null,null,null,null,null,0,0]
[null,null,null,null,null,0,0]
[null,null,null,null,null,0,0]
[null,null,null,null,null,0,0]
[null,null,null,null,null,0,0]
[null,null,null,null,null,0,0]
[null,null,null,null,null,0,0]
[null,null,null,null,null,0,0]
[null,null,null,null,null,0,0]
[null,null,null,null,null,0,0]
[null,null,null,null,null,0,0]
[null,null,null,null,null,0,0]
[null,null,null,null,null,0,0]
[null,null,null,null,null,0,0]
[null,null,null,null,null,0,0]
[null,null,null,null,null,0,0]
[null,null,null,null,null,0,0]
[null,null,null,null,null,0,0]
[null,null,null,null,null,0,0]
[null,null,null,null,null,0,0]
[null,null,null,null,null,0,0]
[null,null,null,null,null,0,0]
[null,null,null,null,null,0,0]
[null,null,null,null,null,0,0]
[null,null,null,null,null,0,0]
[null,null,null,null,null,0,0]
[null,null,null,null,null,0,0]
[null,null,null,null,null,0,0]
[null,null,null,null,null,0,0]
[null,null,null,null,null,0,0]
[null,null,null,null,null,0,0]
[null,null,null,null,null,0,0]
[null,null,null,null,null,0,0]
[null,null,null,null,null,0,0]
[null,null,null,null,null,0,0]
[null,null,null,null,null,0,0]
[null,null,null,null,null,0,0]
[null,null,null,null,null,0,0]
[null,null,null,null,null,0,0]
[null,null,null,null,null,0,0]
[null,null,null,null,null,0,0]
[null,null,null,null,null,0,0]
[null,null,null,null,null,0,0]
[null,null,null,null,null,{"$f":"E72-D72","v":0},{"$f":"F72^2","v":0}]
[null,null,null,null,null,0,0]
[null,null,null,null,null,0,0]
[null,null,null,null,null,0,0]
[null,null,null,null,null,0,0]
[null,null,null,null,null,0,0]
[null,null,null,null,null,0,0]
[null,null,null,null,null,0,0]
[null,null,null,null,null,0,0]
[null,null,null,null,null,0,0]
[null,null,null,null,null,0,0]
[null,null,null,null,null,0,0]
[null,null,null,null,null,0,0]
[null,null,null,null,null,0,0]
[null,null,null,null,null,0,0]
[null,null,null,null,null,0,0]
[null,null,null,null,null,0,0]
[null,null,null,null,null,0,0]
[null,null,null,null,null,0,0]
[null,null,null,null,null,0,0]
[null,null,null,null,null,0,0]
[null,null,null,null,null,0,0]
[null,null,null,null,null,0,0]
[null,null,null,null,null,0,0]
[null,null,null,null,null,0,0]
[null,null,null,null,null,0,0]
[null,null,null,null,null,0,0]
[null,null,null,null,null,{"$f":"E99-D99","v":0},{"$f":"F99^2","v":0}]
[null,null,null,null,null,0,0]
[null,null,null,null,null,0,0]
[null,null,null,null,null,0,0]
[null,null,null,null,null,0,0]
[null,null,null,null,null,0,0]
[null,null,null,null,"Sum Dz=",{"$f":"SUM($F$5:$F104)","v":0}]
["Spreadsheet user is responsible to verify all calculations. This spreadsheet is not guaranteed to provide accurate results.",null,null,null,"Sum Dz^2=",null,{"$f":"SUM($G$5:$G104)","v":0}]
[null,null,null,null,"N=",{"$f":"COUNT($D$5:$D104)","v":0}]

{"sheet":"DATABASE","index":17,"n_rows":1,"n_cols":18,"rows_kept":1,"cut":false,"hidden":false,"merged":[]}
["Name","Point ID","Northing","Easting","Elevation","Feature","Condition","Latitude","Longitude","Ellips Ht","Datum_Adj","Geoid","Method","Date","County","Route","District","PID"]

{"sheet":"FINAL GRID COORDINATES PENZC","index":18,"n_rows":21,"n_cols":5,"rows_kept":21,"cut":false,"hidden":false,"merged":[]}
["Point ID","Easting","Northing","Elevation","Code"]
["GS1",{"$f":"INDIRECT(A2&\"!E38\")","v":{"$error":"#REF!"}},{"$f":"INDIRECT($A2&\"!D38\")","v":{"$error":"#REF!"}},{"$f":"INDIRECT($A2&\"!F38\")","v":{"$error":"#REF!"}},{"$f":"INDIRECT($A2&\"!G38\")","v":{"$error":"#REF!"}}]
["GS2",{"$f":"INDIRECT(A3&\"!E38\")","v":{"$error":"#REF!"}},{"$f":"INDIRECT($A3&\"!D38\")","v":{"$error":"#REF!"}},{"$f":"INDIRECT($A3&\"!F38\")","v":{"$error":"#REF!"}},{"$error":"#REF!"}]
["GS3",{"$error":"#REF!"},{"$error":"#REF!"},{"$error":"#REF!"},{"$error":"#REF!"}]
["GS4",{"$error":"#REF!"},{"$error":"#REF!"},{"$error":"#REF!"},{"$error":"#REF!"}]
["GS5",{"$error":"#REF!"},{"$error":"#REF!"},{"$error":"#REF!"},{"$error":"#REF!"}]
["CNTL1",2458075.5981666669,376931.96865833335,1021.853,"IPINS"]
["CNTL2",2458323.4474166669,376988.95747500006,1012.7933333333332,"IPINS"]
["CNTL3",2458138.1177499997,376669.85781666666,1034.7279999999998,"IPINS"]
["GS9",{"$error":"#REF!"},{"$error":"#REF!"},{"$error":"#REF!"},{"$error":"#REF!"}]
["GS10",{"$error":"#REF!"},{"$error":"#REF!"},{"$error":"#REF!"},{"$error":"#REF!"}]
["GS11",{"$error":"#REF!"},{"$error":"#REF!"},{"$error":"#REF!"},{"$error":"#REF!"}]
["GS12",{"$error":"#REF!"},{"$error":"#REF!"},{"$error":"#REF!"},{"$error":"#REF!"}]
["GS13",{"$error":"#REF!"},{"$error":"#REF!"},{"$error":"#REF!"},{"$error":"#REF!"}]
["GS14",{"$error":"#REF!"},{"$error":"#REF!"},{"$error":"#REF!"},{"$error":"#REF!"}]
["GS15",{"$error":"#REF!"},{"$error":"#REF!"},{"$error":"#REF!"},{"$error":"#REF!"}]
["GS16",{"$error":"#REF!"},{"$error":"#REF!"},{"$error":"#REF!"},{"$error":"#REF!"}]
["GS17",{"$error":"#REF!"},{"$error":"#REF!"},{"$error":"#REF!"},{"$error":"#REF!"}]
["GS18",{"$error":"#REF!"},{"$error":"#REF!"},{"$error":"#REF!"},{"$error":"#REF!"}]
["GS19",{"$error":"#REF!"},{"$error":"#REF!"},{"$error":"#REF!"},{"$error":"#REF!"}]
["GS20",{"$error":"#REF!"},{"$error":"#REF!"},{"$error":"#REF!"},{"$error":"#REF!"}]

{"sheet":"FINAL GROUND COORDINATES PENZC","index":19,"n_rows":21,"n_cols":5,"rows_kept":21,"cut":false,"hidden":false,"merged":[]}
["Point ID","Easting","Northing","Elevation","Code"]
["GS1",{"$f":"INDIRECT(A2&\"!E39\")","v":{"$error":"#REF!"}},{"$f":"INDIRECT($A2&\"!D39\")","v":{"$error":"#REF!"}},{"$f":"INDIRECT($A2&\"!F39\")","v":{"$error":"#REF!"}},{"$f":"INDIRECT($A2&\"!G39\")","v":{"$error":"#REF!"}}]
["GS2",{"$f":"INDIRECT(A3&\"!E39\")","v":{"$error":"#REF!"}},{"$f":"INDIRECT($A3&\"!D39\")","v":{"$error":"#REF!"}},{"$f":"INDIRECT($A3&\"!F39\")","v":{"$error":"#REF!"}},{"$f":"INDIRECT($A3&\"!G39\")","v":{"$error":"#REF!"}}]
["GS3",{"$error":"#REF!"},{"$error":"#REF!"},{"$error":"#REF!"},{"$error":"#REF!"}]
["GS4",{"$error":"#REF!"},{"$error":"#REF!"},{"$error":"#REF!"},{"$error":"#REF!"}]
["GS5",{"$error":"#REF!"},{"$error":"#REF!"},{"$error":"#REF!"},{"$error":"#REF!"}]
["CNTL1",2458297.2674241094,376965.96038326697,1021.853,"IPINS"]
["CNTL2",2458545.139025155,377022.95433918515,1012.7933333333332,"IPINS"]
["CNTL3",2458359.7926454581,376703.82590444456,1034.7279999999998,"IPINS"]
["GS9",{"$error":"#REF!"},{"$error":"#REF!"},{"$error":"#REF!"},{"$error":"#REF!"}]
["GS10",{"$error":"#REF!"},{"$error":"#REF!"},{"$error":"#REF!"},{"$error":"#REF!"}]
["GS11",{"$error":"#REF!"},{"$error":"#REF!"},{"$error":"#REF!"},{"$error":"#REF!"}]
["GS12",{"$error":"#REF!"},{"$error":"#REF!"},{"$error":"#REF!"},{"$error":"#REF!"}]
["GS13",{"$error":"#REF!"},{"$error":"#REF!"},{"$error":"#REF!"},{"$error":"#REF!"}]
["GS14",{"$error":"#REF!"},{"$error":"#REF!"},{"$error":"#REF!"},{"$error":"#REF!"}]
["GS15",{"$error":"#REF!"},{"$error":"#REF!"},{"$error":"#REF!"},{"$error":"#REF!"}]
["GS16",{"$error":"#REF!"},{"$error":"#REF!"},{"$error":"#REF!"},{"$error":"#REF!"}]
["GS17",{"$error":"#REF!"},{"$error":"#REF!"},{"$error":"#REF!"},{"$error":"#REF!"}]
["GS18",{"$error":"#REF!"},{"$error":"#REF!"},{"$error":"#REF!"},{"$error":"#REF!"}]
["GS19",{"$error":"#REF!"},{"$error":"#REF!"},{"$error":"#REF!"},{"$error":"#REF!"}]
["GS20",{"$error":"#REF!"},{"$error":"#REF!"},{"$error":"#REF!"},{"$error":"#REF!"}]