{"text_format":"1","workbook":"xlsx","n_sheets":9,"sheets":["Instructions","Safety Application","DSRTSignature","Project Scoring","ScoringCalculations","ScoringTable","RefTables","RSI_Data","Import"],"not_rendered":{"charts":0,"images":4,"macros":1,"external_links":0,"defined_names":38,"comments":1,"pivot_tables":0},"unopened":[],"bounds":{"document_bytes":16777216,"sheet_cells":100000,"rows_first":2000,"rows_last":500,"rows_between":2000,"halvings":0,"cell_chars":16384,"cell_head_chars":4096},"cells_cut":0,"cells_raw":0,"read":"whole","date_system":"1900"}

{"sheet":"Instructions","index":0,"n_rows":16,"n_cols":12,"rows_kept":16,"cut":false,"hidden":false,"merged":[[0,0,0,8],[1,0,1,8],[2,0,2,8],[5,0,5,8],[6,0,6,8],[7,0,7,8],[16,0,16,8],[3,0,3,8],[4,0,4,8],[8,0,8,8],[9,0,9,8],[11,0,11,8],[12,0,12,8],[14,0,14,8],[15,0,15,8],[13,0,13,8]]}
["Highway Safety Improvement Program",null,null,null,null,null,null,null,null,null,"Version",{"$f":"'Safety Application'!J110","v":20221028}]
["Formal Funding Application"]
["Scoring Tool Instructions"]
[]
["The instructions can be used to understand the functionality of the tool.  The tool attempts to complete as many fields as possible form information entered in the Economic Crash Analysis Tool (ECAT).  "]
[]
["The worksheets have been protected because the tool is standardized to import into the ODOT Central Office Database. Once submitted, the complete data layouts will be imported into the current database.  At this point, the district will be able to make any changes desired prior to the HSIP Program Committee Review."]
[]
[]
["I recommend starting a new application by importing data from existing ECAT Tool(s).  The import functionality will obtain information from (1) an ECAT Tool that does not have a fundamental change in Safety Performance Function (SPF) ('No' response in Cell \"K14\" on the Project Information Worksheet) or (2) an ECAT Tool that has have a fundamental change in Safety Performance Function (SPF) ('Yes' response in Cell \"K14\" on the Project Information Worksheet).  Follow the coded prompts.  Two files will be required for Item (2).  The order of import is does not matter.  Following the import process, please verify the data as assumptions have been made.  For example, it was assumed that only one route (major route) was used in the Project Element Description Table when determining project limits (All NLFIDs match in Column F).\n\nNote:  If you choose to import a new dataset, any previous information will be overridden."]
[]
[]
["At times, it will be necessary to change the font size of cells to make the text visible.  Once the tool is activated, select the cells you desire to decrease / increase the font size (selection can be contiguous or noncontiguous cells).  Once the cells have been selected, select the desired functionality."]
[]
[]
["This tool can be used to add rows of details for either work locations of funding sources.  Submitters can add up to a total of 10 work locations.  Similarly, there are a ten (10) total funding sources possible (including the three already defined).  For funding sources, we are asking that each source be individually itemized."]

{"sheet":"Safety Application","index":1,"n_rows":117,"n_cols":28,"rows_kept":117,"cut":false,"hidden":false,"merged":[[103,0,103,9],[91,0,91,3],[92,0,92,3],[91,6,91,7],[81,0,81,2],[96,0,96,3],[97,0,97,3],[98,0,98,3],[99,0,99,3],[90,0,90,9],[97,4,97,6],[97,7,97,9],[98,4,98,6],[98,7,98,9],[95,0,95,9],[91,4,91,5],[92,4,92,5],[91,8,91,9],[92,8,92,9],[92,6,92,7],[93,0,93,3],[93,4,93,5],[93,6,93,7],[93,8,93,9],[110,0,110,9],[105,5,105,7],[104,8,104,9],[105,8,105,9],[104,5,104,7],[85,0,85,2],[107,8,107,9],[106,0,106,7],[107,0,107,7],[106,8,106,9],[101,4,101,6],[101,7,101,9],[100,4,100,6],[100,7,100,9],[104,0,104,4],[105,0,105,4],[100,0,100,3],[101,0,101,3],[96,4,96,6],[96,7,96,9],[99,4,99,6],[99,7,99,9],[87,0,87,9],[88,0,88,9],[41,0,41,6],[42,0,42,6],[43,0,43,6],[72,0,72,9],[53,0,53,3],[54,0,54,3],[55,0,55,3],[56,0,56,3],[62,0,62,1],[63,0,63,1],[64,0,64,1],[65,0,65,1],[66,0,66,1],[46,0,46,9],[67,0,67,1],[68,0,68,1],[69,0,69,1],[70,0,70,1],[61,0,61,1],[59,0,59,9],[60,0,60,1],[44,0,44,7],[49,3,49,5],[50,3,50,5],[38,0,38,6],[39,0,39,6],[40,0,40,6],[17,0,17,9],[18,0,18,9],[19,0,19,9],[20,0,20,9],[21,0,21,9],[30,0,30,9],[23,0,23,9],[22,0,22,9],[32,0,32,3],[34,0,34,9],[35,0,35,6],[36,0,36,6],[37,0,37,6],[24,0,24,4],[25,0,25,4],[26,0,26,4],[27,0,27,4],[29,0,29,4],[28,0,28,4],[16,0,16,9],[15,0,15,9],[1,0,1,2],[9,7,9,9],[10,7,10,9],[8,0,8,9],[9,0,9,1],[10,0,10,1],[11,0,11,1],[9,5,9,6],[10,5,10,6],[11,5,11,6],[11,7,11,9],[9,2,9,4],[10,2,10,4],[11,2,11,4],[13,0,13,1],[12,2,12,4],[13,5,13,6],[12,7,12,9],[12,0,12,1],[12,5,12,6],[13,2,13,4],[13,7,13,9],[0,0,0,9],[6,0,6,2],[1,3,1,9],[2,3,2,9],[3,3,3,9],[4,3,4,9],[5,3,5,9],[6,3,6,9],[4,0,4,2],[5,0,5,2],[2,0,2,2],[3,0,3,2],[68,14,68,15],[69,14,69,15],[70,14,70,15],[62,10,62,11],[62,12,62,13],[63,10,63,11],[63,12,63,13],[64,10,64,11],[64,12,64,13],[65,10,65,11],[65,12,65,13],[66,10,66,11],[68,10,68,11],[68,12,68,13],[69,10,69,11],[69,12,69,13],[70,10,70,11],[70,12,70,13],[61,10,61,11],[61,12,61,13],[61,14,61,15],[62,14,62,15],[63,14,63,15],[64,14,64,15],[65,14,65,15],[66,14,66,15],[67,14,67,15],[66,12,66,13],[67,10,67,11],[67,12,67,13],[116,0,116,9],[114,0,114,2],[73,0,73,2],[76,0,76,2],[53,4,53,9],[54,4,54,9],[55,4,55,9],[56,4,56,9],[57,4,57,9],[69,6,69,9],[70,6,70,9],[74,0,74,2],[75,0,75,2],[73,9,75,9],[60,6,60,9],[61,6,61,9],[62,6,62,9],[63,6,63,9],[64,6,64,9],[65,6,65,9],[66,6,66,9],[67,6,67,9],[68,6,68,9],[83,0,83,2],[79,0,79,2],[84,0,84,2],[77,0,77,2],[78,0,78,2],[82,0,82,2],[80,0,80,2],[52,0,52,9],[47,0,47,2],[48,0,48,2],[50,0,50,2],[47,6,47,8],[48,6,48,8],[49,6,49,8],[49,0,49,2],[50,6,50,8],[47,3,47,5],[48,3,48,5]]}
["General Project Information",null,null,null,null,null,null,null,null,null,null,null,null,null,null,null,null,null,null,null,null,null,null,null,null,"Show Conditional Format:","Yes"]
["Project Sponsoring Agency",null,null,"ODOT D8",null,null,null,null,null,null,null,null,null,null,null,null,null,null,null,null,null,null,null,null,null,"Lat Long Format:","Yes"]
["Project Name",null,null,{"$f":"IF(ScoringCalculations!C2=\"\",\"\",ScoringCalculations!C2)","v":"SR-747 at SR-129 Interchanges and Grandin Ridge Drive/Logsdons Meadow Drive"},null,null,null,null,null,null,null,null,null,null,null,null,null,null,null,null,null,null,null,null,null,"Priority Rank Format:","Yes"]
["PID",null,null,"TBD"]
["Applicant Name",null,null,"Brianne Hetzel"]
["Contact Phone",null,null,"513-933-6624"]
["Contact Email",null,null,"brianne.hetzel@dot.ohio.gov"]
[]
["Location Information"]
["ODOT District",null,{"$f":"IFERROR(VLOOKUP(H10,RefTables!A:B,2,FALSE),\"\")","v":8},null,null,"County",null,{"$f":"MID(A62,2,3)","v":"BUT"}]
["Route Number",null,{"$f":"IFERROR(MID(A62,5,2)&\"-\"&MID(A62,7,5)*1&IF(LEFT(A62,1)=\"S\",IF(RIGHT(A62,2)=\"*C\",\"R\",MID(A62,13,1)),IF(RIGHT(A62,3)=\"**C\",\"\",MID(A62,12,1))),\"\")","v":"SR-747R"},null,null,"Road Name",null,"SR-747"]
["Begin Logpoint",null,{"$f":"IF(C62=\"\",\"\",C62)","v":5.43},null,null,"End Logpoint",null,{"$f":"IF(D62=\"\",\"\",D62)","v":5.65}]
["Begin Latitude",null,null,null,null,"Begin Longitude"]
["End Latitude",null,null,null,null,"End Longitude"]
[]
["Project Description"]
["Summary of Crash Patterns"]
["Crash data between 2018 and 2020 was obtained using ODOT’s TIMS website. A total of 100 crashes occurred within the study area with three involving serious injuries, thirteen involving minor injuries, and ten involving possible injuries. The data shows that rear end and left turn crashes happen more frequently in the study area than is typical. Crashes were higher on weekdays, especially on Monday (19%) and Tuesday (18%)\nand were most common between 2 PM and 7 PM. Following Too Closely/ACDA (Assured Clear Distance Ahead) was the highest contributing factor (54%) of crashes. Failure to Yield was the next most common contributing factor (23%), with six from angle crashes and 17 from left turn crashes indicating drivers were unable to properly select an appropriate gap in traffic. Pavement friction is likely not a significant contributing factor\nsince 68% of the crashes occurred on dry pavement.\n\nThe 2021-2022 updated crash data shows 25 crashes occurring in 2021 and 35 crashes occurring in 2022, with a nearly 32% injury rate. The highest concentration of crashes was still rear end and left turn crashes. There were 8 left turn crashes at the WB ramp and 10 left turn crashes at the EB ramp. Rear ends are primarily in the SB direction at both ramps due to queing of the left turns. "]
["Summary of Recommended Countermeasures"]
["The SR-129 EB ramp signal operates poorly during the AM peak, with several movements underperforming (LOS E/F). Additionally, the southbound left-turn movement shows LOS D, however, the 95% queue exceeds the existing storage. During the PM peak, this trend occurs again for the southbound left, while the rest of the intersection operates functionally (except the WB right-turn, with LOS E). The SR-129 WB ramp signal operates well during the AM peak and in the PM peak hours, except the WB approach during the AM Peak (LOS E), and the 95% queue exceeds the existing storage in the PM peak. The signalized ramp intersections operate poorly over all time periods, with several movements underperforming (LOS E/F) and 95% queues exceeding existing storage.\n\nConvert the interchange to a Diverging Diamond Interchange (DDI). All movements for both the AM and PM peak hours show acceptable levels of service (LOS D or better) in the design year. Furthermore, all V/C ratios are under 1.0, and all 95th Percentile Queues are within the existing/proposed storage lengths."]
["Project Priority Information"]
["SuburbanNonFwy #36 (2020 SA List)\nSuburbanNonFwy #160 (2021 SA List)"]
["Crash Data"]
["Crash Totals"]
["(average per year)",null,null,null,null,"Fatal & Serious Injury  (KA)","Visible Injury (B)","Non-Visible (C)","Property Damage Only (O)","Total"]
["Existing Conditions: Predicted Crash Frequency",null,null,null,null,{"$f":"IF(ScoringCalculations!D43=0,\"\",ScoringCalculations!D43)","v":0.48489999999999994},{"$f":"IF(ScoringCalculations!E43=0,\"\",ScoringCalculations!E43)","v":1.9638999999999998},{"$f":"IF(ScoringCalculations!F43=0,\"\",ScoringCalculations!F43)","v":2.9813000000000001},{"$f":"IF(ScoringCalculations!G43=0,\"\",ScoringCalculations!G43)","v":14.086300000000001},{"$f":"ROUND(SUM(F26:I26),2)","v":19.52}]
["Existing Conditions: Expected Crash Frequency",null,null,null,null,{"$f":"IF(ScoringCalculations!D44=0,\"\",ScoringCalculations!D44)","v":0.5222},{"$f":"IF(ScoringCalculations!E44=0,\"\",ScoringCalculations!E44)","v":2.1368},{"$f":"IF(ScoringCalculations!F44=0,\"\",ScoringCalculations!F44)","v":3.2578},{"$f":"IF(ScoringCalculations!G44=0,\"\",ScoringCalculations!G44)","v":18.366799999999998},{"$f":"ROUND(SUM(F27:I27),2)","v":24.28}]
["Potential for Safety Improvement",null,null,null,null,{"$f":"IF(ScoringCalculations!D45=0,\"\",ScoringCalculations!D45)","v":3.7300000000000055E-2},{"$f":"IF(ScoringCalculations!E45=0,\"\",ScoringCalculations!E45)","v":0.17290000000000028},{"$f":"IF(ScoringCalculations!F45=0,\"\",ScoringCalculations!F45)","v":0.27649999999999997},{"$f":"IF(ScoringCalculations!G45=0,\"\",ScoringCalculations!G45)","v":4.2804999999999964},4.7699999999999996]
[{"$f":"\"Proposed Conditions: \"&IF('Project Scoring'!H7=\"ECAT - Change in base SPF\",\"Predicted\",\"Expected\")&\" Crash Frequency\"","v":"Proposed Conditions: Expected Crash Frequency"},null,null,null,null,{"$f":"IF(ScoringCalculations!D46=0,\"\",ScoringCalculations!D46)","v":0.34639999999999999},{"$f":"IF(ScoringCalculations!E46=0,\"\",ScoringCalculations!E46)","v":1.4200999999999999},{"$f":"IF(ScoringCalculations!F46=0,\"\",ScoringCalculations!F46)","v":2.2084000000000001},{"$f":"IF(ScoringCalculations!G46=0,\"\",ScoringCalculations!G46)","v":12.4259},16.399999999999999]
["Observed Crashes",null,null,null,null,{"$f":"IF(ScoringCalculations!D47=\"\",\"\",ScoringCalculations!D47)","v":1},{"$f":"IF(ScoringCalculations!E47=\"\",\"\",ScoringCalculations!E47)","v":4.3333000000000004},{"$f":"IF(ScoringCalculations!F47=\"\",\"\",ScoringCalculations!F47)","v":3.3332999999999999},{"$f":"IF(ScoringCalculations!G47=\"\",\"\",ScoringCalculations!G47)","v":24.666699999999999},33.33]
["Observed People Injury Totals"]
[null,null,null,null,null,"Fatal Injury  (K)","Serious Injury  (A)","Visible Injury (B)","Non-Visible (C)","Total"]
["Observed People Injury Totals",null,null,null,null,{"$f":"IF(ScoringCalculations!D53=\"\",\"\",ScoringCalculations!D53)","v":0},{"$f":"IF(ScoringCalculations!E53=\"\",\"\",ScoringCalculations!E53)","v":1.6667000000000001},{"$f":"IF(ScoringCalculations!F53=\"\",\"\",ScoringCalculations!F53)","v":5.3333000000000004},{"$f":"IF(ScoringCalculations!G53=\"\",\"\",ScoringCalculations!G53)","v":9},{"$f":"ROUND(SUM(F33:I33),2)","v":16}]
[]
["Application Scoring"]
["Category",null,null,null,null,null,null,"Scoring Value","Points Awarded","Points Possible"]
["Ratio of Observed Fatal and Serious Injuries to Observed Total Crashes",null,null,null,null,null,null,{"$f":"IF(J30=0,\"\",ROUND(SUM(F33:G33)/J30,2))","v":0.05},{"$f":"IFERROR(VLOOKUP(H37,ScoringTable!AA:AB,2,TRUE),\"\")","v":10},{"$f":"MAX(ScoringTable!AB:AB)","v":30}]
["Percentage of the Potential for Safety Improvement to Total Expected Crashes",null,null,null,null,null,null,{"$f":"IF(J27=0,\"\",IF(J28<0,0,IFERROR(ROUND(J28/J27,4),0)))","v":0.19650000000000001},{"$f":"IFERROR(VLOOKUP(H38,ScoringTable!AC:AD,2,TRUE),\"\")","v":14},{"$f":"MAX(ScoringTable!AD:AD)","v":20}]
["Relative Severity Index",null,null,null,null,null,null,{"$f":"IF(ScoringCalculations!B36=0,\"\",ScoringCalculations!B36)","v":28889.8},{"$f":"IFERROR(VLOOKUP(H39,ScoringTable!AE:AF,2,TRUE),\"\")","v":8},{"$f":"MAX(ScoringTable!AF:AF)","v":20}]
["Equivalent Property Damage Only Index",null,null,null,null,null,null,{"$f":"IF(J27=0,IF(J30=0,\"\",ROUND((F30*ScoringCalculations!D48+G30*ScoringCalculations!E48+H30*ScoringCalculations!F48+I30*ScoringCalculations!G48)/J30,2)),ROUND((F27*ScoringCalculations!D48+G27*ScoringCalculations!E48+H27*ScoringCalculations!F48+I27*ScoringCalculations!G48)/J27,2))","v":2.9},{"$f":"IFERROR(VLOOKUP(H40,ScoringTable!AG:AH,2,TRUE),\"\")","v":8},{"$f":"MAX(ScoringTable!AH:AH)","v":20}]
["Location Equity Measure",null,null,null,null,null,null,0,{"$f":"IF(H41=0,\"\",IFERROR(VLOOKUP(H41,ScoringTable!AI:AJ,2,TRUE),\"\"))","v":""},{"$f":"MAX(ScoringTable!AJ:AJ)","v":10}]
[null,null,null,null,null,null,null,null,{"$f":"IFERROR(VLOOKUP(H42,ScoringTable!AM:AN,2,TRUE),\"\")","v":""}]
[null,null,null,null,null,null,null,null,{"$f":"IFERROR(IF(H43<0,0,VLOOKUP(H43,ScoringTable!AO:AP,2,TRUE)),\"\")","v":""}]
[null,null,null,null,null,null,null,null,{"$f":"IFERROR(VLOOKUP(H44,ScoringTable!AQ:AR,2,TRUE),\"\")","v":""}]
["Total",null,null,null,null,null,null,null,{"$f":"IF(SUM(I37:I44)=0,\"\",SUM(I37:I44))","v":40},{"$f":"SUM(J37:J44)","v":100}]
[]
["Safety Key Metrics"]
["Functional Class",null,null,"3 - Other Principal Arterial Roadway",null,null,"Active Transportation Need"]
["Major Route AADT",null,null,26368,null,null,"Active Transportation Demand"]
["Maximum Posted Speed Limit",null,null,55,null,null,"Bicycle Level of traffic stress (if available)"]
[null,null,null,null,null,null,"TOAST Score (if available)",null,null,0.56999999999999995]
[]
["Strategic Highway Safety Plan"]
["Ohio Emphasis Area",null,null,null,"Serious Crash Types"]
["Ohio Emphasis Area Subcategory",null,null,null,"Intersection"]
["FHWA Emphasis Area",null,null,null,"Improving the design and operation of highway intersections"]
["FHWA Improvement Category",null,null,null,"Interchange design"]
["FHWA Improvement Subcategory",null,null,null,"Interchange design - other"]
[]
["Work Locations"]
["NLFID",null,"Begin Logpoint","End \nLogpoint","Begin \nLatitude","Begin Longitude","Location Termini\n(i.e. from Street 1 to Street 2)",null,null,null,null,null,null,null,null,null,null,null,null,null,null,null,null,null,null,null,"EndLatitude","EndLongitude"]
["SBUTSR00747**C",null,5.43,5.65,null,null,null,null,null,null,{"$f":"IF(OR(E62=\"\",F62=\"\"),\"\",HYPERLINK(CONCATENATE(\"http://maps.google.com/maps?q=\",+E62,\",+\",+F62,\"+(Begin Project)&iwloc=A&hl=en\"),\"Google Map\"))","v":""},null,{"$f":"IF(OR(E62=\"\",F62=\"\"),\"\",HYPERLINK(CONCATENATE(\"http://bing.com/maps/default.aspx?rtop=1~0&rtp=pos.\",E62,\"_\",F62,\"_\",\"Begin Project\"),\"Bing Maps\"))","v":""},null,{"$f":"IF(A62=\"\",\"\",IF(OR(MID(A62,5,2)=\"IR\",MID(A62,5,2)=\"SR\",MID(A62,5,2)=\"US\"),IF(RIGHT(A62,1)=\"C\",HYPERLINK(\"http://pathweb.pathwayservices.com/ohiopublic/?nlfid='\"&A62&\"'&logpoint=\"&C62,\"Pathway Images\"),\"Not Available\"),\"Not Available\"))","v":"Pathway Images"}]
[null,null,null,null,null,null,null,null,null,null,{"$f":"IF(OR(E63=\"\",F63=\"\"),\"\",HYPERLINK(CONCATENATE(\"http://maps.google.com/maps?q=\",+E63,\",+\",+F63,\"+(Begin Project)&iwloc=A&hl=en\"),\"Google Map\"))","v":""},null,{"$f":"IF(OR(E63=\"\",F63=\"\"),\"\",HYPERLINK(CONCATENATE(\"http://bing.com/maps/default.aspx?rtop=1~0&rtp=pos.\",E63,\"_\",F63,\"_\",\"Begin Project\"),\"Bing Maps\"))","v":""},null,""]
[null,null,null,null,null,null,null,null,null,null,"",null,"",null,""]
[null,null,null,null,null,null,null,null,null,null,"",null,"",null,""]
[null,null,null,null,null,null,null,null,null,null,"",null,"",null,""]
[null,null,null,null,null,null,null,null,null,null,"",null,"",null,""]
[null,null,null,null,null,null,null,null,null,null,"",null,"",null,""]
[null,null,null,null,null,null,null,null,null,null,"",null,"",null,""]
[null,null,null,null,null,null,null,null,null,null,"",null,"",null,""]
[null,null,null,null,null,null,null,null,null,null,"",null,"",null,""]
[]
["Project Funding"]
["Project Phase",null,null,"Safety Study","Interchange Mod. Study","PE - Environmental","PE - Detailed Design","Right of Way /Utilities","Construction","Total"]
["Fiscal Year",null,null,null,null,2024]
["Project Phase Completed",null,null,null,null,null,null,null,"N/A"]
["Previous Safety",null,null,null,null,null,null,null,null,{"$f":"SUM(D77:I77)","v":0}]
["New Safety",null,null,null,null,300000,null,null,null,{"$f":"SUM(D78:I78)","v":300000}]
["Sponsor Funding",null,null,null,null,null,null,null,null,0]
[null,null,null,null,null,null,null,null,null,0]
[null,null,null,null,null,null,null,null,null,0]
[null,null,null,null,null,null,null,null,null,0]
[null,null,null,null,null,null,null,null,null,0]
[null,null,null,null,null,null,null,null,null,0]
[null,null,null,null,null,null,null,null,null,0]
[null,null,null,null,null,null,null,null,null,0]
[null,null,"Total",{"$f":"SUM(D77:D86)","v":0},{"$f":"SUM(E77:E86)","v":0},300000,0,0,0,300000]
["Additional Funding Detail"]
["Funding for feasibility study only to get better cost estimate and right of way impacts/utility impacts for the DDI. Also consider alternative for loop ramps for the existing left turn movements from SR-747 NB and SB to SR-129 EB/WB. "]
[]
["Safety Economic Analysis Results"]
["Net Present Value of Project",null,null,null,{"$f":"IF(ScoringCalculations!D58=0,\"\",ScoringCalculations!D58)","v":6430000},null,"Net Benefit",null,{"$f":"IF(ScoringCalculations!D60=0,\"\",ScoringCalculations!D60)","v":-4623370.78}]
["Net Present Value of Safety Benefits",null,null,null,{"$f":"IF(ScoringCalculations!D59=0,\"\",ScoringCalculations!D59)","v":1806629.23},null,"Benefit / \nTotal Project Cost Ratio",null,{"$f":"IF(ScoringCalculations!D61=\"Unable to calculate\",\"\",ROUND(ScoringCalculations!D61,2))","v":0.28000000000000003}]
[null,null,null,null,null,null,"Benefit / Safety Funding Request Ratio",null,{"$f":"IF(E93=\"\",\"\",IF(J78=0,\"Please complete project funding table\",ROUND(E93/J78,2)))","v":6.02}]
[]
["Project Development"]
["Project Phase",null,null,null,"Completed by",null,null,"Completion Date"]
["Safety Study"]
["Interchange Modification Study"]
["PE-Environmental"]
["PE-Detailed Design"]
["Right of Way / Utilities"]
[]
["Applicant Information"]
["Name",null,null,null,null,"Title",null,null,"Phone Number"]
["Brianne Hetzel",null,null,null,null,"D8 Traffic Studies Engineer",null,null,{"$f":"IF(D6=\"\",\"\",D6)","v":"513-933-6624"}]
["Signature",null,null,null,null,null,null,null,"Date"]
[null,null,null,null,null,null,null,null,{"$f":"NOW()","v":"2023-03-31T14:21:34.330"}]
[]
[null,null,null,null,null,null,null,null,"Version:",20221028]
["The following information should be included in submission of the safety project application:\n1. An electronic copy of the Safety Engineering Study\n2. All Excel Analysis Files\n      May include Crash Analysis Module (CAM) Tool, Economic Crash Analysis Tool (ECAT), HSIP Application and Scoring Tool.\n3. Benefit-Cost Results (Economic Analysis)\n4. DSRT approval signatures"]
[]
["ODOT Use Only:"]
["Application ID:"]
["202303D08-05"]
["Document Library on Odrive:"]
["O:\\SAFETY\\D08\\SAFETY APPLICATIONS\\202303 Applications\\202303D08-05 BUT SR-747 @ SR-129 interchange"]

{"sheet":"DSRTSignature","index":2,"n_rows":47,"n_cols":27,"rows_kept":47,"cut":false,"hidden":true,"merged":[[31,0,31,9],[32,0,32,4],[32,5,32,7],[33,0,33,4],[33,5,33,7],[16,0,16,9],[27,0,27,4],[27,5,27,7],[28,0,28,4],[28,5,28,7],[23,5,23,7],[24,0,24,7],[19,0,19,7],[19,8,19,9],[20,0,20,7],[20,8,20,9],[18,0,18,4],[18,5,18,7],[21,0,21,9],[22,0,22,4],[22,5,22,7],[30,0,30,7],[24,8,24,9],[25,0,25,7],[29,8,29,9],[29,0,29,7],[30,8,30,9],[25,8,25,9],[26,0,26,9],[40,0,40,7],[40,8,40,9],[35,0,35,7],[36,0,36,9],[34,0,34,7],[34,8,34,9],[35,8,35,9],[39,8,39,9],[37,0,37,4],[37,5,37,7],[38,0,38,4],[38,5,38,7],[39,0,39,7],[46,0,46,9],[41,0,41,9],[42,0,42,4],[42,5,42,7],[43,0,43,4],[43,5,43,7],[44,0,44,7],[44,8,44,9],[45,0,45,7],[45,8,45,9],[23,0,23,4],[8,0,8,9],[9,0,9,9],[4,0,4,2],[4,3,4,9],[5,0,5,2],[5,3,5,9],[6,0,6,2],[6,3,6,9],[10,0,10,9],[11,0,11,9],[12,0,12,9],[17,0,17,4],[17,5,17,7],[13,0,13,9],[14,0,14,9],[3,0,3,2],[3,3,3,9],[0,0,0,9],[1,0,1,2],[1,3,1,9],[2,0,2,2],[2,3,2,9]]}
["General Project Information",null,null,null,null,null,null,null,null,null,null,null,null,null,null,null,null,null,null,null,null,null,null,null,null,"Show Conditional Format:","Yes"]
["Project Sponsoring Agency",null,null,null,null,null,null,null,null,null,null,null,null,null,null,null,null,null,null,null,null,null,null,null,null,"Lat Long Format:","Yes"]
["Project Name",null,null,"","","","","","","",null,null,null,null,null,null,null,null,null,null,null,null,null,null,null,"Priority Rank Format:","Yes"]
["PID",null,null,"","","","","","",""]
["Project Manager"]
["Contact Phone"]
["Contact Email"]
[]
["Project Description"]
["Summary of Crash Patterns"]
[]
["Summary of Recommended Countermeasures","Summary of Recommended Countermeasures","Summary of Recommended Countermeasures","Summary of Recommended Countermeasures","Summary of Recommended Countermeasures","Summary of Recommended Countermeasures","Summary of Recommended Countermeasures","Summary of Recommended Countermeasures","Summary of Recommended Countermeasures","Summary of Recommended Countermeasures"]
[]
["Project Priority Information","Project Priority Information","Project Priority Information","Project Priority Information","Project Priority Information","Project Priority Information","Project Priority Information","Project Priority Information","Project Priority Information","Project Priority Information"]
[]
[]
["District Safety Review Team Signatures"]
["Name",null,null,null,null,"Title",null,null,"Approve","Disapprove"]
[null,null,null,null,null,"Planning & Engineering Administrator",null,null,"¨","¨"]
["Signature",null,null,null,null,null,null,null,"Date"]
[]
["Comments:"]
["Name",null,null,null,null,"Title",null,null,"Approve","Disapprove"]
[null,null,null,null,null,"Highway Management Adminstrator",null,null,"¨","¨"]
["Signature",null,null,null,null,null,null,null,"Date"]
[]
["Comments:"]
["Name",null,null,null,null,"Title",null,null,"Approve","Disapprove"]
[null,null,null,null,null,"Design Engineer",null,null,"¨","¨"]
["Signature",null,null,null,null,null,null,null,"Date"]
[]
["Comments:"]
["Name",null,null,null,null,"Title",null,null,"Approve","Disapprove"]
[null,null,null,null,null,"Planning Manager",null,null,"¨","¨"]
["Signature",null,null,null,null,null,null,null,"Date"]
[]
["Comments:"]
["Name",null,null,null,null,"Title",null,null,"Approve","Disapprove"]
[null,null,null,null,null,"Traffic Engineer",null,null,"¨","¨"]
["Signature",null,null,null,null,null,null,null,"Date"]
[]
["Comments:"]
["Name",null,null,null,null,"Title",null,null,"Approve","Disapprove"]
[null,null,null,null,null,"Other",null,null,"¨","¨"]
["Signature",null,null,null,null,null,null,null,"Date"]
[]
["Comments:"]

{"sheet":"Project Scoring","index":3,"n_rows":16,"n_cols":9,"rows_kept":16,"cut":false,"hidden":true,"merged":[[8,1,8,6],[15,1,15,7],[12,1,12,6],[13,1,13,6],[10,1,10,6],[9,1,9,6],[11,1,11,6],[0,0,0,9],[1,0,1,9],[2,0,2,1],[2,2,2,4],[2,5,2,6],[2,7,2,9],[3,0,3,1],[3,2,3,4],[3,5,3,6],[3,7,3,9],[4,0,4,1],[4,2,4,4],[4,5,4,6],[4,7,4,9],[5,0,5,1],[5,2,5,4],[5,5,5,6],[5,7,5,9],[6,0,6,1],[6,2,6,4],[6,5,6,6],[6,7,6,9]]}
["Project Scoring Summary"]
["General Project Information"]
["Project Name",null,null,null,null,"Contact Email"]
["Project Description",null,null,null,null,"Contact Phone"]
["Reference Number",null,null,null,null,"Date Performed"]
["Analyst",null,null,null,null,"Analysis Year"]
["Agency/Company",null,null,null,null,"Analysis Type Performed"]
[]
[null,"Category",null,null,null,null,null,"Value","Points Awarded"]
[null,{"$f":"'Safety Application'!A37","v":"Ratio of Observed Fatal and Serious Injuries to Observed Total Crashes"},null,null,null,null,null,{"$f":"IF('Safety Application'!H37=\"\",\"\",'Safety Application'!H37)","v":0.05},{"$f":"IF('Safety Application'!I37=\"\",\"\",'Safety Application'!I37)","v":10}]
[null,{"$f":"'Safety Application'!A38","v":"Percentage of the Potential for Safety Improvement to Total Expected Crashes"},null,null,null,null,null,{"$f":"IF('Safety Application'!H38=\"\",\"\",'Safety Application'!H38)","v":0.19650000000000001},{"$f":"IF('Safety Application'!I38=\"\",\"\",'Safety Application'!I38)","v":14}]
[null,{"$f":"'Safety Application'!A39","v":"Relative Severity Index"},null,null,null,null,null,{"$f":"IF('Safety Application'!H39=\"\",\"\",'Safety Application'!H39)","v":28889.8},{"$f":"IF('Safety Application'!I39=\"\",\"\",'Safety Application'!I39)","v":8}]
[null,{"$f":"'Safety Application'!A40","v":"Equivalent Property Damage Only Index"},null,null,null,null,null,{"$f":"IF('Safety Application'!H40=\"\",\"\",'Safety Application'!H40)","v":2.9},{"$f":"IF('Safety Application'!I40=\"\",\"\",'Safety Application'!I40)","v":8}]
[null,{"$f":"'Safety Application'!A41","v":"Location Equity Measure"},null,null,null,null,null,{"$f":"IF('Safety Application'!H41=\"\",\"\",'Safety Application'!H41)","v":0},{"$f":"IF('Safety Application'!I41=\"\",\"\",'Safety Application'!I41)","v":""}]
[]
[null,"Safety Application Score",null,null,null,null,null,null,{"$f":"SUM(I10:I14)","v":40}]

{"sheet":"ScoringCalculations","index":4,"n_rows":61,"n_cols":56,"rows_kept":61,"cut":false,"hidden":false,"merged":[[4,0,4,1],[4,2,4,4],[4,5,4,6],[4,7,4,9],[5,0,5,1],[5,2,5,4],[5,5,5,6],[5,7,5,9],[2,0,2,1],[2,2,2,4],[2,5,2,6],[2,7,2,9],[3,0,3,1],[3,2,3,4],[3,5,3,6],[3,7,3,9],[0,0,0,9],[1,0,1,1],[1,2,1,4],[1,5,1,6],[1,7,1,9],[50,26,50,28],[40,26,40,33],[41,26,41,28],[42,26,42,28],[43,26,43,28],[44,26,44,28],[45,26,45,28],[47,26,47,33],[48,26,48,28],[49,26,49,28],[55,0,55,7],[57,3,57,4],[58,3,58,4],[59,3,59,4],[60,3,60,4],[50,0,50,7],[51,0,51,2],[52,0,52,2],[41,0,41,2],[42,0,42,2],[43,0,43,2],[44,0,44,2],[46,0,46,2],[45,0,45,2],[48,0,48,2],[47,0,47,2],[40,0,40,7],[35,1,35,2],[39,0,39,7],[7,0,7,3],[12,0,12,3]]}
["Project Scoring Summary",null,null,null,null,null,null,null,null,null,null,null,null,null,null,null,null,null,null,null,null,null,null,null,null,null,"HSM Analysis Type:","ECAT - Change in base SPF"]
["Project Name",null,"SR-747 at SR-129 Interchanges and Grandin Ridge Drive/Logsdons Meadow Drive",null,null,"Contact Email",null,"kristi@lanhamengineering.com"]
["Project Description",null,"SR-747-5.49 Safety Study: Existing",null,null,"Contact Phone",null,"309-269-0238"]
["Reference Number",null,null,null,null,"Date Performed",null,"2022-06-30"]
["Analyst",null,"KMN",null,null,"Analysis Year",null,"2018-2020"]
["Agency/Company",null,"Lanham Engineering, LLC",null,null,"Analysis Type Performed",null,""]
[]
["Relative Severity Index Calculation",null,null,null,null,null,null,null,null,null,null,null,null,null,null,null,null,null,null,null,null,null,null,null,null,null,null,null,null,null,null,null,null,null,"All Sites"]
["ODOT District","STW",null,null,null,null,null,null,null,null,null,null,null,null,null,null,null,null,null,null,null,null,null,null,null,null,"NLFID:",null,null,null,"FindTruck",0,null,null,"HSM Elements Only",null,null,null,null,null,null,null,null,null,null,null,null,null,null,null,null,null,"Crash Costs (2021)"]
["Urban Area","Yes",null,null,null,null,null,null,null,null,null,null,null,null,null,null,null,null,null,null,null,null,null,null,null,null,"Blog:",null,null,null,"FindVC",0,null,null,"Observed Elements Only",null,null,null,null,null,null,null,null,null,null,null,null,null,null,null,null,null,"KA","B","C","O"]
["Freeway","No",null,null,null,null,null,null,null,null,null,null,null,null,null,null,null,null,null,null,null,null,null,null,null,null,"Elog:",null,null,null,null,null,null,null,null,null,null,null,null,null,null,null,null,null,null,null,null,null,null,null,null,null,460098,66621,45156,10176]
[null,null,null,null,null,null,null,null,null,null,null,null,null,null,null,null,null,null,null,null,null,null,null,null,null,null,"WAADT:",null,null,null,null,null,null,null,null,null,null,null,null,null,null,null,null,null,null,null,null,null,null,null,null,null,{"$f":"ROUND(BA11/$BD$11,2)","v":45.21},{"$f":"ROUND(BB11/$BD$11,2)","v":6.55},{"$f":"ROUND(BC11/$BD$11,2)","v":4.4400000000000004},{"$f":"ROUND(BD11/$BD$11,2)","v":1}]
["Fill in the Number of Crashes by Crash Type",null,null,null,null,null,null,null,null,null,null,null,null,null,null,null,null,null,null,null,null,null,null,null,null,null,"WAADTT:"]
["Crash Type","Number of Crashes","Crash Type Severity Calc","RSI Multiplier",null,null,null,null,null,null,null,null,null,null,null,null,null,null,null,null,null,null,null,null,null,null,"WVCRatio:"]
["Unknown",1.5324809999999993E-2,{"$f":"IF(OR($B$9=\"\",$B$10=\"\",$B$11=\"\"),\"\",B15*D15)","v":430.94898200999978},{"$f":"IFERROR(ROUND(IF($B$9=\"STW\",SUMIFS(RSI_Data!$F:$F,RSI_Data!$C:$C,$B$10,RSI_Data!$D:$D,$B$11,RSI_Data!$E:$E,$A15)/SUMIFS(RSI_Data!$G:$G,RSI_Data!$C:$C,$B$10,RSI_Data!$D:$D,$B$11,RSI_Data!$E:$E,$A15),SUMIFS(RSI_Data!$F:$F,RSI_Data!$C:$C,$B$10,RSI_Data!$D:$D,$B$11,RSI_Data!$A:$A,$B$9,RSI_Data!$E:$E,$A15)/SUMIFS(RSI_Data!$G:$G,RSI_Data!$C:$C,$B$10,RSI_Data!$D:$D,$B$11,RSI_Data!$A:$A,$B$9,RSI_Data!$E:$E,$A15)),0),0)","v":28121},null,null,null,null,null,null,null,null,null,null,null,null,null,null,null,null,null,null,null,null,null,null,"TotalLength:"]
["Head On",7.12116E-2,{"$f":"IF(OR($B$9=\"\",$B$10=\"\",$B$11=\"\"),\"\",B16*D16)","v":5333.6064168000003},{"$f":"IFERROR(ROUND(IF($B$9=\"STW\",SUMIFS(RSI_Data!$F:$F,RSI_Data!$C:$C,$B$10,RSI_Data!$D:$D,$B$11,RSI_Data!$E:$E,$A16)/SUMIFS(RSI_Data!$G:$G,RSI_Data!$C:$C,$B$10,RSI_Data!$D:$D,$B$11,RSI_Data!$E:$E,$A16),SUMIFS(RSI_Data!$F:$F,RSI_Data!$C:$C,$B$10,RSI_Data!$D:$D,$B$11,RSI_Data!$A:$A,$B$9,RSI_Data!$E:$E,$A16)/SUMIFS(RSI_Data!$G:$G,RSI_Data!$C:$C,$B$10,RSI_Data!$D:$D,$B$11,RSI_Data!$A:$A,$B$9,RSI_Data!$E:$E,$A16)),0),0)","v":74898},null,null,null,null,null,null,null,null,null,null,null,null,null,null,null,null,null,null,null,null,null,null,"Functional Class:",null,{"$f":"IFERROR(VLOOKUP(AB16,RefTables!E27:F34,2,FALSE),\"Other\")","v":"Other"}]
["Rear End",9.6469679700000004,231951.69787068001,{"$f":"IFERROR(ROUND(IF($B$9=\"STW\",SUMIFS(RSI_Data!$F:$F,RSI_Data!$C:$C,$B$10,RSI_Data!$D:$D,$B$11,RSI_Data!$E:$E,$A17)/SUMIFS(RSI_Data!$G:$G,RSI_Data!$C:$C,$B$10,RSI_Data!$D:$D,$B$11,RSI_Data!$E:$E,$A17),SUMIFS(RSI_Data!$F:$F,RSI_Data!$C:$C,$B$10,RSI_Data!$D:$D,$B$11,RSI_Data!$A:$A,$B$9,RSI_Data!$E:$E,$A17)/SUMIFS(RSI_Data!$G:$G,RSI_Data!$C:$C,$B$10,RSI_Data!$D:$D,$B$11,RSI_Data!$A:$A,$B$9,RSI_Data!$E:$E,$A17)),0),0)","v":24044},null,null,null,null,null,null,null,null,null,null,null,null,null,null,null,null,null,null,null,null,null,null,"Truck %:",{"$f":"IFERROR(ROUND(AB13/AB12,4),\"\")","v":""}]
["Backing",0.28940355000000012,3673.9780672500015,{"$f":"IFERROR(ROUND(IF($B$9=\"STW\",SUMIFS(RSI_Data!$F:$F,RSI_Data!$C:$C,$B$10,RSI_Data!$D:$D,$B$11,RSI_Data!$E:$E,$A18)/SUMIFS(RSI_Data!$G:$G,RSI_Data!$C:$C,$B$10,RSI_Data!$D:$D,$B$11,RSI_Data!$E:$E,$A18),SUMIFS(RSI_Data!$F:$F,RSI_Data!$C:$C,$B$10,RSI_Data!$D:$D,$B$11,RSI_Data!$A:$A,$B$9,RSI_Data!$E:$E,$A18)/SUMIFS(RSI_Data!$G:$G,RSI_Data!$C:$C,$B$10,RSI_Data!$D:$D,$B$11,RSI_Data!$A:$A,$B$9,RSI_Data!$E:$E,$A18)),0),0)","v":12695}]
["Sideswipe - Meeting",0.18100547,6636.0225411399997,{"$f":"IFERROR(ROUND(IF($B$9=\"STW\",SUMIFS(RSI_Data!$F:$F,RSI_Data!$C:$C,$B$10,RSI_Data!$D:$D,$B$11,RSI_Data!$E:$E,$A19)/SUMIFS(RSI_Data!$G:$G,RSI_Data!$C:$C,$B$10,RSI_Data!$D:$D,$B$11,RSI_Data!$E:$E,$A19),SUMIFS(RSI_Data!$F:$F,RSI_Data!$C:$C,$B$10,RSI_Data!$D:$D,$B$11,RSI_Data!$A:$A,$B$9,RSI_Data!$E:$E,$A19)/SUMIFS(RSI_Data!$G:$G,RSI_Data!$C:$C,$B$10,RSI_Data!$D:$D,$B$11,RSI_Data!$A:$A,$B$9,RSI_Data!$E:$E,$A19)),0),0)","v":36662}]
["Sideswipe - Passing",2.3425318100000001,44650.998830410004,{"$f":"IFERROR(ROUND(IF($B$9=\"STW\",SUMIFS(RSI_Data!$F:$F,RSI_Data!$C:$C,$B$10,RSI_Data!$D:$D,$B$11,RSI_Data!$E:$E,$A20)/SUMIFS(RSI_Data!$G:$G,RSI_Data!$C:$C,$B$10,RSI_Data!$D:$D,$B$11,RSI_Data!$E:$E,$A20),SUMIFS(RSI_Data!$F:$F,RSI_Data!$C:$C,$B$10,RSI_Data!$D:$D,$B$11,RSI_Data!$A:$A,$B$9,RSI_Data!$E:$E,$A20)/SUMIFS(RSI_Data!$G:$G,RSI_Data!$C:$C,$B$10,RSI_Data!$D:$D,$B$11,RSI_Data!$A:$A,$B$9,RSI_Data!$E:$E,$A20)),0),0)","v":19061}]
["Angle",3.56547671,128884.85211307999,{"$f":"IFERROR(ROUND(IF($B$9=\"STW\",SUMIFS(RSI_Data!$F:$F,RSI_Data!$C:$C,$B$10,RSI_Data!$D:$D,$B$11,RSI_Data!$E:$E,$A21)/SUMIFS(RSI_Data!$G:$G,RSI_Data!$C:$C,$B$10,RSI_Data!$D:$D,$B$11,RSI_Data!$E:$E,$A21),SUMIFS(RSI_Data!$F:$F,RSI_Data!$C:$C,$B$10,RSI_Data!$D:$D,$B$11,RSI_Data!$A:$A,$B$9,RSI_Data!$E:$E,$A21)/SUMIFS(RSI_Data!$G:$G,RSI_Data!$C:$C,$B$10,RSI_Data!$D:$D,$B$11,RSI_Data!$A:$A,$B$9,RSI_Data!$E:$E,$A21)),0),0)","v":36148}]
["Parked Vehicle",0.29020057999999999,5554.4391011999996,{"$f":"IFERROR(ROUND(IF($B$9=\"STW\",SUMIFS(RSI_Data!$F:$F,RSI_Data!$C:$C,$B$10,RSI_Data!$D:$D,$B$11,RSI_Data!$E:$E,$A22)/SUMIFS(RSI_Data!$G:$G,RSI_Data!$C:$C,$B$10,RSI_Data!$D:$D,$B$11,RSI_Data!$E:$E,$A22),SUMIFS(RSI_Data!$F:$F,RSI_Data!$C:$C,$B$10,RSI_Data!$D:$D,$B$11,RSI_Data!$A:$A,$B$9,RSI_Data!$E:$E,$A22)/SUMIFS(RSI_Data!$G:$G,RSI_Data!$C:$C,$B$10,RSI_Data!$D:$D,$B$11,RSI_Data!$A:$A,$B$9,RSI_Data!$E:$E,$A22)),0),0)","v":19140}]
["Pedestrian",6.4799999999999996E-2,9574.5887999999995,{"$f":"IFERROR(ROUND(IF($B$9=\"STW\",SUMIFS(RSI_Data!$F:$F,RSI_Data!$C:$C,$B$10,RSI_Data!$D:$D,$B$11,RSI_Data!$E:$E,$A23)/SUMIFS(RSI_Data!$G:$G,RSI_Data!$C:$C,$B$10,RSI_Data!$D:$D,$B$11,RSI_Data!$E:$E,$A23),SUMIFS(RSI_Data!$F:$F,RSI_Data!$C:$C,$B$10,RSI_Data!$D:$D,$B$11,RSI_Data!$A:$A,$B$9,RSI_Data!$E:$E,$A23)/SUMIFS(RSI_Data!$G:$G,RSI_Data!$C:$C,$B$10,RSI_Data!$D:$D,$B$11,RSI_Data!$A:$A,$B$9,RSI_Data!$E:$E,$A23)),0),0)","v":147756}]
["Animal",3.5010470000000002E-2,479.60842853000003,{"$f":"IFERROR(ROUND(IF($B$9=\"STW\",SUMIFS(RSI_Data!$F:$F,RSI_Data!$C:$C,$B$10,RSI_Data!$D:$D,$B$11,RSI_Data!$E:$E,$A24)/SUMIFS(RSI_Data!$G:$G,RSI_Data!$C:$C,$B$10,RSI_Data!$D:$D,$B$11,RSI_Data!$E:$E,$A24),SUMIFS(RSI_Data!$F:$F,RSI_Data!$C:$C,$B$10,RSI_Data!$D:$D,$B$11,RSI_Data!$A:$A,$B$9,RSI_Data!$E:$E,$A24)/SUMIFS(RSI_Data!$G:$G,RSI_Data!$C:$C,$B$10,RSI_Data!$D:$D,$B$11,RSI_Data!$A:$A,$B$9,RSI_Data!$E:$E,$A24)),0),0)","v":13699}]
["Train",6.5560000000000002E-5,5.7421381600000005,{"$f":"IFERROR(ROUND(IF($B$9=\"STW\",SUMIFS(RSI_Data!$F:$F,RSI_Data!$C:$C,$B$10,RSI_Data!$D:$D,$B$11,RSI_Data!$E:$E,$A25)/SUMIFS(RSI_Data!$G:$G,RSI_Data!$C:$C,$B$10,RSI_Data!$D:$D,$B$11,RSI_Data!$E:$E,$A25),SUMIFS(RSI_Data!$F:$F,RSI_Data!$C:$C,$B$10,RSI_Data!$D:$D,$B$11,RSI_Data!$A:$A,$B$9,RSI_Data!$E:$E,$A25)/SUMIFS(RSI_Data!$G:$G,RSI_Data!$C:$C,$B$10,RSI_Data!$D:$D,$B$11,RSI_Data!$A:$A,$B$9,RSI_Data!$E:$E,$A25)),0),0)","v":87586}]
["Pedalcycles",0.1180011,11594.788086,{"$f":"IFERROR(ROUND(IF($B$9=\"STW\",SUMIFS(RSI_Data!$F:$F,RSI_Data!$C:$C,$B$10,RSI_Data!$D:$D,$B$11,RSI_Data!$E:$E,$A26)/SUMIFS(RSI_Data!$G:$G,RSI_Data!$C:$C,$B$10,RSI_Data!$D:$D,$B$11,RSI_Data!$E:$E,$A26),SUMIFS(RSI_Data!$F:$F,RSI_Data!$C:$C,$B$10,RSI_Data!$D:$D,$B$11,RSI_Data!$A:$A,$B$9,RSI_Data!$E:$E,$A26)/SUMIFS(RSI_Data!$G:$G,RSI_Data!$C:$C,$B$10,RSI_Data!$D:$D,$B$11,RSI_Data!$A:$A,$B$9,RSI_Data!$E:$E,$A26)),0),0)","v":98260}]
["Other Non-Vehicle",0,0,{"$f":"IFERROR(ROUND(IF($B$9=\"STW\",SUMIFS(RSI_Data!$F:$F,RSI_Data!$C:$C,$B$10,RSI_Data!$D:$D,$B$11,RSI_Data!$E:$E,$A27)/SUMIFS(RSI_Data!$G:$G,RSI_Data!$C:$C,$B$10,RSI_Data!$D:$D,$B$11,RSI_Data!$E:$E,$A27),SUMIFS(RSI_Data!$F:$F,RSI_Data!$C:$C,$B$10,RSI_Data!$D:$D,$B$11,RSI_Data!$A:$A,$B$9,RSI_Data!$E:$E,$A27)/SUMIFS(RSI_Data!$G:$G,RSI_Data!$C:$C,$B$10,RSI_Data!$D:$D,$B$11,RSI_Data!$A:$A,$B$9,RSI_Data!$E:$E,$A27)),0),0)","v":116914}]
["Fixed Object",0.97969520999999993,39995.077253039999,{"$f":"IFERROR(ROUND(IF($B$9=\"STW\",SUMIFS(RSI_Data!$F:$F,RSI_Data!$C:$C,$B$10,RSI_Data!$D:$D,$B$11,RSI_Data!$E:$E,$A28)/SUMIFS(RSI_Data!$G:$G,RSI_Data!$C:$C,$B$10,RSI_Data!$D:$D,$B$11,RSI_Data!$E:$E,$A28),SUMIFS(RSI_Data!$F:$F,RSI_Data!$C:$C,$B$10,RSI_Data!$D:$D,$B$11,RSI_Data!$A:$A,$B$9,RSI_Data!$E:$E,$A28)/SUMIFS(RSI_Data!$G:$G,RSI_Data!$C:$C,$B$10,RSI_Data!$D:$D,$B$11,RSI_Data!$A:$A,$B$9,RSI_Data!$E:$E,$A28)),0),0)","v":40824}]
["Other Object",4.0708880000000003E-2,835.38692648000006,{"$f":"IFERROR(ROUND(IF($B$9=\"STW\",SUMIFS(RSI_Data!$F:$F,RSI_Data!$C:$C,$B$10,RSI_Data!$D:$D,$B$11,RSI_Data!$E:$E,$A29)/SUMIFS(RSI_Data!$G:$G,RSI_Data!$C:$C,$B$10,RSI_Data!$D:$D,$B$11,RSI_Data!$E:$E,$A29),SUMIFS(RSI_Data!$F:$F,RSI_Data!$C:$C,$B$10,RSI_Data!$D:$D,$B$11,RSI_Data!$A:$A,$B$9,RSI_Data!$E:$E,$A29)/SUMIFS(RSI_Data!$G:$G,RSI_Data!$C:$C,$B$10,RSI_Data!$D:$D,$B$11,RSI_Data!$A:$A,$B$9,RSI_Data!$E:$E,$A29)),0),0)","v":20521}]
["Overturning",8.3201890000000001E-2,8548.74459183,{"$f":"IFERROR(ROUND(IF($B$9=\"STW\",SUMIFS(RSI_Data!$F:$F,RSI_Data!$C:$C,$B$10,RSI_Data!$D:$D,$B$11,RSI_Data!$E:$E,$A30)/SUMIFS(RSI_Data!$G:$G,RSI_Data!$C:$C,$B$10,RSI_Data!$D:$D,$B$11,RSI_Data!$E:$E,$A30),SUMIFS(RSI_Data!$F:$F,RSI_Data!$C:$C,$B$10,RSI_Data!$D:$D,$B$11,RSI_Data!$A:$A,$B$9,RSI_Data!$E:$E,$A30)/SUMIFS(RSI_Data!$G:$G,RSI_Data!$C:$C,$B$10,RSI_Data!$D:$D,$B$11,RSI_Data!$A:$A,$B$9,RSI_Data!$E:$E,$A30)),0),0)","v":102747}]
["Other Non-Collision",0.1295926,4827.5835352000004,{"$f":"IFERROR(ROUND(IF($B$9=\"STW\",SUMIFS(RSI_Data!$F:$F,RSI_Data!$C:$C,$B$10,RSI_Data!$D:$D,$B$11,RSI_Data!$E:$E,$A31)/SUMIFS(RSI_Data!$G:$G,RSI_Data!$C:$C,$B$10,RSI_Data!$D:$D,$B$11,RSI_Data!$E:$E,$A31),SUMIFS(RSI_Data!$F:$F,RSI_Data!$C:$C,$B$10,RSI_Data!$D:$D,$B$11,RSI_Data!$A:$A,$B$9,RSI_Data!$E:$E,$A31)/SUMIFS(RSI_Data!$G:$G,RSI_Data!$C:$C,$B$10,RSI_Data!$D:$D,$B$11,RSI_Data!$A:$A,$B$9,RSI_Data!$E:$E,$A31)),0),0)","v":37252}]
["Left Turn",1.5333028899999999,57094.066412039996,{"$f":"IFERROR(ROUND(IF($B$9=\"STW\",SUMIFS(RSI_Data!$F:$F,RSI_Data!$C:$C,$B$10,RSI_Data!$D:$D,$B$11,RSI_Data!$E:$E,$A32)/SUMIFS(RSI_Data!$G:$G,RSI_Data!$C:$C,$B$10,RSI_Data!$D:$D,$B$11,RSI_Data!$E:$E,$A32),SUMIFS(RSI_Data!$F:$F,RSI_Data!$C:$C,$B$10,RSI_Data!$D:$D,$B$11,RSI_Data!$A:$A,$B$9,RSI_Data!$E:$E,$A32)/SUMIFS(RSI_Data!$G:$G,RSI_Data!$C:$C,$B$10,RSI_Data!$D:$D,$B$11,RSI_Data!$A:$A,$B$9,RSI_Data!$E:$E,$A32)),0),0)","v":37236}]
["Right Turn",0,0,{"$f":"IFERROR(ROUND(IF($B$9=\"STW\",SUMIFS(RSI_Data!$F:$F,RSI_Data!$C:$C,$B$10,RSI_Data!$D:$D,$B$11,RSI_Data!$E:$E,$A33)/SUMIFS(RSI_Data!$G:$G,RSI_Data!$C:$C,$B$10,RSI_Data!$D:$D,$B$11,RSI_Data!$E:$E,$A33),SUMIFS(RSI_Data!$F:$F,RSI_Data!$C:$C,$B$10,RSI_Data!$D:$D,$B$11,RSI_Data!$A:$A,$B$9,RSI_Data!$E:$E,$A33)/SUMIFS(RSI_Data!$G:$G,RSI_Data!$C:$C,$B$10,RSI_Data!$D:$D,$B$11,RSI_Data!$A:$A,$B$9,RSI_Data!$E:$E,$A33)),0),0)","v":21036}]
["Totals",{"$f":"SUM(B15:B33)","v":19.386501100000004},{"$f":"SUM(C15:C33)","v":560072.13009384996}]
[]
["RSI Value = ",{"$f":"IFERROR(ROUND(C34/B34,2),0)","v":28889.8}]
[]
[]
[]
["All Sites"]
["Crash Frequencies Per Year Summary Results",null,null,null,null,null,null,null,null,null,null,null,null,null,null,null,null,null,null,null,null,null,null,null,null,null,"Project EB Method Summary Results (Without Animal Crashes)"]
[null,null,null,"KA","B","C","O","Total",null,null,null,null,null,null,null,null,null,null,null,null,null,null,null,null,null,null,null,null,null,"KA","B","C","O","Total"]
["Existing Conditions: Predicted Crash Frequency",null,null,{"$f":"IF($AH$43+$AH$50=0,\"\",IF($A$40=$AI$10,AD50,IF($A$40=$AI$9,AD43,AD43+AD50)))","v":0.48489999999999994},{"$f":"IF($AH$43+$AH$50=0,\"\",IF($A$40=$AI$10,AE50,IF($A$40=$AI$9,AE43,AE43+AE50)))","v":1.9638999999999998},2.9813000000000001,14.086300000000001,{"$f":"ROUND(SUM(D43:G43),2)","v":19.52},null,null,null,null,null,null,null,null,null,null,null,null,null,null,null,null,null,null,"Existing Conditions: Predicted Crash Frequency",null,null,0.48489999999999994,1.9638999999999998,2.9813000000000001,14.086300000000001,19.516400000000001]
["Existing Conditions: Expected Crash Frequency",null,null,{"$f":"IF($AH$44+$AH$50=0,\"\",IF($A$41=$AI$10,AD50,IF($A$41=$AI$9,AD44,AD44+AD50)))","v":0.5222},{"$f":"IF($AH$44+$AH$50=0,\"\",IF($A$41=$AI$10,AE50,IF($A$41=$AI$9,AE44,AE44+AE50)))","v":2.1368},3.2578,18.366799999999998,24.28,null,null,null,null,null,null,null,null,null,null,null,null,null,null,null,null,null,null,"Existing Conditions: Expected Crash Frequency",null,null,0.5222,2.1368,3.2578,18.366799999999998,24.2836]
["Potential for Safety Improvement",null,null,{"$f":"IF($AH$43+$AH$50=0,\"\",D44-D43)","v":3.7300000000000055E-2},{"$f":"IF($AH$43+$AH$50=0,\"\",E44-E43)","v":0.17290000000000028},0.27649999999999997,4.2804999999999964,4.7699999999999996,null,null,null,null,null,null,null,null,null,null,null,null,null,null,null,null,null,null,"Potential for Safety Improvement",null,null,3.7300000000000055E-2,0.17290000000000028,0.27649999999999997,4.2804999999999964,4.767199999999999]
[{"$f":"\"Proposed Conditions: \"&IF('Project Scoring'!$H$7=\"ECAT - Change in base SPF\",\"Predicted\",\"Expected\")&\" Crash Frequency\"","v":"Proposed Conditions: Expected Crash Frequency"},null,null,{"$f":"IF($AH$46+$AH$51=0,\"\",IF($A$43=$AI$10,AD51,IF($A$43=$AI$9,AD46,AD46+AD51)))","v":0.34639999999999999},{"$f":"IF($AH$46+$AH$51=0,\"\",IF($A$43=$AI$10,AE51,IF($A$43=$AI$9,AE46,AE46+AE51)))","v":1.4200999999999999},2.2084000000000001,12.4259,16.399999999999999,null,null,null,null,null,null,null,null,null,null,null,null,null,null,null,null,null,null,{"$f":"\"Proposed Conditions: \"&IF('Project Scoring'!$H$7=\"ECAT - Change in base SPF\",\"Predicted\",\"Expected\")&\" Crash Frequency\"","v":"Proposed Conditions: Expected Crash Frequency"},null,null,0.34639999999999999,1.4200999999999999,2.2084000000000001,12.4259,16.4008]
["Observed Crashes",null,null,1,4.3333000000000004,3.3332999999999999,24.666699999999999,33.33]
["Equivalent Property Damage Only Factor",null,null,{"$f":"BA12","v":45.21},{"$f":"BB12","v":6.55},4.4400000000000004,1,null,null,null,null,null,null,null,null,null,null,null,null,null,null,null,null,null,null,null,"Project EB Method Summary Results (Without Animal Crashes)"]
["Equivalent Property Damage Only Value",null,null,{"$f":"IF($H$44=0,D48*D47,D44*D48)","v":23.608661999999999},{"$f":"IF($H$44=0,E48*E47,E44*E48)","v":13.996040000000001},14.464632000000002,18.366799999999998,{"$f":"ROUND(SUM(D49:G49),2)","v":70.44},null,null,null,null,null,null,null,null,null,null,null,null,null,null,null,null,null,null,null,null,null,"KA","B","C","O","Total"]
[null,null,null,null,null,null,null,null,null,null,null,null,null,null,null,null,null,null,null,null,null,null,null,null,null,null,"Existing Conditions Observed Crashes",null,null,0,0,0,0,0]
["People Injuries Per Year Summary Results ",null,null,null,null,null,null,null,null,null,null,null,null,null,null,null,null,null,null,null,null,null,null,null,null,null,"Proposed Conditions Observed Crashes",null,null,0,0,0,0,0]
[null,null,null,"K","A","B","C","Total"]
["Observed Totals",null,null,0,1.6667000000000001,5.3333000000000004,9,{"$f":"ROUND(SUM(D53:G53),2)","v":16}]
[]
[]
["Benefit - Cost Ratio Calculations"]
[]
[null,null,"Net Present Value of Project",6430000]
[null,null,"Net Present Value of Safety Benefits",1806629.23]
[null,null,"Net Benefit",-4623370.78]
[null,null,"Benefit / Cost Ratio",0.28096877526484154]

{"sheet":"ScoringTable","index":5,"n_rows":26,"n_cols":36,"rows_kept":26,"cut":false,"hidden":false,"merged":[[0,0,0,9],[0,26,0,35],[1,26,1,27],[1,28,1,29],[1,30,1,31],[1,32,1,33],[1,34,1,35],[1,0,1,9],[25,9,26,9],[23,9,24,9],[2,6,2,7],[2,8,2,9],[2,0,2,1],[2,2,2,3],[2,4,2,5]]}
["ODOT Highway Safety Improvement Program (HSIP)",null,null,null,null,null,null,null,null,null,null,null,null,null,null,null,null,null,null,null,null,null,null,null,null,null,"Safety Criteria"]
["Formal Funding Application Scoring Criteria",null,null,null,null,null,null,null,null,null,null,null,null,null,null,null,null,null,null,null,null,null,null,null,null,null,"Ratio of Observed Fatal and Serious Injuries to Observed Total Crashes",null,"Percentage of the Potential for Safety Improvement to Total Expected Crashes",null,"Relative Severity Index",null,"Equivalent Property Damage Only Index",null,"Location Equity Measure"]
[{"$f":"AA2","v":"Ratio of Observed Fatal and Serious Injuries to Observed Total Crashes"},null,{"$f":"AC2","v":"Percentage of the Potential for Safety Improvement to Total Expected Crashes"},null,{"$f":"AE2","v":"Relative Severity Index"},null,{"$f":"AG2","v":"Equivalent Property Damage Only Index"},null,{"$f":"AI2","v":"Location Equity Measure"},null,null,null,null,null,null,null,null,null,null,null,null,null,null,null,null,null,"Value","Points","Value","Points","Value","Points","Value","Points","Value","Points"]
["Value","Points","Value","Points","Value","Points","Value","Points","Value","Points",null,null,null,null,null,null,null,null,null,null,null,null,null,null,null,null,0,0,0,0,0,0,0,0,0,0]
[{"$f":"\"< \"&TEXT(AA5,\"#0.00\")","v":"< 0.01"},{"$f":"IF(AB4=\"\",\"\",AB4)","v":0},{"$f":"\"< \"&AC5*100&\"%\"","v":"< 2.5%"},{"$f":"IF(AD4=\"\",\"\",AD4)","v":0},{"$f":"\"< \"&TEXT(AE5,\"00,000\")","v":"< 20,000"},{"$f":"IF(AF4=\"\",\"\",AF4)","v":0},{"$f":"\"< \"&TEXT(AG5,\"#0.00\")","v":"< 1.00"},{"$f":"IF(AH4=\"\",\"\",AH4)","v":0},{"$f":"\"< \"&AI5*100&\"%\"","v":"< 10%"},{"$f":"IF(AJ4=\"\",\"\",AJ4)","v":0},null,null,null,null,null,null,null,null,null,null,null,null,null,null,null,null,0.01,2,2.5000000000000001E-2,2,20000,2,1,2,0.1,2]
[{"$f":"TEXT(AA5,\"#0.00\")&\"-\"&TEXT(AA6-0.001,\"#0.000\")","v":"0.01-0.019"},{"$f":"IF(AB5=\"\",\"\",AB5)","v":2},{"$f":"AC5*100&\"%\"&\"-\"&(AC6-0.0001)*100&\"%\"","v":"2.5%-4.99%"},2,{"$f":"TEXT(AE5,\"00,000\")&\"-\"&TEXT(AE6-0.01,\"00,000.00\")","v":"20,000-22,499.99"},2,{"$f":"TEXT(AG5,\"#0.00\")&\"-\"&TEXT(AG6-0.001,\"#0.000\")","v":"1.00-1.499"},2,{"$f":"AI5*100&\"%\"&\"-\"&(AI6-0.0001)*100&\"%\"","v":"10%-14.99%"},2,null,null,null,null,null,null,null,null,null,null,null,null,null,null,null,null,{"$f":"AA5+0.01","v":0.02},4,{"$f":"AC5+0.025","v":0.05},4,{"$f":"AE5+2500","v":22500},4,{"$f":"AG5+0.5","v":1.5},4,{"$f":"AI5+0.05","v":0.15000000000000002},4]
[{"$f":"TEXT(AA6,\"#0.00\")&\"-\"&TEXT(AA7-0.001,\"#0.000\")","v":"0.02-0.029"},4,{"$f":"AC6*100&\"%\"&\"-\"&(AC7-0.0001)*100&\"%\"","v":"5%-7.49%"},4,{"$f":"TEXT(AE6,\"00,000\")&\"-\"&TEXT(AE7-0.01,\"00,000.00\")","v":"22,500-24,999.99"},4,{"$f":"TEXT(AG6,\"#0.00\")&\"-\"&TEXT(AG7-0.001,\"#0.000\")","v":"1.50-1.999"},4,{"$f":"AI6*100&\"%\"&\"-\"&(AI7-0.0001)*100&\"%\"","v":"15%-19.99%"},4,null,null,null,null,null,null,null,null,null,null,null,null,null,null,null,null,{"$f":"AA6+0.01","v":0.03},6,{"$f":"AC6+0.025","v":7.5000000000000011E-2},6,{"$f":"AE6+2500","v":25000},6,{"$f":"AG6+0.5","v":2},6,{"$f":"AI6+0.05","v":0.2},6]
["0.03-0.039",6,"7.5%-9.99%",6,"25,000-27,499.99",6,"2.00-2.499",6,"20%-24.99%",6,null,null,null,null,null,null,null,null,null,null,null,null,null,null,null,null,0.04,8,0.1,8,27500,8,2.5,8,0.25,8]
["0.04-0.049",8,"10%-12.49%",8,"27,500-29,999.99",8,"2.50-2.999",8,"25%-29.99%",8,null,null,null,null,null,null,null,null,null,null,null,null,null,null,null,null,0.05,10,0.125,10,30000,10,3,10,0.3,10]
["0.05-0.059",10,"12.5%-14.99%",10,"30,000-32,499.99",10,"3.00-3.499",10,{"$f":"\"≥ \"&AI9*100&\"%\"","v":"≥ 30%"},10,null,null,null,null,null,null,null,null,null,null,null,null,null,null,null,null,6.0000000000000005E-2,12,0.15,12,32500,12,3.5,12]
["0.06-0.069",12,"15%-17.49%",12,"32,500-34,999.99",12,"3.50-3.999",12,null,"",null,null,null,null,null,null,null,null,null,null,null,null,null,null,null,null,7.0000000000000007E-2,14,0.17499999999999999,14,35000,14,4,14]
["0.07-0.079",14,"17.5%-19.99%",14,"35,000-37,499.99",14,"4.00-4.499",14,null,"",null,null,null,null,null,null,null,null,null,null,null,null,null,null,null,null,0.08,16,0.19999999999999998,16,37500,16,4.5,16]
["0.08-0.089",16,"20%-22.49%",16,"37,500-39,999.99",16,"4.50-4.999",16,null,"",null,null,null,null,null,null,null,null,null,null,null,null,null,null,null,null,0.09,18,0.22499999999999998,18,40000,18,5,18]
["0.09-0.099",18,"22.5%-24.99%",18,"40,000-42,499.99",18,"5.00-5.499",18,null,"",null,null,null,null,null,null,null,null,null,null,null,null,null,null,null,null,9.9999999999999992E-2,20,0.24999999999999997,20,42500,20,5.5,20]
["0.10-0.109",20,{"$f":"\"≥ \"&AC14*100&\"%\"","v":"≥ 25%"},20,{"$f":"\"≥ \"&TEXT(AE14,\"00,000\")","v":"≥ 42,500"},20,{"$f":"\"≥ \"&TEXT(AG14,\"#0.00\")","v":"≥ 5.50"},20,null,"",null,null,null,null,null,null,null,null,null,null,null,null,null,null,null,null,0.10999999999999999,22]
["0.11-0.119",22,null,"",null,"",null,"",null,"",null,null,null,null,null,null,null,null,null,null,null,null,null,null,null,null,0.11999999999999998,24]
["0.12-0.129",24,null,"",null,"",null,"",null,"",null,null,null,null,null,null,null,null,null,null,null,null,null,null,null,null,0.12999999999999998,26]
["0.13-0.139",26,null,"",null,"",null,"",null,"",null,null,null,null,null,null,null,null,null,null,null,null,null,null,null,null,0.13999999999999999,28]
["0.14-0.149",28,null,"",null,"",null,"",null,"",null,null,null,null,null,null,null,null,null,null,null,null,null,null,null,null,0.15,30]
[{"$f":"\"≥ \"&TEXT(AA19,\"#0.00\")","v":"≥ 0.15"},30,null,"",null,"",null,"",null,""]
[]
[]
[]
[null,null,null,null,null,null,null,null,null,"Total Points"]
[]
[null,null,null,null,null,null,null,null,null,{"$f":"SUM(MAX(AB4:AB1000),MAX(AD4:AD1000),MAX(AF4:AF1000),MAX(AH4:AH1000),MAX(AJ4:AJ1000),MAX(AL4:AL1000),MAX(AN4:AN1000),MAX(AP4:AP1000),MAX(AR4:AR1000))","v":100}]

{"sheet":"RefTables","index":6,"n_rows":93,"n_cols":19,"rows_kept":93,"cut":false,"hidden":true,"merged":[]}
["County Code","District Number",null,"Ohio SHSP Emphasis Area",null,"FHWA SHSP Emphasis Area",null,"Improvement Type","Access management","Advanced technology and ITS","Alignment","Interchange design","Intersection geometry",null,null,null,null,null,"MPH"]
[{"$f":"LEFT(C2,3)","v":"ADA"},9,"ADA - Adams","Serious Crash Types",null,"Creating more effective processes and safety management systems",null,"Access management",null,null,"Alignment - other","Acceleration / deceleration / merge lane",null,null,null,null,null,null,5]
[{"$f":"LEFT(C3,3)","v":"ALL"},1,"ALL - Allen","High Risk Drivers and Behaviors",null,"Curbing aggressive driving",null,"Advanced technology and ITS","Access management - other","AdvancedtechnologyandITS","Horizontal curve realignment","Convert at-grade intersection to interchange","Auxiliary lanes - add acceleration lane",null,null,null,null,null,{"$f":"S2+5","v":10}]
["ASD",3,"ASD - Ashland","Special Vehicles and Roadway Users",null,"Designing safer work zones",null,"Alignment","Change in access - close or restrict existing access","Advanced technology and ITS - other","Horizontal and vertical alignment","Extend existing lane on ramp","Auxiliary lanes - add auxiliary through lane",null,null,null,null,null,{"$f":"S3+5","v":15}]
["ATB",4,"ATB - Ashtabula","Data",null,"Enhancing emergency medical capabilities to increase survivability",null,"Animal-related","Change in access - miscellaneous/unspecified","Congestion detection / traffic monitoring system","Vertical alignment or elevation change","Improve intersection radius at ramp terminus","Auxiliary lanes - add left-turn lane",null,null,null,null,null,20]
["ATH",10,"ATH - Athens",null,null,"Ensuring drivers are licensed and fully competent",null,"Interchange design","Grassed median - extend existing","Dynamic message signs",null,"Installation of new lane on ramp","Auxiliary lanes - add right-turn lane",null,null,null,null,null,25]
["AUG",7,"AUG - Auglaize",null,null,"Ensuring safer bicycle travel",null,"Intersection geometry","Median crossover - close crossover","Over height vehicle detection","Roadside","Interchange design - other","Auxiliary lanes - add right-turn lane (free-flow)",null,null,null,null,null,30]
["BEL",11,"BEL - Belmont","Data",null,"Improving information and decision support systems",null,"Intersection traffic control","Median crossover - directional crossover",null,null,"Ramp closure","Auxiliary lanes - add slip lane",null,null,null,null,null,35]
["BRO",9,"BRO - Brown","Timely Data",null,"Improving motorcycle safety and increasing motorcycle awareness",null,"Lighting","Median crossover - relocate existing",null,"Barrier end treatments (crash cushions, terminals)","Ramp metering","Auxiliary lanes - add two-way left-turn lane",null,null,null,null,null,40]
["BUT",8,"BUT - Butler","Reliable Data",null,"Improving the design and operation of highway intersections",null,"Miscellaneous","Median crossover - unspecified",null,"Barrier transitions",null,"Auxiliary lanes - extend acceleration/deceleration lane",null,null,null,null,null,45]
["CAR",11,"CAR - Carroll","Comprehensive Data",null,"Increasing driver safety awareness",null,"Non-infrastructure ","Raised island - install new",null,"Barrier - cable",null,"Auxiliary lanes - extend existing left-turn lane",null,null,null,null,null,50]
["CHP",7,"CHP - Champaign","Integrated Data and Analysis Systems",null,"Increasing safety enhancements in vehicles",null,"Parking","Raised island - modify existing",null,"Barrier - concrete",null,"Auxiliary lanes - extend existing right-turn lane",null,null,null,null,null,{"$f":"S11+5","v":55}]
["CLA",7,"CLA - Clark",null,null,"Increasing seat belt use and improving airbag effectiveness",null,"Pedestrians and bicyclists","Raised island - remove existing",null,"Barrier- metal",null,"Auxiliary lanes - miscellaneous/other/unspecified",null,null,null,null,null,60]
["CLE",8,"CLE - Clermont","SeriousCrashTypes",null,"Instituting graduated licensing for younger drivers",null,"Railroad grade crossings","Raised island - unspecified",null,"Barrier - other",null,"Auxiliary lanes - modify acceleration lane",null,null,null,null,null,65]
["CLI",8,"CLI - Clinton","Roadway Departure",null,"Keeping drivers alert",null,"Roadside",null,null,"Barrier - removal",null,"Auxiliary lanes - modify auxiliary through lane",null,null,null,null,null,70]
["COL",11,"COL - Columbiana","Intersection",null,"Keeping vehicles in the roadway",null,"Roadway",null,null,"Curb or curb and gutter",null,"Auxiliary lanes - modify free-flow turn  lane"]
["COS",5,"COS - Coshocton","Highway Railroad Crossing",null,"Making truck travel safer",null,"Roadway delineation",null,null,"Drainage improvements",null,"Auxiliary lanes - modify left-turn lane offset"]
["CRA",3,"CRA - Crawford",null,null,"Making walking and street crossing easier",null,"Roadway signs and traffic control",null,null,"Fencing",null,"Auxiliary lanes - modify right-turn lane offset"]
["CUY",12,"CUY - Cuyahoga",null,null,"Minimizing the consequences of leaving the road",null,"Shoulder treatments",null,null,"Removal of roadside objects (trees, poles, etc.)",null,"Auxiliary lanes - modify turn lane storage"]
["DAR",7,"DAR - Darke","HighRiskDriversandBehaviors",null,"Reducing head-on and across-median crashes",null,"Speed management",null,null,"Roadside grading",null,"Auxiliary lanes - modify turn lane taper"]
["DEF",1,"DEF - Defiance","Impaired Drivers",null,"Reducing impaired driving",null,"Work Zone",null,null,"Roadside - other",null,"Auxiliary lanes - modify two-way left-turn lane"]
["DEL",6,"DEL - Delaware","Seat Belt",null,"Reducing vehicle-train crashes",null,null,null,null,null,null,"Intersection geometrics - miscellaneous/other/unspecified"]
["ERI",3,"ERI - Erie","Speed",null,"Sustaining proficiency in older drivers",null,null,null,null,null,null,"Intersection geometrics - modify intersection corner radius"]
["FAI",5,"FAI - Fairfield","Young Drivers",null,"Other",null,"Animal-related","Intersection traffic control","Lighting","Roadway",null,"Intersection geometrics - modify skew angle"]
["FAY",6,"FAY - Fayette","Older Drivers",null,null,null,null,null,null,null,null,"Intersection geometrics - realignment to align offset cross streets"]
["FRA",6,"FRA - Franklin","Distracted Drivers",null,"Functional Class",null,null,"Intersection flashers - add \"when flashing\" warning sign-mounted","Continuous roadway lighting","Install / remove / modify passing zone",null,"Intersection geometrics - realignment to increase cross street offset"]
["FUL",2,"FUL - Fulton",null,1,"1 - Interstates",null,null,"Intersection flashers - add advance emergency vehicle warning sign-mounted","Intersection lighting","Pavement surface - high friction surface",null,"Intersection geometrics - re-assign existing lane use"]
["GAL",10,"GAL - Gallia","SpecialVehiclesandRoadwayUsers",2,"2 - Other Freeways or Expressways",null,null,"Intersection flashers - add advance heavy vehicle warning sign-mounted","Lighting - other","Pavement surface - miscellaneous",null,"Intersection geometry - other"]
["GEA",12,"GEA - Geauga","Bicycle Riders",3,"3 - Other Principal Arterial Roadway",null,null,"Intersection flashers - add advance intersection warning sign-mounted","Site lighting - horizontal curve ","Roadway narrowing (road diet, roadway reconfiguration)",null,"Splitter island - install on one or more approaches"]
["GRE",8,"GRE - Greene","Pedestrians",4,"4 - Minor Arterial Roadway",null,null,"Intersection flashers - add miscellaneous/other/unspecified","Site lighting - intersection","Roadway - other",null,"Splitter island - remove from one or more approaches"]
["GUE",5,"GUE - Guernsey","Commercial Vehicles",5,"5 - Major Collector Roadway",null,null,"Intersection flashers - add overhead (actuated)","Site lighting - interchange","Roadway - restripe to revise separation between opposing lanes and/or shoulder widths ",null,"Splitter island - unspecified"]
["HAM",8,"HAM - Hamilton","Motorcycles",6,"6 - Minor Collector Roadway",null,null,"Intersection flashers - add overhead (continuous)","Site lighting - pedestrian crosswalk","Roadway widening - add lane(s) along segment",null,"Through lanes - add additional through lane"]
["HAN",1,"HAN - Hancock",null,7,"7 - Local Roadway",null,null,"Intersection flashers - add stop sign-mounted",null,"Roadway widening - curve "]
["HAR",1,"HAR - Hardin",null,99,"99 - Other Roadway",null,null,"Intersection flashers - modify existing",null,"Roadway widening - travel lanes"]
["HAS",11,"HAS - Harrison",null,null,null,null,null,"Intersection flashers - remove existing","Parking","Rumble strips - center"]
["HEN",2,"HEN - Henry",null,null,null,null,null,"Intersection signing - add basic advance warning",null,"Rumble strips - edge or shoulder"]
["HIG",9,"HIG - Highland",null,null,null,null,null,"Intersection signing - add enhanced advance warning (double-up and/or oversize)","Modify parking","Rumble strips - transverse"]
["HOC",10,"HOC - Hocking",null,null,null,null,null,"Intersection signing - add enhanced regulatory sign (double-up and/or oversize)","Parking - other","Rumble strips - unspecified or other"]
["HOL",11,"HOL - Holmes",null,null,null,null,null,"Intersection signing - miscellaneous/other/unspecified","Remove parking","Superelevation / cross slope"]
["HUR",3,"HUR - Huron",null,null,null,null,null,"Intersection signing - relocate existing regulatory sign","Restrict parking"]
["JAC",9,"JAC - Jackson",null,null,null,null,null,"Intersection traffic control - other","Truck parking facilities"]
["JEF",11,"JEF - Jefferson",null,null,null,null,null,"Modify control - all-way stop to roundabout"]
["KNO",5,"KNO - Knox",null,null,null,null,null,"Modify control - modifications to roundabout","Pedestrians and bicyclists","Roadway delineation"]
["LAK",12,"LAK - Lake",null,null,null,null,null,"Modify control - no control to roundabout"]
["LAW",9,"LAW - Lawrence",null,null,null,null,null,"Modify control - no control to two-way stop","Crosswalk","Improve retroreflectivity"]
["LIC",5,"LIC - Licking",null,null,null,null,null,"Modify control - remove right-turn yield","Install new \"smart\" crosswalk","Longitudinal pavement markings - new"]
["LOG",7,"LOG - Logan",null,null,null,null,null,"Modify control - reverse priority of stop condition","Install new crosswalk","Longitudinal pavement markings - remarking"]
["LOR",3,"LOR - Lorain",null,null,null,null,null,"Modify control - traffic signal to roundabout","Install sidewalk","Delineators post-mounted or on barrier "]
["LUC",2,"LUC - Lucas",null,null,null,null,null,"Modify control - two-way stop to all-way stop","Medians and pedestrian refuge areas","Raised pavement markers"]
["MAD",6,"MAD - Madison",null,null,null,null,null,"Modify control - two-way stop to signal operation","Miscellaneous pedestrians and bicyclists","Roadway delineation - other"]
["MAH",4,"MAH - Mahoning",null,null,null,null,null,"Modify control - two-way stop to roundabout","Modify existing crosswalk"]
["MAR",6,"MAR - Marion",null,null,null,null,null,"Modify control - two-way yield to two-way stop","Pedestrian beacons"]
["MED",3,"MED - Medina",null,null,null,null,null,"Pavement Markings - add advance signal ahead","Pedestrian bridge","Roadway signs and traffic control"]
["MEG",10,"MEG - Meigs",null,null,null,null,null,"Pavement markings - add advance stop ahead","Pedestrian signal"]
["MER",7,"MER - Mercer",null,null,null,null,null,"Pavement markings - add dashed edge line along mainline","Pedestrian signal - audible device","Curve-related warning signs and flashers"]
["MIA",7,"MIA - Miami",null,null,null,null,null,"Pavement markings - add lane use symbols","Pedestrian signal - Pedestrian Hybrid Beacon","Sign sheeting - upgrade or replacement"]
["MOE",10,"MOE - Monroe",null,null,null,null,null,"Pavement markings - add stop line","Pedestrian signal - install new at intersection","Roadway signs and traffic control - other"]
["MOT",7,"MOT - Montgomery",null,null,null,null,null,"Pavement markings - add yield line","Pedestrian signal - install new at non-intersection location","Roadway signs (including post) - new or updated"]
["MRG",10,"MRG - Morgan",null,null,null,null,null,"Pavement markings - miscellaneous/other/unspecified","Pedestrian signal - modify existing"]
["MRW",6,"MRW - Morrow",null,null,null,null,null,"Pavement markings - refresh existing pavement markings","Pedestrian signal - remove existing"]
["MUS",5,"MUS - Muskingum",null,null,null,null,null,"Modify traffic signal - add additional signal heads","Pedestrian warning signs - add/modify flashers"]
["NOB",10,"NOB - Noble",null,null,null,null,null,"Modify traffic signal - add backplates","Pedestrian warning signs - overhead"]
["OTT",2,"OTT - Ottawa",null,null,null,null,null,"Modify traffic signal - add backplates with retroreflective borders"]
["PAU",1,"PAU - Paulding",null,null,null,null,null,"Modify traffic signal - add closed loop system","Railroad grade crossings"]
["PER",5,"PER - Perry",null,null,null,null,null,"Modify traffic signal - add emergency vehicle preemption"]
["PIC",6,"PIC - Pickaway",null,null,null,null,null,"Modify traffic signal - add flashing yellow arrow","Grade separation"]
[{"$f":"LEFT(C67,3)","v":"PIK"},9,"PIK - Pike",null,null,null,null,null,"Modify traffic signal - add long vehicle detection","Model enforcement activity"]
["POR",4,"POR - Portage",null,null,null,null,null,"Modify traffic signal - add railroad preemption","Protective devices"]
["PRE",8,"PRE - Preble",null,null,null,null,null,"Modify traffic signal - add wireless system","Railroad grade crossing gates"]
["PUT",1,"PUT - Putnam",null,null,null,null,null,"Modify traffic signal - miscellaneous/other/unspecified","Railroad grade crossing signing"]
["RIC",3,"RIC - Richland",null,null,null,null,null,"Modify traffic signal - modernization/replacement","Railroad grade crossings - other","Speed management"]
["ROS",9,"ROS - Ross",null,null,null,null,null,"Modify traffic signal - modify signal mounting (spanwire to mast arm)","Surface treatment"]
["SAN",2,"SAN - Sandusky",null,null,null,null,null,"Modify traffic signal - remove existing signal","Upgrade railroad crossing signal","Modify speed limit"]
["SCI",9,"SCI - Scioto",null,null,null,null,null,"Modify traffic signal - replace existing indications (incandescent-to-LED and/or 8-to-12 inch dia.)","Widen crossing for additional lane","Radar speed signs"]
["SEN",2,"SEN - Seneca",null,null,null,null,null,"Modify traffic signal timing - left-turn phasing (permissive to protected/permissive)",null,"Speed detection system / truck warning"]
["SHE",7,"SHE - Shelby",null,null,null,null,null,"Modify traffic signal timing - left-turn phasing (permissive to protected-only)",null,"Speed management - other"]
["STA",4,"STA - Stark",null,null,null,null,null,"Modify traffic signal timing - adjust clearance interval (yellow change and/or all-red)",null,"Traffic calming feature"]
["SUM",4,"SUM - Summit",null,null,null,null,null,"Modify traffic signal timing - general retiming"]
["TRU",4,"TRU - Trumbull",null,null,null,null,null,"Modify traffic signal timing - signal coordination"]
["TUS",11,"TUS - Tuscarawas",null,null,null,null,null,"Systemic improvements - signal-controlled"]
["UNI",6,"UNI - Union",null,null,null,null,null,"Systemic improvements - stop-controlled","Miscellaneous"]
["VAN",1,"VAN - Van Wert"]
["VIN",10,"VIN - Vinton"]
["WAR",8,"WAR - Warren"]
["WAS",10,"WAS - Washington",null,null,null,null,"Non-infrastructure ","Shoulder treatments","Work Zone"]
["WAY",3,"WAY - Wayne",null,null,null,null,"Educational efforts","Widen shoulder – paved or other"]
["WIL",2,"WIL - Williams",null,null,null,null,"Enforcement","Pave existing shoulders"]
["WOO",2,"WOO - Wood",null,null,null,null,"Data/traffic records","Shoulder grading"]
["WYA",1,"WYA - Wyandot",null,null,null,null,"Non-infrastructure - other","Shoulder treatments - other"]
[null,null,null,null,null,null,null,"Outreach"]
[null,null,null,null,null,null,null,"Road safety audits"]
[null,null,null,null,null,null,null,"Training and workforce development"]
[null,null,null,null,null,null,null,"Transportation safety planning"]

{"sheet":"RSI_Data","index":7,"n_rows":8443,"n_cols":10,"rows_kept":8443,"cut":false,"hidden":true,"merged":[]}
[null,null,null,null,{"$f":"F1/G1","v":32524.061936497157},{"$f":"SUBTOTAL(9,F3:F86584)","v":45972111066},{"$f":"SUBTOTAL(9,G3:G86584)","v":1413480}]
["DISTRICT_NBR","NLF_COUNTY_CD","URBAN_AREA","FREEWAY_IND","CRASH_TYPE_CD","CRASH_COST_NBR","Crash_Count",null,null,"Select "]
[2,"FUL","No","No","Parked Vehicle",1474677,55,null,null,"--CRASH_YR,"]
[9,"JAC","No","No","Fixed Object",42698817,956,null,null,"DISTRICT_NBR,"]
[6,"FRA","Yes","Yes","Parked Vehicle",66621,1,null,null,"NLF_COUNTY_CD,"]
[8,"BUT","No","Yes","Left Turn",97149,4]
[3,"HUR","Yes","No","Animal",30528,3,null,null,"--CASE WHEN ODOT_MAINTAINED_HWY_IND = 'Y' THEN 'Yes'"]
[11,"TUS","Yes","Yes","Head On",2979690,13,null,null,"--ELSE 'No' END AS ODOT_MAINTAINED_HWY_IND,"]
[6,"PIC","No","No","Pedalcycles",840585,8]
[4,"SUM","Yes","No","Left Turn",10176,1,null,null,"CASE WHEN AREA_CODE = 99999 THEN 'No'"]
[1,"DEF","Yes","No","Left Turn",3453861,112,null,null,"ELSE 'Yes' END AS URBAN_AREA,"]
[10,"ATH","No","No","Other Object",122112,12]
[7,"MOT","Yes","Yes","Rear End",539805,15,null,null,"--CASE WHEN FUNCTIONAL_CLASS_CD = 1 THEN 'Interstate Route'"]
[4,"POR","Yes","No","Right Turn",1763787,107,null,null,"--WHEN FUNCTIONAL_CLASS_CD = 2 THEN 'Other Freeways or Expressways'"]
[8,"CLI","Yes","No","Backing",518976,51,null,null,"--WHEN FUNCTIONAL_CLASS_CD = 3 THEN 'Other Principal Arterial Roads'"]
[3,"WAY","Yes","Yes","Sideswipe - Passing",20352,2,null,null,"--WHEN FUNCTIONAL_CLASS_CD = 4 THEN 'Minor Arterial Roads'"]
[7,"LOG","Yes","No","Rear End",2384952,90,null,null,"--WHEN FUNCTIONAL_CLASS_CD = 5 THEN 'Major Collector Roads'"]
[6,"UNI","Yes","Yes","Overturning",178398,3,null,null,"--WHEN FUNCTIONAL_CLASS_CD = 6 THEN 'Minor Collector Roads'"]
[4,"POR","No","Yes","Overturning",162657,7,null,null,"--WHEN FUNCTIONAL_CLASS_CD = 7 THEN 'Local Roads' END AS FUNCTIONAL_CLASS_CD,"]
[6,"FRA","Yes","No","Parked Vehicle",45156,1]
[2,"HEN","Yes","Yes","Rear End",653283,11,null,null,"CASE WHEN FREEWAY_IND = 'N' THEN 'No'"]
[6,"UNI","Yes","No","Pedalcycles",540918,13,null,null,"WHEN FREEWAY_IND = 'Y' THEN 'Yes' END AS FREEWAY_IND,"]
[11,"JEF","No","No","Rear End",3353214,105]
[10,"HOC","No","No","Animal",4767852,197,null,null,"CASE WHEN CRASH_TYPE_CD = 0 THEN 'Unknown'"]
[7,"AUG","Yes","No","Fixed Object",4048107,129,null,null,"WHEN CRASH_TYPE_CD = 1 THEN 'Head On'"]
[8,"CLE","Yes","Yes","Overturning",460098,1,null,null,"WHEN CRASH_TYPE_CD = 2 THEN 'Rear End'"]
[12,"CUY","Yes","No","Rear End",152481,6,null,null,"WHEN CRASH_TYPE_CD = 3 THEN 'Backing'"]
[4,"ATB","Yes","No","Other Object",20352,2,null,null,"WHEN CRASH_TYPE_CD = 4 THEN 'Sideswipe - Meeting'"]
[2,"WIL","No","No","Pedalcycles",1435626,5,null,null,"WHEN CRASH_TYPE_CD = 5 THEN 'Sideswipe - Passing'"]
[10,"HOC","Yes","No","Animal",10176,1,null,null,"WHEN CRASH_TYPE_CD = 6 THEN 'Angle'"]
[7,"DAR","Yes","No","Left Turn",10176,1,null,null,"WHEN CRASH_TYPE_CD = 7 THEN 'Parked Vehicle'"]
[10,"MEG","Yes","No","Overturning",163770,5,null,null,"WHEN CRASH_TYPE_CD = 8 THEN 'Pedestrian'"]
[9,"ROS","Yes","Yes","Rear End",5824662,156,null,null,"WHEN CRASH_TYPE_CD = 9 THEN 'Animal'"]
[3,"HUR","Yes","No","Fixed Object",1830789,50,null,null,"WHEN CRASH_TYPE_CD = 10 THEN 'Train'"]
[1,"VAN","Yes","No","Fixed Object",2078463,37,null,null,"WHEN CRASH_TYPE_CD = 11 THEN 'Pedalcycles'"]
[8,"WAR","Yes","No","Unknown",75684,4,null,null,"WHEN CRASH_TYPE_CD = 12 THEN 'Other Non-Vehicle'"]
[2,"LUC","Yes","No","Other Object",97149,4,null,null,"WHEN CRASH_TYPE_CD = 13 THEN 'Fixed Object'"]
[4,"SUM","Yes","No","Rear End",296966580,13900,null,null,"WHEN CRASH_TYPE_CD = 14 THEN 'Other Object'"]
[2,"FUL","Yes","No","Other Object",50880,5,null,null,"WHEN CRASH_TYPE_CD = 15 THEN 'Falling From Or In Vehicle'"]
[10,"MOE","Yes","No","Other Non-Collision",55332,2,null,null,"WHEN CRASH_TYPE_CD = 16 THEN 'Overturning'"]
[11,"TUS","No","No","Other Non-Vehicle",66621,1,null,null,"WHEN CRASH_TYPE_CD = 17 THEN 'Other Non-Collision'"]
[6,"FAY","Yes","Yes","Overturning",10176,1,null,null,"WHEN CRASH_TYPE_CD = 18 THEN 'Left Turn'"]
[6,"MRW","Yes","Yes","Overturning",121953,3,null,null,"WHEN CRASH_TYPE_CD = 19 THEN 'Right Turn' END AS CRASH_TYPE_CD,"]
[7,"MOT","Yes","No","Pedestrian",1732050,16]
[10,"HOC","Yes","No","Angle",10176,1,null,null,"sum(CASE WHEN CRASH_SEVERITY_CD = '1' THEN 460098"]
[7,"CLA","Yes","Yes","Other Non-Collision",10176,1,null,null,"WHEN CRASH_SEVERITY_CD = '2' THEN 460098"]
[4,"SUM","Yes","Yes","Right Turn",10176,1,null,null,"WHEN CRASH_SEVERITY_CD = '3' THEN 66621"]
[1,"HAN","Yes","Yes","Other Object",411492,37,null,null,"WHEN CRASH_SEVERITY_CD = '4' THEN 45156"]
[8,"WAR","Yes","Yes","Pedestrian",45156,1,null,null,"ELSE 10176 END ) AS CRASH_COST_NBR -- 2021 VALUES"]
[3,"CRA","No","No","Backing",694146,24]
[12,"CUY","Yes","Yes","Other Non-Collision",12678084,385,null,null,",count(DOCUMENT_NBR) as Crash_Count"]
[4,"TRU","No","No","Angle",17678856,363]
[10,"GAL","No","No","Pedestrian",1063614,5,null,null,"From warehouse.dbo.oh1_cr_crash_details"]
[9,"JAC","Yes","No","Unknown",81408,8,null,null,"where CRASH_YR BETWEEN 2017 AND 2021"]
[1,"HAN","No","Yes","Rear End",2869011,60,null,null,"Group by  --CRASH_YR,"]
[9,"JAC","No","No","Rear End",6520206,105,null,null,"DISTRICT_NBR,"]
[4,"POR","No","No","Right Turn",1963761,74,null,null,"NLF_COUNTY_CD,"]
[3,"WAY","No","Yes","Animal",996771,71,null,null,"AREA_CODE,"]
[11,"COL","Yes","Yes","Parked Vehicle",65508,3,null,null,"--ODOT_MAINTAINED_HWY_IND,"]
[8,"WAR","No","No","Sideswipe - Meeting",10176,1,null,null,"--FUNCTIONAL_CLASS_CD,"]
[8,"GRE","Yes","Yes","Rear End",216876,11,null,null,"FREEWAY_IND,"]
[11,"COL","Yes","No","Angle",4052178,124,null,null,"CRASH_TYPE_CD"]
[11,"COL","Yes","No","Sideswipe - Passing",214650,10]
[8,"HAM","No","Yes","Animal",152640,15]
[2,"LUC","Yes","No","Pedestrian",2869551,16]
[12,"GEA","Yes","No","Unknown",20352,2]
[3,"ERI","Yes","Yes","Pedestrian",505254,2]
[8,"WAR","Yes","Yes","Backing",61056,6]
[3,"HUR","Yes","No","Parked Vehicle",86973,3]
[4,"STA","Yes","No","Pedalcycles",20139885,155]
[9,"SCI","No","No","Angle",15468150,245]
[5,"MUS","Yes","Yes","Fixed Object",10176,1]
[4,"ATB","Yes","No","Other Non-Collision",1161606,34]
[9,"LAW","Yes","No","Sideswipe - Passing",4627440,226]
[4,"MAH","Yes","Yes","Fixed Object",678087,10]
[11,"TUS","Yes","Yes","Sideswipe - Passing",20352,2]
[11,"JEF","No","Yes","Angle",505254,2]
[2,"HEN","No","Yes","Other Non-Collision",168381,11]
[4,"MAH","Yes","No","Angle",2392488,52]
[7,"MOT","Yes","No","Fixed Object",4824567,110]
[2,"SAN","Yes","No","Rear End",137853,8]
[6,"UNI","No","No","Overturning",5483049,53]
[6,"MAD","Yes","No","Rear End",208926,6]
[4,"SUM","Yes","No","Pedalcycles",26268888,246]
[8,"BUT","Yes","No","Sideswipe - Passing",55332,2]
[4,"MAH","Yes","No","Sideswipe - Passing",10176,1]
[6,"MAD","Yes","Yes","Parked Vehicle",10176,1]
[11,"TUS","Yes","No","Other Object",437250,25]
[11,"COL","Yes","Yes","Unknown",10176,1]
[11,"TUS","Yes","No","Rear End",10176,1]
[11,"COL","Yes","No","Right Turn",1601082,55]
[11,"TUS","Yes","Yes","Sideswipe - Passing",30528,3]
[10,"HOC","Yes","No","Parked Vehicle",20352,2]
[8,"HAM","No","Yes","Parked Vehicle",85860,5]
[7,"DAR","Yes","Yes","Right Turn",45156,1]
[5,"MUS","No","Yes","Parked Vehicle",250743,8]
[1,"HAN","No","No","Other Non-Collision",1573146,111]
[8,"BUT","Yes","No","Backing",13415958,987]
[8,"BUT","Yes","Yes","Fixed Object",141192,7]
[1,"PUT","No","No","Animal",8382957,772]
[8,"HAM","Yes","No","Other Non-Collision",27314238,836]
[11,"JEF","Yes","Yes","Parked Vehicle",61056,6]
[4,"ATB","Yes","No","Rear End",2844891,82]
[2,"SAN","Yes","Yes","Backing",107325,5]
[4,"SUM","Yes","Yes","Animal",55332,2]
[2,"HEN","Yes","No","Right Turn",10176,1]
[7,"MIA","Yes","Yes","Parked Vehicle",1476219,40]
[2,"SAN","Yes","No","Left Turn",608970,35]
[2,"SAN","Yes","Yes","Unknown",127677,7]
[5,"MUS","No","Yes","Overturning",1047285,13]
[8,"GRE","Yes","No","Right Turn",8547219,433]
[10,"GAL","No","No","Sideswipe - Passing",2468856,67]
[0,"CUY","Yes","No","Pedalcycles",66621,1]
[12,"CUY","Yes","No","Right Turn",10176,1]
[9,"SCI","Yes","No","Other Non-Collision",946956,24]
[6,"FAY","Yes","No","Overturning",10176,1]
[1,"HAN","No","Yes","Fixed Object",3420837,130]
[3,"MED","No","No","Left Turn",16891884,306]
[4,"SUM","Yes","No","Unknown",167268,13]
[5,"MUS","Yes","No","Angle",37891155,1193]
[10,"MOE","No","No","Overturning",5369364,73]
[11,"BEL","No","Yes","Head On",96036,6]
[1,"WYA","No","Yes","Fixed Object",860142,30]
[4,"MAH","Yes","Yes","Rear End",40704,4]
[2,"LUC","No","Yes","Head On",470274,2]
[4,"SUM","Yes","Yes","Right Turn",30528,3]
[10,"HOC","No","No","Rear End",5075184,135]
[1,"VAN","Yes","No","Head On",1234221,17]
[6,"MAD","No","No","Pedestrian",6348246,20]
[4,"SUM","Yes","No","Other Non-Collision",55332,2]
[3,"HUR","Yes","No","Left Turn",847581,19]
[11,"HAS","Yes","No","Right Turn",20352,2]
[10,"ATH","Yes","Yes","Fixed Object",10176,1]
[4,"MAH","No","No","Angle",26326209,437]
[3,"CRA","Yes","No","Pedalcycles",245019,4]
[4,"STA","Yes","No","Sideswipe - Meeting",10176,1]
[3,"LOR","Yes","No","Head On",187461,6]
[4,"STA","Yes","No","Backing",19174716,1639]
[8,"BUT","Yes","No","Pedalcycles",1676718,14]
[11,"COL","Yes","No","Rear End",8572977,301]
[3,"HUR","Yes","No","Fixed Object",3253473,97]
[1,"ALL","Yes","Yes","Backing",127677,7]
[7,"MOT","Yes","Yes","Left Turn",10176,1]
[4,"POR","Yes","Yes","Sideswipe - Passing",424689,14]
[10,"HOC","Yes","No","Head On",1050783,21]
[11,"BEL","Yes","Yes","Right Turn",10176,1]
[7,"MOT","Yes","No","Other Object",5217456,119]
[7,"LOG","Yes","Yes","Unknown",10176,1]
[10,"WAS","Yes","Yes","Overturning",45156,1]
[8,"CLI","Yes","Yes","Angle",121953,3]
[6,"PIC","No","Yes","Overturning",188574,4]
[4,"POR","Yes","Yes","Sideswipe - Passing",3890046,179]
[8,"HAM","Yes","No","Other Non-Collision",1123287,35]
[7,"CLA","Yes","No","Unknown",40704,4]
[4,"SUM","Yes","Yes","Animal",30528,3]
[8,"WAR","Yes","Yes","Other Object",789117,72]
[4,"STA","Yes","Yes","Overturning",2337363,34]
[6,"PIC","No","No","Backing",1018236,71]
[3,"HUR","Yes","No","Backing",193344,19]
[3,"CRA","No","No","Animal",11084589,850]
[8,"CLE","No","No","Rear End",20766303,686]
[8,"WAR","Yes","Yes","Left Turn",55332,2]
[6,"MAD","Yes","Yes","Rear End",30528,3]
[2,"WOO","Yes","No","Overturning",111777,2]
[8,"WAR","No","No","Other Object",122112,12]
[1,"HAN","Yes","No","Sideswipe - Passing",213537,12]
[5,"PER","Yes","No","Backing",61056,6]
[4,"ATB","No","No","Overturning",9627954,67]
[8,"CLE","Yes","No","Rear End",730239,22]
[8,"WAR","Yes","Yes","Other Non-Collision",456648,38]
[10,"HOC","No","No","Right Turn",717249,29]
[5,"MUS","Yes","Yes","Head On",500802,5]
[6,"FRA","No","Yes","Other Non-Collision",158205,10]
[9,"SCI","No","Yes","Sideswipe - Passing",76797,2]
[4,"TRU","Yes","Yes","Right Turn",452832,12]
[8,"HAM","Yes","Yes","Fixed Object",2430537,68]
[6,"FRA","Yes","Yes","Left Turn",1153926,7]
[2,"SAN","Yes","No","Unknown",20352,2]
[11,"HAS","Yes","No","Animal",10176,1]
[10,"WAS","No","No","Unknown",126564,9]
[5,"COS","Yes","No","Head On",965082,25]
[7,"SHE","Yes","No","Angle",65508,3]
[10,"GAL","Yes","No","Other Object",50880,5]
[8,"HAM","Yes","No","Fixed Object",10176,1]
[4,"MAH","Yes","Yes","Animal",152481,6]
[11,"JEF","Yes","No","Other Object",10176,1]
[6,"MAD","Yes","No","Fixed Object",117501,6]
[6,"FAY","Yes","No","Sideswipe - Passing",20352,2]
[5,"LIC","No","No","Parked Vehicle",2212707,73]
[4,"STA","Yes","Yes","Other Non-Collision",20352,2]
[2,"SAN","Yes","No","Head On",3228207,25]
[2,"SAN","Yes","No","Train",560586,4]
[7,"MOT","No","No","Right Turn",630276,26]
[7,"DAR","Yes","No","Animal",10176,1]
[4,"TRU","Yes","Yes","Unknown",148029,9]
[1,"HAN","Yes","No","Animal",20352,2]
[8,"CLE","Yes","Yes","Left Turn",155820,5]
[11,"TUS","Yes","No","Pedestrian",7393830,39]
[2,"WOO","No","No","Other Object",489243,28]
[11,"JEF","Yes","No","Other Non-Collision",1218369,52]
[9,"ROS","Yes","No","Animal",30528,3]
[11,"COL","Yes","Yes","Left Turn",10176,1]
[10,"HOC","No","No","Backing",458874,34]
[2,"WOO","Yes","Yes","Rear End",369357,17]
[6,"MRW","No","No","Right Turn",2680866,43]
[3,"CRA","No","No","Right Turn",356955,15]
[4,"SUM","Yes","Yes","Rear End",17726445,659]
[12,"CUY","Yes","No","Other Non-Collision",20352,2]
[10,"GAL","No","Yes","Head On",10176,1]
[7,"MIA","No","No","Rear End",10613835,303]
[6,"FAY","No","Yes","Other Non-Collision",447585,35]
[5,"PER","Yes","No","Unknown",10176,1]
[5,"COS","No","No","Other Non-Collision",1127739,32]
[9,"BRO","No","No","Angle",30714591,455]
[6,"FRA","Yes","Yes","Unknown",2622180,93]
[9,"SCI","Yes","No","Parked Vehicle",146916,11]
[4,"POR","Yes","Yes","Overturning",142305,5]
[7,"LOG","No","No","Sideswipe - Passing",5047008,111]
[1,"HAN","Yes","No","Rear End",184122,7]
[10,"ATH","No","Yes","Sideswipe - Passing",259806,11]
[8,"WAR","Yes","Yes","Right Turn",163770,5]
[5,"MUS","No","No","Rear End",12318204,279]
[4,"MAH","No","Yes","Other Object",912183,73]
[7,"LOG","No","Yes","Unknown",61056,6]
[2,"HEN","No","No","Pedestrian",996993,4]
[5,"LIC","Yes","No","Head On",5201349,60]
[5,"FAI","No","Yes","Other Object",30528,3]
[6,"PIC","Yes","No","Sideswipe - Passing",30528,3]
[6,"PIC","Yes","No","Left Turn",255195,5]
[8,"CLE","Yes","No","Right Turn",40704,4]
[7,"SHE","Yes","Yes","Head On",991428,9]
[4,"STA","Yes","Yes","Parked Vehicle",460098,1]
[12,"LAK","No","No","Sideswipe - Meeting",10176,1]
[10,"VIN","No","No","Other Object",40704,4]
[3,"MED","Yes","No","Sideswipe - Passing",9553179,485]
[3,"LOR","Yes","No","Overturning",460098,1]
[9,"PIK","No","No","Fixed Object",44175717,869]
[1,"HAN","No","Yes","Left Turn",107325,5]
[6,"PIC","Yes","No","Overturning",505254,2]
[7,"MOT","Yes","Yes","Left Turn",71232,7]
[5,"LIC","Yes","Yes","Fixed Object",12030795,286]
[2,"HEN","Yes","No","Left Turn",806448,33]
[7,"MIA","Yes","No","Fixed Object",21130791,570]
[4,"MAH","Yes","No","Head On",86973,3]
[9,"BRO","No","No","Pedalcycles",1153926,7]
[9,"SCI","Yes","No","Sideswipe - Meeting",55332,2]
[6,"MAD","Yes","No","Unknown",142305,5]
[10,"NOB","No","No","Left Turn",489084,19]
[8,"WAR","Yes","Yes","Animal",1022688,68]
[7,"CLA","No","No","Other Non-Collision",931104,59]
[3,"MED","Yes","Yes","Unknown",81408,8]
[12,"CUY","Yes","No","Animal",410220,30]
[11,"COL","Yes","No","Other Object",10176,1]
[6,"MAD","No","Yes","Head On",1590333,7]
[7,"MOT","Yes","Yes","Other Non-Collision",10176,1]
[3,"HUR","Yes","No","Rear End",3261153,129]
[3,"CRA","No","No","Pedalcycles",505254,2]
[12,"GEA","No","No","Left Turn",13320300,255]
[3,"LOR","Yes","Yes","Pedestrian",613692,5]
[8,"PRE","No","Yes","Left Turn",45156,1]
[7,"CLA","No","Yes","Sideswipe - Passing",8787627,421]
[9,"JAC","Yes","No","Left Turn",3237414,83]
[5,"COS","Yes","No","Parked Vehicle",20352,2]
[8,"GRE","No","No","Parked Vehicle",2133573,106]
[12,"GEA","No","No","Animal",12490260,909]
[12,"CUY","Yes","No","Sideswipe - Meeting",9172326,300]
[3,"ERI","Yes","Yes","Overturning",536895,3]
[9,"LAW","Yes","Yes","Animal",1229706,96]
[7,"CLA","Yes","No","Left Turn",1693620,53]
[7,"SHE","Yes","No","Left Turn",55332,2]
[1,"HAR","No","No","Backing",396705,30]
[5,"KNO","Yes","No","Pedestrian",939372,17]
[5,"LIC","Yes","Yes","Rear End",6216342,152]
[3,"ASD","Yes","No","Backing",1138440,105]
[3,"WAY","No","No","Other Non-Collision",1247514,79]
[3,"ERI","Yes","Yes","Other Object",468096,46]
[9,"JAC","Yes","No","Fixed Object",15159468,282]
[12,"CUY","Yes","No","Fixed Object",1129122,8]
[4,"MAH","Yes","No","Pedestrian",66621,1]
[7,"DAR","Yes","No","Head On",1426134,15]
[10,"GAL","No","Yes","Backing",30528,3]
[2,"FUL","Yes","Yes","Other Object",20352,2]
[4,"SUM","Yes","Yes","Parked Vehicle",10176,1]
[8,"PRE","Yes","No","Head On",55332,2]
[10,"GAL","No","No","Other Object",255354,14]
[12,"LAK","Yes","Yes","Left Turn",10176,1]
[7,"MOT","Yes","No","Angle",40704,4]
[1,"DEF","Yes","No","Unknown",85860,5]
[6,"DEL","Yes","Yes","Angle",541506,9]
[5,"FAI","Yes","No","Fixed Object",19677801,453]
[8,"WAR","Yes","No","Fixed Object",19521330,473]
[2,"SAN","Yes","No","Parked Vehicle",167268,13]
[5,"FAI","Yes","No","Rear End",23897301,1191]
[10,"WAS","Yes","No","Overturning",634044,7]
[10,"WAS","Yes","No","Pedestrian",1010508,4]
[3,"WAY","Yes","No","Angle",3817239,96]
[1,"PAU","No","No","Sideswipe - Passing",2243346,45]
[5,"GUE","Yes","Yes","Angle",490626,4]
[12,"GEA","Yes","No","Left Turn",5456481,141]
[6,"MAR","Yes","No","Left Turn",97149,4]
[3,"LOR","No","No","Sideswipe - Meeting",531330,8]
[11,"HOL","Yes","No","Left Turn",10176,1]
[5,"MUS","Yes","Yes","Backing",30528,3]
[11,"BEL","Yes","Yes","Pedestrian",66621,1]
[10,"HOC","No","No","Fixed Object",51176373,947]
[9,"ROS","Yes","Yes","Angle",219102,7]
[7,"MIA","Yes","No","Angle",10176348,341]
[8,"WAR","Yes","Yes","Other Object",50880,5]
[4,"SUM","Yes","Yes","Fixed Object",2841552,83]
[6,"FRA","Yes","Yes","Animal",480450,3]
[5,"MUS","Yes","Yes","Unknown",142464,14]
[4,"STA","Yes","Yes","Animal",20352,2]
[4,"SUM","Yes","Yes","Right Turn",40704,4]
[7,"CHP","Yes","No","Head On",10176,1]
[2,"WOO","Yes","No","Angle",26267352,822]
[11,"JEF","Yes","Yes","Animal",2290665,118]
[12,"CUY","Yes","No","Rear End",936355191,37482]
[1,"PUT","Yes","No","Right Turn",20352,2]
[5,"KNO","Yes","No","Sideswipe - Meeting",470274,2]
[9,"ROS","No","No","Unknown",106212,7]
[2,"SAN","Yes","No","Angle",13583256,363]
[3,"RIC","Yes","Yes","Right Turn",133242,2]
[8,"HAM","No","Yes","Left Turn",214650,10]
[6,"FRA","Yes","No","Other Non-Vehicle",111777,2]
[11,"BEL","Yes","No","Right Turn",10176,1]
[1,"HAN","Yes","Yes","Other Object",10176,1]
[6,"MAD","No","No","Angle",26702688,373]
[4,"POR","Yes","Yes","Sideswipe - Passing",81408,8]
[1,"ALL","Yes","No","Sideswipe - Passing",493695,25]
[7,"AUG","Yes","Yes","Rear End",148029,9]
[9,"ROS","No","No","Backing",931263,68]
[7,"LOG","Yes","Yes","Other Non-Collision",20352,2]
[8,"WAR","Yes","No","Left Turn",6981816,203]
[5,"FAI","Yes","No","Left Turn",11391456,257]
[8,"PRE","No","Yes","Parked Vehicle",1078401,12]
[3,"ASD","Yes","No","Unknown",20352,2]
[2,"FUL","Yes","No","Pedestrian",1840392,4]
[4,"MAH","Yes","No","Overturning",20352,2]
[11,"BEL","No","Yes","Parked Vehicle",556134,7]
[3,"CRA","Yes","No","Left Turn",917700,28]
[7,"LOG","Yes","No","Rear End",9490773,474]
[7,"DAR","Yes","No","Left Turn",90312,2]
[7,"CHP","No","No","Right Turn",423735,25]
[6,"FAY","No","Yes","Pedestrian",470274,2]
[8,"GRE","Yes","Yes","Overturning",5996157,35]
[11,"CAR","No","No","Animal",3992934,136]
[10,"VIN","Yes","No","Backing",50880,5]
[7,"CLA","Yes","No","Fixed Object",167268,13]
[11,"JEF","Yes","No","Parked Vehicle",106212,7]
[12,"CUY","Yes","No","Backing",10176,1]
[1,"HAN","Yes","No","Rear End",86973,3]
[10,"WAS","No","Yes","Other Object",101760,10]
[6,"MAD","No","No","Other Object",308460,20]
[5,"GUE","Yes","No","Head On",66621,1]
[4,"TRU","Yes","Yes","Left Turn",111777,2]
[11,"HAS","Yes","No","Sideswipe - Meeting",10176,1]
[3,"HUR","Yes","No","Head On",2059065,24]
[8,"GRE","No","No","Left Turn",6768342,170]
[4,"MAH","Yes","Yes","Rear End",193185,10]
[2,"LUC","No","Yes","Sideswipe - Passing",1018077,62]
[1,"HAR","No","No","Right Turn",61056,6]
[3,"WAY","No","Yes","Parked Vehicle",659007,15]
[11,"COL","Yes","No","Head On",2795823,35]
[10,"GAL","No","Yes","Unknown",10176,1]
[7,"CLA","Yes","No","Rear End",71232,7]
[3,"HUR","Yes","No","Left Turn",2722842,54]
[4,"SUM","Yes","Yes","Left Turn",10176,1]
[7,"MOT","Yes","No","Sideswipe - Passing",107325,5]
[1,"ALL","No","Yes","Right Turn",30528,3]
[1,"PAU","No","Yes","Right Turn",45156,1]
[7,"SHE","Yes","Yes","Unknown",126564,9]
[10,"GAL","No","No","Angle",5773527,127]
[4,"TRU","Yes","No","Backing",10176,1]
[2,"HEN","No","No","Other Object",81408,8]
[7,"LOG","Yes","No","Fixed Object",7357071,237]
[1,"DEF","Yes","Yes","Rear End",10176,1]
[6,"PIC","Yes","No","Animal",722019,44]
[3,"CRA","No","No","Rear End",3560184,88]
[7,"AUG","Yes","No","Angle",162657,7]
[7,"MIA","No","No","Pedalcycles",792090,8]
[8,"BUT","Yes","No","Sideswipe - Meeting",20352,2]
[7,"MOT","Yes","Yes","Backing",20352,2]
[1,"HAR","Yes","No","Pedalcycles",638496,4]
[10,"ATH","Yes","No","Other Non-Collision",657894,17]
[6,"DEL","Yes","No","Other Object",10176,1]
[6,"MRW","No","No","Sideswipe - Meeting",20352,2]
[3,"LOR","Yes","No","Left Turn",39017367,1039]
[5,"MUS","Yes","Yes","Rear End",10176,1]
[7,"DAR","Yes","No","Unknown",10176,1]
[6,"FRA","Yes","Yes","Right Turn",76797,2]
[3,"MED","Yes","No","Backing",325632,32]
[5,"MUS","No","Yes","Left Turn",66621,1]
[9,"PIK","Yes","No","Overturning",443769,9]
[12,"CUY","No","No","Fixed Object",5360460,79]
[7,"SHE","Yes","No","Animal",20352,2]
[9,"LAW","Yes","Yes","Sideswipe - Passing",10176,1]
[12,"CUY","Yes","No","Right Turn",1810644,102]
[1,"ALL","No","No","Other Non-Vehicle",10176,1]
[10,"VIN","No","No","Sideswipe - Passing",2033307,36]
[11,"BEL","No","No","Sideswipe - Passing",3778539,155]
[7,"LOG","Yes","No","Backing",2393220,173]
[9,"ROS","Yes","Yes","Fixed Object",7284630,142]
[5,"LIC","Yes","Yes","Rear End",7079172,266]
[11,"BEL","Yes","Yes","Other Object",395592,32]
[3,"LOR","Yes","Yes","Parked Vehicle",770625,8]
[3,"MED","No","No","Overturning",6312504,71]
[11,"COL","Yes","No","Sideswipe - Passing",2706609,152]
[1,"HAN","Yes","Yes","Overturning",10176,1]
[4,"ATB","Yes","Yes","Sideswipe - Passing",10176,1]
[1,"DEF","Yes","No","Head On",1841760,31]
[1,"DEF","Yes","No","Train",470274,2]
[8,"PRE","No","Yes","Animal",1015851,66]
[7,"DAR","Yes","No","Unknown",20352,2]
[7,"MOT","Yes","No","Sideswipe - Passing",129902076,6253]
[2,"WOO","Yes","Yes","Other Non-Collision",10176,1]
[3,"WAY","Yes","No","Parked Vehicle",75684,4]
[2,"SAN","Yes","No","Right Turn",223713,13]
[10,"NOB","No","No","Head On",2329476,23]
[4,"STA","Yes","Yes","Left Turn",86973,3]
[6,"UNI","No","No","Other Object",158205,10]
[3,"HUR","Yes","No","Overturning",173946,6]
[2,"OTT","No","No","Other Non-Collision",2934312,79]
[10,"MEG","No","No","Sideswipe - Meeting",603516,4]
[7,"CLA","Yes","No","Animal",5586210,381]
[6,"FRA","Yes","Yes","Parked Vehicle",13315164,242]
[6,"FRA","Yes","No","Other Non-Collision",10176,1]
[10,"WAS","Yes","No","Sideswipe - Passing",1225731,66]
[2,"WIL","Yes","No","Fixed Object",55332,2]
[6,"DEL","Yes","Yes","Other Non-Collision",223872,22]
[6,"MAD","Yes","No","Animal",269028,23]
[7,"MIA","No","No","Fixed Object",39290316,891]
[6,"UNI","No","Yes","Angle",510978,6]
[2,"LUC","Yes","Yes","Fixed Object",3969465,73]
[6,"MAR","No","No","Right Turn",1147932,25]
[3,"RIC","Yes","No","Sideswipe - Passing",1124559,47]
[8,"BUT","Yes","No","Backing",1280904,119]
[3,"HUR","No","No","Overturning",7736412,80]
[1,"DEF","No","No","Pedalcycles",571875,3]
[12,"CUY","Yes","Yes","Fixed Object",152481,6]
[8,"CLI","No","Yes","Sideswipe - Passing",2852205,111]
[1,"HAN","Yes","No","Angle",1141254,32]
[10,"ATH","No","Yes","Other Non-Collision",55332,2]
[3,"HUR","Yes","No","Right Turn",117501,6]
[7,"DAR","No","No","Other Non-Collision",1299618,51]
[10,"WAS","No","No","Overturning",12993585,108]
[5,"KNO","Yes","No","Angle",75684,4]
[12,"CUY","Yes","No","Right Turn",96036,6]
[7,"AUG","Yes","No","Head On",264258,8]
[8,"BUT","Yes","Yes","Left Turn",945843,21]
[2,"FUL","No","Yes","Animal",1226526,106]
[2,"HEN","Yes","No","Rear End",121953,3]
[10,"WAS","Yes","No","Right Turn",1991268,101]
[2,"WOO","Yes","Yes","Animal",10176,1]
[10,"ATH","Yes","No","Rear End",10176,1]
[6,"UNI","Yes","Yes","Rear End",132129,4]
[10,"MRG","No","No","Angle",5331204,88]
[3,"MED","Yes","No","Angle",36131946,1106]
[10,"ATH","No","Yes","Angle",20352,2]
[11,"TUS","No","Yes","Other Object",350436,31]
[6,"MRW","Yes","No","Fixed Object",20352,2]
[8,"GRE","Yes","No","Left Turn",71232,7]
[7,"MOT","Yes","No","Angle",10176,1]
[4,"MAH","Yes","No","Sideswipe - Passing",111936,11]
[4,"SUM","Yes","No","Backing",2875833,253]
[5,"GUE","Yes","No","Pedestrian",2433732,7]
[4,"ATB","No","No","Left Turn",9248088,152]
[4,"POR","Yes","No","Sideswipe - Meeting",570762,5]
[3,"HUR","Yes","No","Backing",198909,14]
[8,"BUT","Yes","No","Left Turn",18348723,410]
[7,"MIA","Yes","Yes","Head On",86973,3]
[7,"MOT","Yes","No","Animal",758430,60]
[6,"MAD","No","No","Sideswipe - Meeting",97149,4]
[4,"STA","Yes","No","Rear End",215535885,9303]
[3,"ERI","Yes","No","Animal",324360,25]
[8,"BUT","Yes","No","Animal",331038,18]
[1,"HAR","Yes","No","Parked Vehicle",20352,2]
[1,"ALL","Yes","No","Sideswipe - Passing",20419953,979]
[8,"CLE","No","No","Fixed Object",90492228,1876]
[8,"CLI","Yes","No","Animal",1971393,126]
[3,"WAY","Yes","No","Overturning",1007169,5]
[1,"ALL","Yes","Yes","Right Turn",55332,2]
[1,"WYA","Yes","No","Other Object",40704,4]
[3,"HUR","Yes","No","Rear End",2314578,52]
[10,"ATH","Yes","No","Left Turn",45156,1]
[1,"PAU","No","Yes","Parked Vehicle",10176,1]
[11,"JEF","No","No","Pedalcycles",45156,1]
[3,"LOR","Yes","No","Overturning",3963789,39]
[7,"CHP","No","No","Rear End",7509282,215]
[1,"DEF","No","No","Animal",19466592,1638]
[12,"CUY","Yes","Yes","Pedestrian",66621,1]
[10,"GAL","Yes","No","Parked Vehicle",30528,3]
[7,"CLA","Yes","No","Pedalcycles",9707073,85]
[11,"TUS","Yes","Yes","Head On",10176,1]
[2,"WIL","No","Yes","Other Object",187620,15]
[9,"LAW","Yes","Yes","Overturning",526719,2]
[1,"PUT","No","No","Rear End",3298995,101]
[2,"OTT","Yes","No","Backing",987072,97]
[7,"MER","Yes","No","Animal",2214504,152]
[1,"ALL","Yes","Yes","Rear End",4596705,109]
[5,"MUS","No","Yes","Fixed Object",7662924,249]
[6,"UNI","Yes","Yes","Animal",617079,44]
[3,"ERI","Yes","No","Pedalcycles",672363,6]
[6,"DEL","No","Yes","Angle",198750,5]
[1,"VAN","Yes","No","Right Turn",66621,1]
[6,"MAD","Yes","Yes","Backing",20352,2]
[8,"BUT","Yes","No","Rear End",2149680,105]
[2,"SAN","No","No","Animal",13471068,1106]
[3,"MED","Yes","Yes","Backing",30528,3]
[9,"JAC","Yes","Yes","Right Turn",480450,3]
[12,"CUY","Yes","Yes","Angle",11594310,368]
[11,"COL","Yes","No","Fixed Object",8143263,223]
[7,"LOG","Yes","No","Overturning",1580157,6]
[3,"RIC","Yes","No","Animal",309732,27]
[11,"JEF","No","No","Animal",3764085,110]
[11,"CAR","No","No","Parked Vehicle",977643,36]
[4,"SUM","Yes","Yes","Angle",10176,1]
[2,"SAN","Yes","No","Other Object",255354,14]
[7,"MOT","Yes","No","Angle",391046631,9823]
[4,"POR","Yes","Yes","Angle",20352,2]
[3,"ASD","Yes","Yes","Overturning",470274,2]
[3,"MED","Yes","No","Backing",142464,14]
[12,"CUY","Yes","Yes","Rear End",141192,7]
[4,"POR","Yes","Yes","Angle",10176,1]
[8,"GRE","Yes","No","Animal",7274043,571]
[1,"PUT","Yes","No","Backing",162816,16]
[10,"ATH","No","No","Sideswipe - Meeting",86973,3]
[3,"MED","Yes","No","Parked Vehicle",142305,5]
[2,"WOO","No","No","Pedalcycles",1048398,11]
[4,"POR","No","No","Backing",989934,69]
[4,"TRU","Yes","No","Fixed Object",111777,2]
[9,"PIK","No","No","Rear End",6113643,97]
[3,"WAY","Yes","No","Overturning",1227384,10]
[3,"RIC","Yes","No","Fixed Object",183009,9]
[8,"GRE","No","No","Backing",1221756,91]
[2,"WIL","Yes","No","Overturning",613692,5]
[1,"VAN","Yes","No","Backing",30528,3]
[2,"HEN","Yes","No","Unknown",162816,16]
[5,"MUS","Yes","No","Sideswipe - Passing",14591508,873]
[1,"VAN","Yes","No","Fixed Object",20352,2]
[1,"VAN","No","No","Overturning",6556839,54]
[12,"GEA","Yes","No","Other Object",20352,2]
[8,"CLI","Yes","Yes","Overturning",10176,1]
[4,"SUM","Yes","No","Fixed Object",55332,2]
[9,"SCI","Yes","No","Left Turn",10176,1]
[6,"MAD","Yes","No","Left Turn",886743,38]
[1,"ALL","No","Yes","Sideswipe - Meeting",460098,1]
[1,"WYA","Yes","No","Sideswipe - Passing",1274814,52]
[6,"UNI","No","Yes","Sideswipe - Passing",2046759,112]
[3,"MED","No","No","Fixed Object",70606851,1487]
[3,"RIC","Yes","No","Sideswipe - Passing",10176,1]
[1,"PUT","Yes","No","Parked Vehicle",10176,1]
[5,"MUS","Yes","Yes","Parked Vehicle",131016,6]
[12,"CUY","Yes","No","Animal",10176,1]
[9,"LAW","No","No","Backing",749049,39]
[4,"MAH","Yes","Yes","Sideswipe - Passing",76797,2]
[8,"GRE","Yes","No","Pedalcycles",9715389,83]
[2,"OTT","No","Yes","Rear End",1126467,25]
[3,"CRA","Yes","No","Unknown",97149,4]
[7,"MOT","Yes","Yes","Fixed Object",4003491,79]
[11,"BEL","No","No","Angle",9016140,217]
[6,"UNI","Yes","No","Parked Vehicle",142464,14]
[8,"BUT","Yes","Yes","Left Turn",20352,2]
[8,"GRE","Yes","Yes","Sideswipe - Passing",10176,1]
[12,"CUY","No","No","Overturning",20352,2]
[8,"WAR","Yes","No","Other Non-Collision",623868,6]
[1,"WYA","No","No","Parked Vehicle",995610,28]
[10,"NOB","No","Yes","Animal",1695528,101]
[3,"MED","Yes","No","Head On",7283994,116]
[2,"WOO","Yes","Yes","Rear End",184122,7]
[4,"STA","No","Yes","Right Turn",20352,2]
[5,"FAI","Yes","Yes","Left Turn",10176,1]
[2,"SEN","No","No","Rear End",7900581,184]
[7,"MOT","Yes","No","Sideswipe - Passing",40704,4]
[12,"GEA","No","No","Parked Vehicle",3551025,60]
[5,"KNO","Yes","No","Sideswipe - Passing",3097797,227]
[11,"BEL","No","Yes","Backing",157092,12]
[4,"STA","Yes","No","Other Non-Collision",10176,1]
[9,"ROS","No","No","Rear End",12950595,317]
[4,"SUM","No","No","Pedestrian",300351,6]
[11,"COL","Yes","No","Pedalcycles",526719,2]
[4,"POR","Yes","No","Overturning",470274,2]
[2,"OTT","Yes","Yes","Unknown",10176,1]
[7,"MOT","Yes","No","Sideswipe - Passing",55332,2]
[4,"SUM","Yes","Yes","Parked Vehicle",135468,3]
[3,"WAY","Yes","No","Right Turn",76797,2]
[6,"FAY","Yes","Yes","Backing",10176,1]
[6,"FRA","Yes","Yes","Overturning",19504125,200]
[4,"TRU","No","Yes","Head On",500802,5]
[5,"MUS","No","No","Animal",6736305,478]
[3,"RIC","No","No","Sideswipe - Passing",5627088,138]
[8,"BUT","Yes","No","Fixed Object",7271958,177]
[6,"FRA","Yes","Yes","Unknown",30528,3]
[2,"WOO","Yes","No","Head On",45156,1]
[12,"GEA","Yes","Yes","Rear End",1013577,25]
[8,"GRE","No","No","Unknown",314184,24]
[7,"SHE","Yes","Yes","Left Turn",536895,3]
[5,"FAI","No","No","Unknown",203361,11]
[3,"WAY","Yes","No","Head On",4791081,50]
[3,"MED","Yes","No","Rear End",386370,20]
[3,"WAY","Yes","No","Sideswipe - Meeting",121953,3]
[7,"CLA","Yes","Yes","Fixed Object",10176,1]
[6,"MAR","No","No","Parked Vehicle",652854,24]
[5,"FAI","Yes","No","Sideswipe - Passing",40704,4]
[7,"MER","No","Yes","Animal",40704,4]
[2,"FUL","Yes","No","Pedestrian",460098,1]
[11,"JEF","Yes","No","Right Turn",20352,2]
[10,"WAS","Yes","No","Sideswipe - Meeting",66621,1]
[6,"MRW","Yes","No","Animal",30528,3]
[12,"CUY","Yes","No","Pedalcycles",103106394,1168]
[8,"CLI","Yes","Yes","Fixed Object",1824222,21]
[4,"POR","Yes","No","Pedestrian",14362050,96]
[5,"LIC","Yes","No","Angle",821394,49]
[7,"MOT","Yes","Yes","Right Turn",76797,2]
[3,"ERI","No","No","Overturning",4930842,36]
[10,"ATH","Yes","Yes","Head On",20352,2]
[3,"ASD","No","No","Fixed Object",62557812,1132]
[2,"WOO","Yes","Yes","Other Object",168381,11]
[11,"TUS","Yes","No","Angle",23894103,899]
[6,"FRA","Yes","No","Fixed Object",392773140,9654]
[5,"GUE","No","No","Backing",720906,46]
[3,"LOR","Yes","Yes","Other Object",1520676,146]
[10,"WAS","Yes","No","Angle",6950619,133]
[10,"ATH","No","No","Pedestrian",659961,4]
[4,"POR","Yes","No","Rear End",27720885,1203]
[4,"SUM","No","No","Other Object",20352,2]
[8,"CLE","Yes","Yes","Parked Vehicle",601290,8]
[3,"RIC","Yes","Yes","Other Object",10176,1]
[1,"PAU","No","Yes","Unknown",20352,2]
[6,"FRA","Yes","Yes","Fixed Object",917271,41]
[2,"WOO","Yes","Yes","Fixed Object",66621,1]
[11,"JEF","Yes","No","Pedestrian",66621,1]
[11,"COL","Yes","No","Backing",548232,47]
[7,"MER","No","No","Head On",4104090,46]
[12,"LAK","Yes","Yes","Other Object",407040,40]
[4,"SUM","Yes","No","Head On",4995222,102]
[4,"SUM","Yes","No","Train",10176,1]
[6,"PIC","Yes","No","Head On",10176,1]
[12,"CUY","Yes","No","Rear End",366018,18]
[10,"MOE","Yes","No","Angle",753771,14]
[3,"LOR","Yes","No","Left Turn",157092,12]
[10,"VIN","No","No","Angle",7771455,74]
[10,"NOB","Yes","Yes","Animal",660168,58]
[3,"WAY","Yes","Yes","Angle",76797,2]
[5,"COS","Yes","No","Backing",30528,3]
[6,"MAR","Yes","No","Fixed Object",148029,9]
[10,"ATH","Yes","No","Angle",13622940,316]
[2,"WIL","No","Yes","Overturning",690489,7]
[8,"GRE","Yes","No","Backing",111936,11]
[5,"FAI","Yes","Yes","Sideswipe - Passing",254241,16]
[11,"CAR","No","No","Pedalcycles",550410,3]
[1,"ALL","Yes","No","Head On",11949513,196]
[1,"ALL","Yes","No","Train",132129,4]
[5,"KNO","Yes","No","Sideswipe - Passing",30528,3]
[7,"LOG","Yes","Yes","Angle",76797,2]
[4,"SUM","Yes","Yes","Rear End",20352,2]
[7,"DAR","Yes","No","Parked Vehicle",50880,5]
[7,"AUG","Yes","No","Unknown",40704,4]
[3,"LOR","Yes","No","Unknown",2193897,56]
[0,"CUY","Yes","No","Fixed Object",45156,1]
[4,"POR","Yes","Yes","Other Non-Collision",168381,11]
[9,"HIG","No","No","Other Non-Vehicle",460098,1]
[5,"LIC","No","No","Animal",14643642,663]
[8,"WAR","Yes","Yes","Sideswipe - Passing",357114,24]
[9,"ROS","No","No","Right Turn",2076492,65]
[5,"GUE","No","Yes","Unknown",122112,12]
[1,"HAR","Yes","No","Animal",967674,84]
[9,"BRO","No","No","Pedestrian",4585764,16]
[5,"FAI","Yes","No","Overturning",3960354,25]
[11,"TUS","No","No","Left Turn",6388809,157]
[7,"MIA","Yes","No","Sideswipe - Passing",2082900,155]
[5,"GUE","Yes","No","Other Object",61056,6]
[6,"UNI","Yes","No","Left Turn",281271,11]
[10,"WAS","Yes","No","Parked Vehicle",20352,2]
[10,"MEG","No","No","Other Object",116388,8]
[7,"MER","No","No","Sideswipe - Passing",3825189,96]
[2,"OTT","Yes","No","Backing",50880,5]
[3,"ASD","Yes","Yes","Rear End",971760,23]
[2,"FUL","Yes","No","Angle",91584,9]
[4,"POR","Yes","Yes","Left Turn",10176,1]
[2,"SAN","Yes","No","Right Turn",10176,1]
[5,"LIC","Yes","No","Head On",10893021,115]
[7,"MOT","Yes","No","Sideswipe - Meeting",2181606,23]
[6,"MAD","No","No","Pedalcycles",2545509,9]
[7,"MOT","Yes","Yes","Head On",6129717,60]
[6,"FRA","Yes","Yes","Rear End",669708,23]
[6,"DEL","Yes","No","Pedestrian",12086952,86]
[4,"ATB","Yes","No","Rear End",2293257,117]
[8,"CLI","Yes","No","Animal",30528,3]
[7,"AUG","Yes","No","Sideswipe - Passing",65508,3]
[6,"DEL","Yes","Yes","Sideswipe - Passing",1055712,45]
[6,"PIC","Yes","No","Pedestrian",45156,1]
[7,"MER","Yes","No","Parked Vehicle",2233107,115]
[12,"CUY","Yes","Yes","Overturning",17047719,195]
[4,"POR","Yes","No","Angle",450606,16]
[8,"WAR","Yes","No","Fixed Object",14296353,336]
[3,"CRA","Yes","Yes","Fixed Object",76797,2]
[4,"TRU","Yes","Yes","Fixed Object",153594,4]
[8,"WAR","Yes","No","Rear End",15197058,518]
[7,"MOT","Yes","Yes","Left Turn",786525,13]
[4,"ATB","Yes","No","Right Turn",126564,9]
[4,"POR","Yes","No","Other Object",917700,28]
[12,"GEA","Yes","No","Parked Vehicle",304962,12]
[12,"CUY","Yes","No","Right Turn",123577533,5365]
[7,"MOT","Yes","No","Angle",206700,10]
[1,"DEF","Yes","Yes","Rear End",346779,14]
[11,"CAR","No","No","Unknown",61056,6]
[4,"SUM","Yes","Yes","Left Turn",528516,16]
[12,"LAK","Yes","No","Left Turn",44488779,1302]
[10,"GAL","Yes","No","Pedestrian",2524044,9]
[11,"COL","Yes","Yes","Sideswipe - Passing",10176,1]
[9,"PIK","Yes","No","Parked Vehicle",10176,1]
[3,"ASD","Yes","No","Right Turn",969741,76]
[4,"SUM","Yes","Yes","Animal",3228654,224]
[7,"SHE","Yes","No","Parked Vehicle",183168,18]
[4,"STA","Yes","No","Angle",1177347,30]
[7,"SHE","Yes","No","Other Non-Collision",698598,21]
[10,"NOB","Yes","No","Head On",592227,5]
[9,"LAW","Yes","Yes","Backing",40704,4]
[6,"PIC","Yes","No","Rear End",14379528,465]
[7,"CHP","No","No","Animal",5294826,228]
[5,"FAI","No","No","Left Turn",9118011,181]
[3,"RIC","Yes","No","Angle",526719,2]
[4,"ATB","Yes","Yes","Fixed Object",10176,1]
[5,"LIC","Yes","Yes","Right Turn",65508,3]
[4,"ATB","Yes","No","Pedalcycles",10176,1]
[6,"UNI","Yes","No","Parked Vehicle",30528,3]
[4,"STA","No","Yes","Parked Vehicle",20352,2]
[3,"LOR","Yes","Yes","Unknown",20352,2]
[4,"POR","Yes","No","Angle",252969,9]
[8,"BUT","No","No","Other Non-Collision",2767410,64]
[11,"TUS","No","No","Fixed Object",74040252,1611]
[6,"MAR","Yes","No","Head On",5849226,80]
[6,"MAR","Yes","No","Train",142305,5]
[11,"TUS","Yes","No","Animal",91584,9]
[4,"SUM","Yes","Yes","Sideswipe - Passing",407994,29]
[3,"WAY","Yes","Yes","Right Turn",30528,3]
[11,"TUS","No","No","Parked Vehicle",3001458,82]
[4,"SUM","Yes","Yes","Sideswipe - Passing",2036154,129]
[10,"ATH","Yes","Yes","Animal",421668,38]
[3,"MED","No","Yes","Pedestrian",920196,2]
[4,"ATB","Yes","No","Fixed Object",7031232,166]
[4,"MAH","Yes","No","Parked Vehicle",15451458,663]
[8,"HAM","No","No","Other Non-Collision",193185,10]
[4,"SUM","No","No","Head On",556134,7]
[4,"SUM","No","No","Train",10176,1]
[4,"SUM","Yes","No","Right Turn",38643531,2020]
[4,"SUM","No","Yes","Head On",97149,4]
[4,"SUM","Yes","Yes","Pedestrian",4337931,20]
[1,"HAN","Yes","Yes","Sideswipe - Passing",30528,3]
[11,"BEL","No","Yes","Left Turn",10176,1]
[5,"GUE","Yes","Yes","Other Non-Collision",442974,29]
[6,"PIC","Yes","No","Right Turn",142464,14]
[10,"MOE","No","No","Sideswipe - Passing",2683251,53]
[2,"OTT","Yes","No","Right Turn",30528,3]
[3,"WAY","No","No","Other Object",938895,50]
[8,"GRE","Yes","Yes","Pedestrian",526719,2]
[1,"WYA","No","No","Sideswipe - Passing",4261071,94]
[3,"MED","No","No","Right Turn",2688960,108]
[11,"BEL","Yes","No","Animal",10176,1]
[7,"SHE","Yes","Yes","Parked Vehicle",378261,6]
[9,"ROS","No","Yes","Left Turn",20352,2]
[9,"JAC","No","No","Head On",5135475,54]
[4,"SUM","Yes","No","Fixed Object",1117833,9]
[7,"CLA","No","Yes","Other Object",412605,35]
[12,"CUY","Yes","Yes","Backing",20352,2]
[3,"RIC","Yes","No","Unknown",10176,1]
[2,"WOO","Yes","No","Other Non-Collision",1229499,42]
[5,"MUS","No","No","Sideswipe - Passing",4352655,103]
[9,"ROS","Yes","No","Sideswipe - Passing",9126297,496]
[2,"LUC","No","No","Head On",3696096,17]
[6,"FAY","Yes","Yes","Rear End",177285,5]
[4,"MAH","No","Yes","Pedestrian",593340,3]
[12,"LAK","No","Yes","Parked Vehicle",500802,5]
[7,"SHE","Yes","No","Sideswipe - Passing",96036,6]
[10,"ATH","Yes","Yes","Fixed Object",66621,1]
[7,"CHP","Yes","No","Pedalcycles",1140411,7]
[12,"GEA","No","No","Unknown",178557,12]
[11,"COL","Yes","Yes","Rear End",1615869,62]
[3,"MED","No","Yes","Other Object",310845,25]
[1,"HAR","Yes","No","Overturning",460098,1]
[4,"SUM","Yes","Yes","Parked Vehicle",10176,1]
[1,"PUT","No","No","Backing",584484,54]
[3,"WAY","Yes","Yes","Angle",20352,2]
[6,"MAR","No","No","Left Turn",6454014,91]
[2,"SAN","Yes","No","Sideswipe - Passing",5328804,194]
[8,"GRE","No","Yes","Rear End",4234248,88]
[3,"MED","Yes","Yes","Animal",299556,26]
[12,"LAK","Yes","No","Rear End",1972395,95]
[8,"PRE","Yes","No","Pedestrian",784140,8]
[6,"MAD","Yes","No","Parked Vehicle",2108880,71]
[9,"ROS","Yes","No","Right Turn",500802,5]
[4,"ATB","Yes","Yes","Sideswipe - Passing",40704,4]
[4,"SUM","Yes","Yes","Overturning",66621,1]
[10,"GAL","Yes","No","Other Non-Collision",75684,4]
[9,"ROS","Yes","No","Other Non-Collision",968421,24]
[5,"FAI","Yes","Yes","Other Object",30528,3]
[4,"TRU","No","No","Sideswipe - Passing",8975262,245]
[5,"LIC","Yes","Yes","Backing",10176,1]
[6,"DEL","No","Yes","Pedestrian",10176,1]
[8,"PRE","No","Yes","Right Turn",10176,1]
[6,"FRA","Yes","No","Other Non-Collision",2810769,46]
[6,"FAY","No","No","Right Turn",362679,19]
[3,"CRA","Yes","Yes","Rear End",40704,4]
[9,"LAW","Yes","Yes","Unknown",30528,3]
[4,"ATB","No","Yes","Other Object",791295,28]
[3,"RIC","No","Yes","Other Non-Collision",841062,35]
[11,"TUS","Yes","No","Fixed Object",715452,15]
[4,"ATB","No","No","Unknown",91584,9]
[6,"MAR","Yes","No","Rear End",207813,8]
[4,"ATB","Yes","No","Rear End",20352,2]
[4,"TRU","Yes","Yes","Right Turn",10176,1]
[6,"FRA","Yes","Yes","Head On",20352,2]
[6,"FAY","Yes","No","Head On",931740,30]
[6,"FAY","Yes","No","Train",30528,3]
[4,"SUM","Yes","Yes","Fixed Object",183009,9]
[1,"HAN","No","No","Head On",4547175,44]
[1,"HAN","No","No","Train",76797,2]
[8,"BUT","Yes","No","Head On",8675418,109]
[8,"BUT","Yes","No","Train",66621,1]
[1,"ALL","Yes","Yes","Fixed Object",9478719,313]
[3,"CRA","Yes","No","Overturning",648672,5]
[2,"SAN","Yes","No","Backing",402429,34]
[3,"HUR","Yes","No","Unknown",20352,2]
[6,"PIC","Yes","No","Animal",835386,71]
[12,"GEA","Yes","No","Pedestrian",536895,3]
[6,"UNI","Yes","No","Animal",1178985,100]
[10,"HOC","No","Yes","Overturning",110664,4]
[6,"PIC","No","No","Animal",9520029,715]
[5,"LIC","Yes","Yes","Backing",168381,11]
[8,"WAR","Yes","No","Angle",2712603,64]
[9,"HIG","Yes","No","Backing",325632,32]
[4,"SUM","Yes","No","Left Turn",797544,39]
[12,"CUY","No","Yes","Angle",161544,9]
[9,"HIG","Yes","No","Overturning",86973,3]
[2,"SEN","Yes","No","Sideswipe - Passing",5751093,319]
[12,"GEA","No","No","Backing",2930322,160]
[4,"SUM","Yes","Yes","Overturning",7868970,76]
[7,"SHE","Yes","No","Angle",15809493,470]
[7,"MIA","Yes","Yes","Rear End",20352,2]
[4,"ATB","Yes","No","Falling From Or In Vehicle",460098,1]
[5,"COS","Yes","No","Left Turn",45156,1]
[9,"ADA","Yes","No","Animal",45156,1]
[8,"GRE","No","No","Head On",11442159,96]
[8,"GRE","No","No","Train",45156,1]
[3,"HUR","Yes","No","Animal",183168,18]
[12,"CUY","Yes","Yes","Rear End",1947432,97]
[5,"GUE","No","No","Rear End",3302334,95]
[12,"GEA","Yes","No","Pedalcycles",547071,4]
[3,"WAY","Yes","No","Unknown",30528,3]
[4,"STA","Yes","Yes","Unknown",10176,1]
[3,"LOR","Yes","Yes","Left Turn",259806,11]
[9,"JAC","Yes","No","Sideswipe - Passing",66621,1]
[2,"SEN","Yes","No","Sideswipe - Meeting",10176,1]
[6,"UNI","Yes","No","Backing",136740,10]
[2,"SAN","No","No","Right Turn",1001175,23]
[2,"HEN","Yes","Yes","Overturning",460098,1]
[4,"STA","Yes","No","Animal",16606389,1352]
[7,"MOT","No","Yes","Pedestrian",45156,1]
[11,"COL","Yes","No","Sideswipe - Passing",1148250,43]
[0,"CUY","Yes","No","Rear End",10176,1]
[5,"GUE","No","No","Fixed Object",43148514,865]
[10,"NOB","No","No","Unknown",40704,4]
[2,"SAN","Yes","No","Sideswipe - Meeting",10176,1]
[2,"OTT","Yes","No","Animal",254400,25]
[5,"GUE","Yes","No","Angle",188574,4]
[9,"JAC","Yes","No","Rear End",10176,1]
[3,"MED","Yes","No","Fixed Object",8349819,238]
[9,"JAC","Yes","No","Animal",10176,1]
[2,"WOO","Yes","No","Overturning",286836,6]
[2,"SAN","Yes","No","Pedestrian",5210745,20]
[8,"CLI","Yes","Yes","Left Turn",10176,1]
[3,"MED","Yes","No","Right Turn",107325,5]
[8,"BUT","Yes","Yes","Unknown",228324,19]
[6,"FRA","Yes","Yes","Left Turn",9771279,263]
[4,"SUM","Yes","Yes","Right Turn",45156,1]
[12,"LAK","Yes","No","Fixed Object",3705096,96]
[8,"GRE","No","Yes","Fixed Object",5212320,101]
[3,"RIC","Yes","No","Rear End",127677,7]
[6,"FAY","Yes","Yes","Fixed Object",893850,18]
[3,"RIC","Yes","Yes","Rear End",8529474,234]
[11,"TUS","Yes","Yes","Fixed Object",66621,1]
[1,"HAR","No","No","Rear End",2100183,66]
[11,"JEF","Yes","Yes","Overturning",45156,1]
[6,"DEL","Yes","No","Other Object",539169,44]
[10,"HOC","No","No","Pedalcycles",505254,2]
[9,"PIK","Yes","No","Angle",11567103,247]
[4,"ATB","Yes","Yes","Overturning",460098,1]
[11,"BEL","Yes","No","Sideswipe - Meeting",500802,5]
[2,"WOO","Yes","No","Sideswipe - Passing",8535723,445]
[3,"CRA","Yes","Yes","Other Object",91584,9]
[11,"JEF","No","Yes","Overturning",10176,1]
[5,"COS","Yes","No","Head On",45156,1]
[11,"TUS","Yes","No","Rear End",137853,8]
[10,"VIN","No","No","Head On",3972915,31]
[10,"MOE","No","Yes","Angle",45156,1]
[4,"SUM","Yes","Yes","Other Object",20352,2]
[9,"ADA","No","No","Sideswipe - Passing",4785135,108]
[7,"CLA","Yes","No","Right Turn",8680032,388]
[5,"GUE","No","Yes","Left Turn",470274,2]
[3,"LOR","No","No","Angle",33225948,500]
[11,"CAR","Yes","No","Backing",30528,3]
[8,"PRE","No","No","Sideswipe - Passing",5263773,153]
[5,"LIC","Yes","Yes","Animal",929991,61]
[9,"ROS","No","No","Parked Vehicle",2231787,63]
[9,"ROS","Yes","Yes","Left Turn",97149,4]
[4,"TRU","Yes","No","Rear End",20352,2]
[5,"PER","No","No","Pedestrian",1610685,9]
[4,"SUM","Yes","No","Left Turn",10984083,335]
[7,"AUG","Yes","No","Left Turn",1038540,33]
[11,"BEL","Yes","No","Unknown",20352,2]
[8,"WAR","Yes","Yes","Sideswipe - Passing",40704,4]
[7,"MOT","Yes","Yes","Backing",30528,3]
[4,"MAH","Yes","Yes","Backing",65508,3]
[2,"OTT","No","Yes","Fixed Object",4124856,86]
[11,"COL","Yes","No","Pedestrian",66621,1]
[3,"WAY","Yes","Yes","Rear End",1564671,39]
[7,"LOG","No","Yes","Backing",66621,1]
[2,"WOO","Yes","No","Fixed Object",407835,20]
[1,"DEF","Yes","Yes","Backing",30528,3]
[9,"ROS","No","Yes","Overturning",813555,8]
[4,"SUM","Yes","Yes","Sideswipe - Passing",553479,24]
[5,"LIC","No","Yes","Fixed Object",13075680,395]
[8,"CLI","Yes","Yes","Sideswipe - Passing",10176,1]
[4,"SUM","Yes","No","Rear End",258693,13]
[6,"FRA","No","No","Pedestrian",1502247,6]
[3,"ERI","Yes","No","Backing",391140,35]
[6,"FRA","Yes","No","Rear End",783834582,29935]
[12,"CUY","Yes","No","Rear End",1406673,83]
[9,"HIG","Yes","No","Other Non-Collision",30528,3]
[7,"AUG","Yes","No","Other Non-Collision",101760,10]
[7,"LOG","Yes","Yes","Overturning",66621,1]
[1,"VAN","No","No","Angle",14990544,127]
[4,"STA","Yes","No","Angle",15642036,540]
[3,"RIC","Yes","No","Rear End",506097,27]
[3,"CRA","No","Yes","Overturning",535782,5]
[8,"BUT","Yes","No","Parked Vehicle",13366173,498]
[12,"CUY","Yes","Yes","Sideswipe - Passing",45156,1]
[2,"SAN","No","No","Backing",1559901,89]
[3,"CRA","Yes","Yes","Sideswipe - Passing",551682,10]
[4,"POR","No","Yes","Unknown",168381,11]
[6,"FAY","No","No","Sideswipe - Meeting",10176,1]
[5,"LIC","Yes","No","Sideswipe - Passing",841905,55]
[1,"DEF","Yes","Yes","Fixed Object",1915806,30]
[7,"MOT","No","No","Unknown",96036,6]
[4,"ATB","Yes","No","Backing",397818,28]
[1,"ALL","Yes","Yes","Left Turn",66621,1]
[2,"WOO","Yes","Yes","Rear End",682428,43]
[8,"CLI","Yes","Yes","Rear End",106212,7]
[8,"BUT","Yes","No","Unknown",2011524,18]
[12,"CUY","Yes","Yes","Right Turn",339942,12]
[9,"ADA","No","No","Other Non-Collision",3007881,51]
[3,"MED","No","Yes","Angle",85860,5]
[5,"GUE","Yes","Yes","Sideswipe - Passing",3129342,143]
[5,"FAI","Yes","No","Angle",281271,11]
[4,"POR","Yes","Yes","Other Non-Collision",65508,3]
[5,"FAI","Yes","Yes","Animal",20352,2]
[3,"LOR","Yes","Yes","Pedalcycles",10176,1]
[4,"MAH","Yes","Yes","Right Turn",20352,2]
[7,"MOT","Yes","No","Sideswipe - Passing",10176,1]
[7,"DAR","Yes","No","Pedalcycles",526719,2]
[8,"PRE","No","Yes","Unknown",50880,5]
[9,"HIG","No","No","Fixed Object",66710745,1114]
[6,"MRW","No","Yes","Pedestrian",986817,3]
[2,"SEN","Yes","No","Other Object",183009,9]
[3,"MED","Yes","No","Other Object",158205,10]
[9,"LAW","Yes","Yes","Right Turn",167268,13]
[7,"SHE","Yes","No","Unknown",10176,1]
[3,"CRA","Yes","Yes","Other Object",10176,1]
[3,"LOR","Yes","No","Fixed Object",30528,3]
[4,"SUM","Yes","Yes","Backing",106212,7]
[11,"BEL","Yes","Yes","Animal",10176,1]
[4,"TRU","Yes","Yes","Rear End",20352,2]
[2,"OTT","No","No","Head On",5858463,36]
[5,"FAI","No","No","Overturning",11077254,86]
[8,"BUT","No","Yes","Parked Vehicle",116388,8]
[4,"SUM","Yes","No","Backing",35756730,2884]
[6,"DEL","No","No","Overturning",4838304,38]
[11,"BEL","Yes","Yes","Fixed Object",10176,1]
[3,"LOR","Yes","No","Sideswipe - Passing",7865967,377]
[8,"PRE","No","Yes","Backing",20352,2]
[7,"MIA","No","No","Overturning",6130083,58]
[3,"CRA","Yes","No","Overturning",771738,6]
[12,"LAK","Yes","No","Unknown",320862,17]
[8,"PRE","Yes","No","Sideswipe - Passing",653283,11]
[12,"GEA","No","Yes","Rear End",1677990,26]
[10,"NOB","No","Yes","Rear End",911817,15]
[2,"WOO","Yes","Yes","Head On",920880,13]
[9,"LAW","Yes","Yes","Parked Vehicle",132129,4]
[4,"MAH","Yes","Yes","Fixed Object",28101414,714]
[1,"WYA","Yes","No","Head On",208926,6]
[3,"MED","Yes","No","Animal",86973,3]
[2,"WOO","Yes","Yes","Fixed Object",10176,1]
[12,"GEA","Yes","Yes","Animal",335649,24]
[4,"POR","Yes","No","Sideswipe - Meeting",10176,1]
[4,"STA","No","No","Other Non-Vehicle",10176,1]
[8,"WAR","Yes","No","Angle",57595242,1684]
[6,"MAD","Yes","No","Other Non-Collision",10176,1]
[10,"NOB","Yes","Yes","Rear End",131016,6]
[10,"WAS","Yes","No","Rear End",14054469,625]
[6,"FAY","Yes","No","Left Turn",20352,2]
[4,"TRU","Yes","Yes","Sideswipe - Passing",10176,1]
[9,"JAC","Yes","Yes","Rear End",229278,8]
[4,"POR","No","No","Rear End",21611292,546]
[3,"RIC","No","No","Angle",23703282,309]
[4,"STA","Yes","No","Overturning",132129,4]
[7,"AUG","Yes","Yes","Right Turn",66621,1]
[4,"STA","Yes","Yes","Other Non-Collision",127677,7]
[8,"HAM","Yes","Yes","Fixed Object",719904,12]
[5,"PER","No","No","Sideswipe - Meeting",50880,5]
[11,"TUS","Yes","No","Pedalcycles",3438708,42]
[6,"MAR","Yes","Yes","Fixed Object",172833,8]
[1,"DEF","Yes","No","Parked Vehicle",10176,1]
[4,"POR","Yes","No","Pedalcycles",121953,3]
[4,"STA","Yes","No","Right Turn",21590799,1107]
[7,"CLA","No","No","Overturning",3996018,36]
[3,"ERI","Yes","Yes","Sideswipe - Passing",136740,10]
[8,"CLE","Yes","No","Parked Vehicle",122112,12]
[8,"WAR","No","Yes","Other Non-Collision",213696,21]
[6,"MAD","Yes","No","Backing",889764,84]
[9,"PIK","No","No","Pedalcycles",460098,1]
[2,"WOO","Yes","Yes","Backing",10176,1]
[7,"CLA","Yes","Yes","Rear End",693558,28]
[8,"BUT","Yes","No","Pedestrian",4411326,34]
[2,"WOO","Yes","Yes","Fixed Object",296058,18]
[4,"POR","Yes","No","Other Object",20352,2]
[5,"FAI","Yes","Yes","Backing",20352,2]
[8,"HAM","Yes","No","Rear End",20352,2]
[8,"CLE","Yes","No","Backing",234048,23]
[7,"MOT","Yes","Yes","Fixed Object",20352,2]
[4,"MAH","Yes","Yes","Fixed Object",71232,7]
[9,"SCI","No","No","Overturning",12736593,99]
[6,"FAY","Yes","Yes","Animal",142464,14]
[7,"MOT","No","Yes","Angle",1128693,21]
[3,"WAY","Yes","No","Parked Vehicle",2245350,108]
[8,"HAM","Yes","No","Pedestrian",254976618,1991]
[8,"WAR","Yes","No","Backing",10176,1]
[1,"DEF","Yes","Yes","Rear End",228165,10]
[3,"LOR","Yes","Yes","Sideswipe - Passing",20352,2]
[4,"TRU","Yes","No","Sideswipe - Passing",28462362,1271]
[12,"LAK","Yes","Yes","Fixed Object",1472292,50]
[9,"SCI","No","No","Sideswipe - Meeting",10176,1]
[10,"WAS","Yes","No","Other Object",40704,4]
[8,"WAR","Yes","Yes","Angle",1413732,18]
[8,"WAR","Yes","No","Animal",895329,79]
[2,"LUC","Yes","No","Angle",3502356,112]
[7,"MIA","Yes","Yes","Fixed Object",12030255,325]
[12,"LAK","Yes","Yes","Left Turn",20352,2]
[2,"FUL","Yes","No","Angle",5140755,132]
[3,"MED","Yes","Yes","Overturning",178398,3]
[3,"MED","Yes","Yes","Other Non-Collision",714339,17]
[3,"ERI","No","No","Backing",775284,54]
[7,"DAR","Yes","No","Animal",1223028,103]
[3,"CRA","Yes","Yes","Overturning",536895,3]
[11,"COL","Yes","No","Angle",163770,5]
[10,"ATH","Yes","No","Backing",193344,19]
[10,"GAL","Yes","Yes","Other Object",40704,4]
[3,"RIC","No","No","Pedalcycles",2500353,8]
[12,"CUY","Yes","Yes","Sideswipe - Passing",779847,20]
[4,"STA","Yes","Yes","Fixed Object",1766394,45]
[3,"ERI","Yes","Yes","Unknown",20352,2]
[3,"MED","Yes","No","Right Turn",1375779,82]
[9,"BRO","Yes","No","Unknown",20352,2]
[6,"FRA","Yes","Yes","Overturning",143418,3]
[7,"MER","Yes","No","Sideswipe - Passing",2128851,131]
[1,"DEF","Yes","No","Fixed Object",8828361,263]
[12,"CUY","Yes","No","Pedalcycles",2176407,21]
[9,"ROS","Yes","No","Overturning",45156,1]
[8,"GRE","No","No","Angle",19695594,332]
[12,"CUY","Yes","No","Backing",13113429,1085]
[8,"BUT","Yes","No","Parked Vehicle",39395838,2017]
[7,"SHE","Yes","No","Right Turn",20352,2]
[8,"BUT","Yes","No","Other Non-Collision",10176,1]
[10,"MEG","Yes","No","Backing",284928,28]
[7,"MOT","Yes","No","Sideswipe - Passing",20352,2]
[3,"LOR","Yes","No","Fixed Object",1718853,39]
[1,"VAN","No","No","Sideswipe - Meeting",460098,1]
[8,"WAR","Yes","Yes","Rear End",61056,6]
[6,"PIC","Yes","No","Overturning",996993,4]
[7,"DAR","Yes","No","Parked Vehicle",106212,7]
[2,"LUC","Yes","No","Head On",75397674,1020]
[2,"LUC","Yes","No","Train",3324243,31]
[4,"SUM","Yes","No","Rear End",47203725,2232]
[5,"MUS","No","Yes","Rear End",4904910,95]
[2,"OTT","Yes","No","Left Turn",3306102,76]
[1,"HAR","Yes","No","Parked Vehicle",269028,23]
[8,"PRE","Yes","No","Pedestrian",66621,1]
[3,"WAY","No","No","Head On",17640993,131]
[3,"WAY","No","No","Train",20352,2]
[5,"FAI","Yes","Yes","Left Turn",10176,1]
[6,"FRA","Yes","Yes","Pedalcycles",111777,2]
[1,"ALL","No","Yes","Fixed Object",8067546,188]
[6,"MRW","No","No","Animal",9974976,759]
[11,"TUS","Yes","Yes","Rear End",45156,1]
[5,"MUS","Yes","No","Pedestrian",9132558,58]
[3,"WAY","Yes","No","Left Turn",7837569,230]
[1,"PUT","No","No","Unknown",40704,4]
[8,"BUT","No","No","Pedestrian",4733634,21]
[7,"CLA","No","Yes","Pedestrian",1053438,4]
[12,"CUY","Yes","No","Right Turn",10176,1]
[4,"STA","Yes","Yes","Angle",10176,1]
[5,"LIC","Yes","No","Other Object",10176,1]
[5,"LIC","Yes","Yes","Angle",10176,1]
[9,"JAC","No","No","Right Turn",750432,15]
[10,"ATH","Yes","Yes","Fixed Object",1698231,59]
[4,"POR","Yes","No","Fixed Object",13055406,276]
[4,"MAH","Yes","No","Angle",138382458,3957]
[5,"LIC","Yes","No","Other Non-Collision",259806,11]
[3,"LOR","Yes","No","Parked Vehicle",23455452,1011]
[6,"FRA","Yes","No","Sideswipe - Passing",193185,10]
[11,"BEL","Yes","Yes","Fixed Object",121953,3]
[3,"MED","No","No","Parked Vehicle",4582314,53]
[2,"WOO","No","No","Angle",52204605,560]
[7,"MIA","Yes","No","Backing",111936,11]
[5,"PER","Yes","No","Rear End",10176,1]
[3,"WAY","Yes","No","Rear End",16904943,849]
[10,"WAS","No","No","Parked Vehicle",754773,43]
[4,"SUM","Yes","No","Left Turn",10176,1]
[3,"LOR","Yes","No","Parked Vehicle",249789,19]
[12,"CUY","Yes","Yes","Sideswipe - Passing",208188993,7708]
[11,"COL","Yes","Yes","Rear End",10176,1]
[3,"ERI","No","No","Unknown",386370,20]
[5,"KNO","Yes","No","Angle",12657543,416]
[11,"TUS","Yes","No","Left Turn",229278,8]
[8,"WAR","Yes","No","Other Object",20352,2]
[4,"MAH","Yes","Yes","Rear End",14037837,424]
[6,"FAY","No","Yes","Angle",760449,7]
[5,"PER","No","No","Overturning",10023387,85]
[8,"CLE","Yes","Yes","Rear End",24482514,783]
[6,"PIC","No","No","Fixed Object",61824282,1181]
[5,"FAI","Yes","No","Head On",20352,2]
[12,"LAK","Yes","Yes","Angle",1958148,44]
[9,"LAW","Yes","No","Parked Vehicle",3278898,198]
[7,"SHE","Yes","No","Other Non-Collision",10176,1]
[2,"LUC","Yes","Yes","Backing",682587,47]
[3,"ASD","No","Yes","Rear End",3641703,65]
[2,"WOO","Yes","No","Head On",107325,5]
[6,"UNI","Yes","Yes","Fixed Object",207813,8]
[5,"MUS","No","No","Unknown",148029,9]
[4,"STA","Yes","Yes","Backing",10176,1]
[5,"GUE","Yes","No","Left Turn",3853905,136]
[7,"MIA","Yes","Yes","Fixed Object",30528,3]
[10,"MEG","Yes","No","Unknown",470274,2]
[12,"CUY","Yes","Yes","Unknown",10176,1]
[5,"LIC","Yes","Yes","Parked Vehicle",10176,1]
[12,"CUY","Yes","Yes","Other Non-Collision",76797,2]
[4,"SUM","No","No","Angle",2186043,76]
[9,"BRO","Yes","No","Backing",81408,8]
[4,"MAH","Yes","Yes","Right Turn",688263,11]
[3,"MED","Yes","No","Unknown",470274,2]
[6,"UNI","Yes","No","Left Turn",20352,2]
[12,"LAK","Yes","Yes","Parked Vehicle",20352,2]
[12,"LAK","Yes","No","Sideswipe - Passing",10176,1]
[12,"CUY","Yes","Yes","Fixed Object",2519322,39]
[3,"WAY","No","No","Falling From Or In Vehicle",460098,1]
[4,"SUM","Yes","Yes","Rear End",30528,3]
[7,"CHP","Yes","No","Sideswipe - Passing",10176,1]
[7,"MOT","Yes","No","Pedestrian",460098,1]
[1,"PUT","Yes","No","Left Turn",20352,2]
[7,"LOG","Yes","No","Fixed Object",5975313,127]
[10,"ATH","Yes","No","Sideswipe - Meeting",66621,1]
[3,"LOR","Yes","No","Rear End",917430,55]
[4,"STA","No","No","Backing",1894437,115]
[1,"ALL","Yes","No","Pedestrian",617031,4]
[2,"WOO","Yes","No","Animal",1792884,154]
[4,"ATB","Yes","Yes","Other Non-Collision",76797,2]
[2,"HEN","Yes","Yes","Fixed Object",1337094,25]
[5,"FAI","Yes","No","Angle",1801374,45]
[10,"WAS","Yes","No","Other Non-Collision",146916,11]
[6,"PIC","Yes","No","Pedalcycles",433593,8]
[5,"LIC","No","No","Unknown",335490,15]
[4,"MAH","Yes","Yes","Overturning",86973,3]
[4,"POR","Yes","No","Sideswipe - Meeting",10176,1]
[2,"WOO","Yes","No","Other Object",30528,3]
[3,"HUR","No","No","Pedestrian",2872365,8]
[5,"GUE","Yes","No","Unknown",117501,6]
[7,"LOG","No","No","Head On",5411022,61]
[4,"POR","No","Yes","Parked Vehicle",380805,25]
[7,"MOT","Yes","No","Backing",392253,33]
[3,"LOR","Yes","No","Pedestrian",1098594,5]
[5,"LIC","Yes","Yes","Animal",947163,73]
[7,"MOT","Yes","No","Sideswipe - Passing",1417389,35]
[11,"COL","No","No","Right Turn",2079147,53]
[5,"GUE","Yes","Yes","Other Object",183168,18]
[11,"HOL","No","No","Other Object",1056936,12]
[5,"MUS","Yes","Yes","Backing",10176,1]
[4,"POR","No","Yes","Right Turn",86973,3]
[7,"CLA","Yes","Yes","Unknown",229437,17]
[9,"JAC","Yes","No","Animal",2112951,191]
[10,"GAL","Yes","No","Rear End",20352,2]
[4,"STA","No","No","Sideswipe - Passing",7360188,238]
[9,"HIG","Yes","No","Angle",1070181,34]
[7,"MOT","Yes","No","Unknown",30528,3]
[11,"BEL","Yes","No","Animal",742689,64]
[11,"COL","Yes","Yes","Fixed Object",1532235,58]
[3,"ERI","Yes","No","Left Turn",536895,3]
[3,"LOR","Yes","No","Head On",4328265,77]
[3,"LOR","Yes","No","Train",66621,1]
[7,"CLA","No","Yes","Other Non-Collision",697533,63]
[12,"LAK","Yes","Yes","Angle",66621,1]
[4,"SUM","Yes","Yes","Fixed Object",253128,18]
[6,"DEL","Yes","No","Pedestrian",1188906,7]
[2,"WOO","Yes","No","Left Turn",132129,4]
[9,"SCI","Yes","Yes","Rear End",405450,15]
[2,"WOO","Yes","Yes","Other Non-Collision",10176,1]
[3,"ERI","No","Yes","Other Non-Collision",741576,66]
[7,"CHP","Yes","No","Animal",584325,45]
[7,"AUG","Yes","No","Animal",962109,89]
[12,"CUY","Yes","Yes","Parked Vehicle",10176,1]
[10,"MEG","Yes","No","Parked Vehicle",1245669,25]
[3,"ERI","Yes","No","Right Turn",281271,11]
[8,"CLI","No","No","Other Object",234048,23]
[7,"MIA","Yes","No","Pedalcycles",5318691,47]
[5,"PER","Yes","No","Right Turn",10176,1]
[6,"FRA","Yes","No","Backing",55892997,4289]
[8,"CLI","Yes","No","Unknown",10176,1]
[11,"TUS","No","Yes","Fixed Object",10661805,211]
[2,"WIL","Yes","No","Other Object",30528,3]
[5,"FAI","No","No","Right Turn",2001237,53]
[4,"MAH","No","Yes","Sideswipe - Passing",6730326,315]
[9,"JAC","No","Yes","Animal",183168,18]
[10,"ATH","Yes","No","Pedalcycles",848535,8]
[2,"WOO","Yes","No","Right Turn",61056,6]
[7,"SHE","Yes","Yes","Overturning",10176,1]
[11,"TUS","No","No","Right Turn",959247,52]
[4,"STA","Yes","Yes","Angle",1162560,23]
[4,"POR","Yes","Yes","Angle",55332,2]
[2,"WOO","Yes","Yes","Sideswipe - Passing",2008074,55]
[4,"MAH","Yes","No","Sideswipe - Passing",232776,16]
[12,"GEA","Yes","No","Backing",760656,61]
[1,"VAN","Yes","No","Pedalcycles",188574,4]
[5,"LIC","No","No","Backing",1902546,129]
[3,"LOR","Yes","Yes","Other Non-Collision",325473,23]
[12,"LAK","Yes","Yes","Pedestrian",930372,3]
[6,"PIC","Yes","No","Rear End",5135652,220]
[6,"FRA","Yes","Yes","Head On",133242,2]
[3,"CRA","Yes","Yes","Other Non-Collision",172833,8]
[7,"CLA","No","Yes","Head On",634044,7]
[2,"WOO","Yes","No","Pedestrian",7379727,43]
[11,"JEF","Yes","Yes","Fixed Object",14222481,285]
[2,"SAN","Yes","Yes","Parked Vehicle",121953,3]
[4,"POR","Yes","No","Pedestrian",178398,3]
[6,"FRA","No","Yes","Other Object",255354,14]
[6,"FRA","Yes","Yes","Fixed Object",316251,11]
[6,"FRA","Yes","Yes","Right Turn",7055496,209]
[5,"MUS","Yes","Yes","Other Non-Collision",396705,30]
[12,"CUY","No","No","Right Turn",20352,2]
[5,"GUE","No","Yes","Overturning",1125354,22]
[4,"STA","Yes","No","Overturning",7570353,85]
[5,"FAI","No","Yes","Pedestrian",66621,1]
[2,"OTT","Yes","No","Rear End",1945746,37]
[1,"ALL","Yes","No","Other Object",10176,1]
[8,"GRE","Yes","Yes","Fixed Object",81408,8]
[6,"UNI","Yes","No","Backing",146916,11]
[7,"CLA","Yes","No","Rear End",64407729,2258]
[8,"PRE","No","No","Other Object",162816,16]
[5,"LIC","Yes","Yes","Fixed Object",10176,1]
[6,"FRA","Yes","No","Head On",647559,7]
[4,"POR","Yes","No","Sideswipe - Passing",375081,21]
[3,"MED","Yes","No","Backing",1860777,167]
[9,"HIG","Yes","No","Animal",700872,62]
[6,"FRA","Yes","Yes","Right Turn",20352,2]
[2,"LUC","Yes","Yes","Sideswipe - Passing",167268,13]
[8,"HAM","No","Yes","Fixed Object",2266767,68]
[5,"GUE","Yes","Yes","Sideswipe - Passing",40704,4]
[6,"FRA","Yes","No","Other Object",463167,22]
[12,"CUY","Yes","Yes","Fixed Object",591114,7]
[4,"SUM","Yes","Yes","Animal",30528,3]
[11,"TUS","No","Yes","Rear End",4288833,85]
[10,"ATH","Yes","No","Pedestrian",3905547,25]
[12,"LAK","Yes","No","Right Turn",13075014,686]
[7,"SHE","Yes","No","Sideswipe - Passing",5513658,327]
[2,"SAN","Yes","No","Fixed Object",111936,11]
[3,"WAY","Yes","Yes","Other Non-Collision",45156,1]
[4,"SUM","Yes","No","Unknown",20352,2]
[7,"MOT","Yes","No","Sideswipe - Passing",1646445,110]
[7,"AUG","No","Yes","Backing",71232,7]
[12,"LAK","No","Yes","Angle",933282,15]
[1,"WYA","Yes","Yes","Other Object",10176,1]
[4,"SUM","Yes","Yes","Other Object",71232,7]
[1,"ALL","Yes","Yes","Fixed Object",143418,3]
[7,"MOT","Yes","No","Left Turn",10176,1]
[1,"ALL","Yes","Yes","Animal",1221915,100]
[9,"SCI","No","Yes","Head On",460098,1]
[7,"LOG","Yes","No","Left Turn",721701,26]
[6,"DEL","No","Yes","Right Turn",107325,5]
[10,"NOB","Yes","Yes","Parked Vehicle",460098,1]
[7,"MOT","No","No","Pedalcycles",1073790,6]
[3,"WAY","Yes","No","Pedestrian",66621,1]
[3,"ASD","No","Yes","Fixed Object",5815647,263]
[8,"GRE","No","Yes","Unknown",61056,6]
[3,"ERI","Yes","Yes","Head On",66621,1]
[2,"WOO","Yes","Yes","Sideswipe - Passing",10176,1]
[6,"PIC","Yes","No","Parked Vehicle",50880,5]
[4,"SUM","Yes","Yes","Parked Vehicle",40704,4]
[2,"OTT","Yes","No","Sideswipe - Passing",50880,5]
[2,"WOO","Yes","Yes","Right Turn",30528,3]
[10,"MOE","Yes","No","Sideswipe - Passing",228165,10]
[3,"RIC","Yes","No","Head On",55332,2]
[9,"HIG","Yes","No","Pedestrian",1782246,10]
[7,"AUG","No","No","Head On",4365279,33]
[4,"SUM","No","Yes","Other Object",249789,19]
[7,"AUG","Yes","No","Fixed Object",2879505,84]
[6,"FRA","Yes","No","Animal",11469846,742]
[8,"WAR","No","No","Sideswipe - Passing",7961238,166]
[2,"SEN","Yes","No","Head On",228165,10]
[7,"DAR","Yes","No","Rear End",116388,8]
[1,"ALL","Yes","No","Head On",612579,7]
[11,"JEF","Yes","Yes","Parked Vehicle",10176,1]
[7,"MER","Yes","No","Backing",30528,3]
[5,"LIC","No","No","Left Turn",14813103,311]
[8,"CLE","Yes","Yes","Fixed Object",13616901,557]
[3,"WAY","Yes","Yes","Overturning",20352,2]
[8,"BUT","Yes","Yes","Rear End",30528,3]
[9,"ADA","No","No","Head On",6612489,79]
[11,"BEL","Yes","Yes","Sideswipe - Passing",7798122,349]
[12,"CUY","Yes","Yes","Parked Vehicle",20352,2]
[6,"FRA","No","Yes","Angle",192072,12]
[4,"TRU","Yes","Yes","Animal",6224166,434]
[8,"WAR","Yes","Yes","Animal",177444,14]
[6,"UNI","Yes","No","Right Turn",873546,61]
[2,"WIL","No","Yes","Sideswipe - Passing",1838517,117]
[4,"SUM","Yes","Yes","Animal",30528,3]
[7,"LOG","Yes","No","Head On",460098,1]
[5,"GUE","Yes","No","Sideswipe - Meeting",460098,1]
[5,"GUE","Yes","No","Overturning",455058,8]
[1,"HAN","Yes","No","Sideswipe - Passing",30528,3]
[7,"MIA","Yes","Yes","Rear End",10765713,299]
[11,"JEF","Yes","Yes","Left Turn",1446645,26]
[10,"HOC","Yes","Yes","Sideswipe - Passing",967467,35]
[3,"MED","Yes","No","Rear End",30528,3]
[8,"GRE","No","Yes","Right Turn",86973,3]
[7,"MER","No","No","Pedestrian",3027072,10]
[12,"LAK","Yes","No","Pedalcycles",14702247,127]
[5,"KNO","Yes","No","Other Non-Collision",239613,18]
[12,"CUY","Yes","Yes","Left Turn",343281,11]
[2,"WOO","Yes","Yes","Fixed Object",136740,10]
[3,"CRA","Yes","No","Right Turn",621372,32]
[5,"KNO","Yes","No","Other Object",40704,4]
[2,"WOO","No","Yes","Other Non-Collision",1452576,84]
[3,"ASD","No","No","Animal",15378987,995]
[12,"CUY","Yes","Yes","Rear End",2976480,140]
[11,"TUS","Yes","No","Head On",10176,1]
[7,"DAR","Yes","Yes","Overturning",111777,2]
[3,"LOR","No","No","Other Object",234048,23]
[9,"JAC","No","No","Pedalcycles",460098,1]
[11,"COL","Yes","Yes","Other Non-Collision",10176,1]
[7,"AUG","No","Yes","Animal",1317792,97]
[2,"WIL","No","No","Animal",22361250,1842]
[7,"CLA","Yes","No","Animal",656670,50]
[4,"ATB","Yes","No","Pedestrian",5211270,27]
[1,"PAU","No","Yes","Rear End",1589904,20]
[10,"WAS","Yes","No","Angle",97149,4]
[11,"TUS","No","No","Animal",15272298,1026]
[4,"SUM","Yes","No","Parked Vehicle",875772,62]
[12,"LAK","Yes","Yes","Rear End",120840,5]
[3,"LOR","No","No","Pedalcycles",2127228,10]
[9,"HIG","Yes","No","Parked Vehicle",727584,39]
[4,"MAH","Yes","Yes","Left Turn",936780,23]
[4,"SUM","Yes","Yes","Other Non-Collision",10176,1]
[3,"RIC","Yes","Yes","Other Object",20352,2]
[7,"CLA","No","No","Angle",14011266,219]
[8,"BUT","Yes","No","Fixed Object",42168582,789]
[3,"LOR","Yes","Yes","Fixed Object",13760142,339]
[6,"PIC","No","No","Rear End",17026287,361]
[2,"LUC","Yes","Yes","Sideswipe - Passing",44814717,2146]
[7,"MOT","Yes","Yes","Right Turn",157092,12]
[7,"LOG","Yes","No","Animal",1150365,75]
[7,"CLA","Yes","No","Pedalcycles",300351,6]
[8,"PRE","Yes","No","Backing",81408,8]
[9,"ROS","Yes","Yes","Parked Vehicle",950724,5]
[8,"HAM","No","No","Head On",4121469,47]
[8,"HAM","No","No","Train",10176,1]
[7,"AUG","Yes","No","Parked Vehicle",886107,67]
[3,"MED","Yes","Yes","Overturning",505254,2]
[8,"HAM","Yes","Yes","Head On",9054330,100]
[8,"HAM","Yes","Yes","Train",10176,1]
[7,"CLA","Yes","Yes","Backing",126564,9]
[5,"FAI","Yes","No","Other Object",244065,15]
[4,"ATB","Yes","No","Overturning",1108770,6]
[11,"COL","Yes","Yes","Fixed Object",331038,18]
[7,"CLA","Yes","No","Animal",61056,6]
[7,"MOT","Yes","No","Backing",20352,2]
[6,"PIC","Yes","No","Fixed Object",5156655,132]
[5,"FAI","Yes","No","Pedalcycles",1318809,10]
[6,"PIC","Yes","No","Rear End",1486602,35]
[4,"SUM","Yes","Yes","Angle",65508,3]
[6,"FRA","Yes","No","Rear End",85860,5]
[8,"WAR","Yes","Yes","Fixed Object",55332,2]
[1,"PAU","No","No","Backing",769719,59]
[12,"CUY","Yes","Yes","Parked Vehicle",308460,20]
[5,"FAI","No","Yes","Angle",10176,1]
[12,"CUY","No","No","Parked Vehicle",61056,6]
[9,"LAW","No","Yes","Backing",10176,1]
[3,"WAY","Yes","Yes","Angle",66621,1]
[3,"WAY","Yes","No","Fixed Object",14858451,422]
[3,"RIC","No","No","Other Object",482565,35]
[3,"WAY","Yes","No","Pedestrian",133242,2]
[11,"CAR","No","No","Fixed Object",38813475,725]
[6,"FRA","Yes","Yes","Other Non-Collision",121953,3]
[2,"WOO","Yes","Yes","Angle",10176,1]
[12,"LAK","Yes","Yes","Rear End",10176,1]
[11,"TUS","Yes","No","Rear End",30163920,1423]
[4,"SUM","Yes","No","Overturning",9754026,105]
[6,"PIC","Yes","No","Angle",618303,11]
[1,"ALL","Yes","No","Angle",142305,5]
[2,"SAN","Yes","Yes","Other Non-Collision",91584,9]
[3,"RIC","No","No","Other Non-Collision",636318,48]
[9,"PIK","No","Yes","Rear End",30528,3]
[4,"STA","Yes","Yes","Sideswipe - Passing",97149,4]
[1,"HAR","Yes","No","Fixed Object",85860,5]
[11,"TUS","Yes","Yes","Fixed Object",97149,4]
[1,"WYA","No","No","Animal",12443307,954]
[6,"DEL","No","No","Fixed Object",46672590,951]
[5,"FAI","Yes","No","Other Non-Collision",30528,3]
[7,"SHE","No","Yes","Right Turn",20352,2]
[7,"AUG","No","Yes","Fixed Object",3462129,130]
[12,"LAK","No","No","Other Non-Collision",699552,10]
[2,"WOO","No","No","Sideswipe - Meeting",480450,3]
[6,"MAD","Yes","Yes","Right Turn",10176,1]
[2,"FUL","No","No","Left Turn",6942240,131]
[8,"PRE","Yes","No","Sideswipe - Passing",20352,2]
[10,"HOC","Yes","Yes","Backing",10176,1]
[7,"SHE","No","No","Pedalcycles",66621,1]
[12,"CUY","Yes","No","Overturning",787638,11]
[2,"HEN","No","No","Angle",24378123,222]
[4,"SUM","Yes","Yes","Rear End",771309,29]
[11,"COL","No","Yes","Other Object",71232,7]
[7,"CLA","Yes","Yes","Angle",20352,2]
[1,"VAN","No","No","Right Turn",148029,9]
[10,"HOC","Yes","No","Other Non-Collision",617190,13]
[4,"MAH","No","No","Rear End",18210060,568]
[1,"HAN","No","Yes","Animal",1487127,97]
[8,"CLE","Yes","No","Head On",37227798,426]
[12,"LAK","Yes","Yes","Animal",10176,1]
[3,"ERI","Yes","No","Left Turn",66621,1]
[4,"MAH","Yes","No","Fixed Object",1381980,48]
[2,"WIL","No","No","Pedestrian",1859043,12]
[12,"GEA","Yes","No","Angle",7226310,195]
[11,"TUS","Yes","Yes","Other Non-Collision",932487,35]
[4,"STA","Yes","No","Sideswipe - Passing",1464660,68]
[8,"CLE","Yes","Yes","Right Turn",30528,3]
[11,"TUS","Yes","No","Right Turn",50880,5]
[8,"PRE","No","No","Parked Vehicle",2432079,58]
[9,"BRO","Yes","No","Overturning",76797,2]
[6,"UNI","No","No","Pedestrian",781914,7]
[3,"RIC","Yes","No","Head On",1654299,25]
[3,"LOR","Yes","No","Right Turn",13449363,586]
[6,"FAY","No","No","Fixed Object",31042959,721]
[8,"BUT","Yes","No","Head On",37145739,453]
[8,"BUT","Yes","No","Train",85860,5]
[2,"WIL","Yes","No","Pedestrian",816894,7]
[2,"OTT","Yes","Yes","Overturning",188574,4]
[7,"MER","Yes","No","Backing",1734213,158]
[6,"UNI","No","No","Sideswipe - Meeting",460098,1]
[9,"LAW","No","No","Head On",6211062,74]
[4,"TRU","Yes","No","Left Turn",41515398,956]
[4,"SUM","Yes","Yes","Right Turn",10176,1]
[1,"PUT","Yes","No","Fixed Object",30528,3]
[11,"HAS","No","No","Sideswipe - Passing",3072006,78]
[6,"PIC","Yes","No","Unknown",136740,10]
[2,"WOO","Yes","Yes","Overturning",10176,1]
[10,"ATH","Yes","Yes","Other Non-Collision",510978,6]
[8,"BUT","No","No","Other Object",96036,6]
[7,"MOT","Yes","Yes","Overturning",55332,2]
[1,"WYA","No","Yes","Animal",370788,33]
[8,"HAM","Yes","No","Pedalcycles",35899485,395]
[9,"JAC","Yes","No","Parked Vehicle",65508,3]
[5,"MUS","No","Yes","Animal",3475215,213]
[10,"GAL","Yes","Yes","Overturning",66621,1]
[8,"BUT","Yes","Yes","Animal",1393158,83]
[10,"WAS","No","Yes","Angle",10176,1]
[11,"TUS","No","Yes","Overturning",397500,10]
[3,"LOR","Yes","No","Animal",694146,24]
[5,"GUE","No","Yes","Parked Vehicle",229278,8]
[9,"SCI","No","No","Right Turn",2384379,38]
[3,"CRA","Yes","No","Rear End",4259085,188]
[1,"ALL","No","No","Pedalcycles",705117,5]
[7,"DAR","Yes","No","Rear End",111777,2]
[4,"POR","Yes","Yes","Other Non-Collision",20352,2]
[3,"HUR","No","No","Other Object",679359,17]
[8,"HAM","Yes","Yes","Animal",20352,2]
[8,"WAR","Yes","No","Parked Vehicle",2309904,122]
[3,"ERI","Yes","No","Parked Vehicle",20352,2]
[12,"LAK","Yes","No","Overturning",9267135,51]
[4,"STA","Yes","No","Right Turn",1653552,90]
[10,"MEG","No","No","Angle",4778871,78]
[8,"GRE","Yes","No","Animal",50880,5]
[3,"LOR","Yes","Yes","Angle",883674,17]
[6,"FAY","No","No","Rear End",4315641,142]
[3,"LOR","Yes","No","Other Object",10176,1]
[1,"HAN","Yes","No","Right Turn",3678099,202]
[7,"CHP","Yes","No","Pedestrian",1340799,17]
[3,"LOR","No","No","Pedestrian",1790196,10]
[3,"ERI","Yes","No","Unknown",20352,2]
[12,"LAK","No","No","Sideswipe - Passing",1100709,37]
[6,"FAY","No","No","Overturning",6876795,67]
[4,"SUM","Yes","Yes","Other Object",50880,5]
[11,"JEF","Yes","No","Head On",5746353,72]
[9,"SCI","Yes","Yes","Fixed Object",76797,2]
[11,"COL","Yes","Yes","Other Non-Collision",10176,1]
[7,"CLA","Yes","No","Fixed Object",65445669,1818]
[6,"FRA","No","No","Overturning",1430586,12]
[1,"DEF","Yes","Yes","Right Turn",10176,1]
[10,"NOB","No","No","Animal",1371009,67]
[7,"CHP","No","No","Pedalcycles",930372,3]
[4,"STA","Yes","Yes","Other Object",1210785,110]
[1,"PAU","Yes","No","Fixed Object",30528,3]
[6,"PIC","Yes","No","Sideswipe - Passing",702621,31]
[2,"WIL","Yes","No","Animal",20352,2]
[7,"MOT","Yes","Yes","Animal",173946,6]
[3,"LOR","No","Yes","Head On",45156,1]
[11,"BEL","Yes","Yes","Rear End",91584,9]
[4,"ATB","Yes","No","Pedalcycles",1277676,19]
[12,"CUY","Yes","Yes","Left Turn",45156,1]
[9,"LAW","Yes","No","Head On",4787154,60]
[4,"MAH","Yes","No","Parked Vehicle",10176,1]
[4,"SUM","Yes","Yes","Left Turn",10176,1]
[1,"PUT","No","No","Sideswipe - Passing",1575594,45]
[4,"MAH","Yes","No","Left Turn",152481,6]
[2,"SAN","Yes","No","Angle",1029477,30]
[3,"MED","Yes","No","Head On",3156975,18]
[7,"AUG","Yes","No","Sideswipe - Passing",50880,5]
[3,"WAY","No","Yes","Fixed Object",5018595,140]
[1,"PUT","Yes","No","Angle",66621,1]
[2,"WOO","Yes","No","Backing",132288,13]
[4,"MAH","No","No","Sideswipe - Meeting",188574,4]
[5,"COS","Yes","No","Fixed Object",66621,1]
[11,"COL","Yes","No","Head On",560586,4]
[10,"ATH","Yes","No","Angle",20352,2]
[4,"TRU","No","No","Other Non-Collision",2341767,56]
[7,"DAR","No","No","Sideswipe - Passing",5632383,170]
[2,"WOO","Yes","No","Other Object",10176,1]
[3,"ASD","Yes","No","Overturning",66621,1]
[8,"HAM","No","Yes","Rear End",1382664,69]
[5,"MUS","Yes","No","Other Object",248517,12]
[2,"SEN","Yes","No","Angle",5203767,171]
[2,"HEN","Yes","Yes","Animal",437409,34]
[6,"FRA","Yes","No","Left Turn",393612798,9601]
[2,"SAN","Yes","No","Animal",371901,31]
[6,"FRA","Yes","Yes","Parked Vehicle",525606,4]
[3,"WAY","Yes","Yes","Animal",727902,57]
[10,"NOB","No","Yes","Fixed Object",2984286,70]
[10,"WAS","Yes","No","Pedalcycles",1452051,17]
[11,"HOL","No","No","Pedestrian",4234104,18]
[3,"LOR","Yes","Yes","Backing",592386,14]
[8,"WAR","Yes","Yes","Rear End",5466054,202]
[6,"PIC","Yes","No","Fixed Object",1407738,36]
[4,"SUM","No","Yes","Sideswipe - Passing",3924660,186]
[11,"BEL","No","Yes","Unknown",168381,11]
[1,"HAR","Yes","No","Left Turn",754884,12]
[3,"MED","Yes","No","Animal",497352,42]
[12,"GEA","No","Yes","Fixed Object",620259,34]
[5,"COS","Yes","No","Sideswipe - Passing",2518257,81]
[11,"HAS","No","No","Other Non-Collision",1715943,27]
[8,"CLE","No","No","Right Turn",2995305,96]
[10,"NOB","Yes","No","Parked Vehicle",76797,2]
[12,"GEA","No","Yes","Overturning",613692,5]
[9,"ROS","Yes","No","Backing",50880,5]
[1,"HAN","Yes","No","Overturning",133242,2]
[4,"TRU","Yes","No","Animal",10176,1]
[8,"WAR","Yes","No","Pedalcycles",670137,5]
[12,"CUY","Yes","No","Fixed Object",592732227,11192]
[11,"HAS","No","No","Head On",5678523,48]
[6,"FRA","Yes","No","Pedalcycles",3684903,33]
[2,"FUL","No","Yes","Rear End",3361179,49]
[11,"TUS","Yes","Yes","Angle",933282,15]
[9,"PIK","Yes","No","Right Turn",836022,42]
[6,"MAR","No","No","Animal",11963652,861]
[4,"SUM","Yes","No","Angle",20352,2]
[3,"ERI","Yes","No","Overturning",1362852,13]
[12,"CUY","Yes","Yes","Left Turn",20352,2]
[6,"FRA","Yes","Yes","Backing",30528,3]
[10,"GAL","Yes","No","Angle",5931351,200]
[2,"FUL","Yes","No","Backing",111936,11]
[4,"POR","No","No","Fixed Object",70306569,1521]
[6,"FRA","No","Yes","Parked Vehicle",480450,3]
[11,"JEF","Yes","No","Angle",561858,11]
[7,"SHE","Yes","Yes","Pedalcycles",135468,3]
[3,"RIC","No","Yes","Sideswipe - Passing",3162192,167]
[2,"LUC","Yes","No","Other Non-Collision",12007437,242]
[5,"MUS","No","No","Backing",936669,54]
[7,"DAR","Yes","No","Rear End",9433707,327]
[10,"NOB","No","No","Fixed Object",12996162,238]
[2,"OTT","Yes","No","Unknown",86973,3]
[3,"MED","Yes","No","Left Turn",5763939,127]
[6,"MAD","No","Yes","Other Non-Collision",995658,73]
[1,"WYA","No","No","Unknown",168381,11]
[1,"HAN","Yes","Yes","Sideswipe - Passing",6462411,295]
[9,"HIG","Yes","No","Animal",30528,3]
[5,"GUE","No","Yes","Right Turn",20352,2]
[2,"WOO","Yes","No","Rear End",820281,46]
[5,"FAI","No","No","Parked Vehicle",1795539,72]
[3,"MED","Yes","Yes","Animal",482565,35]
[8,"CLE","Yes","No","Animal",71232,7]
[2,"FUL","No","Yes","Right Turn",66621,1]
[10,"HOC","No","Yes","Other Object",61056,6]
[5,"LIC","Yes","Yes","Fixed Object",3011745,52]
[4,"POR","No","No","Animal",12171369,794]
[4,"STA","Yes","No","Rear End",14821200,744]
[3,"WAY","No","Yes","Left Turn",66621,1]
[3,"LOR","Yes","Yes","Rear End",6519063,299]
[5,"MUS","Yes","Yes","Right Turn",76797,2]
[3,"LOR","Yes","Yes","Parked Vehicle",85860,5]
[2,"LUC","No","No","Angle",21336249,246]
[7,"MOT","No","Yes","Other Object",45156,1]
[8,"HAM","Yes","No","Angle",574874946,18193]
[6,"FRA","No","No","Sideswipe - Passing",731082,47]
[10,"NOB","No","No","Parked Vehicle",198909,14]
[6,"FRA","Yes","No","Pedestrian",8494779,86]
[7,"CLA","No","No","Sideswipe - Passing",5036832,110]
[9,"HIG","Yes","No","Pedestrian",460098,1]
[8,"CLE","No","Yes","Animal",20352,2]
[1,"DEF","Yes","Yes","Right Turn",10176,1]
[1,"HAR","Yes","No","Rear End",10176,1]
[7,"MER","No","No","Other Object",233889,14]
[8,"BUT","Yes","No","Rear End",5314956,242]
[3,"ERI","Yes","Yes","Backing",10176,1]
[7,"CHP","Yes","No","Head On",10176,1]
[7,"AUG","Yes","No","Sideswipe - Passing",209085,15]
[5,"MUS","Yes","Yes","Rear End",665256,26]
[4,"SUM","Yes","No","Backing",20352,2]
[11,"CAR","No","No","Rear End",9390522,288]
[3,"MED","Yes","No","Unknown",10176,1]
[2,"WIL","Yes","No","Animal",2183070,200]
[11,"JEF","Yes","No","Other Object",566310,8]
[6,"FRA","Yes","No","Angle",11246244,433]
[7,"CLA","Yes","Yes","Overturning",111777,2]
[2,"WOO","Yes","Yes","Fixed Object",61056,6]
[4,"ATB","Yes","Yes","Other Object",10176,1]
[4,"ATB","Yes","Yes","Parked Vehicle",10176,1]
[10,"NOB","Yes","Yes","Fixed Object",908637,25]
[10,"GAL","No","Yes","Other Non-Collision",61056,6]
[6,"FRA","Yes","Yes","Unknown",66621,1]
[5,"PER","No","No","Rear End",12251376,289]
[12,"CUY","Yes","Yes","Overturning",1055664,5]
[3,"WAY","Yes","No","Other Non-Collision",367131,16]
[2,"WIL","Yes","Yes","Fixed Object",470274,2]
[2,"SAN","No","Yes","Other Object",1383777,127]
[1,"VAN","Yes","No","Animal",45156,1]
[1,"WYA","No","No","Backing",417216,41]
[3,"ASD","Yes","No","Animal",2581635,168]
[12,"CUY","Yes","No","Fixed Object",963969,27]
[3,"RIC","Yes","No","Animal",8760534,702]
[5,"PER","Yes","No","Overturning",10176,1]
[2,"HEN","No","Yes","Sideswipe - Passing",2738424,46]
[3,"ASD","No","No","Pedalcycles",715293,6]
[4,"SUM","Yes","Yes","Head On",515430,3]
[4,"SUM","No","No","Other Non-Collision",1142796,17]
[3,"MED","Yes","Yes","Parked Vehicle",117501,6]
[4,"SUM","Yes","Yes","Head On",255195,5]
[3,"ERI","No","No","Sideswipe - Meeting",91584,9]
[5,"KNO","No","No","Other Non-Collision",534558,38]
[10,"WAS","Yes","No","Fixed Object",10638798,246]
[6,"FAY","Yes","Yes","Right Turn",10176,1]
[4,"SUM","Yes","Yes","Other Object",2713128,201]
[2,"WOO","No","No","Pedestrian",1712286,10]
[3,"WAY","No","Yes","Other Non-Collision",259965,20]
[4,"SUM","Yes","Yes","Fixed Object",505938,18]
[4,"STA","No","Yes","Rear End",1238244,27]
[3,"ERI","No","No","Pedalcycles",66621,1]
[6,"MRW","No","Yes","Sideswipe - Passing",6439674,278]
[1,"VAN","No","No","Rear End",7461024,92]
[2,"SAN","Yes","No","Other Object",10176,1]
[4,"POR","Yes","No","Fixed Object",10176,1]
[6,"UNI","Yes","No","Fixed Object",648831,14]
[6,"FRA","Yes","Yes","Animal",40704,4]
[2,"LUC","No","No","Train",10176,1]
[6,"DEL","No","Yes","Overturning",388437,7]
[8,"BUT","No","Yes","Other Non-Collision",10176,1]
[8,"HAM","Yes","No","Other Object",2965191,196]
[4,"MAH","Yes","No","Left Turn",65508,3]
[4,"ATB","No","No","Right Turn",1468953,51]
[3,"ERI","Yes","No","Left Turn",683811,14]
[11,"COL","No","No","Pedalcycles",1523712,6]
[9,"HIG","Yes","No","Backing",30528,3]
[6,"DEL","Yes","Yes","Sideswipe - Meeting",460098,1]
[7,"AUG","Yes","Yes","Fixed Object",4676697,105]
[3,"ERI","Yes","No","Pedalcycles",2967909,33]
[5,"MUS","Yes","Yes","Fixed Object",1001175,23]
[11,"BEL","Yes","Yes","Overturning",525606,4]
[8,"PRE","Yes","No","Other Object",107325,5]
[9,"PIK","Yes","No","Fixed Object",10176,1]
[4,"TRU","Yes","No","Parked Vehicle",10176,1]
[9,"ROS","No","Yes","Parked Vehicle",490626,4]
[7,"MOT","No","No","Overturning",3100530,18]
[8,"CLE","No","No","Pedalcycles",1308633,9]
[4,"MAH","No","Yes","Overturning",1002129,12]
[5,"COS","No","No","Head On",5223465,40]
[1,"PAU","No","Yes","Animal",691809,59]
[12,"GEA","Yes","No","Fixed Object",14964630,348]
[10,"GAL","No","Yes","Parked Vehicle",91584,9]
[6,"UNI","Yes","No","Fixed Object",7518996,193]
[9,"SCI","Yes","No","Sideswipe - Passing",12418200,566]
[1,"ALL","No","No","Animal",13742703,1022]
[6,"DEL","Yes","Yes","Head On",728808,6]
[7,"MOT","Yes","Yes","Other Non-Collision",65508,3]
[3,"CRA","Yes","No","Pedalcycles",862050,8]
[8,"HAM","Yes","No","Sideswipe - Passing",6942750,394]
[5,"FAI","Yes","No","Backing",1036521,86]
[7,"AUG","Yes","Yes","Overturning",1360626,12]
[7,"MIA","Yes","Yes","Right Turn",71232,7]
[6,"MAR","Yes","No","Parked Vehicle",81408,8]
[4,"POR","Yes","No","Right Turn",40704,4]
[1,"PUT","Yes","No","Animal",315456,31]
[1,"HAN","No","Yes","Backing",81408,8]
[4,"TRU","Yes","Yes","Fixed Object",66621,1]
[10,"HOC","Yes","No","Backing",85860,5]
[2,"SAN","No","No","Overturning",5495706,69]
[2,"OTT","Yes","Yes","Animal",1052262,82]
[6,"MRW","Yes","Yes","Backing",76797,2]
[6,"PIC","Yes","No","Angle",2510880,58]
[8,"WAR","Yes","No","Sideswipe - Meeting",117501,6]
[8,"CLI","Yes","No","Sideswipe - Passing",76797,2]
[8,"WAR","Yes","No","Rear End",91629882,4501]
[3,"ERI","Yes","No","Rear End",1578393,93]
[12,"CUY","Yes","Yes","Pedalcycles",111777,2]
[3,"ERI","No","Yes","Other Object",1165629,109]
[3,"ASD","Yes","Yes","Fixed Object",1410282,55]
[3,"LOR","Yes","Yes","Unknown",101760,10]
[3,"RIC","No","Yes","Head On",10176,1]
[8,"BUT","Yes","Yes","Pedalcycles",45156,1]
[4,"STA","No","Yes","Fixed Object",3509304,78]
[7,"CLA","Yes","Yes","Head On",66621,1]
[5,"GUE","No","No","Animal",7300977,481]
[9,"BRO","No","No","Rear End",15653499,487]
[2,"WIL","Yes","No","Right Turn",40704,4]
[1,"DEF","No","No","Rear End",6695949,130]
[6,"FRA","No","Yes","Head On",230391,6]
[11,"CAR","No","No","Right Turn",881178,43]
[2,"FUL","No","Yes","Fixed Object",6315144,165]
[7,"LOG","Yes","No","Right Turn",50880,5]
[5,"FAI","Yes","No","Other Non-Collision",20352,2]
[1,"HAN","No","No","Sideswipe - Passing",3596118,137]
[3,"WAY","Yes","No","Animal",20352,2]
[8,"CLE","Yes","Yes","Backing",111936,11]
[9,"LAW","No","No","Parked Vehicle",2277213,42]
[9,"ROS","Yes","No","Overturning",143418,3]
[4,"ATB","Yes","No","Other Object",771897,15]
[4,"POR","Yes","Yes","Other Object",10176,1]
[9,"BRO","No","No","Overturning",8536293,79]
[7,"SHE","No","Yes","Animal",2264748,121]
[7,"AUG","Yes","No","Angle",1279107,40]
[9,"ROS","No","Yes","Fixed Object",5577051,153]
[3,"MED","Yes","No","Pedestrian",5658378,35]
[3,"WAY","No","Yes","Unknown",40704,4]
[8,"WAR","Yes","Yes","Other Non-Collision",10176,1]
[3,"CRA","Yes","No","Backing",924585,75]
[3,"WAY","Yes","No","Right Turn",279045,15]
[10,"WAS","Yes","Yes","Sideswipe - Passing",55332,2]
[6,"UNI","Yes","No","Fixed Object",1226844,59]
[4,"POR","Yes","Yes","Sideswipe - Passing",2058843,91]
[2,"WOO","Yes","No","Parked Vehicle",111936,11]
[10,"ATH","Yes","No","Pedalcycles",460098,1]
[1,"HAN","Yes","No","Animal",4872555,445]
[8,"BUT","Yes","Yes","Backing",300669,24]
[4,"MAH","Yes","Yes","Unknown",10176,1]
[7,"SHE","Yes","Yes","Fixed Object",5351589,176]
[8,"HAM","No","Yes","Backing",10176,1]
[6,"UNI","Yes","No","Other Non-Collision",66621,1]
[10,"GAL","Yes","No","Head On",470274,2]
[7,"MIA","Yes","No","Other Non-Collision",995880,6]
[4,"MAH","Yes","Yes","Left Turn",10176,1]
[4,"ATB","Yes","No","Fixed Object",470274,2]
[2,"SEN","Yes","No","Other Non-Collision",193185,10]
[8,"BUT","Yes","No","Overturning",45156,1]
[8,"BUT","No","Yes","Backing",30528,3]
[3,"WAY","No","Yes","Backing",187620,15]
[1,"HAR","No","No","Animal",10734423,802]
[1,"DEF","No","No","Left Turn",1790610,48]
[11,"HAS","No","No","Other Object",219261,16]
[11,"HAS","Yes","No","Overturning",460098,1]
[4,"SUM","Yes","Yes","Rear End",1931007,80]
[7,"AUG","Yes","Yes","Other Object",30528,3]
[11,"JEF","No","No","Left Turn",1675065,60]
[10,"MOE","Yes","No","Overturning",470274,2]
[3,"HUR","Yes","No","Head On",76797,2]
[5,"FAI","No","No","Fixed Object",78602016,1246]
[4,"MAH","Yes","No","Pedestrian",45156,1]
[11,"COL","Yes","No","Parked Vehicle",1150365,75]
[6,"FRA","Yes","No","Pedestrian",66621,1]
[1,"HAR","Yes","No","Animal",10176,1]
[8,"GRE","Yes","No","Right Turn",127677,7]
[2,"HEN","No","No","Right Turn",288108,18]
[6,"UNI","Yes","No","Parked Vehicle",1873767,100]
[2,"HEN","Yes","No","Angle",45156,1]
[3,"HUR","No","No","Pedalcycles",45156,1]
[6,"UNI","Yes","No","Rear End",1742004,89]
[4,"TRU","No","No","Other Object",228324,19]
[3,"LOR","Yes","No","Pedalcycles",76797,2]
[7,"SHE","No","Yes","Unknown",50880,5]
[10,"NOB","No","No","Backing",111936,11]
[2,"WOO","Yes","Yes","Parked Vehicle",460098,1]
[7,"MOT","Yes","No","Fixed Object",85860,5]
[11,"JEF","Yes","Yes","Sideswipe - Passing",4720407,206]
[8,"GRE","No","No","Other Non-Collision",1698549,77]
[12,"CUY","Yes","Yes","Overturning",76797,2]
[1,"WYA","No","No","Left Turn",959358,21]
[10,"GAL","Yes","No","Angle",66621,1]
[3,"ERI","Yes","No","Backing",4721505,395]
[6,"PIC","Yes","No","Left Turn",1812234,57]
[11,"BEL","Yes","Yes","Fixed Object",10176,1]
[11,"COL","No","No","Backing",1571874,104]
[3,"MED","Yes","No","Left Turn",310686,16]
[3,"LOR","Yes","No","Pedestrian",2462559,16]
[5,"FAI","Yes","No","Animal",2286102,157]
[11,"COL","Yes","No","Backing",10176,1]
[5,"FAI","Yes","Yes","Other Non-Collision",40704,4]
[6,"FRA","Yes","No","Other Non-Collision",10176,1]
[4,"MAH","No","No","Other Object",304008,23]
[8,"WAR","No","Yes","Pedestrian",460098,1]
[10,"WAS","No","No","Fixed Object",56346273,1066]
[12,"GEA","Yes","No","Animal",2476425,195]
[4,"SUM","Yes","No","Rear End",317364,14]
[7,"CLA","Yes","Yes","Rear End",6906354,197]
[5,"FAI","Yes","Yes","Fixed Object",693987,15]
[9,"SCI","Yes","No","Overturning",3231117,32]
[2,"HEN","Yes","Yes","Left Turn",470274,2]
[12,"GEA","No","No","Rear End",30714342,857]
[4,"POR","Yes","No","Head On",142305,5]
[10,"VIN","Yes","No","Fixed Object",1911195,24]
[11,"COL","Yes","No","Other Non-Collision",85860,5]
[6,"PIC","No","Yes","Sideswipe - Meeting",460098,1]
[2,"OTT","Yes","No","Fixed Object",6591216,179]
[1,"WYA","No","No","Fixed Object",23397444,406]
[9,"ROS","No","Yes","Animal",2131713,168]
[3,"MED","Yes","Yes","Fixed Object",1792884,89]
[6,"FRA","Yes","Yes","Unknown",10176,1]
[6,"DEL","No","No","Animal",11172198,779]
[8,"BUT","Yes","No","Backing",2461638,193]
[10,"HOC","Yes","No","Sideswipe - Passing",40704,4]
[9,"ROS","Yes","No","Sideswipe - Meeting",460098,1]
[1,"HAR","Yes","No","Backing",280317,22]
[6,"UNI","Yes","No","Sideswipe - Passing",10176,1]
[1,"PUT","No","No","Fixed Object",23682579,418]
[6,"UNI","Yes","Yes","Rear End",2113698,71]
[7,"MOT","Yes","Yes","Rear End",187620,15]
[2,"WOO","Yes","Yes","Parked Vehicle",66621,1]
[6,"UNI","Yes","Yes","Parked Vehicle",10176,1]
[6,"DEL","No","No","Pedalcycles",3138849,12]
[4,"SUM","Yes","Yes","Left Turn",783186,19]
[9,"LAW","No","Yes","Rear End",749160,8]
[7,"MIA","No","No","Left Turn",4146051,113]
[3,"ASD","No","Yes","Unknown",91584,9]
[11,"TUS","No","Yes","Right Turn",20352,2]
[10,"VIN","Yes","No","Head On",143418,3]
[4,"STA","Yes","No","Parked Vehicle",26621415,1542]
[1,"HAR","No","No","Train",470274,2]
[1,"HAR","No","No","Head On",4829145,20]
[6,"PIC","No","No","Parked Vehicle",2655108,55]
[8,"WAR","No","No","Other Non-Collision",1005945,38]
[11,"JEF","No","No","Unknown",137853,8]
[1,"WYA","Yes","No","Angle",4360065,97]
[10,"HOC","No","No","Unknown",50880,5]
[7,"SHE","Yes","No","Head On",1222503,31]
[4,"MAH","No","Yes","Other Non-Collision",948546,49]
[7,"MOT","Yes","Yes","Other Object",3255159,212]
[7,"MIA","Yes","No","Parked Vehicle",10109679,480]
[5,"COS","Yes","No","Sideswipe - Passing",10176,1]
[11,"TUS","No","Yes","Unknown",61056,6]
[4,"SUM","Yes","Yes","Unknown",10176,1]
[11,"COL","No","No","Rear End",12893880,349]
[9,"ROS","Yes","No","Pedestrian",7215957,43]
[7,"CLA","Yes","Yes","Unknown",40704,4]
[2,"WOO","Yes","Yes","Other Object",10176,1]
[4,"MAH","Yes","No","Right Turn",10176,1]
[1,"HAR","Yes","No","Fixed Object",685608,28]
[5,"MUS","Yes","Yes","Animal",76797,2]
[4,"MAH","Yes","No","Fixed Object",10176,1]
[2,"WOO","Yes","No","Sideswipe - Passing",10176,1]
[3,"HUR","No","No","Rear End",11131872,174]
[7,"CHP","No","No","Overturning",3913815,48]
[11,"JEF","Yes","No","Angle",17447877,486]
[9,"ROS","No","No","Head On",8675577,103]
[4,"TRU","No","Yes","Sideswipe - Passing",1146708,58]
[3,"HUR","Yes","No","Parked Vehicle",821823,31]
[12,"CUY","Yes","Yes","Backing",10176,1]
[7,"MIA","Yes","No","Backing",3529641,331]
[8,"BUT","Yes","No","Right Turn",1236336,49]
[11,"TUS","Yes","Yes","Pedestrian",133242,2]
[4,"ATB","No","No","Fixed Object",86538468,1560]
[3,"HUR","Yes","No","Angle",12012384,353]
[4,"STA","Yes","No","Fixed Object",152018442,4361]
[10,"WAS","Yes","No","Unknown",480450,3]
[5,"LIC","No","Yes","Overturning",2063517,21]
[8,"BUT","Yes","No","Other Object",10176,1]
[6,"MAD","Yes","No","Right Turn",345825,25]
[4,"TRU","Yes","Yes","Rear End",167268,13]
[7,"DAR","Yes","No","Fixed Object",421350,20]
[4,"ATB","Yes","No","Parked Vehicle",622755,8]
[8,"HAM","Yes","No","Sideswipe - Meeting",1739205,46]
[6,"UNI","No","No","Pedalcycles",1053438,4]
[9,"PIK","No","No","Parked Vehicle",883833,26]
[4,"STA","Yes","No","Overturning",265371,6]
[2,"SAN","No","Yes","Right Turn",20352,2]
[3,"RIC","Yes","Yes","Angle",20352,2]
[3,"WAY","Yes","No","Rear End",295899,9]
[11,"BEL","Yes","Yes","Fixed Object",10176,1]
[6,"DEL","No","Yes","Other Object",421509,29]
[5,"LIC","No","No","Fixed Object",93770343,1820]
[2,"WIL","No","Yes","Angle",20352,2]
[6,"MAR","Yes","No","Other Non-Collision",2090913,79]
[3,"WAY","No","Yes","Head On",515430,3]
[10,"MOE","No","No","Sideswipe - Meeting",20352,2]
[10,"NOB","Yes","No","Other Object",30528,3]
[12,"CUY","Yes","Yes","Rear End",2859090,93]
[7,"MIA","Yes","No","Overturning",1756329,13]
[12,"CUY","No","No","Rear End",2050050,71]
[7,"LOG","Yes","No","Other Non-Collision",321975,15]
[8,"CLE","No","No","Left Turn",14116287,420]
[11,"COL","Yes","No","Angle",6545202,219]
[12,"LAK","No","No","Overturning",977325,13]
[10,"ATH","Yes","No","Overturning",1999122,16]
[6,"UNI","No","No","Animal",10589049,706]
[8,"WAR","Yes","No","Sideswipe - Passing",816942,52]
[4,"TRU","Yes","No","Rear End",187620,15]
[5,"MUS","Yes","No","Angle",152640,15]
[1,"ALL","Yes","No","Angle",81420240,2004]
[3,"ERI","Yes","No","Angle",75684,4]
[11,"BEL","Yes","No","Rear End",206700,10]
[3,"RIC","Yes","No","Angle",4514724,114]
[9,"LAW","Yes","Yes","Fixed Object",4690737,107]
[3,"RIC","Yes","No","Right Turn",10176,1]
[7,"MOT","Yes","No","Angle",3072261,107]
[8,"HAM","Yes","Yes","Backing",75684,4]
[3,"RIC","Yes","Yes","Overturning",1696116,27]
[3,"CRA","Yes","No","Parked Vehicle",1353408,68]
[3,"WAY","Yes","No","Backing",1861731,156]
[7,"DAR","No","No","Overturning",8898129,88]
[6,"UNI","Yes","Yes","Unknown",61056,6]
[4,"ATB","Yes","No","Unknown",86973,3]
[11,"JEF","Yes","No","Rear End",40704,4]
[5,"FAI","Yes","No","Head On",6573852,72]
[3,"LOR","Yes","Yes","Right Turn",167268,13]
[11,"BEL","No","Yes","Other Non-Collision",1281921,32]
[10,"HOC","Yes","Yes","Parked Vehicle",470274,2]
[9,"ROS","Yes","Yes","Animal",1360563,88]
[3,"WAY","Yes","No","Fixed Object",50880,5]
[6,"UNI","Yes","No","Unknown",10176,1]
[9,"LAW","No","Yes","Animal",325473,23]
[7,"AUG","Yes","Yes","Angle",460098,1]
[6,"MAD","No","Yes","Angle",669024,7]
[8,"CLE","Yes","No","Angle",79279611,2456]
[10,"HOC","Yes","No","Pedestrian",66621,1]
[7,"CLA","Yes","Yes","Sideswipe - Passing",55332,2]
[2,"WOO","Yes","Yes","Right Turn",10176,1]
[3,"MED","Yes","No","Fixed Object",20352,2]
[7,"LOG","Yes","Yes","Other Object",20352,2]
[4,"SUM","Yes","Yes","Other Non-Collision",50880,5]
[5,"FAI","Yes","Yes","Fixed Object",86973,3]
[1,"DEF","No","No","Fixed Object",38643234,611]
[12,"CUY","Yes","No","Other Non-Vehicle",10176,1]
[11,"JEF","Yes","Yes","Unknown",183168,18]
[2,"WOO","Yes","Yes","Head On",10176,1]
[7,"SHE","No","Yes","Rear End",6002820,84]
[6,"PIC","No","Yes","Unknown",20352,2]
[2,"SAN","Yes","No","Pedestrian",66621,1]
[9,"JAC","Yes","Yes","Animal",10176,1]
[10,"MRG","No","No","Head On",4471491,40]
[1,"DEF","Yes","No","Left Turn",45156,1]
[7,"SHE","Yes","Yes","Animal",997725,60]
[3,"WAY","Yes","No","Rear End",101760,10]
[4,"STA","No","Yes","Animal",1004721,71]
[1,"HAR","No","No","Fixed Object",24076596,379]
[8,"WAR","Yes","Yes","Overturning",255195,5]
[8,"WAR","No","No","Overturning",5019183,61]
[9,"SCI","Yes","No","Fixed Object",1072677,8]
[5,"FAI","Yes","No","Parked Vehicle",1063392,72]
[1,"DEF","Yes","No","Other Non-Collision",10176,1]
[9,"JAC","Yes","No","Backing",50880,5]
[7,"MOT","Yes","No","Overturning",658848,6]
[4,"MAH","No","No","Right Turn",1360674,57]
[11,"COL","Yes","No","Sideswipe - Passing",10176,1]
[3,"MED","Yes","Yes","Left Turn",40704,4]
[8,"WAR","No","Yes","Angle",132129,4]
[3,"MED","Yes","No","Rear End",14830548,669]
[4,"MAH","Yes","Yes","Head On",3213420,18]
[1,"VAN","Yes","No","Animal",707502,15]
[8,"WAR","Yes","No","Right Turn",7012122,343]
[7,"MOT","Yes","No","Other Non-Collision",21588837,393]
[4,"MAH","Yes","Yes","Rear End",20352,2]
[1,"VAN","Yes","No","Sideswipe - Passing",2048826,99]
[7,"CLA","Yes","Yes","Rear End",10176,1]
[10,"VIN","Yes","No","Parked Vehicle",76797,2]
[12,"CUY","Yes","No","Left Turn",65508,3]
[5,"FAI","Yes","No","Right Turn",3117465,148]
[3,"CRA","No","Yes","Other Object",490626,4]
[7,"DAR","Yes","No","Left Turn",2514441,55]
[11,"TUS","Yes","Yes","Overturning",10176,1]
[10,"GAL","No","Yes","Angle",143418,3]
[12,"LAK","Yes","Yes","Other Non-Collision",20352,2]
[6,"UNI","Yes","No","Rear End",11460783,519]
[3,"MED","Yes","No","Other Non-Collision",40704,4]
[8,"PRE","No","No","Falling From Or In Vehicle",460098,1]
[10,"HOC","Yes","Yes","Unknown",30528,3]
[6,"FAY","Yes","Yes","Fixed Object",107325,5]
[3,"WAY","Yes","No","Other Object",126564,9]
[6,"UNI","Yes","Yes","Sideswipe - Passing",207813,8]
[2,"SAN","Yes","Yes","Angle",76797,2]
[11,"JEF","Yes","Yes","Other Object",30528,3]
[9,"HIG","No","No","Backing",690378,43]
[9,"LAW","Yes","No","Angle",20352,2]
[4,"POR","Yes","No","Other Non-Collision",10176,1]
[2,"WOO","Yes","Yes","Left Turn",86973,3]
[10,"ATH","Yes","Yes","Rear End",153594,4]
[6,"MAD","Yes","No","Sideswipe - Passing",20352,2]
[8,"CLE","Yes","Yes","Rear End",91584,9]
[3,"HUR","Yes","No","Sideswipe - Passing",75684,4]
[4,"SUM","Yes","No","Sideswipe - Passing",196524,9]
[3,"LOR","Yes","No","Other Object",444087,27]
[7,"CLA","Yes","Yes","Overturning",2178633,17]
[5,"COS","Yes","No","Other Non-Collision",10176,1]
[3,"RIC","Yes","Yes","Fixed Object",12418152,446]
[8,"CLE","Yes","Yes","Unknown",223872,22]
[10,"MEG","Yes","No","Sideswipe - Meeting",10176,1]
[7,"LOG","Yes","No","Sideswipe - Passing",20352,2]
[9,"ROS","Yes","No","Head On",7965006,82]
[9,"ROS","Yes","No","Train",460098,1]
[7,"DAR","No","No","Angle",21975891,364]
[7,"AUG","No","No","Sideswipe - Passing",2613117,90]
[5,"FAI","Yes","Yes","Rear End",353616,21]
[11,"JEF","Yes","No","Pedestrian",3173241,21]
[1,"HAN","Yes","Yes","Angle",10176,1]
[11,"JEF","Yes","Yes","Backing",152481,6]
[6,"UNI","Yes","Yes","Backing",10176,1]
[11,"COL","Yes","No","Other Object",10176,1]
[2,"LUC","No","No","Other Non-Collision",127677,7]
[8,"CLE","Yes","No","Pedestrian",13046055,83]
[6,"DEL","No","Yes","Rear End",4335357,123]
[6,"UNI","Yes","No","Unknown",66621,1]
[6,"PIC","Yes","No","Right Turn",10176,1]
[7,"MER","Yes","No","Unknown",55332,2]
[2,"WOO","No","Yes","Head On",1272540,11]
[2,"SAN","Yes","No","Pedalcycles",66621,1]
[4,"POR","Yes","No","Angle",1010922,42]
[10,"GAL","Yes","No","Parked Vehicle",10176,1]
[11,"JEF","Yes","No","Fixed Object",621642,10]
[9,"SCI","Yes","No","Rear End",197637,7]
[5,"LIC","Yes","Yes","Left Turn",940548,4]
[11,"COL","Yes","Yes","Animal",376353,28]
[10,"ATH","Yes","Yes","Sideswipe - Passing",10176,1]
[8,"CLE","Yes","Yes","Animal",40704,4]
[7,"DAR","Yes","No","Right Turn",10176,1]
[3,"WAY","No","No","Pedestrian",3628887,20]
[6,"MAD","Yes","Yes","Fixed Object",10176,1]
[7,"SHE","Yes","No","Rear End",50880,5]
[4,"MAH","No","Yes","Angle",286836,6]
[10,"ATH","Yes","Yes","Sideswipe - Passing",10176,1]
[8,"HAM","No","No","Pedestrian",1220547,8]
[6,"DEL","Yes","No","Angle",300510,15]
[2,"SAN","No","Yes","Pedestrian",1120059,5]
[12,"CUY","Yes","Yes","Backing",71232,7]
[4,"SUM","Yes","No","Rear End",345825,25]
[1,"WYA","Yes","No","Pedestrian",223554,4]
[1,"DEF","Yes","No","Parked Vehicle",2065521,89]
[3,"RIC","Yes","No","Unknown",341214,19]
[12,"CUY","Yes","Yes","Head On",76797,2]
[2,"FUL","Yes","No","Sideswipe - Passing",20352,2]
[6,"UNI","Yes","Yes","Rear End",1104891,56]
[1,"HAN","Yes","Yes","Pedestrian",460098,1]
[8,"CLE","Yes","No","Other Non-Collision",5362275,305]
[4,"ATB","No","No","Parked Vehicle",4112565,53]
[7,"MOT","Yes","Yes","Rear End",131016,6]
[3,"CRA","Yes","No","Pedestrian",3059238,18]
[11,"BEL","Yes","No","Right Turn",2014641,89]
[8,"CLE","Yes","No","Other Object",724404,49]
[12,"CUY","Yes","Yes","Other Object",10176,1]
[6,"FAY","Yes","Yes","Left Turn",460098,1]
[9,"HIG","Yes","No","Head On",107325,5]
[6,"MAR","No","No","Rear End",10095957,226]
[4,"ATB","Yes","No","Head On",709728,11]
[3,"HUR","Yes","No","Left Turn",20352,2]
[1,"HAN","Yes","Yes","Overturning",976212,15]
[3,"LOR","Yes","Yes","Overturning",133242,2]
[2,"LUC","Yes","No","Left Turn",10176,1]
[8,"BUT","No","Yes","Fixed Object",624711,31]
[3,"RIC","No","No","Pedestrian",1758555,9]
[7,"AUG","No","No","Other Non-Collision",1601670,51]
[4,"SUM","Yes","No","Other Non-Collision",1999011,52]
[1,"HAR","Yes","No","Right Turn",106212,7]
[7,"SHE","Yes","Yes","Overturning",66621,1]
[4,"ATB","Yes","Yes","Pedestrian",66621,1]
[4,"MAH","Yes","Yes","Parked Vehicle",882561,19]
[11,"BEL","Yes","Yes","Rear End",145644,4]
[11,"COL","Yes","No","Backing",788004,74]
[4,"TRU","Yes","No","Unknown",1291938,24]
[2,"OTT","No","Yes","Animal",380964,34]
[2,"FUL","Yes","Yes","Sideswipe - Passing",10176,1]
[8,"HAM","Yes","Yes","Sideswipe - Passing",40704,4]
[4,"ATB","No","Yes","Angle",945684,12]
[10,"GAL","Yes","No","Overturning",536895,3]
[10,"HOC","Yes","No","Left Turn",30528,3]
[7,"CLA","Yes","No","Backing",30528,3]
[7,"DAR","Yes","No","Fixed Object",3649590,141]
[7,"CLA","Yes","Yes","Rear End",45156,1]
[7,"MOT","No","No","Backing",928035,38]
[4,"ATB","No","Yes","Overturning",3451761,24]
[5,"FAI","Yes","No","Unknown",61056,6]
[1,"DEF","Yes","No","Fixed Object",50880,5]
[5,"FAI","Yes","No","Pedestrian",10750605,71]
[9,"HIG","Yes","No","Other Object",86973,3]
[1,"WYA","Yes","Yes","Animal",10176,1]
[3,"ERI","Yes","No","Fixed Object",1346571,66]
[10,"ATH","Yes","No","Other Object",61056,6]
[3,"HUR","Yes","No","Right Turn",462054,24]
[10,"ATH","No","No","Sideswipe - Passing",1559154,84]
[6,"FRA","Yes","No","Sideswipe - Passing",326391330,16456]
[12,"CUY","Yes","Yes","Unknown",20352,2]
[7,"DAR","Yes","Yes","Other Object",10176,1]
[2,"HEN","Yes","No","Backing",985800,90]
[7,"DAR","Yes","No","Right Turn",10176,1]
[7,"CLA","Yes","Yes","Fixed Object",1522902,77]
[2,"SEN","No","No","Pedalcycles",1175391,7]
[11,"JEF","Yes","Yes","Other Non-Collision",351549,29]
[8,"BUT","No","No","Head On",14585460,115]
[8,"BUT","No","No","Train",571875,3]
[12,"LAK","Yes","No","Parked Vehicle",9274452,353]
[8,"HAM","No","No","Other Object",30528,3]
[5,"MUS","Yes","Yes","Fixed Object",6226041,186]
[7,"CLA","Yes","No","Left Turn",31120077,679]
[6,"MAR","Yes","No","Animal",10176,1]
[8,"WAR","Yes","Yes","Angle",358068,13]
[11,"CAR","Yes","No","Fixed Object",40704,4]
[8,"GRE","No","Yes","Left Turn",306075,10]
[1,"HAN","Yes","Yes","Angle",20352,2]
[11,"TUS","Yes","No","Sideswipe - Meeting",20352,2]
[12,"CUY","Yes","Yes","Backing",126564,9]
[3,"LOR","Yes","Yes","Left Turn",30528,3]
[6,"MAR","Yes","Yes","Animal",10176,1]
[12,"CUY","Yes","Yes","Parked Vehicle",20352,2]
[4,"POR","Yes","No","Sideswipe - Passing",15679083,782]
[6,"MRW","No","Yes","Overturning",1211055,18]
[3,"LOR","Yes","Yes","Other Non-Collision",55332,2]
[11,"BEL","Yes","Yes","Sideswipe - Passing",10176,1]
[4,"STA","Yes","Yes","Pedestrian",986817,3]
[9,"ROS","No","No","Animal",12590526,1029]
[7,"DAR","Yes","No","Parked Vehicle",2292891,114]
[9,"BRO","No","No","Sideswipe - Meeting",1600509,8]
[11,"HOL","Yes","No","Backing",30528,3]
[1,"DEF","Yes","Yes","Unknown",10176,1]
[11,"BEL","Yes","Yes","Rear End",65508,3]
[4,"SUM","Yes","Yes","Right Turn",30528,3]
[7,"LOG","No","No","Backing",417216,41]
[4,"ATB","Yes","Yes","Animal",254400,25]
[2,"WOO","Yes","Yes","Sideswipe - Passing",30528,3]
[4,"MAH","Yes","Yes","Unknown",695100,13]
[4,"ATB","Yes","No","Right Turn",733578,21]
[4,"STA","Yes","Yes","Fixed Object",10176,1]
[2,"SEN","Yes","No","Other Non-Collision",285882,17]
[11,"COL","No","No","Parked Vehicle",2528115,59]
[6,"UNI","Yes","No","Left Turn",4221687,77]
[10,"WAS","No","No","Right Turn",639339,29]
[5,"PER","No","No","Fixed Object",82044792,1175]
[12,"LAK","Yes","Yes","Right Turn",10176,1]
[4,"SUM","No","Yes","Parked Vehicle",713067,10]
[6,"PIC","No","Yes","Pedestrian",45156,1]
[6,"FRA","Yes","Yes","Rear End",399461583,12194]
[11,"BEL","No","No","Sideswipe - Meeting",249630,10]
[3,"ERI","No","Yes","Angle",208926,6]
[5,"LIC","No","Yes","Pedalcycles",536895,3]
[4,"TRU","Yes","No","Parked Vehicle",8577015,380]
[12,"CUY","Yes","Yes","Unknown",86973,3]
[4,"STA","Yes","No","Sideswipe - Passing",420396,31]
[12,"CUY","Yes","Yes","Other Non-Collision",567423,6]
[10,"NOB","Yes","No","Backing",10176,1]
[5,"LIC","Yes","Yes","Left Turn",45156,1]
[7,"MIA","No","Yes","Rear End",97149,4]
[1,"ALL","Yes","No","Pedalcycles",470274,2]
[11,"JEF","No","Yes","Right Turn",66621,1]
[3,"WAY","Yes","No","Angle",5733252,110]
[8,"CLI","No","No","Pedestrian",550410,3]
[2,"WOO","Yes","Yes","Sideswipe - Passing",91584,9]
[11,"JEF","Yes","No","Sideswipe - Passing",10176,1]
[7,"MOT","Yes","No","Other Object",45156,1]
[8,"CLI","Yes","No","Sideswipe - Passing",3146769,184]
[4,"ATB","Yes","No","Angle",18950013,483]
[7,"AUG","Yes","Yes","Rear End",969105,35]
[1,"ALL","No","Yes","Rear End",3359478,55]
[7,"LOG","No","No","Parked Vehicle",1062390,38]
[11,"COL","No","No","Unknown",188733,13]
[2,"LUC","Yes","No","Animal",10176,1]
[3,"LOR","No","Yes","Other Non-Collision",152640,15]
[2,"SAN","No","No","Pedalcycles",1165215,6]
[12,"CUY","No","No","Left Turn",948069,22]
[8,"PRE","No","No","Head On",10273509,81]
[10,"MRG","No","No","Other Non-Collision",2394984,26]
[8,"WAR","Yes","Yes","Sideswipe - Passing",9084957,456]
[5,"FAI","Yes","Yes","Animal",132288,13]
[3,"RIC","Yes","Yes","Sideswipe - Passing",10176,1]
[9,"JAC","Yes","No","Pedalcycles",255195,5]
[1,"HAN","Yes","No","Rear End",35619669,1708]
[10,"GAL","Yes","No","Sideswipe - Passing",2066952,105]
[2,"LUC","Yes","No","Right Turn",30528,3]
[4,"SUM","Yes","No","Fixed Object",26327244,727]
[1,"DEF","No","No","Right Turn",435978,18]
[6,"DEL","Yes","No","Angle",72624330,1701]
[8,"GRE","Yes","Yes","Other Object",498624,49]
[7,"LOG","No","Yes","Animal",1206015,95]
[4,"SUM","Yes","No","Overturning",10176,1]
[6,"DEL","Yes","Yes","Sideswipe - Passing",66621,1]
[11,"HAS","No","No","Sideswipe - Meeting",950724,5]
[2,"WIL","Yes","No","Pedalcycles",40704,4]
[4,"SUM","No","No","Sideswipe - Passing",635364,59]
[7,"MOT","Yes","Yes","Fixed Object",1339845,28]
[4,"SUM","Yes","Yes","Other Object",10176,1]
[9,"HIG","No","No","Other Non-Collision",768447,52]
[12,"CUY","Yes","Yes","Pedalcycles",1458300,23]
[4,"SUM","No","Yes","Other Non-Collision",1260297,23]
[12,"GEA","No","No","Fixed Object",82862934,1747]
[6,"PIC","Yes","No","Parked Vehicle",533286,31]
[8,"WAR","Yes","No","Other Non-Collision",691332,32]
[5,"LIC","No","No","Rear End",26078157,811]
[11,"JEF","Yes","No","Head On",10176,1]
[1,"HAR","Yes","No","Left Turn",1158267,35]
[7,"DAR","Yes","No","Other Non-Collision",194298,8]
[9,"BRO","Yes","No","Right Turn",20352,2]
[9,"HIG","No","No","Unknown",107325,5]
[11,"JEF","Yes","Yes","Rear End",4890012,129]
[5,"MUS","Yes","No","Sideswipe - Passing",602562,15]
[2,"SEN","No","No","Backing",663348,48]
[8,"HAM","Yes","Yes","Rear End",162657,7]
[4,"ATB","Yes","No","Left Turn",3236841,41]
[4,"SUM","Yes","Yes","Overturning",10176,1]
[4,"POR","Yes","Yes","Head On",547071,4]
[8,"GRE","No","No","Sideswipe - Passing",4473909,141]
[3,"LOR","No","Yes","Other Object",197796,16]
[6,"FAY","Yes","No","Fixed Object",526719,2]
[3,"RIC","Yes","Yes","Left Turn",526719,2]
[10,"HOC","No","Yes","Rear End",1325646,17]
[4,"POR","Yes","No","Unknown",148029,9]
[4,"TRU","Yes","Yes","Left Turn",66621,1]
[4,"TRU","Yes","Yes","Other Non-Vehicle",10176,1]
[4,"SUM","Yes","Yes","Overturning",2108673,22]
[10,"ATH","Yes","No","Other Non-Collision",163770,5]
[2,"HEN","Yes","No","Rear End",4532247,180]
[4,"STA","Yes","Yes","Rear End",35103951,1220]
[10,"MRG","No","No","Other Object",40704,4]
[12,"CUY","Yes","No","Unknown",1084014,52]
[6,"MRW","Yes","Yes","Fixed Object",127677,7]
[8,"WAR","Yes","Yes","Other Object",50880,5]
[6,"FRA","Yes","Yes","Angle",10176,1]
[6,"FRA","Yes","Yes","Right Turn",75684,4]
[2,"WIL","Yes","Yes","Other Object",10176,1]
[4,"SUM","Yes","No","Fixed Object",284610,10]
[4,"POR","Yes","Yes","Sideswipe - Passing",30528,3]
[8,"WAR","Yes","Yes","Unknown",157092,12]
[6,"PIC","Yes","No","Head On",1152813,9]
[12,"LAK","Yes","Yes","Overturning",66621,1]
[4,"POR","No","Yes","Backing",209085,15]
[3,"ASD","No","Yes","Pedestrian",1380294,3]
[12,"LAK","Yes","No","Animal",162816,16]
[8,"PRE","Yes","No","Other Non-Collision",55332,2]
[12,"CUY","Yes","Yes","Fixed Object",2390787,63]
[2,"FUL","Yes","No","Head On",66621,1]
[3,"MED","Yes","Yes","Rear End",50880,5]
[4,"MAH","Yes","No","Animal",432957,37]
[3,"HUR","No","No","Fixed Object",47960058,866]
[3,"WAY","Yes","No","Fixed Object",197637,7]
[4,"MAH","Yes","Yes","Other Non-Collision",10176,1]
[3,"LOR","Yes","Yes","Head On",856485,13]
[1,"PUT","Yes","No","Backing",30528,3]
[3,"WAY","No","Yes","Sideswipe - Passing",2363280,101]
[9,"SCI","Yes","Yes","Fixed Object",97149,4]
[4,"TRU","No","Yes","Angle",20352,2]
[4,"ATB","No","No","Rear End",14951751,309]
[8,"HAM","Yes","Yes","Left Turn",40704,4]
[3,"HUR","No","No","Sideswipe - Meeting",198909,14]
[2,"SEN","Yes","No","Animal",30528,3]
[2,"WOO","No","Yes","Pedestrian",1513536,5]
[11,"HOL","No","No","Right Turn",1178349,64]
[4,"STA","Yes","No","Head On",197637,7]
[6,"FRA","Yes","Yes","Rear End",2035359,89]
[5,"LIC","Yes","No","Other Non-Collision",4319949,79]
[2,"WOO","Yes","No","Fixed Object",223713,13]
[1,"HAR","Yes","No","Rear End",587505,35]
[10,"ATH","No","Yes","Other Object",10176,1]
[7,"SHE","No","Yes","Fixed Object",5012028,111]
[2,"WOO","Yes","Yes","Sideswipe - Passing",10591815,473]
[10,"WAS","Yes","Yes","Fixed Object",10176,1]
[4,"STA","Yes","Yes","Rear End",1279950,65]
[9,"JAC","No","No","Backing",477954,29]
[5,"GUE","No","No","Head On",4312857,43]
[10,"MEG","No","No","Overturning",5108382,60]
[6,"UNI","No","Yes","Other Object",136740,10]
[11,"COL","Yes","No","Parked Vehicle",1003560,33]
[5,"MUS","No","No","Fixed Object",60036171,1295]
[10,"ATH","Yes","No","Left Turn",920880,13]
[10,"MEG","Yes","No","Rear End",2298933,71]
[6,"MRW","No","No","Other Object",172833,8]
[11,"HAS","Yes","No","Unknown",10176,1]
[7,"AUG","Yes","Yes","Pedestrian",460098,1]
[4,"MAH","Yes","No","Other Object",539010,35]
[11,"HAS","No","No","Pedestrian",1492071,5]
[2,"OTT","No","Yes","Unknown",61056,6]
[4,"POR","No","No","Head On",8526864,88]
[4,"POR","No","No","Train",10176,1]
[9,"PIK","No","No","Backing",1145865,38]
[5,"LIC","Yes","No","Parked Vehicle",2552919,63]
[4,"TRU","Yes","Yes","Fixed Object",306075,10]
[11,"TUS","No","No","Pedalcycles",2745372,12]
[2,"WOO","Yes","Yes","Other Object",10176,1]
[3,"ASD","Yes","Yes","Animal",264576,26]
[9,"ROS","Yes","No","Fixed Object",127677,7]
[12,"CUY","No","Yes","Overturning",470274,2]
[12,"LAK","Yes","No","Backing",681633,58]
[3,"RIC","Yes","No","Other Non-Collision",709728,11]
[2,"WIL","Yes","No","Angle",5855253,158]
[2,"LUC","No","Yes","Parked Vehicle",199863,3]
[12,"CUY","Yes","Yes","Rear End",1914678,93]
[3,"HUR","Yes","Yes","Rear End",50880,5]
[8,"CLE","Yes","Yes","Angle",239454,9]
[7,"SHE","Yes","No","Overturning",66621,1]
[2,"WOO","Yes","No","Sideswipe - Meeting",10176,1]
[3,"WAY","No","No","Angle",56347941,724]
[1,"WYA","Yes","No","Angle",76797,2]
[6,"FRA","Yes","No","Unknown",9836580,337]
[2,"WOO","Yes","No","Rear End",21011799,797]
[8,"BUT","Yes","No","Backing",889605,75]
[9,"ADA","No","No","Overturning",8967039,74]
[4,"SUM","Yes","Yes","Animal",10176,1]
[7,"AUG","Yes","No","Other Non-Collision",219102,7]
[12,"CUY","Yes","Yes","Angle",141192,7]
[1,"HAR","Yes","No","Unknown",116388,8]
[6,"MAD","No","Yes","Sideswipe - Passing",12726930,484]
[1,"VAN","Yes","No","Pedestrian",2585625,17]
[4,"POR","Yes","Yes","Other Object",219261,16]
[2,"LUC","Yes","No","Sideswipe - Meeting",456489,29]
[2,"OTT","Yes","No","Parked Vehicle",490626,4]
[3,"HUR","Yes","No","Rear End",40704,4]
[7,"SHE","Yes","No","Pedestrian",3167088,30]
[12,"LAK","Yes","Yes","Head On",10176,1]
[2,"OTT","No","Yes","Left Turn",10176,1]
[7,"MOT","Yes","Yes","Pedestrian",6221253,24]
[2,"SAN","Yes","No","Parked Vehicle",20352,2]
[3,"RIC","Yes","Yes","Right Turn",132129,4]
[2,"FUL","No","No","Backing",1595883,123]
[4,"STA","No","No","Parked Vehicle",1939386,62]
[6,"DEL","Yes","Yes","Pedestrian",460098,1]
[4,"SUM","Yes","Yes","Backing",379692,27]
[3,"HUR","Yes","No","Fixed Object",213537,12]
[2,"WOO","Yes","Yes","Parked Vehicle",337716,11]
[2,"LUC","No","No","Other Object",91584,9]
[5,"FAI","Yes","Yes","Animal",10176,1]
[9,"LAW","No","No","Other Non-Collision",101760,10]
[5,"GUE","Yes","Yes","Pedestrian",460098,1]
[7,"SHE","Yes","No","Head On",20352,2]
[1,"WYA","No","Yes","Pedalcycles",10176,1]
[4,"SUM","Yes","Yes","Pedalcycles",515430,3]
[4,"SUM","Yes","No","Fixed Object",225021927,5905]
[2,"LUC","Yes","Yes","Backing",40704,4]
[9,"HIG","Yes","No","Sideswipe - Meeting",10176,1]
[4,"ATB","Yes","Yes","Other Object",10176,1]
[11,"BEL","No","No","Head On",11403315,100]
[3,"CRA","No","No","Unknown",775236,14]
[4,"MAH","Yes","No","Rear End",1014690,23]
[3,"WAY","Yes","No","Right Turn",714339,17]
[3,"HUR","Yes","No","Sideswipe - Passing",1901115,108]
[12,"GEA","Yes","No","Animal",976896,96]
[7,"AUG","Yes","Yes","Unknown",40704,4]
[4,"SUM","Yes","No","Animal",3222405,218]
[7,"DAR","Yes","Yes","Angle",45156,1]
[5,"COS","No","No","Other Object",132288,13]
[2,"OTT","Yes","No","Fixed Object",2215203,47]
[6,"MAD","Yes","Yes","Sideswipe - Passing",10176,1]
[10,"WAS","Yes","No","Left Turn",4085934,157]
[7,"DAR","No","No","Sideswipe - Meeting",30528,3]
[10,"WAS","No","No","Backing",752547,47]
[9,"LAW","Yes","Yes","Rear End",131016,6]
[4,"ATB","Yes","Yes","Angle",536895,3]
[9,"JAC","Yes","Yes","Angle",10176,1]
[3,"LOR","Yes","Yes","Overturning",2940783,23]
[4,"ATB","Yes","No","Fixed Object",7493142,120]
[6,"DEL","Yes","No","Right Turn",7610328,386]
[6,"MRW","No","Yes","Other Non-Collision",553956,51]
[8,"GRE","Yes","Yes","Right Turn",273480,20]
[7,"CLA","Yes","No","Backing",716772,67]
[8,"BUT","Yes","No","Unknown",40704,4]
[6,"MAD","No","Yes","Pedestrian",1380294,3]
[11,"TUS","Yes","Yes","Fixed Object",10176,1]
[2,"WOO","Yes","Yes","Unknown",10176,1]
[4,"MAH","Yes","Yes","Head On",470274,2]
[9,"SCI","No","Yes","Angle",613692,5]
[7,"AUG","Yes","No","Pedalcycles",457284,9]
[1,"ALL","No","No","Backing",1017282,82]
[2,"SAN","Yes","No","Overturning",66621,1]
[7,"AUG","No","Yes","Unknown",50880,5]
[4,"ATB","Yes","Yes","Rear End",40704,4]
[3,"ERI","Yes","No","Right Turn",127677,7]
[4,"SUM","Yes","Yes","Unknown",91584,9]
[5,"PER","No","No","Other Object",310686,16]
[8,"CLE","Yes","Yes","Rear End",10176,1]
[7,"MIA","Yes","Yes","Sideswipe - Passing",3535110,176]
[6,"FAY","No","No","Other Object",878268,31]
[3,"LOR","Yes","No","Rear End",3907854,177]
[11,"COL","Yes","No","Other Non-Collision",1845576,57]
[8,"GRE","Yes","No","Rear End",457761,36]
[9,"SCI","Yes","No","Pedalcycles",10176,1]
[3,"ERI","Yes","No","Head On",330879,9]
[1,"ALL","No","Yes","Other Object",111936,11]
[8,"WAR","Yes","No","Backing",1777938,143]
[8,"WAR","Yes","No","Pedestrian",9006153,53]
[8,"BUT","Yes","No","Other Non-Collision",1586136,39]
[2,"WOO","Yes","No","Overturning",4174845,26]
[2,"HEN","Yes","Yes","Overturning",121953,3]
[9,"JAC","No","Yes","Fixed Object",85860,5]
[10,"WAS","Yes","Yes","Fixed Object",45156,1]
[10,"GAL","Yes","Yes","Animal",10176,1]
[7,"LOG","No","Yes","Rear End",1162719,32]
[11,"COL","Yes","No","Right Turn",162816,16]
[7,"LOG","Yes","No","Parked Vehicle",316410,20]
[12,"CUY","Yes","Yes","Right Turn",40704,4]
[6,"MAR","Yes","No","Angle",41433069,980]
[1,"HAN","Yes","No","Head On",470274,2]
[11,"JEF","No","No","Parked Vehicle",1005945,38]
[11,"COL","Yes","No","Fixed Object",45156,1]
[6,"MAD","No","No","Overturning",4236585,43]
[9,"SCI","Yes","No","Head On",9650850,93]
[9,"SCI","Yes","No","Train",526719,2]
[3,"ASD","No","Yes","Other Object",524541,46]
[8,"BUT","Yes","Yes","Sideswipe - Passing",126564,9]
[6,"MAR","Yes","No","Parked Vehicle",6232608,285]
[7,"MIA","Yes","No","Overturning",811329,12]
[12,"LAK","No","No","Head On",1798146,15]
[10,"HOC","No","Yes","Animal",717885,65]
[3,"MED","Yes","No","Left Turn",116388,8]
[1,"HAN","Yes","No","Parked Vehicle",20352,2]
[3,"ERI","Yes","Yes","Rear End",173946,6]
[5,"LIC","No","Yes","Backing",101760,10]
[3,"WAY","Yes","Yes","Left Turn",75684,4]
[4,"SUM","Yes","Yes","Parked Vehicle",20352,2]
[10,"HOC","Yes","Yes","Rear End",40704,4]
[1,"PAU","No","Yes","Head On",20352,2]
[5,"FAI","No","No","Other Non-Vehicle",460098,1]
[2,"FUL","No","No","Sideswipe - Passing",4302459,109]
[2,"FUL","No","No","Unknown",480450,3]
[1,"PAU","No","No","Left Turn",1441764,47]
[10,"MRG","No","No","Pedestrian",45156,1]
[1,"HAN","No","Yes","Unknown",61056,6]
[10,"HOC","Yes","No","Rear End",122112,12]
[4,"STA","Yes","No","Other Non-Collision",932487,35]
[4,"ATB","Yes","No","Sideswipe - Passing",6800508,258]
[5,"GUE","Yes","No","Right Turn",1706499,82]
[6,"PIC","Yes","No","Backing",995817,82]
[8,"WAR","Yes","No","Pedestrian",111777,2]
[7,"LOG","Yes","No","Animal",290493,23]
[11,"TUS","Yes","Yes","Rear End",143418,3]
[4,"ATB","Yes","Yes","Rear End",76797,2]
[4,"TRU","Yes","No","Right Turn",10176,1]
[3,"WAY","Yes","No","Overturning",10176,1]
[12,"CUY","Yes","No","Left Turn",275419203,7952]
[3,"WAY","Yes","Yes","Unknown",10176,1]
[3,"CRA","No","No","Left Turn",745392,27]
[4,"SUM","Yes","No","Backing",20352,2]
[8,"PRE","Yes","No","Animal",10176,1]
[5,"LIC","No","No","Sideswipe - Passing",10056429,289]
[3,"ERI","Yes","No","Backing",203520,20]
[2,"LUC","Yes","No","Fixed Object",10176,1]
[3,"MED","Yes","Yes","Right Turn",75684,4]
[4,"SUM","Yes","No","Unknown",5416302,209]
[9,"ROS","Yes","Yes","Unknown",40704,4]
[8,"PRE","Yes","No","Pedalcycles",1242012,8]
[4,"POR","Yes","No","Pedalcycles",3837480,54]
[7,"MIA","No","No","Backing",876090,75]
[2,"SAN","No","No","Left Turn",4115205,87]
[9,"ROS","Yes","Yes","Other Non-Collision",162816,16]
[2,"HEN","Yes","No","Animal",107325,5]
[3,"LOR","Yes","No","Other Non-Collision",275547,7]
[12,"CUY","Yes","No","Pedestrian",286706568,1995]
[6,"MRW","No","No","Pedestrian",4967952,17]
[5,"COS","No","No","Overturning",5363910,42]
[2,"WIL","No","No","Left Turn",5165304,97]
[4,"MAH","No","No","Pedestrian",3027072,10]
[12,"LAK","Yes","Yes","Rear End",30528,3]
[1,"PUT","Yes","No","Animal",173946,6]
[12,"CUY","Yes","Yes","Animal",50880,5]
[3,"CRA","Yes","No","Animal",986913,88]
[4,"STA","Yes","Yes","Animal",3753783,266]
[1,"DEF","Yes","No","Backing",1581573,143]
[11,"BEL","Yes","No","Rear End",12972030,534]
[5,"GUE","Yes","No","Pedalcycles",133242,2]
[4,"SUM","Yes","No","Angle",1438155,75]
[11,"COL","Yes","Yes","Sideswipe - Passing",75684,4]
[4,"ATB","Yes","No","Unknown",111777,2]
[2,"WOO","Yes","No","Animal",30528,3]
[7,"MOT","Yes","Yes","Angle",10176,1]
[8,"CLE","Yes","Yes","Animal",2721603,208]
[6,"MRW","No","No","Rear End",11221965,381]
[12,"CUY","Yes","Yes","Sideswipe - Meeting",187461,6]
[7,"CHP","No","Yes","Angle",10176,1]
[1,"DEF","Yes","No","Other Non-Collision",405609,24]
[11,"COL","Yes","Yes","Head On",648672,5]
[7,"MOT","Yes","No","Left Turn",566040,30]
[1,"DEF","No","No","Parked Vehicle",817212,25]
[6,"UNI","Yes","Yes","Overturning",10176,1]
[9,"SCI","No","No","Pedalcycles",460098,1]
[7,"AUG","No","Yes","Left Turn",121953,3]
[7,"SHE","Yes","No","Other Object",232776,16]
[4,"SUM","Yes","No","Sideswipe - Passing",8800092,487]
[4,"MAH","Yes","No","Falling From Or In Vehicle",460098,1]
[6,"PIC","No","Yes","Animal",265530,15]
[7,"MOT","Yes","Yes","Fixed Object",30528,3]
[6,"FAY","No","No","Pedestrian",1165215,6]
[9,"ROS","Yes","No","Sideswipe - Meeting",10176,1]
[8,"WAR","Yes","No","Unknown",10176,1]
[7,"CHP","Yes","No","Fixed Object",6334224,165]
[9,"HIG","No","No","Parked Vehicle",2051433,42]
[4,"STA","Yes","No","Other Object",20352,2]
[8,"PRE","Yes","No","Angle",6066135,187]
[5,"FAI","Yes","No","Sideswipe - Meeting",460098,1]
[2,"WIL","Yes","No","Rear End",3718056,201]
[4,"STA","No","No","Left Turn",9559284,216]
[7,"MOT","No","No","Left Turn",1291239,64]
[12,"CUY","Yes","No","Parked Vehicle",10176,1]
[10,"NOB","No","Yes","Unknown",50880,5]
[3,"LOR","Yes","No","Backing",437568,43]
[2,"SAN","Yes","No","Animal",40704,4]
[5,"FAI","Yes","No","Parked Vehicle",1528944,99]
[11,"BEL","Yes","No","Pedestrian",1388769,10]
[5,"FAI","Yes","Yes","Sideswipe - Passing",239613,18]
[1,"HAN","Yes","No","Fixed Object",50880,5]
[6,"UNI","Yes","No","Head On",2055726,30]
[9,"ROS","Yes","Yes","Backing",470274,2]
[8,"PRE","Yes","No","Right Turn",624711,31]
[3,"WAY","Yes","Yes","Rear End",10176,1]
[11,"JEF","No","No","Overturning",4901316,62]
[8,"BUT","Yes","No","Left Turn",936510,50]
[2,"OTT","Yes","No","Sideswipe - Passing",2424336,107]
[12,"LAK","Yes","Yes","Sideswipe - Passing",633090,18]
[4,"POR","Yes","No","Other Non-Collision",1632723,56]
[4,"TRU","Yes","No","Right Turn",153594,4]
[8,"GRE","Yes","No","Backing",5692836,496]
[8,"HAM","Yes","No","Sideswipe - Passing",340244802,20281]
[2,"SEN","Yes","No","Rear End",65508,3]
[4,"MAH","Yes","Yes","Overturning",45156,1]
[3,"WAY","Yes","No","Animal",2056188,173]
[8,"HAM","Yes","Yes","Angle",9611484,228]
[2,"SEN","Yes","No","Overturning",1272540,11]
[4,"MAH","Yes","No","Rear End",167268,13]
[3,"WAY","Yes","No","Head On",20352,2]
[7,"MIA","Yes","Yes","Other Object",748413,68]
[11,"TUS","Yes","Yes","Sideswipe - Passing",6045894,209]
[5,"FAI","Yes","Yes","Left Turn",10176,1]
[3,"RIC","Yes","Yes","Backing",148029,9]
[5,"LIC","Yes","No","Angle",25561023,521]
[2,"WOO","Yes","No","Fixed Object",8801061,280]
[8,"CLI","No","Yes","Overturning",991953,11]
[5,"KNO","No","No","Angle",17024346,272]
[2,"OTT","Yes","Yes","Right Turn",45156,1]
[10,"VIN","Yes","No","Sideswipe - Passing",40704,4]
[2,"WIL","No","No","Sideswipe - Meeting",10176,1]
[7,"MOT","Yes","Yes","Angle",219102,7]
[3,"ASD","No","No","Overturning",14118588,91]
[10,"HOC","No","No","Parked Vehicle",581940,35]
[6,"MRW","No","No","Fixed Object",45990210,933]
[12,"CUY","No","No","Animal",218148,18]
[9,"PIK","Yes","No","Pedalcycles",670137,5]
[12,"GEA","No","Yes","Backing",10176,1]
[5,"GUE","No","No","Other Non-Collision",1241217,28]
[8,"PRE","No","Yes","Rear End",7368741,123]
[3,"RIC","No","No","Overturning",7469499,84]
[7,"CLA","Yes","No","Parked Vehicle",36096825,1569]
[4,"SUM","Yes","No","Backing",30528,3]
[1,"ALL","Yes","No","Parked Vehicle",13779177,757]
[8,"GRE","Yes","No","Unknown",554910,40]
[12,"CUY","Yes","Yes","Rear End",719475,30]
[3,"HUR","Yes","No","Parked Vehicle",2328411,65]
[4,"SUM","Yes","Yes","Parked Vehicle",20352,2]
[3,"RIC","Yes","No","Parked Vehicle",10176,1]
[3,"MED","Yes","Yes","Angle",10176,1]
[3,"HUR","Yes","No","Animal",2094666,181]
[5,"LIC","Yes","No","Sideswipe - Passing",5671926,196]
[7,"MOT","Yes","Yes","Falling From Or In Vehicle",460098,1]
[11,"COL","Yes","No","Head On",10176,1]
[8,"GRE","Yes","Yes","Rear End",15282282,472]
[10,"NOB","No","Yes","Parked Vehicle",930372,3]
[4,"SUM","Yes","Yes","Fixed Object",1612641,32]
[2,"SEN","Yes","No","Backing",10176,1]
[3,"WAY","Yes","No","Pedalcycles",526719,2]
[1,"HAN","Yes","Yes","Other Non-Collision",10176,1]
[3,"LOR","Yes","No","Right Turn",592386,14]
[4,"SUM","Yes","Yes","Rear End",100421841,3876]
[4,"MAH","Yes","No","Angle",45156,1]
[4,"SUM","Yes","No","Unknown",131016,6]
[7,"MIA","No","No","Animal",11075097,995]
[3,"ERI","Yes","No","Rear End",1244970,60]
[3,"WAY","Yes","No","Sideswipe - Passing",3875100,228]
[1,"VAN","No","No","Other Object",162816,16]
[7,"SHE","No","Yes","Other Object",382077,32]
[2,"OTT","Yes","Yes","Fixed Object",20352,2]
[2,"OTT","No","No","Sideswipe - Meeting",20352,2]
[5,"COS","Yes","No","Other Non-Collision",705276,14]
[2,"LUC","Yes","Yes","Left Turn",1688484,45]
[9,"ROS","No","Yes","Rear End",2685939,62]
[3,"LOR","Yes","Yes","Sideswipe - Passing",10155963,303]
[12,"LAK","Yes","No","Rear End",146439258,6201]
[8,"CLE","No","No","Backing",2758602,155]
[8,"WAR","Yes","Yes","Rear End",2009871,69]
[11,"JEF","Yes","Yes","Rear End",265530,15]
[2,"OTT","Yes","Yes","Fixed Object",1317855,21]
[4,"SUM","Yes","Yes","Left Turn",110664,4]
[3,"ERI","Yes","Yes","Right Turn",66621,1]
[11,"COL","Yes","Yes","Animal",319908,28]
[2,"WOO","Yes","Yes","Other Non-Collision",30528,3]
[10,"NOB","Yes","Yes","Head On",460098,1]
[4,"SUM","Yes","No","Left Turn",45156,1]
[4,"SUM","Yes","No","Backing",1017441,91]
[5,"FAI","Yes","No","Fixed Object",24193305,593]
[6,"FAY","Yes","Yes","Fixed Object",10176,1]
[11,"TUS","Yes","Yes","Other Object",1066047,55]
[3,"LOR","Yes","No","Animal",6678747,480]
[10,"HOC","Yes","No","Angle",3946077,146]
[4,"POR","No","Yes","Fixed Object",14062959,416]
[1,"ALL","No","Yes","Unknown",101760,10]
[5,"LIC","No","Yes","Animal",2898729,199]
[11,"BEL","No","No","Pedestrian",4462698,15]
[7,"LOG","Yes","No","Backing",366177,27]
[3,"RIC","Yes","Yes","Rear End",645063,33]
[12,"LAK","Yes","Yes","Right Turn",10176,1]
[9,"JAC","Yes","No","Backing",1393635,110]
[4,"SUM","Yes","Yes","Other Non-Collision",101760,10]
[8,"HAM","Yes","Yes","Other Non-Collision",11033739,348]
[2,"FUL","Yes","No","Fixed Object",20352,2]
[4,"SUM","Yes","No","Animal",96036,6]
[6,"FAY","No","No","Unknown",547071,4]
[1,"ALL","Yes","No","Overturning",10176,1]
[8,"CLE","Yes","Yes","Sideswipe - Passing",14247510,485]
[4,"SUM","Yes","No","Other Non-Collision",126564,9]
[1,"HAN","Yes","No","Other Object",331197,27]
[7,"MER","Yes","No","Fixed Object",6050139,157]
[3,"RIC","Yes","No","Parked Vehicle",963015,38]
[8,"WAR","Yes","Yes","Fixed Object",478908,18]
[2,"FUL","No","Yes","Parked Vehicle",1185567,8]
[5,"PER","No","No","Unknown",198909,14]
[6,"PIC","Yes","No","Animal",132288,13]
[4,"SUM","No","No","Sideswipe - Meeting",10176,1]
[3,"WAY","Yes","No","Pedalcycles",848535,8]
[4,"STA","Yes","Yes","Pedalcycles",515430,3]
[3,"MED","Yes","Yes","Head On",470274,2]
[5,"GUE","Yes","No","Animal",1787001,141]
[3,"HUR","No","No","Right Turn",1049670,23]
[7,"MOT","Yes","Yes","Pedalcycles",45156,1]
[6,"UNI","Yes","Yes","Head On",66621,1]
[4,"SUM","Yes","Yes","Fixed Object",248517,12]
[5,"FAI","No","No","Rear End",18643095,463]
[7,"CLA","Yes","No","Head On",14327961,171]
[7,"CLA","Yes","No","Train",163770,5]
[3,"ERI","Yes","Yes","Angle",647559,7]
[4,"TRU","Yes","No","Angle",45156,1]
[7,"MER","Yes","No","Left Turn",3440886,68]
[10,"NOB","No","No","Other Non-Collision",284769,19]
[8,"WAR","Yes","Yes","Left Turn",45156,1]
[4,"POR","No","Yes","Rear End",5706063,96]
[6,"UNI","No","Yes","Overturning",264258,8]
[1,"HAN","No","Yes","Other Non-Collision",330084,29]
[4,"SUM","Yes","No","Right Turn",20352,2]
[7,"AUG","Yes","No","Animal",961950,80]
[9,"JAC","Yes","No","Left Turn",65508,3]
[10,"MOE","No","No","Other Non-Collision",142464,14]
[3,"MED","Yes","Yes","Backing",40704,4]
[7,"AUG","Yes","No","Pedalcycles",121953,3]
[2,"WOO","No","No","Overturning",11159346,105]
[3,"CRA","No","No","Parked Vehicle",632931,9]
[12,"GEA","No","No","Right Turn",2342181,94]
[8,"CLE","Yes","Yes","Rear End",2083218,108]
[7,"AUG","Yes","Yes","Unknown",10176,1]
[11,"TUS","Yes","Yes","Angle",66621,1]
[4,"SUM","Yes","No","Right Turn",75684,4]
[2,"SAN","Yes","No","Backing",71232,7]
[3,"WAY","Yes","Yes","Overturning",66621,1]
[2,"WOO","Yes","No","Right Turn",71232,7]
[5,"MUS","Yes","No","Other Non-Collision",768447,52]
[4,"TRU","Yes","Yes","Fixed Object",23497809,679]
[5,"KNO","No","No","Sideswipe - Passing",6018069,169]
[4,"ATB","Yes","No","Left Turn",1737933,34]
[4,"ATB","No","Yes","Right Turn",490626,4]
[4,"STA","Yes","Yes","Right Turn",676704,34]
[8,"GRE","Yes","Yes","Other Object",10176,1]
[7,"CLA","Yes","No","Fixed Object",8893821,216]
[7,"AUG","Yes","Yes","Animal",10176,1]
[4,"STA","Yes","No","Other Object",101760,10]
[12,"CUY","Yes","Yes","Fixed Object",1441350,9]
[2,"OTT","No","Yes","Head On",480450,3]
[8,"WAR","Yes","No","Parked Vehicle",1401378,61]
[2,"WOO","No","Yes","Sideswipe - Passing",9446841,420]
[6,"FAY","Yes","No","Backing",30528,3]
[9,"JAC","No","No","Left Turn",5463429,97]
[9,"ROS","Yes","Yes","Other Non-Collision",10176,1]
[6,"MAD","No","Yes","Overturning",1675080,14]
[2,"SAN","Yes","Yes","Rear End",168381,11]
[9,"SCI","No","No","Other Object",807036,24]
[11,"CAR","No","No","Backing",1704750,113]
[11,"TUS","Yes","Yes","Unknown",10176,1]
[10,"WAS","Yes","No","Sideswipe - Passing",75684,4]
[6,"FRA","Yes","Yes","Sideswipe - Passing",1764852,60]
[6,"MRW","Yes","Yes","Rear End",659532,22]
[1,"HAR","Yes","No","Fixed Object",5348265,126]
[8,"WAR","No","No","Angle",24098238,390]
[12,"LAK","Yes","No","Unknown",107325,5]
[2,"WOO","Yes","Yes","Angle",66621,1]
[12,"LAK","No","No","Pedestrian",1031973,4]
[1,"ALL","No","No","Left Turn",6625893,115]
[3,"RIC","Yes","No","Fixed Object",30528,3]
[7,"CLA","Yes","Yes","Left Turn",240567,7]
[3,"CRA","Yes","No","Backing",1417644,129]
[8,"GRE","No","Yes","Animal",1289649,104]
[7,"MIA","Yes","No","Unknown",172833,8]
[12,"CUY","Yes","No","Unknown",10176,1]
[12,"CUY","Yes","No","Animal",20516751,854]
[4,"ATB","Yes","No","Animal",818532,77]
[4,"SUM","Yes","No","Unknown",10176,1]
[8,"CLI","No","Yes","Other Non-Collision",458874,34]
[2,"OTT","No","No","Angle",16794669,175]
[2,"LUC","Yes","No","Animal",20352,2]
[8,"BUT","Yes","Yes","Fixed Object",20490531,513]
[12,"LAK","Yes","Yes","Right Turn",549027,27]
[1,"PUT","No","No","Parked Vehicle",436137,27]
[3,"ASD","Yes","No","Parked Vehicle",1221438,73]
[10,"WAS","Yes","No","Backing",1163244,104]
[4,"POR","Yes","No","Overturning",45156,1]
[4,"MAH","Yes","Yes","Backing",270141,21]
[7,"SHE","No","Yes","Overturning",1374141,12]
[5,"MUS","Yes","No","Sideswipe - Meeting",20352,2]
[8,"CLI","No","Yes","Other Object",325473,23]
[6,"FRA","Yes","No","Other Non-Collision",33216681,826]
[6,"MAR","Yes","No","Other Object",437568,43]
[5,"FAI","Yes","No","Head On",152481,6]
[3,"WAY","Yes","No","Left Turn",460098,1]
[4,"SUM","No","Yes","Angle",289221,16]
[1,"ALL","No","No","Rear End",12214917,233]
[1,"PAU","No","No","Other Non-Collision",1039812,40]
[8,"HAM","Yes","No","Pedestrian",4162968,31]
[9,"ROS","Yes","No","Right Turn",535782,5]
[2,"WOO","Yes","Yes","Overturning",121953,3]
[7,"DAR","Yes","Yes","Parked Vehicle",66621,1]
[6,"MRW","No","No","Pedalcycles",693828,6]
[11,"TUS","Yes","Yes","Overturning",1436310,16]
[8,"CLI","No","Yes","Angle",20352,2]
[1,"HAN","Yes","Yes","Other Non-Collision",10176,1]
[7,"SHE","Yes","No","Other Object",10176,1]
[3,"ERI","Yes","No","Rear End",39621000,1648]
[6,"FAY","No","Yes","Other Object",687198,53]
[1,"PUT","Yes","No","Rear End",45156,1]
[12,"LAK","Yes","No","Right Turn",441702,22]
[10,"HOC","Yes","Yes","Sideswipe - Passing",66621,1]
[1,"PAU","No","Yes","Left Turn",10176,1]
[7,"CLA","Yes","Yes","Backing",30528,3]
[6,"FAY","Yes","No","Other Object",500802,5]
[5,"FAI","No","No","Pedalcycles",1175391,7]
[7,"CHP","No","No","Left Turn",5380971,90]
[3,"MED","Yes","No","Parked Vehicle",608127,10]
[8,"CLE","Yes","Yes","Left Turn",66621,1]
[1,"HAN","Yes","No","Overturning",1471290,16]
[3,"MED","Yes","No","Fixed Object",177444,14]
[4,"SUM","Yes","No","Head On",695625,20]
[2,"LUC","Yes","Yes","Other Object",45156,1]
[4,"MAH","No","No","Animal",10208991,626]
[8,"WAR","Yes","Yes","Other Object",20352,2]
[2,"FUL","Yes","Yes","Other Object",10176,1]
[6,"MAR","No","No","Unknown",81408,8]
[6,"FRA","Yes","Yes","Backing",2061705,128]
[7,"AUG","No","Yes","Sideswipe - Passing",1724355,110]
[6,"PIC","Yes","Yes","Fixed Object",97149,4]
[2,"HEN","Yes","No","Parked Vehicle",585438,43]
[8,"BUT","Yes","No","Other Non-Collision",632931,9]
[2,"LUC","Yes","Yes","Angle",30528,3]
[7,"DAR","Yes","Yes","Fixed Object",303849,14]
[2,"WOO","Yes","Yes","Sideswipe - Passing",177285,5]
[7,"MOT","Yes","Yes","Sideswipe - Passing",122112,12]
[3,"CRA","Yes","No","Animal",315456,31]
[5,"KNO","Yes","No","Pedestrian",111777,2]
[1,"ALL","Yes","Yes","Unknown",136740,10]
[1,"PUT","Yes","No","Left Turn",291447,12]
[3,"RIC","Yes","No","Rear End",58536909,2302]
[12,"CUY","Yes","Yes","Unknown",30528,3]
[9,"ADA","Yes","No","Fixed Object",10176,1]
[9,"SCI","Yes","No","Pedestrian",10268517,63]
[4,"SUM","Yes","No","Rear End",562542,22]
[1,"ALL","No","No","Parked Vehicle",1292781,49]
[11,"BEL","Yes","No","Right Turn",66621,1]
[2,"OTT","Yes","Yes","Left Turn",30528,3]
[5,"LIC","Yes","Yes","Parked Vehicle",204474,9]
[8,"GRE","Yes","No","Head On",111777,2]
[11,"BEL","Yes","No","Rear End",45156,1]
[3,"LOR","Yes","No","Sideswipe - Meeting",111777,2]
[10,"MOE","No","No","Pedestrian",1625313,7]
[8,"BUT","Yes","Yes","Parked Vehicle",1440492,35]
[3,"WAY","Yes","No","Rear End",4276161,110]
[6,"DEL","No","Yes","Animal",1021734,79]
[1,"HAN","Yes","No","Other Non-Collision",10176,1]
[8,"CLE","Yes","No","Fixed Object",10176,1]
[11,"BEL","Yes","No","Parked Vehicle",61056,6]
[8,"BUT","Yes","No","Animal",798180,75]
[2,"OTT","No","Yes","Parked Vehicle",10176,1]
[11,"JEF","No","No","Right Turn",396546,21]
[12,"CUY","Yes","No","Backing",71232,7]
[7,"SHE","No","No","Left Turn",1720698,88]
[7,"LOG","Yes","No","Sideswipe - Passing",2268294,169]
[7,"AUG","No","Yes","Other Non-Collision",223872,22]
[9,"SCI","Yes","Yes","Backing",10176,1]
[5,"GUE","No","No","Left Turn",1614327,77]
[10,"WAS","Yes","No","Pedalcycles",121953,3]
[10,"ATH","Yes","Yes","Sideswipe - Passing",670185,50]
[10,"MRG","No","No","Sideswipe - Passing",2300904,43]
[8,"HAM","Yes","No","Overturning",19008585,206]
[3,"WAY","Yes","Yes","Parked Vehicle",86973,3]
[1,"ALL","Yes","No","Right Turn",10176,1]
[3,"RIC","Yes","Yes","Other Object",40704,4]
[5,"KNO","No","No","Pedestrian",1590333,7]
[1,"HAN","No","No","Pedestrian",1513536,5]
[9,"ROS","Yes","No","Rear End",161544,9]
[7,"DAR","Yes","No","Backing",1350864,119]
[4,"MAH","No","No","Pedalcycles",1276992,8]
[7,"MIA","Yes","Yes","Overturning",1294005,11]
[2,"HEN","Yes","No","Fixed Object",2804187,138]
[5,"GUE","Yes","No","Rear End",11021322,432]
[10,"MOE","Yes","No","Other Object",10176,1]
[5,"FAI","Yes","No","Right Turn",4694331,205]
[10,"NOB","Yes","Yes","Unknown",10176,1]
[6,"UNI","Yes","Yes","Left Turn",648672,5]
[5,"FAI","No","No","Animal",4537653,291]
[9,"JAC","No","No","Unknown",61056,6]
[3,"MED","No","No","Rear End",31291512,897]
[4,"ATB","Yes","No","Sideswipe - Passing",75684,4]
[3,"ASD","Yes","No","Angle",66621,1]
[2,"HEN","Yes","No","Animal",1007106,81]
[2,"OTT","No","Yes","Backing",40704,4]
[6,"FRA","Yes","Yes","Rear End",2590920,44]
[8,"BUT","Yes","No","Sideswipe - Passing",1968690,103]
[4,"TRU","Yes","No","Backing",10363095,823]
[6,"PIC","No","No","Right Turn",2262426,35]
[11,"COL","Yes","No","Unknown",10176,1]
[5,"KNO","No","No","Head On",9798195,86]
[4,"SUM","Yes","Yes","Rear End",1174056,76]
[8,"HAM","Yes","No","Head On",1901544,30]
[3,"ERI","Yes","No","Parked Vehicle",162657,7]
[6,"UNI","No","Yes","Other Non-Collision",223872,22]
[8,"BUT","Yes","No","Fixed Object",4771557,124]
[4,"SUM","Yes","No","Unknown",10176,1]
[3,"CRA","No","No","Fixed Object",28157586,533]
[11,"BEL","Yes","Yes","Other Non-Collision",473502,32]
[2,"SEN","No","No","Overturning",9001431,73]
[7,"MOT","Yes","No","Other Non-Collision",254082,7]
[1,"WYA","Yes","Yes","Angle",20352,2]
[6,"UNI","Yes","Yes","Right Turn",10176,1]
[10,"MEG","Yes","No","Right Turn",171720,10]
[1,"PUT","Yes","No","Animal",75684,4]
[6,"UNI","Yes","No","Rear End",202248,13]
[2,"LUC","No","No","Sideswipe - Passing",4510383,91]
[4,"POR","Yes","No","Overturning",66621,1]
[1,"ALL","Yes","Yes","Other Non-Collision",10176,1]
[3,"ERI","Yes","No","Fixed Object",902643,43]
[11,"HAS","Yes","No","Parked Vehicle",10176,1]
[1,"DEF","Yes","Yes","Parked Vehicle",66621,1]
[3,"RIC","Yes","Yes","Unknown",168381,11]
[4,"STA","Yes","No","Pedestrian",3219081,28]
[12,"LAK","Yes","No","Angle",10176,1]
[1,"HAN","Yes","No","Pedestrian",6289608,50]
[9,"PIK","No","No","Overturning",5834868,55]
[12,"LAK","Yes","No","Backing",10509582,912]
[5,"FAI","Yes","No","Pedalcycles",5031330,39]
[4,"ATB","Yes","Yes","Fixed Object",1772913,34]
[5,"KNO","Yes","No","Overturning",460098,1]
[1,"ALL","Yes","Yes","Sideswipe - Passing",10176,1]
[5,"COS","Yes","No","Angle",7541829,220]
[8,"WAR","Yes","Yes","Parked Vehicle",674748,11]
[6,"UNI","Yes","No","Sideswipe - Passing",101760,10]
[7,"LOG","Yes","Yes","Rear End",75684,4]
[12,"LAK","Yes","No","Fixed Object",69644061,1705]
[4,"POR","Yes","Yes","Other Object",30528,3]
[5,"MUS","Yes","No","Head On",12068238,159]
[7,"CLA","No","No","Pedalcycles",1186680,6]
[10,"ATH","Yes","No","Rear End",40704,4]
[9,"PIK","No","No","Animal",6906339,443]
[3,"ASD","Yes","Yes","Parked Vehicle",10176,1]
[8,"CLI","No","No","Angle",17495304,285]
[8,"WAR","No","Yes","Other Object",244224,24]
[1,"HAN","Yes","No","Left Turn",10176,1]
[3,"RIC","Yes","No","Unknown",66621,1]
[7,"SHE","Yes","Yes","Rear End",672522,15]
[5,"LIC","No","No","Head On",15038355,111]
[11,"COL","Yes","No","Pedalcycles",460098,1]
[11,"COL","Yes","No","Other Object",71232,7]
[7,"MIA","No","Yes","Overturning",470274,2]
[2,"WOO","Yes","No","Animal",81408,8]
[9,"JAC","Yes","No","Head On",10176,1]
[3,"RIC","Yes","No","Backing",76797,2]
[8,"CLE","No","Yes","Rear End",1208988,36]
[7,"MIA","Yes","No","Parked Vehicle",152640,15]
[1,"ALL","Yes","Yes","Head On",250743,8]
[1,"DEF","No","Yes","Rear End",86973,3]
[11,"HOL","No","No","Rear End",24141744,670]
[11,"TUS","Yes","No","Overturning",3132855,30]
[4,"STA","Yes","Yes","Right Turn",107325,5]
[7,"CLA","Yes","No","Right Turn",342327,17]
[7,"MOT","Yes","No","Overturning",11546241,132]
[2,"SAN","No","No","Unknown",50880,5]
[7,"MIA","Yes","No","Angle",230391,6]
[3,"MED","Yes","Yes","Sideswipe - Passing",3524457,148]
[7,"SHE","No","No","Overturning",6704343,66]
[12,"GEA","Yes","No","Pedalcycles",10176,1]
[8,"HAM","Yes","Yes","Other Non-Collision",40704,4]
[12,"CUY","No","No","Backing",132288,13]
[1,"HAN","Yes","No","Fixed Object",18979698,726]
[8,"WAR","Yes","Yes","Fixed Object",9339483,264]
[8,"GRE","Yes","Yes","Other Non-Collision",10176,1]
[3,"ASD","Yes","No","Rear End",10981302,424]
[8,"CLI","Yes","No","Rear End",6901935,301]
[3,"CRA","No","Yes","Animal",1001541,86]
[3,"LOR","Yes","Yes","Fixed Object",2898060,72]
[9,"BRO","Yes","Yes","Sideswipe - Passing",45156,1]
[8,"BUT","Yes","Yes","Right Turn",718791,14]
[4,"SUM","Yes","Yes","Other Non-Collision",10176,1]
[4,"SUM","Yes","Yes","Right Turn",2671962,54]
[3,"LOR","Yes","No","Backing",13760559,1050]
[11,"HAS","Yes","No","Fixed Object",30528,3]
[6,"UNI","No","No","Right Turn",1177506,39]
[2,"FUL","No","No","Other Non-Collision",1178778,46]
[1,"VAN","Yes","No","Backing",223872,22]
[6,"PIC","Yes","No","Other Non-Collision",50880,5]
[2,"SAN","Yes","No","Left Turn",30528,3]
[6,"FRA","No","No","Other Non-Collision",55332,2]
[5,"COS","No","No","Pedestrian",617031,4]
[3,"HUR","Yes","No","Head On",117501,6]
[9,"BRO","Yes","No","Rear End",866391,36]
[3,"RIC","Yes","Yes","Angle",647559,7]
[1,"PUT","No","No","Head On",1015803,21]
[1,"PUT","No","No","Train",30528,3]
[1,"HAN","No","No","Sideswipe - Meeting",20352,2]
[3,"ERI","No","No","Rear End",8682687,291]
[12,"GEA","Yes","No","Animal",81408,8]
[4,"MAH","Yes","No","Sideswipe - Passing",37825014,1952]
[10,"NOB","Yes","No","Sideswipe - Passing",122112,12]
[1,"DEF","Yes","No","Animal",10176,1]
[7,"AUG","Yes","Yes","Left Turn",10176,1]
[11,"COL","Yes","No","Angle",1912452,87]
[2,"FUL","Yes","No","Pedalcycles",86973,3]
[4,"MAH","Yes","No","Backing",20352,2]
[10,"ATH","Yes","Yes","Rear End",45156,1]
[2,"SAN","Yes","No","Rear End",3466947,130]
[11,"JEF","Yes","Yes","Head On",735645,8]
[10,"ATH","Yes","Yes","Other Object",30528,3]
[3,"CRA","Yes","No","Sideswipe - Meeting",40704,4]
[3,"ERI","Yes","No","Parked Vehicle",1143909,15]
[4,"STA","Yes","Yes","Other Object",20352,2]
[5,"LIC","Yes","No","Overturning",55332,2]
[2,"LUC","Yes","Yes","Parked Vehicle",1074633,31]
[9,"ADA","No","No","Other Object",167268,13]
[3,"MED","Yes","No","Sideswipe - Passing",814986,29]
[6,"DEL","Yes","Yes","Sideswipe - Passing",6835536,293]
[6,"MAD","Yes","No","Animal",20352,2]
[10,"WAS","Yes","Yes","Fixed Object",10176,1]
[4,"SUM","Yes","No","Fixed Object",551682,10]
[7,"AUG","Yes","Yes","Angle",10176,1]
[5,"LIC","Yes","Yes","Head On",86973,3]
[11,"COL","Yes","No","Left Turn",3100515,69]
[9,"HIG","Yes","No","Fixed Object",2246304,97]
[3,"LOR","Yes","No","Animal",30528,3]
[1,"ALL","Yes","No","Other Non-Collision",3546780,117]
[8,"CLI","No","Yes","Head On",2024514,11]
[10,"GAL","Yes","Yes","Other Non-Collision",20352,2]
[3,"LOR","Yes","No","Rear End",128120595,5025]
[10,"ATH","No","No","Other Non-Collision",1494345,46]
[6,"FAY","Yes","Yes","Rear End",183009,9]
[5,"GUE","No","Yes","Rear End",4219032,89]
[4,"ATB","Yes","No","Other Non-Collision",470274,2]
[7,"LOG","No","No","Other Non-Collision",387642,27]
[3,"ERI","Yes","Yes","Other Non-Collision",117501,6]
[8,"HAM","Yes","No","Sideswipe - Meeting",10176,1]
[2,"LUC","Yes","No","Right Turn",621372,32]
[5,"FAI","Yes","No","Sideswipe - Passing",10176,1]
[10,"GAL","No","No","Head On",5295906,65]
[2,"HEN","No","Yes","Head On",30528,3]
[7,"MOT","Yes","Yes","Right Turn",10176,1]
[7,"AUG","No","No","Sideswipe - Meeting",460098,1]
[3,"RIC","Yes","No","Right Turn",6893508,339]
[11,"TUS","Yes","Yes","Fixed Object",10176,1]
[10,"HOC","No","Yes","Fixed Object",1732257,70]
[6,"UNI","Yes","Yes","Animal",1093761,66]
[6,"FRA","Yes","Yes","Unknown",66621,1]
[2,"LUC","Yes","No","Rear End",862098,53]
[2,"WOO","Yes","No","Pedestrian",3785820,23]
[7,"DAR","No","No","Pedalcycles",592227,5]
[12,"CUY","Yes","Yes","Rear End",263145,10]
[2,"LUC","No","Yes","Other Non-Collision",204474,9]
[8,"CLE","No","No","Unknown",178557,12]
[6,"UNI","Yes","Yes","Animal",10176,1]
[11,"JEF","Yes","Yes","Animal",10176,1]
[2,"LUC","Yes","No","Fixed Object",85860,5]
[10,"ATH","Yes","Yes","Fixed Object",10176,1]
[7,"DAR","Yes","Yes","Rear End",76797,2]
[4,"SUM","Yes","Yes","Animal",6012537,400]
[3,"MED","Yes","No","Parked Vehicle",752547,47]
[3,"WAY","No","Yes","Rear End",2969181,45]
[6,"PIC","Yes","No","Overturning",837246,9]
[11,"BEL","No","Yes","Sideswipe - Passing",5431089,216]
[7,"MER","Yes","No","Rear End",10176,1]
[6,"FAY","No","No","Left Turn",3779286,90]
[4,"SUM","Yes","No","Sideswipe - Passing",314184,24]
[2,"WIL","Yes","No","Right Turn",405768,33]
[9,"ADA","No","No","Sideswipe - Meeting",127677,7]
[6,"UNI","Yes","No","Animal",142464,14]
[7,"AUG","Yes","No","Other Non-Collision",10176,1]
[5,"FAI","Yes","No","Fixed Object",20352,2]
[3,"CRA","Yes","No","Fixed Object",4349682,102]
[11,"TUS","Yes","Yes","Angle",10176,1]
[7,"SHE","Yes","No","Fixed Object",97149,4]
[3,"MED","Yes","Yes","Sideswipe - Meeting",10176,1]
[12,"LAK","No","Yes","Sideswipe - Passing",5224818,183]
[2,"SAN","No","Yes","Angle",20352,2]
[6,"UNI","Yes","Yes","Unknown",10176,1]
[3,"MED","Yes","No","Head On",55332,2]
[1,"ALL","Yes","Yes","Animal",10176,1]
[6,"MAR","Yes","No","Sideswipe - Passing",13176519,657]
[5,"MUS","No","No","Head On",9076686,95]
[5,"MUS","No","No","Train",10176,1]
[5,"LIC","Yes","Yes","Other Non-Collision",55332,2]
[3,"ERI","No","No","Right Turn",988773,26]
[6,"MAD","Yes","No","Rear End",4473894,202]
[3,"RIC","Yes","Yes","Pedestrian",571875,3]
[2,"WOO","Yes","Yes","Overturning",66621,1]
[4,"POR","Yes","Yes","Overturning",45156,1]
[6,"FRA","Yes","Yes","Backing",10176,1]
[1,"WYA","No","No","Head On",3377778,19]
[2,"FUL","No","No","Angle",41064642,439]
[8,"BUT","Yes","Yes","Angle",233730,5]
[5,"FAI","Yes","Yes","Fixed Object",1054965,40]
[1,"PAU","Yes","Yes","Fixed Object",603516,4]
[8,"GRE","Yes","Yes","Sideswipe - Passing",10176,1]
[2,"SEN","Yes","No","Right Turn",10176,1]
[2,"SAN","No","Yes","Rear End",6536043,126]
[7,"MER","No","No","Angle",20994891,237]
[11,"TUS","Yes","Yes","Overturning",76797,2]
[4,"STA","Yes","No","Unknown",1324581,59]
[6,"PIC","Yes","No","Unknown",960900,6]
[4,"ATB","Yes","No","Backing",1354314,82]
[9,"ADA","No","No","Pedestrian",1186680,6]
[2,"WOO","Yes","Yes","Angle",1425021,17]
[4,"SUM","Yes","Yes","Backing",30528,3]
[4,"STA","No","No","Angle",32466501,517]
[10,"MRG","Yes","No","Angle",10176,1]
[7,"MOT","No","No","Rear End",4114395,173]
[10,"HOC","Yes","Yes","Fixed Object",3341352,54]
[11,"BEL","Yes","No","Backing",10176,1]
[1,"PUT","Yes","No","Rear End",2759190,86]
[4,"POR","Yes","No","Left Turn",9546390,263]
[3,"LOR","Yes","No","Angle",2110947,63]
[8,"BUT","Yes","No","Left Turn",1349067,40]
[10,"HOC","Yes","No","Overturning",107325,5]
[11,"JEF","Yes","Yes","Fixed Object",1102776,24]
[4,"ATB","Yes","Yes","Animal",61056,6]
[5,"KNO","No","No","Sideswipe - Meeting",20352,2]
[6,"PIC","Yes","Yes","Left Turn",10176,1]
[7,"MOT","No","No","Fixed Object",23593620,424]
[3,"LOR","Yes","Yes","Rear End",8766876,210]
[1,"ALL","No","Yes","Left Turn",30528,3]
[4,"POR","Yes","Yes","Angle",66621,1]
[9,"BRO","Yes","No","Overturning",10176,1]
[4,"TRU","Yes","No","Angle",280158,13]
[7,"DAR","Yes","Yes","Left Turn",167109,4]
[4,"TRU","Yes","No","Head On",20292621,265]
[4,"TRU","Yes","No","Train",75684,4]
[5,"LIC","Yes","No","Sideswipe - Passing",12460383,706]
[8,"GRE","Yes","Yes","Animal",20352,2]
[5,"GUE","No","Yes","Fixed Object",10578378,271]
[10,"GAL","Yes","Yes","Rear End",210039,4]
[3,"CRA","Yes","Yes","Animal",468096,46]
[7,"MIA","Yes","No","Animal",2993604,232]
[2,"LUC","Yes","Yes","Unknown",1770051,62]
[12,"LAK","Yes","No","Parked Vehicle",499419,29]
[8,"GRE","No","Yes","Parked Vehicle",525606,4]
[8,"PRE","Yes","No","Rear End",7353828,278]
[10,"MEG","Yes","No","Animal",959676,39]
[11,"TUS","Yes","No","Parked Vehicle",101760,10]
[10,"MOE","Yes","No","Head On",66621,1]
[7,"MER","Yes","No","Left Turn",45156,1]
[11,"BEL","Yes","Yes","Rear End",30528,3]
[8,"PRE","Yes","No","Rear End",65508,3]
[1,"VAN","Yes","No","Other Object",71232,7]
[3,"ASD","No","No","Backing",1263573,93]
[9,"LAW","Yes","Yes","Rear End",17269815,533]
[3,"ERI","Yes","Yes","Animal",1091964,52]
[12,"GEA","Yes","No","Overturning",132129,4]
[12,"CUY","Yes","Yes","Right Turn",50880,5]
[4,"MAH","Yes","No","Right Turn",65508,3]
[8,"GRE","Yes","Yes","Angle",1473405,48]
[4,"ATB","Yes","No","Fixed Object",10176,1]
[2,"SEN","No","No","Unknown",1133733,14]
[11,"BEL","Yes","No","Fixed Object",460098,1]
[6,"MAD","Yes","Yes","Left Turn",460098,1]
[6,"FAY","Yes","No","Sideswipe - Passing",2592717,118]
[1,"DEF","Yes","Yes","Fixed Object",97149,4]
[5,"LIC","Yes","No","Pedalcycles",736758,6]
[8,"HAM","Yes","Yes","Parked Vehicle",143418,3]
[12,"CUY","Yes","Yes","Left Turn",75684,4]
[12,"GEA","No","No","Other Non-Vehicle",55332,2]
[2,"FUL","No","Yes","Unknown",50880,5]
[1,"PUT","Yes","No","Parked Vehicle",235002,12]
[11,"TUS","Yes","Yes","Sideswipe - Passing",20352,2]
[9,"LAW","Yes","Yes","Left Turn",1020255,18]
[9,"ROS","Yes","Yes","Head On",106212,7]
[7,"MIA","Yes","No","Other Non-Collision",10176,1]
[2,"FUL","Yes","No","Parked Vehicle",40704,4]
[2,"WOO","Yes","No","Unknown",198909,14]
[8,"WAR","Yes","Yes","Overturning",20352,2]
[1,"VAN","Yes","No","Parked Vehicle",10176,1]
[7,"MIA","Yes","No","Rear End",23370756,1162]
[7,"SHE","Yes","Yes","Sideswipe - Passing",4440360,162]
[4,"STA","No","Yes","Unknown",10176,1]
[9,"PIK","No","No","Unknown",204474,9]
[12,"CUY","Yes","No","Unknown",10176,1]
[1,"HAN","No","Yes","Head On",613692,5]
[3,"RIC","Yes","No","Other Object",40704,4]
[11,"BEL","Yes","No","Left Turn",121953,3]
[2,"WIL","Yes","No","Parked Vehicle",10176,1]
[3,"CRA","Yes","No","Fixed Object",5308929,154]
[4,"POR","Yes","No","Overturning",2670372,24]
[3,"RIC","Yes","No","Parked Vehicle",9354843,453]
[4,"POR","Yes","No","Backing",981030,75]
[3,"ASD","No","No","Right Turn",1211214,32]
[8,"BUT","Yes","Yes","Rear End",35246748,1061]
[9,"LAW","No","Yes","Fixed Object",644220,8]
[5,"FAI","No","Yes","Right Turn",86973,3]
[3,"WAY","Yes","No","Pedestrian",366972,7]
[2,"OTT","Yes","Yes","Parked Vehicle",536895,3]
[2,"LUC","Yes","No","Sideswipe - Passing",172544778,8814]
[9,"JAC","No","Yes","Overturning",10176,1]
[4,"MAH","Yes","No","Other Non-Collision",4802943,91]
[4,"ATB","Yes","No","Sideswipe - Meeting",10176,1]
[5,"COS","No","No","Angle",3710184,64]
[6,"DEL","Yes","Yes","Other Object",431685,30]
[8,"CLE","Yes","No","Left Turn",219102,7]
[2,"OTT","No","No","Other Object",234048,23]
[7,"CLA","Yes","No","Backing",6238794,437]
[3,"MED","Yes","Yes","Parked Vehicle",10176,1]
[6,"MAR","Yes","No","Sideswipe - Passing",157092,12]
[6,"FRA","Yes","Yes","Rear End",192072,12]
[7,"MOT","Yes","Yes","Angle",5174034,133]
[11,"BEL","Yes","No","Fixed Object",172833,8]
[9,"JAC","No","No","Animal",8668791,679]
[6,"PIC","No","Yes","Rear End",3053832,32]
[8,"WAR","Yes","No","Sideswipe - Passing",6252054,343]
[12,"CUY","Yes","No","Fixed Object",152481,6]
[7,"LOG","Yes","Yes","Animal",319908,28]
[4,"MAH","Yes","Yes","Angle",96036,6]
[9,"ADA","Yes","No","Rear End",20352,2]
[9,"ROS","Yes","No","Left Turn",165996,6]
[6,"UNI","Yes","No","Unknown",106212,7]
[9,"PIK","Yes","No","Backing",40704,4]
[2,"WOO","Yes","No","Left Turn",1139298,9]
[6,"MAR","No","No","Backing",797862,57]
[12,"CUY","Yes","Yes","Rear End",86973,3]
[6,"FRA","Yes","Yes","Other Object",76797,2]
[7,"CLA","Yes","No","Unknown",1358448,61]
[3,"ERI","Yes","Yes","Sideswipe - Meeting",45156,1]
[3,"ERI","Yes","Yes","Overturning",2653947,12]
[3,"ERI","No","Yes","Overturning",777462,10]
[6,"UNI","Yes","No","Backing",1016169,84]
[10,"GAL","Yes","Yes","Angle",66621,1]
[11,"BEL","Yes","Yes","Rear End",10176,1]
[9,"HIG","Yes","No","Unknown",116388,8]
[5,"MUS","No","No","Parked Vehicle",973032,30]
[3,"WAY","Yes","Yes","Sideswipe - Meeting",10176,1]
[9,"PIK","Yes","No","Pedestrian",199863,3]
[2,"SAN","Yes","Yes","Sideswipe - Passing",625983,38]
[5,"FAI","Yes","No","Unknown",612738,16]
[6,"FRA","No","No","Angle",3795456,73]
[7,"SHE","No","No","Rear End",8901198,174]
[1,"DEF","Yes","Yes","Animal",1070388,88]
[11,"TUS","No","Yes","Animal",4363389,262]
[3,"CRA","No","Yes","Unknown",50880,5]
[6,"UNI","Yes","Yes","Backing",10176,1]
[2,"OTT","Yes","Yes","Head On",470274,2]
[7,"AUG","Yes","No","Pedestrian",45156,1]
[12,"LAK","No","Yes","Head On",1082853,9]
[3,"ASD","Yes","No","Head On",1587678,24]
[4,"SUM","Yes","No","Fixed Object",709728,11]
[2,"WOO","Yes","Yes","Angle",10176,1]
[11,"COL","No","Yes","Overturning",10176,1]
[2,"FUL","Yes","No","Fixed Object",811647,30]
[7,"LOG","Yes","Yes","Backing",20352,2]
[12,"LAK","Yes","No","Pedalcycles",66621,1]
[3,"ERI","Yes","No","Left Turn",6564393,178]
[8,"PRE","Yes","No","Overturning",75684,4]
[3,"RIC","Yes","No","Left Turn",23394936,621]
[7,"MOT","No","No","Animal",3724590,194]
[11,"COL","No","No","Left Turn",8160609,188]
[2,"WOO","Yes","Yes","Other Object",559521,46]
[7,"DAR","No","No","Pedestrian",1298457,8]
[12,"LAK","Yes","No","Animal",5981007,433]
[6,"MAR","Yes","Yes","Unknown",20352,2]
[2,"LUC","Yes","Yes","Parked Vehicle",10176,1]
[7,"AUG","Yes","Yes","Animal",894852,52]
[3,"ASD","Yes","Yes","Angle",10176,1]
[1,"HAN","Yes","No","Backing",71232,7]
[8,"CLI","Yes","No","Parked Vehicle",10176,1]
[5,"PER","Yes","No","Parked Vehicle",40704,4]
[2,"WOO","No","No","Right Turn",1775187,70]
[9,"JAC","Yes","Yes","Animal",295104,29]
[4,"MAH","Yes","No","Animal",40704,4]
[3,"ERI","Yes","No","Sideswipe - Passing",10176,1]
[4,"STA","Yes","No","Falling From Or In Vehicle",460098,1]
[7,"MOT","Yes","Yes","Rear End",2037267,127]
[3,"MED","Yes","Yes","Rear End",1428249,47]
[6,"MAR","Yes","Yes","Backing",10176,1]
[9,"ROS","No","Yes","Right Turn",86973,3]
[5,"FAI","Yes","Yes","Head On",10176,1]
[8,"WAR","Yes","No","Other Object",392094,24]
[4,"SUM","Yes","No","Right Turn",55332,2]
[6,"MAR","Yes","No","Other Non-Collision",76797,2]
[4,"STA","No","No","Unknown",572034,12]
[4,"STA","Yes","No","Other Object",106212,7]
[6,"FAY","No","Yes","Sideswipe - Passing",3947826,180]
[11,"JEF","Yes","Yes","Other Non-Collision",10176,1]
[5,"LIC","Yes","Yes","Unknown",91584,9]
[2,"HEN","Yes","No","Right Turn",305280,30]
[9,"HIG","Yes","No","Rear End",10851177,493]
[7,"SHE","Yes","Yes","Backing",20352,2]
[11,"TUS","Yes","Yes","Rear End",152481,6]
[2,"OTT","Yes","No","Head On",810216,14]
[2,"OTT","Yes","No","Train",10176,1]
[7,"LOG","Yes","No","Unknown",20352,2]
[3,"ASD","Yes","Yes","Right Turn",66621,1]
[11,"COL","Yes","No","Pedestrian",66621,1]
[10,"ATH","Yes","Yes","Angle",245019,4]
[6,"FAY","Yes","Yes","Other Non-Collision",30528,3]
[9,"HIG","No","No","Left Turn",5527125,137]
[2,"WIL","No","No","Fixed Object",40466346,872]
[7,"DAR","Yes","No","Backing",30528,3]
[10,"WAS","Yes","Yes","Other Object",20352,2]
[1,"VAN","Yes","No","Rear End",280158,13]
[5,"GUE","No","Yes","Animal",3747471,266]
[11,"BEL","Yes","No","Overturning",1197540,23]
[7,"AUG","Yes","Yes","Head On",20352,2]
[1,"ALL","No","No","Unknown",259965,20]
[7,"AUG","Yes","Yes","Rear End",10176,1]
[3,"ERI","Yes","No","Right Turn",3181335,151]
[6,"DEL","Yes","Yes","Other Non-Collision",595566,4]
[7,"AUG","Yes","No","Unknown",40704,4]
[9,"LAW","No","No","Sideswipe - Passing",1585341,59]
[9,"ROS","Yes","No","Backing",10176,1]
[1,"HAN","No","Yes","Sideswipe - Passing",2823474,117]
[12,"LAK","Yes","Yes","Fixed Object",20352,2]
[4,"MAH","Yes","No","Pedestrian",66621,1]
[2,"OTT","Yes","Yes","Parked Vehicle",10176,1]
[2,"SEN","Yes","No","Other Object",10176,1]
[7,"MOT","No","Yes","Overturning",1328985,11]
[6,"FAY","Yes","Yes","Sideswipe - Passing",245178,13]
[8,"BUT","Yes","No","Sideswipe - Passing",59542137,2898]
[12,"CUY","Yes","No","Parked Vehicle",17093994,1315]
[11,"TUS","Yes","Yes","Other Non-Collision",10176,1]
[9,"ADA","Yes","No","Backing",20352,2]
[8,"GRE","Yes","No","Parked Vehicle",198909,14]
[10,"VIN","No","No","Other Non-Collision",361566,21]
[11,"JEF","Yes","No","Sideswipe - Passing",4143333,276]
[9,"JAC","Yes","No","Angle",10176,1]
[5,"LIC","Yes","Yes","Rear End",120840,5]
[7,"MOT","Yes","Yes","Sideswipe - Passing",531330,8]
[3,"ERI","No","No","Left Turn",5529111,63]
[3,"ASD","No","No","Left Turn",8555580,128]
[9,"BRO","Yes","Yes","Other Non-Collision",10176,1]
[10,"ATH","Yes","No","Right Turn",45156,1]
[9,"BRO","No","No","Right Turn",1045107,62]
[4,"SUM","Yes","No","Parked Vehicle",53412768,3109]
[4,"POR","No","No","Left Turn",10482327,236]
[8,"WAR","No","No","Pedestrian",2172384,11]
[1,"WYA","No","Yes","Rear End",163770,5]
[9,"JAC","Yes","Yes","Backing",10176,1]
[7,"MOT","Yes","Yes","Rear End",1763580,58]
[8,"WAR","Yes","No","Overturning",20352,2]
[3,"WAY","Yes","Yes","Sideswipe - Passing",10176,1]
[4,"ATB","Yes","No","Fixed Object",76797,2]
[1,"PAU","No","No","Head On",1765551,25]
[3,"MED","Yes","Yes","Rear End",1299300,33]
[1,"ALL","Yes","Yes","Sideswipe - Passing",20352,2]
[3,"HUR","Yes","No","Unknown",127677,7]
[7,"AUG","No","No","Angle",22723236,201]
[11,"JEF","No","No","Fixed Object",36730260,795]
[8,"GRE","Yes","No","Fixed Object",142464,14]
[6,"UNI","Yes","Yes","Parked Vehicle",20352,2]
[5,"FAI","No","Yes","Rear End",2621178,69]
[9,"PIK","No","No","Right Turn",615489,19]
[10,"MEG","Yes","No","Fixed Object",4644309,99]
[6,"FAY","Yes","Yes","Animal",10176,1]
[0,"LOR","Yes","No","Fixed Object",10176,1]
[6,"MAD","No","No","Rear End",17515578,374]
[7,"CLA","No","No","Other Object",1149633,19]
[3,"LOR","No","Yes","Sideswipe - Passing",1420299,47]
[9,"LAW","Yes","No","Rear End",30528,3]
[2,"FUL","No","Yes","Backing",20352,2]
[3,"HUR","Yes","No","Other Non-Collision",1583385,36]
[12,"CUY","Yes","No","Fixed Object",23384679,744]
[3,"HUR","Yes","No","Backing",675909,54]
[7,"DAR","Yes","Yes","Overturning",45156,1]
[9,"SCI","Yes","No","Backing",81408,8]
[3,"MED","No","Yes","Right Turn",30528,3]
[9,"ROS","No","No","Left Turn",9298206,203]
[8,"BUT","Yes","Yes","Other Non-Collision",10176,1]
[9,"BRO","Yes","No","Left Turn",162657,7]
[12,"CUY","No","Yes","Rear End",1942980,100]
[7,"AUG","Yes","No","Parked Vehicle",2028363,133]
[2,"SEN","Yes","No","Angle",12959595,471]
[7,"AUG","Yes","Yes","Animal",524382,37]
[7,"MIA","No","No","Unknown",116388,8]
[9,"JAC","No","No","Parked Vehicle",1393539,25]
[3,"MED","Yes","Yes","Backing",30528,3]
[12,"LAK","Yes","Yes","Rear End",26843694,781]
[10,"GAL","No","Yes","Sideswipe - Passing",632661,31]
[6,"DEL","Yes","Yes","Angle",1564416,10]
[3,"ASD","Yes","No","Left Turn",6062493,114]
[3,"RIC","Yes","No","Head On",12238527,153]
[3,"RIC","Yes","No","Train",55332,2]
[7,"SHE","Yes","Yes","Left Turn",142305,5]
[4,"POR","Yes","No","Rear End",883245,35]
[5,"LIC","Yes","No","Pedestrian",10890096,79]
[8,"WAR","No","Yes","Sideswipe - Passing",3632466,164]
[7,"CLA","Yes","No","Other Non-Collision",10176,1]
[6,"FAY","Yes","No","Other Non-Collision",535782,5]
[8,"WAR","Yes","No","Left Turn",8127633,196]
[10,"ATH","Yes","No","Head On",1042149,5]
[5,"MUS","No","No","Other Non-Collision",1214871,44]
[3,"MED","Yes","No","Sideswipe - Meeting",45156,1]
[0,"LOR","Yes","No","Rear End",110664,4]
[10,"HOC","Yes","No","Sideswipe - Passing",1841013,96]
[8,"WAR","Yes","No","Right Turn",20352,2]
[5,"LIC","Yes","No","Angle",38757561,1168]
[2,"SEN","No","No","Left Turn",4002999,98]
[4,"STA","No","Yes","Backing",10176,1]
[10,"WAS","No","No","Pedalcycles",178398,3]
[4,"SUM","Yes","No","Left Turn",40704,4]
[6,"UNI","Yes","Yes","Fixed Object",3357459,113]
[1,"HAN","No","Yes","Parked Vehicle",81408,8]
[8,"HAM","Yes","No","Angle",8481027,289]
[12,"GEA","Yes","Yes","Fixed Object",522951,21]
[8,"BUT","No","No","Sideswipe - Passing",4808016,190]
[4,"SUM","Yes","No","Rear End",10176,1]
[6,"UNI","Yes","Yes","Left Turn",526719,2]
[2,"OTT","Yes","Yes","Left Turn",66621,1]
[12,"GEA","No","Yes","Right Turn",20352,2]
[8,"GRE","Yes","Yes","Sideswipe - Meeting",460098,1]
[12,"LAK","No","No","Other Object",30528,3]
[9,"HIG","Yes","No","Unknown",20352,2]
[8,"CLE","Yes","No","Sideswipe - Passing",24748107,1272]
[4,"MAH","Yes","No","Other Non-Collision",470274,2]
[1,"VAN","Yes","Yes","Overturning",505254,2]
[11,"TUS","Yes","Yes","Animal",10176,1]
[8,"GRE","Yes","No","Parked Vehicle",14392821,777]
[3,"RIC","Yes","Yes","Animal",4202370,330]
[3,"MED","No","Yes","Rear End",6668298,113]
[2,"SAN","Yes","No","Head On",1214982,13]
[5,"FAI","Yes","Yes","Overturning",110664,4]
[1,"ALL","Yes","No","Angle",2115399,60]
[4,"TRU","Yes","Yes","Animal",20352,2]
[4,"POR","Yes","Yes","Pedestrian",460098,1]
[4,"POR","Yes","No","Right Turn",587775,8]
[4,"TRU","Yes","No","Sideswipe - Passing",10176,1]
[2,"WOO","Yes","Yes","Fixed Object",622755,8]
[10,"GAL","No","No","Other Non-Collision",699711,19]
[7,"AUG","Yes","No","Right Turn",228324,19]
[4,"STA","Yes","No","Angle",8778213,254]
[7,"MER","No","Yes","Other Non-Collision",55332,2]
[12,"CUY","Yes","Yes","Sideswipe - Passing",343440,20]
[8,"BUT","Yes","No","Overturning",460098,1]
[6,"DEL","Yes","No","Right Turn",117501,6]
[2,"LUC","Yes","No","Sideswipe - Meeting",45156,1]
[7,"LOG","No","Yes","Head On",20352,2]
[1,"VAN","Yes","No","Right Turn",75684,4]
[9,"HIG","No","No","Head On",7719462,71]
[7,"MOT","Yes","No","Pedestrian",122523321,753]
[7,"SHE","No","No","Animal",11260236,920]
[11,"COL","Yes","No","Overturning",163770,5]
[7,"MOT","Yes","Yes","Sideswipe - Passing",10176,1]
[7,"AUG","Yes","No","Backing",1017441,91]
[3,"RIC","Yes","No","Fixed Object",370470,15]
[2,"OTT","Yes","Yes","Rear End",260919,9]
[1,"HAR","No","No","Unknown",85860,5]
[7,"LOG","Yes","No","Pedalcycles",536895,3]
[1,"WYA","No","Yes","Right Turn",66621,1]
[2,"LUC","Yes","No","Pedestrian",98598795,655]
[4,"TRU","Yes","Yes","Parked Vehicle",723243,11]
[5,"LIC","Yes","Yes","Backing",20352,2]
[5,"GUE","No","Yes","Backing",223713,13]
[4,"SUM","Yes","Yes","Rear End",517545,35]
[7,"CLA","Yes","No","Parked Vehicle",2608029,127]
[12,"CUY","Yes","No","Left Turn",3409500,161]
[10,"WAS","Yes","No","Overturning",1139298,9]
[2,"WIL","No","No","Right Turn",781803,38]
[12,"LAK","No","No","Angle",5876304,120]
[4,"ATB","Yes","Yes","Fixed Object",101760,10]
[12,"CUY","Yes","Yes","Other Non-Collision",110664,4]
[12,"CUY","Yes","No","Sideswipe - Passing",81408,8]
[6,"FRA","Yes","Yes","Left Turn",567423,6]
[4,"SUM","Yes","Yes","Overturning",10176,1]
[6,"MRW","No","No","Overturning",7577682,68]
[11,"COL","Yes","No","Head On",2164593,20]
[11,"COL","Yes","No","Train",920196,2]
[2,"HEN","No","No","Pedalcycles",1063614,5]
[11,"TUS","No","No","Rear End",12854178,394]
[2,"OTT","No","No","Pedestrian",1952169,6]
[3,"RIC","Yes","Yes","Sideswipe - Passing",10176,1]
[6,"MRW","Yes","Yes","Right Turn",20352,2]
[10,"ATH","Yes","Yes","Unknown",20352,2]
[3,"LOR","Yes","Yes","Backing",197796,16]
[2,"SAN","No","Yes","Overturning",230391,6]
[7,"MIA","Yes","Yes","Pedalcycles",66621,1]
[9,"HIG","Yes","No","Sideswipe - Passing",457602,27]
[5,"LIC","No","Yes","Unknown",137853,8]
[10,"WAS","No","Yes","Right Turn",10176,1]
[6,"MAD","No","No","Right Turn",2812995,47]
[12,"CUY","No","Yes","Right Turn",40704,4]
[10,"ATH","Yes","No","Right Turn",992955,50]
[2,"LUC","No","Yes","Angle",143418,3]
[11,"BEL","Yes","No","Angle",10176,1]
[11,"JEF","Yes","No","Unknown",20352,2]
[9,"JAC","Yes","Yes","Overturning",133242,2]
[9,"PIK","Yes","No","Other Object",106212,7]
[2,"WIL","No","No","Overturning",7305729,79]
[3,"CRA","Yes","No","Unknown",541506,9]
[7,"MOT","Yes","No","Parked Vehicle",1102140,53]
[6,"DEL","Yes","No","Pedalcycles",188574,4]
[8,"BUT","Yes","No","Sideswipe - Passing",13418676,559]
[2,"OTT","Yes","Yes","Left Turn",66621,1]
[4,"ATB","No","No","Pedalcycles",2028966,8]
[2,"WOO","Yes","Yes","Rear End",447267,17]
[3,"RIC","No","No","Sideswipe - Meeting",152481,6]
[7,"MOT","No","No","Parked Vehicle",712956,41]
[7,"CHP","Yes","No","Unknown",10176,1]
[2,"HEN","Yes","Yes","Backing",10176,1]
[4,"POR","No","No","Parked Vehicle",1295961,34]
[4,"SUM","Yes","Yes","Fixed Object",97901562,2244]
[2,"SAN","Yes","Yes","Left Turn",110664,4]
[5,"MUS","No","Yes","Backing",61056,6]
[3,"ERI","Yes","Yes","Pedalcycles",10176,1]
[6,"FRA","Yes","Yes","Sideswipe - Passing",71232,7]
[12,"CUY","Yes","Yes","Head On",86973,3]
[10,"VIN","Yes","No","Angle",383985,10]
[9,"HIG","No","No","Sideswipe - Meeting",480450,3]
[12,"CUY","Yes","No","Angle",470274,2]
[4,"SUM","Yes","No","Other Object",10176,1]
[12,"GEA","No","No","Other Non-Collision",1271046,71]
[9,"ADA","No","No","Unknown",61056,6]
[9,"PIK","No","No","Sideswipe - Passing",1704909,57]
[7,"LOG","No","No","Sideswipe - Meeting",10176,1]
[4,"SUM","Yes","No","Other Non-Collision",12800307,351]
[8,"CLE","No","No","Sideswipe - Passing",6716460,206]
[8,"BUT","Yes","Yes","Other Non-Collision",1154022,92]
[3,"WAY","Yes","Yes","Angle",713067,10]
[9,"LAW","Yes","Yes","Other Non-Collision",20352,2]
[10,"HOC","Yes","Yes","Pedestrian",460098,1]
[5,"FAI","Yes","No","Parked Vehicle",9307302,442]
[6,"FRA","Yes","No","Backing",6182238,533]
[2,"LUC","Yes","Yes","Pedestrian",2412267,7]
[2,"OTT","Yes","No","Rear End",86973,3]
[2,"LUC","Yes","No","Overturning",16078899,137]
[2,"HEN","Yes","Yes","Other Non-Collision",576486,9]
[11,"HOL","No","No","Head On",10259565,94]
[9,"LAW","Yes","No","Parked Vehicle",61056,6]
[4,"TRU","No","No","Animal",13106988,834]
[2,"FUL","No","No","Overturning",8574708,98]
[6,"FRA","Yes","Yes","Overturning",286836,6]
[9,"SCI","No","No","Animal",7839351,485]
[7,"AUG","Yes","Yes","Animal",117501,6]
[7,"MOT","Yes","Yes","Angle",86973,3]
[7,"MIA","Yes","No","Sideswipe - Passing",6661161,430]
[6,"UNI","Yes","Yes","Head On",930372,3]
[11,"TUS","Yes","No","Other Object",86973,3]
[11,"BEL","No","No","Rear End",10485015,355]
[4,"STA","Yes","No","Right Turn",126564,9]
[6,"DEL","Yes","No","Fixed Object",47619312,1486]
[12,"LAK","No","No","Animal",1686465,98]
[5,"MUS","Yes","Yes","Overturning",66621,1]
[7,"SHE","Yes","No","Rear End",127677,7]
[10,"ATH","Yes","Yes","Left Turn",735645,8]
[8,"BUT","No","No","Pedalcycles",705117,5]
[4,"SUM","Yes","Yes","Overturning",525606,4]
[2,"LUC","Yes","No","Left Turn",1817274,50]
[8,"WAR","Yes","No","Pedestrian",1153926,7]
[7,"LOG","No","No","Pedestrian",1053438,4]
[9,"HIG","Yes","No","Head On",2452542,29]
[10,"ATH","Yes","Yes","Fixed Object",2255319,55]
[7,"MOT","Yes","Yes","Rear End",624870,40]
[6,"PIC","Yes","No","Angle",3835206,88]
[1,"ALL","No","Yes","Other Non-Collision",290493,23]
[1,"ALL","No","Yes","Backing",40704,4]
[4,"SUM","Yes","Yes","Head On",45156,1]
[1,"HAN","Yes","No","Rear End",1004514,27]
[2,"WOO","Yes","No","Backing",3003510,260]
[6,"MAD","Yes","Yes","Right Turn",66621,1]
[7,"CLA","Yes","No","Rear End",30528,3]
[8,"WAR","Yes","No","Backing",462372,42]
[12,"GEA","Yes","No","Overturning",111777,2]
[6,"DEL","Yes","No","Left Turn",41517387,945]
[5,"LIC","No","No","Angle",33597372,574]
[3,"ERI","Yes","Yes","Head On",10176,1]
[8,"GRE","Yes","No","Other Non-Collision",66621,1]
[12,"CUY","Yes","No","Parked Vehicle",45156,1]
[6,"FRA","Yes","No","Unknown",289221,16]
[1,"PUT","No","No","Angle",11675175,202]
[1,"HAN","Yes","No","Sideswipe - Passing",10176,1]
[3,"LOR","No","Yes","Overturning",143418,3]
[2,"WOO","Yes","Yes","Overturning",30528,3]
[7,"MIA","Yes","No","Pedalcycles",3140646,26]
[7,"AUG","Yes","Yes","Other Non-Collision",20352,2]
[11,"COL","Yes","Yes","Rear End",20352,2]
[11,"CAR","No","No","Other Non-Collision",1808481,25]
[4,"ATB","Yes","Yes","Rear End",40704,4]
[4,"SUM","Yes","Yes","Angle",1235334,15]
[1,"WYA","No","No","Pedalcycles",470274,2]
[0,"CUY","Yes","No","Backing",10176,1]
[9,"PIK","Yes","No","Animal",1243380,100]
[7,"SHE","Yes","Yes","Pedestrian",505254,2]
[2,"OTT","Yes","Yes","Other Object",91584,9]
[3,"LOR","Yes","Yes","Fixed Object",194298,8]
[3,"RIC","Yes","Yes","Left Turn",121953,3]
[8,"CLI","No","No","Unknown",162657,7]
[9,"ADA","No","No","Backing",830616,56]
[2,"SEN","No","No","Head On",10661532,50]
[2,"SEN","No","No","Train",920196,2]
[3,"MED","Yes","No","Rear End",52205754,2383]
[7,"SHE","No","No","Other Object",244065,15]
[4,"SUM","Yes","Yes","Parked Vehicle",5153331,87]
[2,"SAN","Yes","Yes","Parked Vehicle",30528,3]
[1,"HAR","Yes","No","Angle",5354022,166]
[5,"FAI","Yes","Yes","Angle",167109,4]
[1,"VAN","Yes","Yes","Fixed Object",40704,4]
[4,"MAH","Yes","Yes","Sideswipe - Passing",11332707,458]
[8,"WAR","No","Yes","Animal",1183278,88]
[3,"ASD","No","No","Head On",9482628,86]
[6,"PIC","No","No","Sideswipe - Passing",5559132,211]
[3,"ERI","No","No","Head On",4706859,45]
[2,"HEN","No","No","Unknown",61056,6]
[4,"SUM","Yes","Yes","Pedalcycles",66621,1]
[7,"SHE","Yes","No","Right Turn",2044374,107]
[10,"GAL","Yes","No","Left Turn",3132156,70]
[10,"HOC","Yes","No","Animal",20352,2]
[10,"ATH","Yes","No","Other Object",86973,3]
[7,"AUG","No","No","Unknown",71232,7]
[2,"SAN","Yes","No","Backing",274752,27]
[11,"BEL","Yes","No","Backing",1860459,149]
[2,"FUL","Yes","Yes","Unknown",10176,1]
[9,"BRO","Yes","No","Head On",1635489,8]
[8,"GRE","Yes","Yes","Parked Vehicle",213537,12]
[12,"CUY","Yes","Yes","Parked Vehicle",15774480,289]
[1,"VAN","No","No","Animal",7661685,603]
[3,"HUR","Yes","No","Overturning",2490861,18]
[6,"MAD","No","Yes","Parked Vehicle",1426293,24]
[12,"LAK","Yes","No","Rear End",258693,13]
[7,"CLA","Yes","No","Fixed Object",30528,3]
[2,"WOO","Yes","No","Backing",20352,2]
[7,"SHE","Yes","Yes","Head On",20352,2]
[1,"ALL","No","No","Other Object",709887,20]
[12,"CUY","Yes","No","Sideswipe - Passing",10176,1]
[4,"POR","Yes","No","Right Turn",10176,1]
[9,"JAC","No","No","Sideswipe - Meeting",460098,1]
[5,"MUS","Yes","No","Pedalcycles",2148789,30]
[12,"LAK","Yes","Yes","Angle",121953,3]
[11,"BEL","Yes","No","Unknown",672522,15]
[5,"GUE","Yes","Yes","Backing",50880,5]
[2,"WOO","Yes","Yes","Overturning",2558595,22]
[4,"STA","Yes","No","Backing",2167011,186]
[5,"LIC","No","Yes","Other Object",437409,34]
[10,"WAS","No","Yes","Backing",20352,2]
[7,"SHE","Yes","No","Backing",3036582,277]
[2,"HEN","Yes","No","Sideswipe - Passing",1525557,60]
[8,"GRE","Yes","Yes","Fixed Object",22516287,713]
[6,"MAD","No","No","Backing",1396131,84]
[1,"ALL","Yes","No","Sideswipe - Meeting",10176,1]
[11,"COL","No","No","Sideswipe - Passing",8064636,176]
[5,"LIC","Yes","Yes","Angle",775395,23]
[9,"BRO","No","No","Parked Vehicle",1319811,44]
[12,"CUY","Yes","Yes","Right Turn",143418,3]
[11,"JEF","No","No","Head On",6813639,38]
[5,"FAI","Yes","No","Animal",106212,7]
[12,"CUY","No","No","Other Non-Collision",86973,3]
[7,"AUG","Yes","No","Other Non-Collision",132288,13]
[9,"ROS","Yes","No","Right Turn",3169347,187]
[11,"TUS","Yes","Yes","Animal",4752510,350]
[8,"WAR","No","No","Head On",8056494,71]
[8,"WAR","No","No","Train",76797,2]
[4,"STA","Yes","No","Pedalcycles",66621,1]
[7,"MOT","Yes","No","Sideswipe - Passing",107325,5]
[11,"HOL","No","No","Other Non-Vehicle",66621,1]
[7,"SHE","Yes","No","Pedalcycles",2553396,30]
[4,"SUM","Yes","No","Angle",10176,1]
[1,"PAU","No","Yes","Other Object",61056,6]
[6,"DEL","Yes","No","Rear End",113658342,4538]
[7,"MOT","Yes","Yes","Fixed Object",1582542,16]
[5,"PER","No","No","Backing",1515588,113]
[3,"WAY","Yes","Yes","Right Turn",66621,1]
[5,"PER","No","No","Right Turn",1129536,46]
[2,"FUL","No","Yes","Head On",480450,3]
[8,"CLI","No","No","Right Turn",2338269,48]
[2,"WOO","Yes","Yes","Left Turn",45156,1]
[3,"HUR","No","No","Animal",14789034,1161]
[5,"FAI","No","Yes","Overturning",1441875,11]
[9,"SCI","No","No","Other Non-Collision",745980,18]
[4,"TRU","No","Yes","Parked Vehicle",133242,2]
[11,"BEL","Yes","No","Fixed Object",13716132,427]
[12,"GEA","Yes","No","Rear End",18298497,713]
[3,"MED","No","No","Animal",14249721,857]
[11,"HOL","Yes","No","Rear End",66621,1]
[7,"DAR","Yes","No","Fixed Object",20352,2]
[2,"WOO","Yes","Yes","Head On",45156,1]
[2,"SAN","No","No","Fixed Object",36399969,777]
[7,"AUG","Yes","No","Left Turn",684654,39]
[12,"LAK","Yes","Yes","Pedalcycles",66621,1]
[10,"MOE","No","No","Angle",4296417,92]
[3,"MED","No","No","Unknown",357114,24]
[7,"LOG","Yes","No","Parked Vehicle",2205234,100]
[2,"WIL","Yes","Yes","Overturning",66621,1]
[5,"LIC","Yes","Yes","Sideswipe - Passing",181896,11]
[7,"CHP","Yes","No","Overturning",602403,6]
[3,"WAY","Yes","No","Other Object",50880,5]
[8,"PRE","No","Yes","Fixed Object",3273666,95]
[4,"SUM","Yes","No","Animal",13767189,988]
[7,"LOG","No","Yes","Parked Vehicle",10176,1]
[6,"FRA","Yes","No","Head On",193873521,2343]
[6,"FRA","Yes","No","Train",531330,8]
[1,"HAN","Yes","Yes","Angle",45156,1]
[6,"FRA","No","Yes","Sideswipe - Passing",5036832,115]
[7,"AUG","No","Yes","Parked Vehicle",480450,3]
[12,"GEA","Yes","No","Right Turn",691491,41]
[1,"HAN","Yes","No","Pedalcycles",4793673,44]
[12,"LAK","Yes","Yes","Overturning",2919318,23]
[4,"MAH","Yes","No","Fixed Object",637383,6]
[2,"LUC","Yes","Yes","Right Turn",284610,10]
[11,"JEF","Yes","Yes","Fixed Object",20352,2]
[7,"AUG","Yes","No","Rear End",3577134,172]
[7,"AUG","Yes","Yes","Sideswipe - Passing",171720,10]
[4,"SUM","No","No","Overturning",1620861,10]
[5,"COS","Yes","No","Other Object",86973,3]
[8,"WAR","Yes","No","Overturning",4136097,40]
[7,"MOT","Yes","Yes","Parked Vehicle",10176,1]
[7,"MIA","Yes","No","Other Object",85860,5]
[8,"CLI","No","No","Overturning",3610062,49]
[4,"TRU","Yes","Yes","Head On",255354,14]
[5,"LIC","Yes","Yes","Sideswipe - Passing",5310312,195]
[10,"MOE","No","No","Other Object",148029,9]
[8,"BUT","No","No","Angle",26191632,444]
[1,"VAN","No","No","Pedalcycles",593340,3]
[1,"HAN","No","No","Angle",30405795,360]
[2,"FUL","Yes","No","Other Object",10176,1]
[7,"LOG","Yes","No","Angle",10176,1]
[10,"HOC","Yes","Yes","Left Turn",66621,1]
[2,"LUC","Yes","No","Overturning",536895,3]
[7,"MIA","Yes","Yes","Animal",1285197,107]
[6,"DEL","No","No","Rear End",20050455,685]
[2,"SAN","Yes","No","Fixed Object",2851998,57]
[11,"TUS","Yes","No","Backing",193344,19]
[12,"CUY","Yes","Yes","Unknown",10176,1]
[2,"WIL","No","No","Rear End",11324613,248]
[7,"CHP","Yes","No","Rear End",8588988,345]
[6,"UNI","No","No","Fixed Object",35279592,779]
[1,"ALL","No","No","Right Turn",2240007,46]
[8,"HAM","No","No","Angle",7743186,173]
[4,"ATB","Yes","Yes","Angle",132129,4]
[4,"POR","Yes","Yes","Other Object",209085,15]
[11,"HOL","Yes","No","Fixed Object",10176,1]
[5,"LIC","No","Yes","Right Turn",10176,1]
[11,"BEL","Yes","No","Sideswipe - Passing",45156,1]
[4,"ATB","No","No","Animal",16840959,919]
[5,"LIC","Yes","No","Sideswipe - Meeting",10176,1]
[7,"LOG","Yes","No","Left Turn",1729443,78]
[10,"ATH","Yes","No","Sideswipe - Passing",268869,14]
[12,"CUY","Yes","Yes","Backing",10176,1]
[12,"LAK","No","Yes","Other Non-Collision",406881,31]
[10,"MEG","Yes","No","Head On",460098,1]
[3,"ERI","Yes","Yes","Fixed Object",1281603,14]
[10,"MEG","No","No","Right Turn",449493,13]
[4,"MAH","Yes","Yes","Fixed Object",116388,8]
[3,"HUR","Yes","No","Pedalcycles",76797,2]
[3,"LOR","Yes","No","Pedalcycles",12993045,107]
[1,"HAN","No","No","Other Object",321021,26]
[1,"HAR","Yes","No","Right Turn",411333,28]
[4,"POR","No","No","Unknown",137853,8]
[3,"RIC","Yes","No","Parked Vehicle",30528,3]
[2,"WOO","Yes","Yes","Other Object",20352,2]
[9,"JAC","Yes","No","Parked Vehicle",978804,74]
[10,"VIN","No","No","Sideswipe - Meeting",97149,4]
[3,"RIC","Yes","No","Left Turn",55332,2]
[10,"HOC","Yes","Yes","Other Non-Collision",50880,5]
[1,"DEF","Yes","No","Sideswipe - Passing",4605387,300]
[7,"LOG","No","Yes","Fixed Object",3406638,119]
[4,"ATB","Yes","Yes","Overturning",76797,2]
[4,"POR","Yes","Yes","Other Non-Collision",55332,2]
[6,"MAD","Yes","Yes","Angle",20352,2]
[1,"HAR","Yes","No","Backing",1294371,74]
[6,"FAY","Yes","No","Pedestrian",1242537,15]
[9,"ROS","Yes","No","Left Turn",86973,3]
[4,"ATB","Yes","Yes","Sideswipe - Passing",10176,1]
[4,"MAH","Yes","No","Head On",26466939,366]
[4,"MAH","Yes","No","Train",10176,1]
[10,"ATH","Yes","No","Fixed Object",20352,2]
[6,"MAD","No","No","Animal",5337486,320]
[8,"CLI","Yes","No","Left Turn",2337252,70]
[6,"DEL","No","No","Left Turn",12849978,218]
[11,"BEL","No","No","Other Non-Collision",1146024,47]
[10,"MRG","No","No","Sideswipe - Meeting",10176,1]
[4,"ATB","Yes","No","Animal",448698,33]
[2,"SEN","Yes","No","Fixed Object",557247,5]
[6,"MAD","Yes","No","Head On",1893069,23]
[9,"ROS","Yes","No","Other Object",734691,19]
[8,"CLE","No","No","Animal",13804458,903]
[6,"UNI","Yes","Yes","Unknown",10176,1]
[1,"WYA","No","Yes","Unknown",20352,2]
[7,"AUG","Yes","No","Other Object",30528,3]
[5,"LIC","No","No","Other Non-Collision",1291239,64]
[6,"UNI","No","No","Rear End",12337842,377]
[10,"HOC","Yes","Yes","Rear End",55332,2]
[4,"SUM","Yes","Yes","Angle",227052,12]
[6,"MAR","Yes","No","Head On",10176,1]
[9,"JAC","Yes","No","Rear End",11515971,436]
[7,"LOG","Yes","No","Unknown",500802,5]
[4,"SUM","Yes","Yes","Angle",440430,15]
[12,"CUY","Yes","Yes","Animal",50880,5]
[7,"CLA","Yes","No","Head On",2398323,20]
[2,"SAN","No","No","Rear End",10267947,214]
[9,"ROS","Yes","Yes","Sideswipe - Passing",4572489,161]
[10,"HOC","No","Yes","Unknown",40704,4]
[8,"WAR","Yes","No","Right Turn",1096941,51]
[6,"MAD","Yes","No","Sideswipe - Passing",65508,3]
[2,"WIL","No","No","Backing",1514952,142]
[1,"HAN","Yes","No","Other Non-Collision",71232,7]
[7,"CLA","Yes","Yes","Angle",20352,2]
[8,"GRE","Yes","No","Left Turn",33809163,810]
[7,"AUG","Yes","Yes","Fixed Object",1266021,27]
[10,"HOC","Yes","No","Pedestrian",1827402,11]
[12,"CUY","Yes","No","Rear End",11166951,562]
[10,"GAL","Yes","No","Fixed Object",20352,2]
[11,"BEL","Yes","No","Rear End",20352,2]
[4,"TRU","Yes","No","Other Non-Collision",9412161,231]
[6,"MRW","No","No","Unknown",101760,10]
[8,"GRE","Yes","No","Other Non-Vehicle",45156,1]
[1,"HAN","Yes","No","Fixed Object",85860,5]
[1,"HAR","Yes","No","Animal",101760,10]
[3,"RIC","No","Yes","Other Object",539328,53]
[1,"VAN","Yes","No","Parked Vehicle",152640,15]
[2,"WIL","No","No","Unknown",142464,14]
[3,"HUR","Yes","No","Parked Vehicle",30528,3]
[4,"POR","Yes","No","Pedestrian",66621,1]
[4,"MAH","Yes","Yes","Sideswipe - Passing",30528,3]
[11,"HAS","Yes","No","Backing",85860,5]
[3,"WAY","Yes","No","Backing",10176,1]
[8,"WAR","Yes","Yes","Overturning",460098,1]
[3,"LOR","Yes","No","Sideswipe - Passing",177444,14]
[1,"ALL","Yes","No","Other Object",479067,27]
[9,"ADA","No","No","Angle",11106369,215]
[4,"TRU","Yes","Yes","Head On",66621,1]
[3,"LOR","Yes","No","Other Non-Collision",3495963,36]
[12,"CUY","Yes","Yes","Right Turn",10176,1]
[2,"FUL","Yes","No","Right Turn",316251,11]
[6,"DEL","Yes","No","Fixed Object",2003622,58]
[7,"MER","No","No","Pedalcycles",550410,3]
[2,"SAN","Yes","No","Animal",2749539,217]
[1,"HAN","Yes","No","Right Turn",86973,3]
[4,"TRU","Yes","Yes","Other Non-Collision",932535,75]
[4,"POR","Yes","No","Parked Vehicle",664572,10]
[11,"COL","Yes","No","Fixed Object",238341,11]
[4,"STA","No","No","Pedalcycles",268710,5]
[11,"COL","Yes","No","Other Non-Collision",203361,11]
[6,"FRA","Yes","Yes","Overturning",670137,5]
[5,"LIC","Yes","No","Overturning",4911078,30]
[11,"JEF","Yes","No","Pedalcycles",1053438,4]
[8,"WAR","Yes","No","Parked Vehicle",897507,35]
[4,"POR","Yes","No","Rear End",517227,17]
[11,"COL","Yes","No","Left Turn",937464,34]
[6,"MAR","Yes","No","Pedestrian",5574903,35]
[7,"LOG","Yes","Yes","Right Turn",10176,1]
[9,"ROS","No","Yes","Head On",950724,5]
[11,"COL","No","Yes","Rear End",599589,14]
[11,"HOL","No","No","Left Turn",8840445,237]
[6,"DEL","Yes","No","Rear End",547914,29]
[4,"MAH","Yes","No","Fixed Object",30528,3]
[3,"MED","Yes","Yes","Other Object",101760,10]
[3,"RIC","Yes","Yes","Fixed Object",20352,2]
[9,"ADA","No","No","Animal",8889768,508]
[11,"JEF","Yes","No","Unknown",10176,1]
[11,"JEF","Yes","No","Angle",40704,4]
[2,"OTT","No","Yes","Other Object",274752,27]
[2,"LUC","Yes","Yes","Other Object",10176,1]
[2,"LUC","Yes","Yes","Rear End",1108500,33]
[2,"LUC","No","No","Left Turn",3367428,55]
[3,"LOR","Yes","No","Parked Vehicle",600225,50]
[1,"ALL","Yes","No","Rear End",632661,36]
[2,"SAN","Yes","No","Animal",218148,18]
[6,"DEL","Yes","Yes","Right Turn",75684,4]
[2,"WIL","No","No","Parked Vehicle",985164,49]
[4,"POR","No","No","Other Non-Collision",2002938,42]
[9,"LAW","Yes","No","Fixed Object",20352,2]
[7,"AUG","Yes","Yes","Fixed Object",117501,6]
[12,"CUY","Yes","No","Angle",7531257,348]
[9,"PIK","Yes","No","Unknown",97149,4]
[1,"HAN","Yes","No","Backing",3969117,357]
[1,"ALL","Yes","No","Pedestrian",15812304,109]
[4,"TRU","Yes","Yes","Rear End",132129,4]
[1,"VAN","Yes","No","Sideswipe - Passing",168381,11]
[10,"WAS","Yes","Yes","Rear End",10176,1]
[4,"STA","Yes","Yes","Overturning",45156,1]
[2,"WOO","Yes","No","Parked Vehicle",2274924,122]
[4,"POR","No","Yes","Head On",75684,4]
[11,"JEF","Yes","Yes","Overturning",3538050,16]
[11,"BEL","Yes","No","Other Non-Collision",86973,3]
[1,"DEF","No","No","Angle",18637908,187]
[10,"MEG","Yes","Yes","Fixed Object",10176,1]
[1,"HAN","Yes","No","Unknown",193344,19]
[3,"HUR","Yes","No","Angle",265530,15]
[8,"WAR","Yes","Yes","Angle",20352,2]
[11,"COL","Yes","No","Angle",10176,1]
[10,"NOB","Yes","Yes","Other Object",50880,5]
[10,"GAL","Yes","Yes","Rear End",359181,16]
[4,"TRU","Yes","No","Unknown",460098,1]
[10,"HOC","No","No","Sideswipe - Meeting",97149,4]
[10,"ATH","Yes","No","Rear End",12220674,408]
[6,"FRA","Yes","No","Right Turn",76797,2]
[1,"PAU","No","No","Other Object",71232,7]
[4,"MAH","Yes","Yes","Other Object",517704,44]
[2,"SAN","Yes","Yes","Head On",526719,2]
[6,"DEL","Yes","No","Other Non-Vehicle",460098,1]
[7,"LOG","No","No","Right Turn",651900,35]
[9,"ROS","No","No","Other Non-Collision",1086765,50]
[8,"CLE","Yes","No","Pedalcycles",3577578,33]
[10,"HOC","Yes","Yes","Angle",86973,3]
[1,"HAR","No","No","Angle",17735265,164]
[11,"TUS","Yes","Yes","Rear End",50880,5]
[3,"RIC","Yes","No","Other Object",672411,46]
[10,"NOB","No","Yes","Other Non-Collision",148029,9]
[5,"FAI","Yes","Yes","Overturning",10176,1]
[11,"HAS","No","No","Backing",899622,67]
[7,"MOT","Yes","No","Rear End",151368,8]
[3,"WAY","Yes","No","Sideswipe - Passing",10176,1]
[4,"POR","Yes","No","Fixed Object",3223836,94]
[7,"CLA","No","No","Left Turn",3464148,77]
[4,"SUM","Yes","No","Other Object",10176,1]
[7,"SHE","No","No","Head On",3624594,32]
[7,"SHE","No","No","Train",10176,1]
[5,"PER","Yes","No","Other Non-Collision",50880,5]
[6,"UNI","Yes","Yes","Angle",100488,3]
[7,"DAR","Yes","Yes","Other Non-Collision",10176,1]
[4,"TRU","Yes","No","Backing",162657,7]
[7,"AUG","No","No","Overturning",4640826,40]
[8,"WAR","Yes","No","Head On",3579438,36]
[3,"WAY","No","Yes","Overturning",250743,8]
[1,"PUT","Yes","No","Other Non-Collision",127677,7]
[6,"PIC","Yes","No","Head On",749160,8]
[2,"SEN","No","No","Other Object",335649,24]
[11,"COL","Yes","No","Animal",415944,34]
[3,"LOR","Yes","No","Sideswipe - Meeting",55332,2]
[5,"KNO","Yes","No","Pedalcycles",916269,12]
[7,"MIA","Yes","No","Pedestrian",2738631,25]
[4,"TRU","Yes","Yes","Sideswipe - Passing",20352,2]
[4,"MAH","Yes","Yes","Sideswipe - Passing",628479,12]
[7,"CLA","Yes","Yes","Right Turn",107325,5]
[4,"SUM","Yes","Yes","Sideswipe - Passing",107325,5]
[7,"CLA","Yes","No","Sideswipe - Passing",30528,3]
[12,"GEA","Yes","No","Right Turn",10176,1]
[8,"PRE","Yes","No","Angle",726153,23]
[4,"POR","Yes","Yes","Pedestrian",460098,1]
[1,"PAU","No","Yes","Fixed Object",1973619,57]
[11,"BEL","Yes","Yes","Backing",10176,1]
[3,"ASD","No","No","Unknown",566310,8]
[4,"SUM","Yes","No","Overturning",76797,2]
[12,"CUY","Yes","Yes","Fixed Object",96036,6]
[4,"TRU","Yes","No","Unknown",10176,1]
[4,"TRU","No","No","Sideswipe - Meeting",30528,3]
[2,"FUL","Yes","No","Left Turn",570762,5]
[4,"STA","Yes","No","Pedestrian",1907013,5]
[7,"MIA","Yes","No","Sideswipe - Meeting",10176,1]
[3,"MED","Yes","Yes","Parked Vehicle",10176,1]
[7,"MOT","Yes","No","Pedalcycles",33774927,327]
[3,"ASD","Yes","Yes","Sideswipe - Passing",1334439,42]
[11,"COL","Yes","Yes","Angle",20352,2]
[7,"LOG","Yes","No","Head On",50880,5]
[10,"HOC","Yes","No","Fixed Object",4835109,99]
[5,"LIC","Yes","No","Overturning",754884,12]
[2,"WIL","Yes","Yes","Right Turn",10176,1]
[3,"ASD","No","No","Other Object",357114,24]
[2,"WOO","No","Yes","Unknown",122112,12]
[3,"WAY","Yes","No","Left Turn",329925,20]
[12,"LAK","No","No","Fixed Object",15031410,343]
[9,"JAC","Yes","No","Angle",460098,1]
[7,"MOT","Yes","Yes","Left Turn",163770,5]
[7,"MOT","Yes","No","Animal",12292050,720]
[11,"COL","Yes","Yes","Other Non-Collision",679200,8]
[6,"UNI","No","Yes","Right Turn",10176,1]
[9,"SCI","No","No","Left Turn",5303046,136]
[7,"CLA","Yes","No","Sideswipe - Passing",26743971,1180]
[12,"LAK","No","Yes","Overturning",1732638,12]
[8,"BUT","Yes","Yes","Pedestrian",965352,3]
[4,"TRU","Yes","No","Left Turn",40704,4]
[4,"SUM","No","No","Unknown",10176,1]
[3,"HUR","No","No","Parked Vehicle",643107,10]
[4,"STA","Yes","No","Fixed Object",6350808,181]
[3,"MED","Yes","No","Overturning",76797,2]
[3,"LOR","Yes","Yes","Overturning",2162208,10]
[3,"ERI","Yes","Yes","Head On",577599,7]
[11,"COL","No","Yes","Fixed Object",4039680,92]
[11,"JEF","Yes","No","Right Turn",2592129,127]
[4,"SUM","Yes","No","Sideswipe - Passing",141192,7]
[7,"LOG","Yes","Yes","Other Non-Collision",10176,1]
[10,"VIN","No","No","Animal",4083819,245]
[7,"SHE","No","No","Pedestrian",515430,3]
[4,"SUM","Yes","Yes","Overturning",20352,2]
[11,"JEF","No","Yes","Parked Vehicle",143418,3]
[8,"WAR","Yes","Yes","Rear End",1624503,83]
[7,"MIA","Yes","Yes","Overturning",286836,6]
[3,"RIC","Yes","No","Angle",76797,2]
[2,"WOO","Yes","Yes","Left Turn",97149,4]
[7,"CLA","Yes","Yes","Animal",20352,2]
[4,"MAH","Yes","Yes","Animal",10176,1]
[7,"MOT","Yes","No","Rear End",446154,19]
[7,"MOT","Yes","Yes","Rear End",284610,10]
[2,"HEN","Yes","No","Unknown",10176,1]
[4,"MAH","Yes","No","Animal",345984,34]
[4,"ATB","Yes","No","Backing",2318538,203]
[7,"SHE","Yes","No","Pedalcycles",45156,1]
[6,"PIC","Yes","No","Sideswipe - Passing",5320170,178]
[2,"LUC","Yes","Yes","Pedalcycles",45156,1]
[10,"MOE","No","No","Parked Vehicle",857916,29]
[3,"HUR","Yes","No","Other Non-Collision",61056,6]
[8,"CLI","No","No","Head On",13434936,91]
[8,"CLI","No","No","Train",20352,2]
[10,"HOC","No","No","Other Non-Collision",413559,24]
[8,"CLI","Yes","No","Other Non-Collision",653442,20]
[2,"FUL","No","Yes","Sideswipe - Passing",1987659,124]
[7,"MER","Yes","No","Other Object",50880,5]
[3,"CRA","Yes","No","Other Non-Collision",673635,13]
[8,"WAR","Yes","Yes","Unknown",122112,12]
[8,"PRE","Yes","No","Train",480450,3]
[8,"PRE","Yes","No","Head On",1552698,24]
[12,"CUY","Yes","Yes","Pedestrian",920196,2]
[0,"CUY","Yes","No","Sideswipe - Passing",10176,1]
[2,"SAN","No","Yes","Unknown",234048,23]
[12,"CUY","Yes","Yes","Angle",181896,11]
[7,"MER","No","No","Rear End",9258456,188]
[2,"HEN","Yes","No","Pedestrian",1647891,10]
[9,"PIK","Yes","No","Left Turn",2174595,63]
[3,"ERI","Yes","No","Sideswipe - Passing",1044423,46]
[1,"VAN","Yes","No","Right Turn",1201356,49]
[1,"PAU","No","No","Pedestrian",1380294,3]
[4,"POR","Yes","Yes","Fixed Object",320862,17]
[10,"ATH","Yes","No","Rear End",45156,1]
[9,"JAC","Yes","Yes","Other Non-Collision",20352,2]
[6,"DEL","Yes","Yes","Right Turn",132129,4]
[1,"PAU","Yes","No","Sideswipe - Passing",10176,1]
[12,"CUY","Yes","Yes","Other Non-Collision",10176,1]
[1,"ALL","Yes","Yes","Other Non-Collision",1256004,35]
[11,"BEL","Yes","Yes","Animal",20352,2]
[12,"CUY","Yes","Yes","Animal",12447663,681]
[3,"LOR","Yes","No","Left Turn",989886,24]
[10,"ATH","Yes","No","Fixed Object",30528,3]
[3,"RIC","No","No","Right Turn",555864,29]
[6,"DEL","No","No","Other Object",464439,29]
[7,"AUG","No","Yes","Other Object",91584,9]
[3,"ERI","Yes","No","Sideswipe - Passing",296058,18]
[12,"CUY","Yes","No","Other Non-Collision",1148250,43]
[6,"UNI","No","Yes","Animal",4098081,190]
[4,"SUM","No","Yes","Right Turn",161544,9]
[5,"GUE","Yes","Yes","Parked Vehicle",55332,2]
[11,"COL","Yes","Yes","Animal",30528,3]
[1,"HAN","Yes","No","Angle",76797,2]
[4,"STA","Yes","Yes","Overturning",76797,2]
[8,"BUT","No","No","Sideswipe - Meeting",500802,5]
[2,"LUC","Yes","Yes","Backing",10176,1]
[5,"KNO","No","No","Fixed Object",65418000,1334]
[10,"WAS","No","Yes","Fixed Object",1571238,63]
[1,"HAN","Yes","Yes","Left Turn",10176,1]
[4,"ATB","Yes","No","Rear End",17390289,660]
[1,"HAR","Yes","No","Overturning",66621,1]
[8,"HAM","Yes","No","Unknown",81408,8]
[11,"COL","Yes","No","Head On",724356,9]
[10,"MOE","No","No","Left Turn",3361497,72]
[2,"LUC","Yes","Yes","Pedalcycles",76797,2]
[7,"SHE","Yes","No","Animal",85860,5]
[2,"LUC","Yes","Yes","Head On",10176,1]
[5,"MUS","No","No","Left Turn",7932603,187]
[6,"PIC","Yes","No","Parked Vehicle",3664122,119]
[10,"WAS","No","No","Rear End",12741255,293]
[4,"TRU","No","No","Overturning",6357660,57]
[9,"BRO","No","No","Other Object",371742,22]
[11,"CAR","No","No","Left Turn",3332067,118]
[8,"PRE","No","No","Other Non-Collision",1899906,25]
[1,"HAN","Yes","Yes","Other Non-Collision",280317,22]
[10,"MOE","Yes","No","Sideswipe - Passing",10176,1]
[7,"MOT","Yes","Yes","Sideswipe - Passing",70986270,2844]
[2,"WOO","No","Yes","Other Object",828708,78]
[3,"LOR","Yes","No","Fixed Object",99052242,2029]
[4,"TRU","Yes","No","Other Non-Collision",10176,1]
[4,"TRU","No","No","Pedestrian",3226935,13]
[2,"OTT","No","Yes","Other Non-Collision",582210,13]
[7,"MIA","Yes","Yes","Angle",940548,4]
[6,"DEL","Yes","Yes","Head On",66621,1]
[1,"ALL","Yes","No","Other Non-Collision",30528,3]
[10,"GAL","Yes","No","Sideswipe - Passing",10176,1]
[2,"SEN","No","No","Right Turn",608127,10]
[2,"LUC","Yes","No","Angle",399550440,10296]
[8,"PRE","No","Yes","Head On",71232,7]
[7,"CHP","Yes","No","Angle",100488,3]
[2,"SEN","Yes","No","Pedestrian",1265703,9]
[11,"TUS","Yes","No","Right Turn",3082962,180]
[3,"LOR","No","Yes","Pedestrian",460098,1]
[4,"ATB","Yes","Yes","Fixed Object",20352,2]
[1,"ALL","Yes","Yes","Parked Vehicle",981252,8]
[9,"JAC","No","Yes","Backing",10176,1]
[1,"HAR","No","No","Parked Vehicle",1183341,12]
[7,"CHP","Yes","No","Backing",1047969,94]
[11,"HAS","No","No","Angle",5746242,98]
[3,"MED","Yes","Yes","Right Turn",76797,2]
[2,"HEN","No","Yes","Other Object",111936,11]
[1,"ALL","No","No","Fixed Object",44914062,707]
[6,"MAD","Yes","Yes","Fixed Object",40704,4]
[8,"HAM","No","No","Sideswipe - Passing",3159870,146]
[7,"MOT","No","Yes","Rear End",5661417,233]
[3,"WAY","No","No","Sideswipe - Passing",17234466,402]
[7,"CHP","No","No","Fixed Object",33898326,670]
[10,"GAL","Yes","Yes","Fixed Object",490626,4]
[5,"GUE","No","No","Sideswipe - Passing",1508544,57]
[11,"TUS","Yes","Yes","Rear End",20352,2]
[2,"WOO","Yes","No","Right Turn",10176,1]
[9,"LAW","Yes","No","Angle",14522883,484]
[5,"FAI","Yes","No","Sideswipe - Passing",735852,62]
[12,"LAK","Yes","No","Other Non-Collision",10176,1]
[2,"WOO","Yes","No","Sideswipe - Meeting",622755,8]
[2,"OTT","Yes","No","Other Non-Collision",987660,28]
[1,"DEF","No","No","Backing",1173420,105]
[2,"FUL","Yes","No","Right Turn",369516,26]
[1,"WYA","No","No","Other Non-Collision",755886,41]
[4,"ATB","No","No","Backing",2150586,109]
[7,"MOT","Yes","Yes","Other Non-Collision",5848368,176]
[1,"VAN","Yes","No","Other Non-Collision",177444,14]
[3,"CRA","Yes","Yes","Rear End",271095,10]
[10,"MEG","No","No","Pedalcycles",66621,1]
[2,"WOO","Yes","No","Right Turn",1747728,93]
[11,"BEL","No","No","Other Object",659007,15]
[2,"LUC","Yes","Yes","Left Turn",657735,8]
[12,"CUY","Yes","Yes","Pedestrian",16951998,74]
[7,"SHE","No","No","Right Turn",438363,23]
[11,"BEL","Yes","No","Pedalcycles",638496,4]
[5,"GUE","No","No","Parked Vehicle",413559,24]
[1,"HAN","Yes","No","Other Object",10176,1]
[1,"HAR","Yes","No","Pedalcycles",10176,1]
[3,"MED","Yes","No","Animal",1447965,78]
[6,"FAY","No","Yes","Overturning",1063026,14]
[10,"HOC","Yes","Yes","Overturning",10176,1]
[12,"GEA","Yes","Yes","Left Turn",66621,1]
[2,"OTT","Yes","Yes","Fixed Object",1878600,34]
[2,"WIL","Yes","No","Backing",30528,3]
[4,"POR","Yes","Yes","Other Non-Collision",663618,21]
[7,"CLA","Yes","No","Head On",10176,1]
[8,"BUT","Yes","No","Angle",184698108,4512]
[8,"WAR","Yes","No","Sideswipe - Meeting",10176,1]
[3,"MED","No","No","Backing",2832489,145]
[8,"HAM","Yes","Yes","Sideswipe - Passing",172910124,8147]
[8,"CLE","Yes","Yes","Overturning",30528,3]
[2,"HEN","Yes","No","Head On",951408,21]
[7,"CLA","Yes","Yes","Fixed Object",9281289,350]
[12,"GEA","Yes","No","Rear End",8016096,359]
[7,"MER","Yes","No","Animal",10176,1]
[1,"WYA","Yes","Yes","Fixed Object",10176,1]
[5,"LIC","No","Yes","Left Turn",153594,4]
[9,"PIK","No","No","Left Turn",4371942,82]
[3,"RIC","Yes","No","Left Turn",142305,5]
[4,"STA","Yes","Yes","Sideswipe - Passing",648561,41]
[12,"CUY","Yes","Yes","Other Object",4790097,298]
[9,"HIG","Yes","No","Right Turn",10176,1]
[3,"RIC","Yes","Yes","Other Non-Collision",20352,2]
[4,"ATB","Yes","No","Parked Vehicle",1848915,56]
[1,"DEF","No","No","Unknown",122112,12]
[2,"OTT","Yes","Yes","Rear End",373809,9]
[5,"GUE","Yes","No","Fixed Object",12547482,347]
[6,"FAY","Yes","Yes","Rear End",20352,2]
[10,"GAL","Yes","Yes","Sideswipe - Passing",1021686,34]
[5,"FAI","Yes","No","Left Turn",19888224,477]
[4,"ATB","Yes","Yes","Sideswipe - Passing",168381,11]
[5,"GUE","Yes","Yes","Angle",55332,2]
[3,"CRA","Yes","Yes","Fixed Object",1389087,28]
[2,"WOO","Yes","Yes","Angle",547071,4]
[6,"PIC","Yes","No","Fixed Object",8289192,214]
[2,"SAN","No","No","Parked Vehicle",1879713,32]
[8,"BUT","Yes","No","Head On",1129806,24]
[2,"FUL","Yes","No","Rear End",961155,40]
[8,"WAR","Yes","No","Left Turn",111777,2]
[1,"PUT","Yes","No","Fixed Object",2138247,36]
[7,"CLA","Yes","Yes","Parked Vehicle",50880,5]
[6,"MRW","No","Yes","Other Object",447585,35]
[11,"COL","Yes","No","Angle",1373871,34]
[6,"DEL","No","No","Right Turn",1635792,82]
[2,"WOO","Yes","No","Pedalcycles",3750252,32]
[5,"FAI","Yes","Yes","Parked Vehicle",121953,3]
[4,"ATB","Yes","Yes","Pedestrian",460098,1]
[9,"SCI","Yes","No","Other Object",168381,11]
[3,"LOR","Yes","Yes","Rear End",14175975,359]
[6,"FRA","Yes","Yes","Left Turn",10176,1]
[6,"FRA","Yes","Yes","Sideswipe - Passing",188733,13]
[11,"COL","No","No","Other Non-Vehicle",460098,1]
[8,"HAM","Yes","Yes","Pedestrian",14994168,53]
[6,"FRA","Yes","Yes","Head On",525606,4]
[1,"WYA","Yes","Yes","Rear End",10176,1]
[2,"WOO","Yes","No","Unknown",10176,1]
[4,"STA","Yes","Yes","Unknown",360612,32]
[9,"HIG","Yes","No","Pedalcycles",121953,3]
[3,"CRA","Yes","No","Left Turn",1828833,27]
[7,"AUG","No","No","Pedestrian",705117,5]
[5,"MUS","Yes","Yes","Animal",1072932,102]
[2,"OTT","Yes","No","Left Turn",294786,11]
[5,"LIC","No","Yes","Parked Vehicle",780960,18]
[6,"FRA","Yes","No","Sideswipe - Passing",6710913,488]
[9,"HIG","Yes","No","Rear End",152481,6]
[2,"SAN","Yes","Yes","Head On",10176,1]
[7,"MOT","No","Yes","Right Turn",743754,22]
[10,"ATH","Yes","No","Parked Vehicle",1464771,32]
[4,"TRU","Yes","No","Fixed Object",98723322,2221]
[2,"WOO","Yes","Yes","Left Turn",86973,3]
[3,"HUR","Yes","No","Backing",2642055,203]
[11,"COL","No","No","Fixed Object",73796487,1667]
[4,"MAH","Yes","No","Head On",177285,5]
[4,"MAH","Yes","No","Train",460098,1]
[7,"MIA","Yes","Yes","Other Object",427233,33]
[10,"ATH","Yes","No","Angle",1946334,33]
[7,"CLA","No","No","Sideswipe - Meeting",480450,3]
[9,"ROS","Yes","No","Fixed Object",962697,20]
[5,"FAI","Yes","Yes","Overturning",1052325,6]
[4,"ATB","No","Yes","Animal",4093614,309]
[1,"HAR","Yes","No","Parked Vehicle",2190606,102]
[3,"ERI","Yes","No","Fixed Object",28375416,613]
[8,"WAR","Yes","No","Rear End",81408,8]
[3,"HUR","Yes","No","Other Non-Collision",50880,5]
[9,"LAW","Yes","Yes","Head On",669024,7]
[2,"LUC","No","No","Overturning",2461446,18]
[4,"SUM","Yes","Yes","Unknown",30528,3]
[4,"STA","Yes","No","Animal",1390296,111]
[8,"BUT","Yes","Yes","Head On",1265862,18]
[11,"JEF","Yes","No","Left Turn",20352,2]
[12,"CUY","Yes","No","Left Turn",20352,2]
[5,"MUS","No","Yes","Unknown",91584,9]
[8,"WAR","Yes","No","Head On",3812151,63]
[8,"WAR","Yes","No","Train",460098,1]
[2,"SAN","Yes","Yes","Fixed Object",177444,14]
[3,"CRA","Yes","Yes","Overturning",10176,1]
[2,"LUC","Yes","Yes","Animal",50880,5]
[7,"DAR","Yes","No","Animal",101760,10]
[4,"SUM","Yes","Yes","Fixed Object",55332,2]
[8,"CLI","No","No","Pedalcycles",595566,4]
[8,"WAR","Yes","No","Pedalcycles",2533203,27]
[7,"CLA","Yes","No","Rear End",8387169,234]
[7,"AUG","Yes","No","Angle",526719,2]
[5,"LIC","Yes","Yes","Head On",1599396,10]
[12,"GEA","Yes","No","Head On",5800746,34]
[7,"CLA","No","No","Pedestrian",2355822,7]
[3,"ERI","Yes","No","Parked Vehicle",11233872,529]
[9,"JAC","Yes","No","Other Non-Collision",30528,3]
[7,"DAR","No","No","Other Object",422781,36]
[5,"FAI","Yes","Yes","Rear End",10176,1]
[10,"GAL","Yes","No","Left Turn",76797,2]
[10,"ATH","Yes","No","Head On",10176,1]
[4,"TRU","Yes","No","Sideswipe - Passing",65508,3]
[6,"UNI","Yes","Yes","Rear End",106212,7]
[12,"CUY","Yes","Yes","Angle",132129,4]
[8,"WAR","No","Yes","Head On",525606,4]
[3,"CRA","No","Yes","Fixed Object",1882782,53]
[4,"TRU","Yes","No","Angle",10176,1]
[8,"CLE","Yes","Yes","Rear End",420237,22]
[5,"FAI","Yes","Yes","Backing",10176,1]
[7,"MOT","Yes","No","Angle",133242,2]
[2,"WOO","Yes","Yes","Animal",20352,2]
[11,"BEL","Yes","Yes","Backing",10176,1]
[2,"SEN","No","No","Animal",19025796,1560]
[6,"FAY","No","No","Animal",4967271,399]
[2,"WOO","Yes","No","Left Turn",5674821,194]
[5,"FAI","Yes","Yes","Unknown",30528,3]
[7,"CLA","Yes","No","Parked Vehicle",148029,9]
[3,"RIC","No","Yes","Pedestrian",920196,2]
[6,"PIC","Yes","No","Left Turn",5020026,96]
[11,"JEF","Yes","Yes","Sideswipe - Passing",638655,13]
[8,"BUT","Yes","Yes","Other Object",10176,1]
[3,"ASD","No","No","Rear End",13130010,313]
[8,"GRE","Yes","No","Rear End",90184935,3731]
[5,"LIC","Yes","No","Other Non-Collision",842859,49]
[7,"AUG","No","No","Other Object",633090,18]
[2,"SEN","Yes","No","Sideswipe - Passing",1488081,91]
[7,"AUG","Yes","No","Pedestrian",245019,4]
[2,"FUL","Yes","No","Overturning",515430,3]
[3,"MED","Yes","Yes","Animal",30528,3]
[4,"POR","Yes","No","Overturning",669024,7]
[11,"COL","Yes","No","Rear End",10176,1]
[8,"WAR","Yes","No","Animal",8023569,582]
[6,"PIC","Yes","No","Other Object",20352,2]
[9,"ROS","No","No","Fixed Object",96005790,1938]
[3,"ERI","Yes","No","Unknown",117501,6]
[2,"WOO","No","No","Rear End",13014846,337]
[9,"BRO","No","No","Animal",13377813,871]
[2,"SEN","No","No","Fixed Object",48648717,778]
[12,"CUY","Yes","No","Overturning",22768233,208]
[7,"SHE","Yes","No","Backing",50880,5]
[4,"STA","No","No","Head On",14065149,123]
[11,"JEF","No","No","Backing",533445,40]
[8,"HAM","Yes","Yes","Head On",10176,1]
[1,"VAN","No","No","Pedestrian",1480782,6]
[10,"NOB","No","No","Sideswipe - Passing",101760,10]
[3,"MED","Yes","No","Other Non-Collision",1294053,56]
[2,"SAN","Yes","No","Right Turn",40704,4]
[2,"SAN","Yes","Yes","Backing",20352,2]
[2,"FUL","No","No","Head On",6359361,61]
[2,"FUL","No","No","Train",75684,4]
[8,"BUT","Yes","Yes","Other Non-Collision",30528,3]
[3,"LOR","Yes","Yes","Right Turn",30528,3]
[5,"COS","Yes","No","Pedestrian",1319922,8]
[4,"TRU","No","Yes","Other Non-Collision",673794,22]
[4,"POR","Yes","No","Animal",870366,71]
[4,"TRU","Yes","Yes","Backing",213696,21]
[7,"MIA","Yes","Yes","Other Non-Collision",229437,17]
[11,"TUS","Yes","No","Animal",5769330,359]
[11,"TUS","No","No","Unknown",71232,7]
[7,"MER","Yes","No","Other Non-Collision",228324,19]
[11,"BEL","Yes","No","Backing",81408,8]
[4,"MAH","No","No","Overturning",3361704,56]
[12,"LAK","Yes","Yes","Sideswipe - Passing",71232,7]
[8,"HAM","Yes","Yes","Other Object",4872618,299]
[4,"MAH","Yes","No","Other Non-Collision",208926,6]
[7,"DAR","Yes","No","Backing",50880,5]
[2,"WOO","Yes","Yes","Overturning",45156,1]
[7,"CHP","Yes","No","Left Turn",1485537,72]
[4,"STA","Yes","No","Pedalcycles",1552539,15]
[3,"LOR","Yes","Yes","Animal",101760,10]
[5,"LIC","Yes","Yes","Sideswipe - Passing",30528,3]
[8,"CLI","No","No","Sideswipe - Meeting",65508,3]
[12,"GEA","Yes","No","Fixed Object",290334,14]
[3,"RIC","No","Yes","Angle",593340,3]
[2,"HEN","No","Yes","Angle",505254,2]
[4,"POR","Yes","No","Angle",76797,2]
[4,"STA","Yes","Yes","Head On",10176,1]
[5,"GUE","Yes","Yes","Right Turn",85860,5]
[1,"VAN","Yes","No","Other Non-Collision",40704,4]
[4,"MAH","Yes","No","Backing",254400,25]
[5,"LIC","Yes","Yes","Other Non-Collision",269028,23]
[1,"HAN","No","No","Pedalcycles",76797,2]
[2,"WOO","Yes","Yes","Overturning",470274,2]
[11,"COL","Yes","No","Sideswipe - Passing",2217318,79]
[9,"JAC","Yes","No","Rear End",71232,7]
[10,"WAS","No","Yes","Sideswipe - Passing",482565,35]
[4,"POR","Yes","Yes","Fixed Object",499260,20]
[11,"JEF","No","No","Falling From Or In Vehicle",460098,1]
[10,"NOB","Yes","No","Sideswipe - Meeting",10176,1]
[2,"OTT","Yes","No","Left Turn",76797,2]
[4,"SUM","Yes","No","Pedestrian",10176,1]
[7,"MOT","Yes","No","Fixed Object",315789912,6379]
[2,"WOO","Yes","Yes","Right Turn",10176,1]
[2,"SEN","Yes","No","Unknown",75684,4]
[9,"ROS","Yes","Yes","Angle",177285,5]
[11,"COL","Yes","No","Overturning",1439649,15]
[6,"PIC","Yes","No","Pedestrian",3317247,15]
[8,"WAR","Yes","No","Overturning",858711,9]
[3,"LOR","Yes","Yes","Backing",508800,50]
[7,"MOT","Yes","No","Left Turn",165865572,4348]
[7,"MER","Yes","No","Rear End",9375879,411]
[8,"BUT","Yes","Yes","Sideswipe - Passing",21730893,975]
[4,"MAH","Yes","No","Right Turn",163770,5]
[2,"LUC","Yes","No","Parked Vehicle",77198481,4395]
[8,"BUT","No","Yes","Right Turn",40704,4]
[5,"GUE","No","No","Other Object",209085,15]
[5,"LIC","Yes","No","Sideswipe - Meeting",91584,9]
[9,"BRO","No","No","Left Turn",5302347,171]
[5,"LIC","Yes","No","Unknown",207813,8]
[2,"HEN","No","Yes","Overturning",276660,5]
[9,"LAW","Yes","Yes","Rear End",10176,1]
[4,"SUM","Yes","Yes","Parked Vehicle",10176,1]
[2,"WOO","Yes","Yes","Overturning",66621,1]
[8,"GRE","Yes","Yes","Left Turn",2783421,33]
[2,"WIL","No","Yes","Fixed Object",2956398,166]
[10,"ATH","No","No","Backing",999267,45]
[11,"TUS","No","Yes","Head On",490626,4]
[4,"MAH","Yes","Yes","Fixed Object",1297233,46]
[3,"ASD","Yes","No","Angle",16011645,363]
[4,"TRU","No","Yes","Unknown",40704,4]
[4,"STA","Yes","Yes","Sideswipe - Passing",270141,21]
[8,"WAR","Yes","No","Left Turn",28370874,872]
[10,"WAS","Yes","No","Head On",2307582,36]
[12,"LAK","Yes","Yes","Sideswipe - Passing",10176,1]
[7,"MER","Yes","No","Pedestrian",2027265,14]
[5,"PER","Yes","No","Sideswipe - Passing",10176,1]
[3,"RIC","Yes","No","Angle",74733813,1742]
[1,"HAR","No","No","Other Object",259965,20]
[4,"ATB","No","No","Other Non-Collision",1367511,59]
[5,"FAI","Yes","No","Right Turn",96036,6]
[12,"GEA","No","No","Pedalcycles",1967481,15]
[9,"LAW","No","Yes","Sideswipe - Passing",40704,4]
[7,"MIA","No","No","Other Object",351390,20]
[6,"FRA","Yes","Yes","Sideswipe - Passing",874659,59]
[7,"MOT","Yes","Yes","Right Turn",45156,1]
[7,"SHE","Yes","No","Fixed Object",71232,7]
[9,"ROS","Yes","Yes","Backing",10176,1]
[1,"PUT","Yes","No","Sideswipe - Passing",20352,2]
[6,"MAD","Yes","No","Angle",10176,1]
[12,"CUY","Yes","No","Sideswipe - Meeting",168381,11]
[4,"MAH","Yes","Yes","Rear End",1761243,93]
[11,"COL","Yes","No","Parked Vehicle",97149,4]
[8,"PRE","Yes","No","Parked Vehicle",96036,6]
[7,"MOT","Yes","No","Rear End",674478,38]
[10,"HOC","Yes","Yes","Rear End",661917,27]
[4,"STA","Yes","No","Sideswipe - Passing",57689646,3211]
[10,"WAS","Yes","No","Parked Vehicle",324201,16]
[6,"FRA","Yes","No","Rear End",624552,22]
[6,"UNI","Yes","No","Right Turn",96036,6]
[7,"AUG","Yes","Yes","Parked Vehicle",45156,1]
[7,"LOG","No","No","Rear End",9074271,257]
[10,"MEG","No","No","Animal",6317625,325]
[10,"MOE","No","No","Backing",649833,48]
[3,"LOR","No","Yes","Parked Vehicle",122112,12]
[4,"ATB","Yes","No","Animal",1939482,147]
[11,"BEL","Yes","No","Other Non-Collision",1753992,48]
[4,"STA","Yes","No","Unknown",116388,8]
[6,"MAR","Yes","No","Sideswipe - Meeting",20352,2]
[10,"HOC","Yes","No","Unknown",10176,1]
[1,"HAN","Yes","Yes","Unknown",223872,22]
[3,"RIC","Yes","Yes","Other Object",961950,80]
[8,"HAM","Yes","No","Animal",18491826,1268]
[7,"MOT","Yes","No","Rear End",324080463,12747]
[1,"HAR","Yes","No","Other Object",163770,5]
[10,"HOC","Yes","No","Right Turn",575262,42]
[5,"MUS","No","Yes","Other Non-Collision",903231,39]
[10,"GAL","No","No","Pedalcycles",460098,1]
[3,"ERI","No","Yes","Animal",2629065,210]
[3,"RIC","Yes","No","Fixed Object",4421169,128]
[9,"LAW","Yes","Yes","Pedalcycles",66621,1]
[1,"DEF","Yes","No","Other Object",71232,7]
[5,"MUS","Yes","Yes","Right Turn",76797,2]
[10,"ATH","No","No","Unknown",81408,8]
[4,"SUM","Yes","Yes","Left Turn",374922,12]
[11,"COL","Yes","Yes","Other Object",10176,1]
[12,"GEA","Yes","No","Backing",784506,66]
[6,"DEL","No","Yes","Parked Vehicle",20352,2]
[7,"LOG","Yes","No","Other Non-Collision",597951,9]
[5,"FAI","Yes","No","Rear End",20352,2]
[7,"DAR","Yes","Yes","Sideswipe - Passing",167268,13]
[4,"MAH","Yes","No","Head On",85860,5]
[2,"WIL","No","Yes","Parked Vehicle",1574688,96]
[6,"DEL","Yes","No","Parked Vehicle",7932636,488]
[6,"FRA","Yes","No","Fixed Object",163770,5]
[4,"POR","Yes","Yes","Rear End",700665,8]
[9,"ROS","Yes","No","Pedalcycles",1524921,24]
[2,"OTT","No","No","Left Turn",4914402,75]
[4,"STA","No","No","Overturning",8344380,86]
[6,"UNI","Yes","Yes","Sideswipe - Passing",2106066,89]
[12,"CUY","Yes","No","Fixed Object",148029,9]
[2,"SAN","Yes","No","Unknown",40704,4]
[11,"JEF","Yes","Yes","Angle",65508,3]
[2,"WOO","Yes","Yes","Overturning",10176,1]
[3,"WAY","No","No","Unknown",158205,10]
[3,"MED","Yes","No","Parked Vehicle",1966146,84]
[3,"ERI","Yes","Yes","Unknown",10176,1]
[12,"GEA","Yes","No","Unknown",30528,3]
[12,"CUY","Yes","Yes","Right Turn",126564,9]
[10,"HOC","No","No","Head On",8602134,54]
[2,"WIL","Yes","No","Backing",1574688,96]
[3,"LOR","Yes","No","Angle",1775028,66]
[7,"LOG","No","No","Left Turn",3704349,91]
[5,"COS","Yes","No","Right Turn",601179,39]
[7,"MOT","Yes","No","Overturning",66621,1]
[4,"MAH","Yes","No","Fixed Object",107705484,2407]
[2,"HEN","Yes","Yes","Other Non-Collision",10176,1]
[3,"RIC","Yes","Yes","Pedalcycles",10176,1]
[3,"MED","Yes","Yes","Unknown",30528,3]
[7,"MOT","Yes","Yes","Fixed Object",431526,21]
[2,"FUL","Yes","No","Rear End",6242880,251]
[1,"DEF","No","Yes","Fixed Object",71232,7]
[8,"CLI","No","No","Parked Vehicle",1776570,46]
[6,"FAY","Yes","No","Fixed Object",10176,1]
[2,"LUC","Yes","No","Unknown",7741581,254]
[5,"MUS","Yes","No","Animal",2861205,250]
[3,"MED","Yes","Yes","Sideswipe - Passing",1093761,66]
[8,"HAM","No","No","Right Turn",1021686,39]
[7,"MOT","Yes","No","Unknown",96036,6]
[1,"ALL","Yes","No","Fixed Object",10176,1]
[6,"MAR","No","No","Head On",4907898,40]
[6,"MAR","No","No","Train",86973,3]
[7,"CHP","Yes","No","Parked Vehicle",3597120,171]
[3,"WAY","Yes","No","Animal",207972,17]
[2,"WIL","Yes","No","Parked Vehicle",1147137,45]
[10,"WAS","Yes","No","Rear End",5159136,182]
[11,"BEL","Yes","Yes","Left Turn",1378752,18]
[7,"MIA","Yes","No","Animal",1475520,145]
[3,"WAY","Yes","Yes","Animal",85860,5]
[11,"BEL","Yes","Yes","Rear End",8497563,255]
[3,"ERI","Yes","Yes","Unknown",193344,19]
[1,"HAN","No","Yes","Other Object",132288,13]
[8,"CLE","Yes","Yes","Sideswipe - Passing",10176,1]
[3,"LOR","Yes","Yes","Fixed Object",21184359,524]
[4,"TRU","No","Yes","Pedestrian",66621,1]
[11,"BEL","Yes","Yes","Fixed Object",9518151,305]
[12,"GEA","No","No","Angle",43840197,751]
[3,"LOR","No","No","Rear End",28502652,722]
[6,"FRA","Yes","No","Sideswipe - Meeting",2136864,60]
[3,"ASD","Yes","No","Rear End",167109,4]
[6,"MAD","No","Yes","Unknown",972078,41]
[10,"MOE","Yes","No","Rear End",1120743,21]
[3,"ERI","Yes","Yes","Parked Vehicle",66621,1]
[10,"WAS","Yes","Yes","Rear End",10176,1]
[8,"WAR","No","No","Fixed Object",56166828,1232]
[5,"FAI","Yes","No","Animal",10176,1]
[9,"LAW","No","No","Sideswipe - Meeting",152481,6]
[1,"VAN","No","No","Backing",620418,43]
[10,"HOC","Yes","No","Backing",10176,1]
[4,"POR","Yes","No","Fixed Object",347892,12]
[12,"LAK","No","No","Pedalcycles",178398,3]
[10,"MRG","No","No","Parked Vehicle",913248,31]
[5,"MUS","No","No","Angle",9503427,152]
[7,"AUG","Yes","No","Pedestrian",1029159,12]
[8,"CLE","Yes","Yes","Backing",10176,1]
[9,"JAC","Yes","No","Pedestrian",1098594,5]
[2,"WOO","Yes","Yes","Fixed Object",111777,2]
[6,"FAY","Yes","No","Rear End",40704,4]
[10,"MRG","Yes","No","Unknown",10176,1]
[3,"LOR","Yes","Yes","Backing",20352,2]
[8,"WAR","Yes","No","Pedestrian",3489396,12]
[7,"MIA","Yes","No","Head On",4982724,85]
[7,"MIA","Yes","No","Train",55332,2]
[10,"WAS","No","No","Head On",10692315,77]
[10,"WAS","No","No","Train",133242,2]
[2,"LUC","Yes","No","Fixed Object",3965586,123]
[2,"OTT","Yes","Yes","Other Non-Collision",50880,5]
[6,"PIC","No","No","Angle",22306593,282]
[5,"FAI","Yes","No","Pedalcycles",76797,2]
[2,"FUL","Yes","No","Fixed Object",2232900,66]
[5,"COS","No","No","Parked Vehicle",933441,24]
[3,"WAY","No","No","Pedalcycles",2622306,11]
[12,"CUY","Yes","Yes","Sideswipe - Passing",76797,2]
[8,"CLI","No","Yes","Rear End",4083135,104]
[6,"PIC","Yes","No","Other Object",40704,4]
[6,"FAY","Yes","Yes","Head On",10176,1]
[5,"KNO","Yes","No","Fixed Object",8554293,237]
[12,"CUY","Yes","No","Other Non-Collision",66621,1]
[3,"ASD","Yes","No","Other Non-Collision",1030590,28]
[11,"CAR","No","No","Angle",8912154,206]
[2,"SAN","No","Yes","Head On",10176,1]
[7,"DAR","Yes","Yes","Angle",1211055,18]
[1,"PAU","Yes","No","Fixed Object",76797,2]
[3,"LOR","Yes","No","Unknown",40704,4]
[12,"LAK","Yes","Yes","Fixed Object",30746331,849]
[4,"TRU","Yes","No","Pedestrian",17983479,97]
[3,"CRA","No","Yes","Head On",470274,2]
[10,"ATH","Yes","No","Backing",713274,59]
[10,"HOC","Yes","Yes","Fixed Object",397659,19]
[2,"WIL","Yes","No","Left Turn",1354203,48]
[10,"NOB","Yes","No","Overturning",20352,2]
[3,"WAY","Yes","No","Other Object",132288,13]
[6,"FRA","Yes","Yes","Fixed Object",812601,19]
[4,"TRU","No","No","Right Turn",744438,33]
[4,"TRU","Yes","Yes","Other Non-Collision",86973,3]
[3,"LOR","Yes","Yes","Angle",197637,7]
[8,"HAM","Yes","Yes","Other Object",20352,2]
[4,"POR","Yes","No","Backing",110664,4]
[4,"TRU","No","Yes","Overturning",858711,9]
[7,"AUG","Yes","Yes","Angle",76797,2]
[9,"PIK","No","No","Head On",3606039,44]
[3,"WAY","No","No","Right Turn",2266767,63]
[11,"TUS","Yes","Yes","Right Turn",137853,8]
[8,"CLI","No","Yes","Fixed Object",2970660,106]
[12,"CUY","Yes","Yes","Other Object",20352,2]
[3,"WAY","Yes","Yes","Left Turn",10176,1]
[10,"MRG","No","No","Left Turn",1901274,47]
[10,"NOB","Yes","Yes","Sideswipe - Passing",289221,16]
[3,"RIC","Yes","No","Backing",10176,1]
[4,"SUM","Yes","Yes","Unknown",804858,68]
[8,"CLE","Yes","Yes","Other Object",10176,1]
[8,"CLI","Yes","No","Angle",20352,2]
[7,"MER","No","Yes","Angle",66621,1]
[4,"STA","Yes","Yes","Angle",525606,4]
[5,"KNO","Yes","No","Rear End",11463120,539]
[7,"SHE","No","No","Sideswipe - Passing",2825127,71]
[10,"GAL","No","No","Animal",3929367,337]
[6,"UNI","No","No","Left Turn",7281831,109]
[5,"LIC","Yes","No","Other Object",239454,9]
[6,"FRA","No","No","Fixed Object",13141821,186]
[4,"SUM","Yes","No","Right Turn",55332,2]
[1,"WYA","No","Yes","Other Object",20352,2]
[6,"FAY","No","Yes","Left Turn",66621,1]
[4,"TRU","No","No","Backing",2682711,97]
[2,"WOO","Yes","Yes","Pedestrian",986817,3]
[4,"STA","No","No","Pedestrian",3766056,17]
[9,"ROS","Yes","Yes","Right Turn",30528,3]
[12,"LAK","Yes","No","Head On",184122,7]
[7,"AUG","Yes","No","Other Object",71232,7]
[4,"POR","Yes","Yes","Animal",606903,43]
[7,"LOG","Yes","No","Sideswipe - Meeting",10176,1]
[3,"ERI","Yes","No","Fixed Object",10176,1]
[9,"HIG","Yes","No","Parked Vehicle",556134,7]
[3,"ERI","Yes","No","Rear End",20352,2]
[1,"HAR","Yes","No","Rear End",4098288,179]
[2,"LUC","Yes","Yes","Other Non-Collision",3268578,127]
[9,"ROS","Yes","No","Parked Vehicle",111936,11]
[9,"LAW","No","No","Angle",5719419,92]
[3,"RIC","Yes","No","Fixed Object",54792657,1542]
[4,"POR","No","Yes","Animal",2654346,166]
[2,"WOO","Yes","No","Backing",1856325,170]
[10,"HOC","No","Yes","Left Turn",66621,1]
[6,"MRW","Yes","Yes","Left Turn",143418,3]
[7,"DAR","Yes","Yes","Rear End",336603,13]
[7,"MER","No","No","Sideswipe - Meeting",460098,1]
[6,"DEL","Yes","No","Pedalcycles",8473473,95]
[10,"GAL","Yes","No","Backing",10176,1]
[1,"WYA","Yes","No","Other Non-Collision",183009,9]
[4,"STA","Yes","Yes","Head On",45156,1]
[6,"FRA","Yes","No","Angle",717090,20]
[3,"MED","Yes","Yes","Fixed Object",1494027,28]
[3,"MED","Yes","Yes","Fixed Object",1571715,95]
[1,"PUT","Yes","No","Head On",20352,2]
[7,"CLA","Yes","Yes","Animal",1313340,105]
[7,"CHP","No","No","Parked Vehicle",1176393,41]
[12,"CUY","Yes","No","Parked Vehicle",183009,9]
[4,"MAH","Yes","No","Other Object",10176,1]
[4,"ATB","Yes","No","Backing",10176,1]
[4,"SUM","Yes","Yes","Other Non-Collision",20352,2]
[4,"STA","Yes","No","Rear End",8393736,343]
[12,"CUY","Yes","Yes","Unknown",75684,4]
[7,"MOT","Yes","Yes","Other Non-Collision",10176,1]
[5,"KNO","No","No","Overturning",7069614,74]
[2,"SAN","Yes","Yes","Other Object",30528,3]
[2,"FUL","No","Yes","Angle",86973,3]
[11,"COL","No","Yes","Left Turn",76797,2]
[11,"JEF","No","No","Other Non-Collision",853305,23]
[9,"PIK","Yes","No","Angle",30528,3]
[8,"PRE","No","Yes","Other Non-Collision",441861,31]
[4,"ATB","Yes","Yes","Left Turn",10176,1]
[2,"LUC","No","No","Right Turn",1206078,19]
[3,"WAY","Yes","Yes","Left Turn",20352,2]
[9,"HIG","No","No","Other Object",152640,15]
[3,"LOR","No","No","Animal",11418123,777]
[12,"CUY","Yes","No","Animal",76797,2]
[1,"PUT","Yes","No","Fixed Object",1242171,17]
[6,"FRA","Yes","No","Backing",96036,6]
[9,"ROS","No","Yes","Sideswipe - Passing",2963568,75]
[11,"JEF","Yes","Yes","Head On",10176,1]
[4,"SUM","Yes","Yes","Sideswipe - Passing",353616,21]
[4,"SUM","Yes","No","Pedestrian",4886115,22]
[2,"LUC","Yes","Yes","Other Object",1893531,166]
[6,"UNI","Yes","No","Angle",1957449,79]
[5,"LIC","Yes","No","Right Turn",162816,16]
[2,"SEN","No","No","Angle",20270838,232]
[9,"LAW","No","No","Right Turn",1410393,19]
[4,"TRU","Yes","Yes","Other Object",783234,59]
[8,"GRE","Yes","Yes","Sideswipe - Passing",10176,1]
[7,"MOT","Yes","Yes","Fixed Object",86973,3]
[2,"WOO","Yes","No","Other Non-Collision",714339,17]
[8,"WAR","Yes","Yes","Backing",66621,1]
[3,"WAY","No","No","Sideswipe - Meeting",97149,4]
[7,"AUG","Yes","No","Left Turn",641994,12]
[9,"SCI","Yes","No","Rear End",29775831,1212]
[3,"RIC","No","Yes","Unknown",122112,12]
[2,"LUC","No","Yes","Pedestrian",460098,1]
[6,"MRW","Yes","No","Fixed Object",162657,7]
[1,"ALL","No","No","Pedestrian",2566974,9]
[2,"WOO","Yes","Yes","Right Turn",76797,2]
[12,"LAK","No","No","Rear End",3130185,103]
[4,"POR","Yes","Yes","Rear End",304962,12]
[4,"MAH","Yes","Yes","Sideswipe - Passing",61056,6]
[1,"HAN","Yes","Yes","Fixed Object",65508,3]
[4,"STA","Yes","Yes","Left Turn",1346682,30]
[3,"WAY","Yes","No","Other Non-Collision",55332,2]
[11,"TUS","Yes","Yes","Fixed Object",50880,5]
[2,"SAN","No","No","Other Non-Collision",1366239,52]
[8,"BUT","No","No","Rear End",16289499,537]
[7,"DAR","No","No","Unknown",111936,11]
[7,"MOT","Yes","No","Right Turn",20352,2]
[7,"MOT","Yes","Yes","Overturning",66621,1]
[2,"SAN","Yes","No","Other Non-Collision",638655,13]
[3,"MED","No","No","Head On",10245033,111]
[3,"MED","No","No","Train",480450,3]
[3,"LOR","Yes","No","Rear End",49620477,2142]
[3,"CRA","Yes","No","Parked Vehicle",814716,51]
[4,"MAH","No","Yes","Unknown",213696,21]
[7,"MER","Yes","No","Angle",11837976,269]
[6,"DEL","Yes","No","Left Turn",131016,6]
[10,"MOE","Yes","No","Right Turn",547071,4]
[3,"WAY","Yes","No","Pedestrian",7595331,47]
[7,"MER","Yes","No","Pedalcycles",848535,8]
[3,"ASD","Yes","No","Right Turn",10176,1]
[6,"MAD","Yes","No","Right Turn",30528,3]
[7,"CLA","Yes","No","Other Object",10176,1]
[7,"CLA","No","No","Unknown",111936,11]
[12,"CUY","Yes","Yes","Unknown",6602871,251]
[10,"WAS","Yes","Yes","Rear End",10176,1]
[10,"ATH","Yes","No","Rear End",50880,5]
[7,"AUG","Yes","No","Fixed Object",85860,5]
[8,"CLI","Yes","No","Angle",8930106,254]
[5,"LIC","Yes","No","Animal",40704,4]
[10,"GAL","Yes","Yes","Right Turn",66621,1]
[3,"ERI","No","Yes","Fixed Object",15798396,471]
[7,"AUG","Yes","Yes","Sideswipe - Passing",2093505,73]
[10,"WAS","No","Yes","Rear End",1384317,18]
[7,"MOT","No","No","Other Non-Collision",1081311,24]
[8,"HAM","Yes","Yes","Fixed Object",159510813,4454]
[4,"ATB","Yes","No","Fixed Object",23299311,440]
[4,"POR","Yes","Yes","Parked Vehicle",45156,1]
[3,"WAY","Yes","No","Left Turn",2937174,46]
[2,"WOO","No","No","Animal",14711745,1313]
[2,"FUL","Yes","No","Head On",143418,3]
[2,"FUL","Yes","No","Train",10176,1]
[4,"SUM","Yes","Yes","Other Non-Collision",30528,3]
[10,"HOC","Yes","No","Overturning",689376,9]
[9,"HIG","Yes","No","Backing",1289808,113]
[8,"WAR","Yes","Yes","Other Non-Collision",330084,29]
[6,"UNI","Yes","No","Angle",9577824,280]
[5,"FAI","Yes","Yes","Other Non-Collision",81408,8]
[4,"TRU","Yes","No","Pedalcycles",5405664,50]
[6,"PIC","Yes","No","Left Turn",1491642,18]
[7,"AUG","Yes","No","Rear End",75684,4]
[3,"HUR","No","No","Left Turn",4831086,89]
[10,"ATH","No","Yes","Animal",447585,35]
[3,"HUR","Yes","No","Other Object",218148,18]
[3,"MED","Yes","Yes","Head On",10176,1]
[5,"FAI","Yes","Yes","Overturning",682539,7]
[8,"WAR","Yes","Yes","Fixed Object",816783,43]
[2,"SAN","No","No","Angle",21650082,236]
[6,"FAY","No","No","Sideswipe - Passing",1806669,67]
[8,"PRE","Yes","No","Left Turn",2237034,50]
[6,"MRW","No","Yes","Angle",10176,1]
[11,"TUS","No","No","Backing",2770320,141]
[5,"LIC","Yes","Yes","Angle",622755,8]
[3,"ERI","Yes","No","Unknown",1343931,27]
[11,"COL","Yes","No","Other Non-Collision",209085,15]
[2,"LUC","Yes","Yes","Head On",2520960,39]
[8,"CLE","Yes","No","Fixed Object",458715,25]
[5,"PER","No","No","Animal",5989401,239]
[3,"ERI","No","No","Parked Vehicle",1106544,10]
[1,"VAN","Yes","No","Angle",8356116,224]
[7,"MIA","Yes","No","Right Turn",2620479,169]
[4,"STA","Yes","Yes","Fixed Object",36927723,869]
[6,"FAY","No","No","Pedalcycles",526719,2]
[2,"WOO","Yes","Yes","Other Non-Collision",723291,51]
[7,"MOT","Yes","Yes","Sideswipe - Passing",213537,12]
[6,"PIC","No","Yes","Fixed Object",1163832,30]
[6,"MAR","Yes","No","Backing",117501,6]
[2,"LUC","Yes","No","Pedalcycles",133242,2]
[7,"LOG","No","No","Angle",18129300,252]
[4,"STA","No","No","Other Non-Collision",2278803,72]
[5,"FAI","Yes","No","Pedestrian",45156,1]
[7,"AUG","Yes","Yes","Rear End",10176,1]
[7,"DAR","Yes","Yes","Animal",274752,27]
[2,"WOO","No","Yes","Angle",1088577,13]
[4,"TRU","No","Yes","Other Object",142464,14]
[12,"CUY","Yes","No","Sideswipe - Passing",367290,25]
[1,"ALL","Yes","No","Fixed Object",204474,9]
[1,"HAR","Yes","No","Head On",1134846,12]
[7,"MOT","Yes","Yes","Other Non-Collision",45156,1]
[8,"CLI","No","No","Backing",1023006,86]
[3,"WAY","Yes","No","Parked Vehicle",470004,24]
[1,"VAN","No","Yes","Fixed Object",470274,2]
[7,"AUG","Yes","No","Right Turn",10176,1]
[3,"RIC","No","Yes","Overturning",1207032,8]
[8,"BUT","No","No","Right Turn",2479032,68]
[8,"CLE","Yes","Yes","Head On",66621,1]
[4,"SUM","Yes","No","Overturning",178398,3]
[4,"SUM","Yes","No","Sideswipe - Passing",96036,6]
[11,"JEF","Yes","No","Other Non-Collision",45156,1]
[3,"CRA","Yes","No","Rear End",50880,5]
[5,"COS","No","No","Pedalcycles",460098,1]
[4,"SUM","Yes","No","Other Object",162816,16]
[6,"FAY","No","No","Backing",639657,47]
[7,"MOT","Yes","No","Left Turn",1472292,50]
[8,"GRE","Yes","No","Sideswipe - Passing",20289717,1054]
[12,"CUY","Yes","Yes","Left Turn",142305,5]
[10,"WAS","Yes","No","Sideswipe - Passing",3173322,227]
[5,"GUE","No","Yes","Other Non-Collision",523428,48]
[6,"DEL","Yes","No","Unknown",549186,36]
[8,"BUT","No","Yes","Angle",648672,5]
[9,"HIG","Yes","No","Left Turn",2305086,62]
[4,"TRU","Yes","No","Angle",89343939,2352]
[8,"GRE","Yes","Yes","Unknown",152640,15]
[4,"SUM","Yes","Yes","Rear End",370470,15]
[9,"JAC","Yes","No","Other Object",96036,6]
[1,"ALL","No","No","Sideswipe - Passing",8684673,212]
[6,"FRA","Yes","Yes","Overturning",1091328,16]
[2,"OTT","Yes","No","Other Non-Collision",85860,5]
[5,"KNO","Yes","No","Pedalcycles",45156,1]
[10,"HOC","Yes","Yes","Left Turn",10176,1]
[4,"STA","No","Yes","Other Non-Collision",572034,12]
[8,"PRE","Yes","No","Backing",809310,65]
[10,"MEG","Yes","No","Head On",250743,8]
[4,"ATB","Yes","Yes","Other Non-Collision",198909,14]
[8,"PRE","No","No","Rear End",10803300,247]
[1,"VAN","No","No","Parked Vehicle",352503,18]
[3,"RIC","Yes","No","Animal",91584,9]
[6,"DEL","Yes","Yes","Backing",183168,18]
[7,"DAR","Yes","No","Pedestrian",3585957,20]
[7,"CLA","No","No","Animal",6473160,473]
[2,"WOO","Yes","Yes","Sideswipe - Passing",10176,1]
[4,"ATB","No","Yes","Fixed Object",9050754,219]
[9,"BRO","Yes","Yes","Overturning",460098,1]
[5,"LIC","Yes","No","Pedestrian",1770957,11]
[8,"BUT","Yes","No","Sideswipe - Meeting",10176,1]
[3,"CRA","No","No","Other Non-Collision",3107781,58]
[4,"TRU","Yes","No","Angle",111777,2]
[8,"PRE","Yes","No","Unknown",40704,4]
[2,"LUC","Yes","No","Unknown",40704,4]
[3,"ASD","No","No","Sideswipe - Passing",8407329,191]
[4,"MAH","Yes","No","Right Turn",117501,6]
[3,"HUR","No","No","Unknown",218148,18]
[5,"GUE","Yes","Yes","Rear End",1927938,54]
[9,"ROS","Yes","Yes","Other Object",132288,13]
[6,"DEL","Yes","Yes","Animal",40704,4]
[1,"ALL","Yes","Yes","Fixed Object",460098,1]
[4,"POR","Yes","No","Left Turn",659007,15]
[9,"ROS","Yes","No","Other Non-Collision",20352,2]
[3,"MED","Yes","No","Angle",171720,10]
[2,"WIL","Yes","No","Unknown",20352,2]
[11,"JEF","Yes","Yes","Rear End",85860,5]
[5,"MUS","Yes","Yes","Other Object",30528,3]
[5,"LIC","Yes","No","Rear End",2077239,70]
[1,"PAU","No","No","Pedalcycles",526719,2]
[3,"LOR","No","No","Backing",2379069,137]
[3,"ASD","Yes","No","Fixed Object",76797,2]
[1,"HAN","Yes","Yes","Fixed Object",9545022,291]
[6,"MRW","No","Yes","Fixed Object",12532950,499]
[6,"FRA","Yes","No","Unknown",66621,1]
[4,"SUM","Yes","Yes","Backing",40704,4]
[10,"ATH","Yes","Yes","Fixed Object",76797,2]
[1,"WYA","Yes","No","Fixed Object",7646211,122]
[1,"DEF","No","No","Sideswipe - Passing",2470128,74]
[2,"SEN","No","No","Pedestrian",1580157,6]
[2,"WOO","Yes","No","Right Turn",3902082,188]
[4,"MAH","Yes","No","Sideswipe - Passing",30528,3]
[4,"SUM","Yes","Yes","Sideswipe - Passing",10739352,576]
[4,"SUM","Yes","No","Pedestrian",2534220,10]
[6,"MAD","Yes","Yes","Rear End",75684,4]
[8,"CLE","Yes","Yes","Overturning",1966368,17]
[12,"CUY","Yes","Yes","Left Turn",5576892,169]
[1,"VAN","Yes","No","Sideswipe - Passing",10176,1]
[4,"STA","No","No","Other Object",525495,35]
[2,"WOO","Yes","Yes","Other Non-Collision",10176,1]
[9,"HIG","No","No","Pedestrian",1656954,8]
[10,"ATH","Yes","No","Animal",10176,1]
[5,"MUS","Yes","Yes","Overturning",745821,9]
[4,"POR","Yes","No","Fixed Object",75684,4]
[8,"CLI","Yes","Yes","Rear End",10176,1]
[6,"PIC","No","Yes","Parked Vehicle",86973,3]
[6,"FRA","No","Yes","Pedalcycles",10176,1]
[1,"ALL","Yes","No","Rear End",20352,2]
[4,"STA","Yes","Yes","Parked Vehicle",521838,18]
[7,"DAR","No","No","Left Turn",4435542,107]
[5,"COS","No","No","Animal",4862712,276]
[8,"GRE","Yes","Yes","Backing",157092,12]
[5,"KNO","Yes","No","Animal",30528,3]
[11,"BEL","No","No","Animal",6263469,250]
[6,"UNI","Yes","Yes","Sideswipe - Passing",917859,37]
[4,"POR","Yes","No","Parked Vehicle",10176,1]
[6,"FRA","Yes","No","Rear End",7761807,358]
[2,"FUL","Yes","No","Rear End",107325,5]
[7,"CHP","Yes","No","Other Non-Collision",183009,9]
[9,"HIG","Yes","No","Right Turn",222600,15]
[10,"MRG","No","No","Unknown",76797,2]
[10,"MOE","Yes","No","Left Turn",10176,1]
[8,"GRE","No","No","Overturning",6412992,64]
[5,"LIC","Yes","Yes","Sideswipe - Passing",2110995,103]
[3,"WAY","Yes","No","Fixed Object",4238367,178]
[2,"WOO","No","Yes","Parked Vehicle",331038,18]
[8,"WAR","Yes","No","Backing",3631242,332]
[4,"MAH","Yes","Yes","Parked Vehicle",45156,1]
[3,"WAY","Yes","Yes","Sideswipe - Passing",1429950,41]
[4,"MAH","No","No","Backing",1206015,95]
[6,"PIC","Yes","No","Other Object",586662,10]
[3,"ERI","Yes","No","Angle",2534793,57]
[6,"PIC","No","Yes","Head On",460098,1]
[4,"TRU","No","No","Other Non-Vehicle",10176,1]
[11,"BEL","Yes","No","Angle",228165,10]
[5,"KNO","No","No","Right Turn",1168443,36]
[5,"LIC","No","Yes","Pedestrian",66621,1]
[4,"TRU","No","No","Left Turn",7301580,161]
[11,"BEL","Yes","Yes","Sideswipe - Passing",10176,1]
[3,"ERI","No","Yes","Parked Vehicle",1260138,14]
[4,"SUM","No","Yes","Fixed Object",9160911,303]
[6,"FAY","Yes","No","Overturning",1222773,9]
[12,"CUY","No","Yes","Backing",10176,1]
[3,"LOR","No","No","Unknown",361566,21]
[2,"WIL","No","Yes","Right Turn",30528,3]
[10,"ATH","No","No","Rear End",5957808,148]
[7,"LOG","Yes","Yes","Sideswipe - Passing",212424,14]
[2,"SAN","Yes","Yes","Angle",111777,2]
[9,"BRO","No","No","Backing",1627476,84]
[7,"AUG","No","No","Left Turn",3026628,74]
[7,"LOG","No","No","Fixed Object",40056204,960]
[4,"MAH","Yes","Yes","Fixed Object",127677,7]
[11,"TUS","No","Yes","Backing",10176,1]
[1,"PAU","No","No","Overturning",7185747,53]
[9,"ROS","No","No","Pedalcycles",76797,2]
[3,"ERI","Yes","No","Angle",39547155,1052]
[9,"HIG","No","No","Angle",13448199,185]
[7,"LOG","Yes","Yes","Animal",50880,5]
[2,"LUC","Yes","No","Animal",223872,22]
[2,"FUL","No","Yes","Other Non-Collision",248676,21]
[8,"BUT","Yes","No","Parked Vehicle",2494869,154]
[7,"MOT","Yes","No","Fixed Object",153594,4]
[5,"FAI","Yes","No","Fixed Object",885900,18]
[1,"VAN","Yes","Yes","Rear End",20352,2]
[2,"OTT","Yes","No","Sideswipe - Meeting",10176,1]
[2,"HEN","No","No","Parked Vehicle",372855,20]
[3,"CRA","No","No","Head On",2436801,28]
[3,"CRA","No","No","Train",121953,3]
[11,"COL","Yes","Yes","Fixed Object",61056,6]
[11,"BEL","No","No","Pedalcycles",515430,3]
[2,"WIL","Yes","No","Other Non-Collision",10176,1]
[7,"CLA","Yes","No","Angle",40704,4]
[11,"COL","Yes","No","Animal",259965,20]
[2,"OTT","No","No","Parked Vehicle",2040558,76]
[6,"MAR","Yes","No","Left Turn",12156501,311]
[3,"ASD","Yes","No","Backing",10176,1]
[10,"MEG","No","No","Backing",284928,28]
[3,"RIC","Yes","No","Sideswipe - Passing",71232,7]
[2,"HEN","No","No","Rear End",8230839,171]
[1,"VAN","No","No","Fixed Object",25880754,503]
[2,"LUC","No","No","Rear End",7566951,187]
[1,"HAR","Yes","No","Head On",30528,3]
[8,"HAM","Yes","Yes","Left Turn",5800764,186]
[8,"BUT","Yes","Yes","Overturning",66621,1]
[2,"FUL","No","No","Other Object",968739,42]
[7,"SHE","Yes","Yes","Sideswipe - Passing",106212,7]
[2,"WOO","Yes","Yes","Fixed Object",20352,2]
[8,"HAM","Yes","Yes","Rear End",177444,14]
[6,"DEL","No","Yes","Left Turn",97149,4]
[11,"JEF","Yes","Yes","Right Turn",61056,6]
[1,"ALL","Yes","No","Animal",30528,3]
[2,"WOO","No","No","Sideswipe - Passing",9129093,211]
[11,"BEL","Yes","Yes","Sideswipe - Passing",45156,1]
[6,"UNI","Yes","No","Other Object",91584,9]
[1,"WYA","Yes","No","Backing",10176,1]
[4,"ATB","No","No","Head On",12592650,94]
[4,"ATB","No","No","Train",460098,1]
[6,"PIC","No","No","Head On",10146357,76]
[3,"WAY","No","Yes","Right Turn",76797,2]
[8,"CLI","No","No","Fixed Object",53051142,1011]
[4,"TRU","Yes","Yes","Left Turn",66621,1]
[8,"BUT","Yes","Yes","Fixed Object",106212,7]
[8,"HAM","Yes","No","Right Turn",1824684,104]
[10,"WAS","Yes","Yes","Overturning",10176,1]
[4,"MAH","Yes","No","Unknown",20352,2]
[6,"UNI","No","Yes","Fixed Object",5055546,107]
[8,"GRE","Yes","Yes","Fixed Object",10176,1]
[4,"POR","Yes","No","Rear End",63655581,2605]
[8,"BUT","Yes","No","Head On",907365,18]
[8,"WAR","Yes","No","Unknown",101760,10]
[9,"ROS","No","No","Angle",21022431,285]
[4,"TRU","Yes","No","Animal",10176,1]
[8,"BUT","Yes","Yes","Left Turn",86973,3]
[5,"COS","Yes","No","Parked Vehicle",2018727,83]
[7,"MIA","Yes","Yes","Parked Vehicle",1712286,10]
[7,"MOT","Yes","Yes","Angle",148029,9]
[11,"CAR","No","No","Sideswipe - Passing",3028806,100]
[12,"CUY","Yes","Yes","Fixed Object",1023753,26]
[6,"MRW","No","No","Parked Vehicle",1077177,45]
[11,"BEL","Yes","Yes","Fixed Object",20352,2]
[3,"HUR","No","No","Angle",25123674,253]
[5,"KNO","Yes","No","Parked Vehicle",2399373,99]
[4,"STA","Yes","No","Head On",36631263,499]
[4,"STA","Yes","No","Train",30528,3]
[2,"SEN","Yes","No","Parked Vehicle",1001223,68]
[8,"CLE","Yes","No","Angle",466506,21]
[1,"WYA","Yes","Yes","Fixed Object",76797,2]
[1,"HAN","Yes","No","Parked Vehicle",4591506,302]
[3,"WAY","Yes","No","Other Non-Collision",76797,2]
[1,"ALL","No","Yes","Parked Vehicle",500802,5]
[2,"SEN","Yes","No","Left Turn",4222689,106]
[4,"SUM","Yes","No","Sideswipe - Passing",10176,1]
[6,"FRA","No","Yes","Animal",551682,10]
[1,"VAN","Yes","No","Backing",1538484,134]
[2,"WIL","No","Yes","Rear End",4832883,103]
[5,"LIC","No","No","Right Turn",2002764,84]
[2,"FUL","Yes","No","Animal",407040,40]
[12,"LAK","Yes","Yes","Backing",259965,20]
[4,"SUM","No","Yes","Rear End",3399261,176]
[6,"MAD","No","No","Unknown",168381,11]
[2,"LUC","Yes","No","Right Turn",50497473,2321]
[7,"MOT","Yes","Yes","Rear End",1010397,35]
[10,"GAL","Yes","Yes","Fixed Object",1297233,41]
[5,"LIC","Yes","Yes","Other Object",157092,12]
[10,"WAS","Yes","No","Left Turn",2693793,52]
[7,"DAR","Yes","No","Sideswipe - Passing",178557,12]
[9,"LAW","Yes","Yes","Other Object",168381,11]
[4,"MAH","No","No","Left Turn",5520129,136]
[5,"COS","Yes","No","Unknown",10176,1]
[11,"TUS","Yes","No","Sideswipe - Passing",6693216,479]
[5,"COS","Yes","Yes","Fixed Object",10176,1]
[8,"WAR","Yes","No","Parked Vehicle",5228889,243]
[2,"WOO","Yes","Yes","Sideswipe - Passing",223713,13]
[4,"TRU","Yes","No","Rear End",95642784,3984]
[5,"LIC","No","Yes","Other Non-Collision",973350,48]
[4,"POR","Yes","No","Right Turn",5751411,277]
[2,"SEN","Yes","No","Right Turn",537897,37]
[3,"ERI","Yes","Yes","Animal",2784885,215]
[11,"COL","No","Yes","Animal",1801311,121]
[7,"SHE","Yes","No","Head On",10176,1]
[8,"BUT","Yes","Yes","Angle",1137327,37]
[6,"DEL","Yes","No","Animal",61056,6]
[10,"MRG","No","No","Fixed Object",29369115,390]
[7,"MIA","Yes","Yes","Backing",81408,8]
[1,"VAN","No","No","Other Non-Collision",1913628,74]
[11,"BEL","Yes","No","Angle",10532094,338]
[8,"HAM","Yes","Yes","Right Turn",6441120,183]
[10,"MRG","No","No","Rear End",3629619,86]
[7,"MIA","No","No","Other Non-Collision",2951277,42]
[6,"FRA","Yes","Yes","Head On",16170546,140]
[6,"FRA","Yes","Yes","Train",133242,2]
[10,"WAS","Yes","Yes","Fixed Object",30528,3]
[9,"HIG","No","No","Overturning",8053362,61]
[11,"TUS","Yes","No","Other Non-Collision",10176,1]
[10,"NOB","No","No","Other Object",40704,4]
[6,"MRW","No","No","Left Turn",8735823,185]
[6,"FAY","Yes","No","Sideswipe - Meeting",20352,2]
[7,"MOT","Yes","No","Pedestrian",10176,1]
[3,"ERI","Yes","Yes","Overturning",526719,2]
[2,"SAN","No","No","Sideswipe - Meeting",30528,3]
[1,"HAN","Yes","No","Other Non-Collision",2189445,59]
[2,"HEN","Yes","No","Angle",5707749,151]
[9,"ROS","Yes","No","Sideswipe - Passing",107325,5]
[7,"AUG","Yes","No","Animal",264576,26]
[2,"WOO","Yes","Yes","Animal",40704,4]
[12,"CUY","Yes","Yes","Rear End",1039653,31]
[7,"MOT","Yes","No","Fixed Object",90312,2]
[8,"CLE","Yes","Yes","Other Non-Collision",20352,2]
[8,"BUT","Yes","No","Fixed Object",30528,3]
[1,"WYA","Yes","Yes","Fixed Object",460098,1]
[2,"FUL","Yes","Yes","Animal",50880,5]
[4,"ATB","No","Yes","Backing",50880,5]
[3,"CRA","No","No","Sideswipe - Meeting",193185,10]
[7,"AUG","No","No","Parked Vehicle",908637,25]
[8,"WAR","Yes","Yes","Head On",704004,7]
[9,"ADA","No","No","Right Turn",1545066,42]
[12,"CUY","Yes","Yes","Other Non-Collision",10176,1]
[8,"PRE","No","Yes","Pedestrian",133242,2]
[2,"HEN","No","No","Animal",11101539,999]
[11,"BEL","Yes","No","Backing",10176,1]
[4,"STA","Yes","No","Pedalcycles",97149,4]
[2,"OTT","Yes","Yes","Angle",163770,5]
[6,"DEL","Yes","Yes","Overturning",634044,7]
[11,"COL","Yes","No","Sideswipe - Meeting",480450,3]
[7,"MOT","Yes","No","Backing",1243332,60]
[7,"LOG","Yes","No","Right Turn",20352,2]
[6,"MAR","Yes","No","Overturning",2534904,21]
[4,"TRU","Yes","Yes","Sideswipe - Passing",132288,13]
[7,"MIA","Yes","Yes","Unknown",50880,5]
[3,"CRA","Yes","Yes","Head On",10176,1]
[1,"PUT","Yes","No","Angle",2906805,52]
[1,"HAR","No","No","Other Non-Collision",1367511,59]
[4,"POR","Yes","No","Head On",5645706,60]
[1,"PAU","Yes","No","Rear End",20352,2]
[11,"COL","Yes","No","Left Turn",2118468,81]
[1,"ALL","Yes","No","Overturning",3685746,53]
[10,"ATH","No","No","Right Turn",905139,17]
[7,"MOT","No","No","Head On",3735687,23]
[6,"MRW","No","Yes","Head On",521154,7]
[4,"STA","Yes","No","Parked Vehicle",2102091,114]
[2,"FUL","No","No","Sideswipe - Meeting",460098,1]
[5,"LIC","Yes","Yes","Pedestrian",66621,1]
[4,"MAH","No","No","Parked Vehicle",855531,24]
[5,"LIC","Yes","No","Left Turn",749319,17]
[3,"CRA","Yes","Yes","Rear End",582051,4]
[1,"VAN","Yes","No","Overturning",1140411,7]
[10,"WAS","No","Yes","Animal",1088355,80]
[7,"AUG","Yes","No","Angle",10176,1]
[10,"ATH","No","No","Parked Vehicle",1480671,37]
[2,"WIL","No","Yes","Head On",66621,1]
[7,"MOT","Yes","Yes","Overturning",7098075,85]
[7,"AUG","Yes","Yes","Head On",66621,1]
[4,"ATB","Yes","Yes","Parked Vehicle",40704,4]
[8,"WAR","Yes","Yes","Animal",40704,4]
[2,"LUC","Yes","No","Parked Vehicle",1502343,91]
[7,"LOG","Yes","Yes","Head On",10176,1]
[8,"WAR","Yes","Yes","Left Turn",10176,1]
[5,"KNO","Yes","No","Left Turn",3027789,127]
[2,"WOO","Yes","Yes","Rear End",20352,2]
[8,"HAM","Yes","Yes","Angle",45156,1]
[3,"MED","No","Yes","Backing",40704,4]
[3,"WAY","Yes","Yes","Rear End",40704,4]
[4,"TRU","Yes","No","Sideswipe - Meeting",198750,5]
[8,"GRE","Yes","Yes","Overturning",66621,1]
[2,"WIL","Yes","No","Fixed Object",4057281,96]
[2,"FUL","No","No","Pedestrian",4936311,16]
[2,"SEN","Yes","No","Right Turn",1802805,66]
[9,"HIG","Yes","No","Animal",10176,1]
[3,"MED","Yes","No","Sideswipe - Passing",91584,9]
[3,"HUR","Yes","No","Sideswipe - Meeting",244065,15]
[6,"FAY","No","No","Parked Vehicle",1317855,21]
[6,"FRA","Yes","Yes","Left Turn",10176,1]
[3,"MED","Yes","Yes","Angle",536895,3]
[7,"LOG","Yes","No","Pedestrian",2519004,16]
[8,"GRE","No","No","Pedestrian",1678944,15]
[6,"FAY","Yes","No","Left Turn",3110850,84]
[6,"FRA","Yes","Yes","Overturning",10176,1]
[7,"AUG","No","No","Right Turn",467619,19]
[3,"MED","No","Yes","Unknown",91584,9]
[4,"ATB","Yes","No","Overturning",658848,6]
[8,"WAR","Yes","No","Rear End",2949195,111]
[9,"LAW","Yes","Yes","Angle",3538830,52]
[4,"STA","No","No","Sideswipe - Meeting",996993,4]
[10,"WAS","Yes","Yes","Sideswipe - Passing",837405,18]
[8,"PRE","Yes","No","Angle",153594,4]
[7,"CLA","Yes","No","Overturning",3538830,42]
[1,"VAN","Yes","No","Fixed Object",4976715,214]
[4,"TRU","Yes","Yes","Sideswipe - Meeting",460098,1]
[2,"WOO","Yes","Yes","Fixed Object",106212,7]
[2,"SEN","Yes","No","Parked Vehicle",10176,1]
[5,"GUE","Yes","No","Sideswipe - Passing",5204514,226]
[2,"LUC","Yes","Yes","Fixed Object",1211373,41]
[6,"MRW","Yes","Yes","Other Object",10176,1]
[1,"WYA","No","No","Other Object",653442,20]
[2,"SAN","Yes","No","Overturning",617031,4]
[6,"PIC","No","Yes","Angle",45156,1]
[9,"LAW","Yes","No","Backing",30528,3]
[6,"UNI","Yes","No","Other Object",10176,1]
[4,"STA","Yes","Yes","Angle",3482640,76]
[6,"MRW","Yes","Yes","Angle",107325,5]
[4,"POR","Yes","No","Unknown",10176,1]
[3,"LOR","No","No","Fixed Object",55758465,1022]
[10,"GAL","Yes","Yes","Parked Vehicle",66621,1]
[2,"SAN","No","No","Pedestrian",1276992,8]
[7,"MOT","Yes","Yes","Animal",10176,1]
[5,"MUS","No","Yes","Other Object",295104,29]
[8,"PRE","No","No","Right Turn",1695162,38]
[8,"CLI","No","Yes","Left Turn",10176,1]
[7,"MER","No","Yes","Other Object",10176,1]
[4,"ATB","No","Yes","Unknown",111936,11]
[5,"LIC","Yes","Yes","Fixed Object",960900,6]
[1,"HAN","Yes","No","Backing",223872,22]
[12,"CUY","No","No","Angle",1016916,19]
[8,"WAR","Yes","No","Rear End",19335162,854]
[5,"MUS","No","Yes","Angle",75684,4]
[9,"PIK","Yes","No","Sideswipe - Passing",3222420,97]
[3,"CRA","Yes","No","Other Object",61056,6]
[7,"AUG","Yes","No","Angle",4433571,140]
[3,"ERI","Yes","No","Other Non-Collision",40704,4]
[3,"RIC","Yes","No","Sideswipe - Passing",18848112,1031]
[4,"SUM","Yes","No","Sideswipe - Passing",577599,7]
[8,"CLI","No","Yes","Parked Vehicle",50880,5]
[2,"SAN","Yes","Yes","Rear End",1476060,31]
[11,"BEL","No","No","Backing",2154720,153]
[3,"MED","No","No","Other Object",223872,22]
[2,"SEN","Yes","No","Parked Vehicle",3554031,157]
[9,"SCI","Yes","Yes","Angle",10176,1]
[10,"ATH","No","Yes","Left Turn",66621,1]
[3,"ERI","Yes","No","Fixed Object",177285,5]
[10,"MOE","No","No","Animal",1668291,52]
[8,"GRE","No","No","Rear End",12422763,337]
[3,"CRA","Yes","No","Angle",7011024,219]
[11,"BEL","Yes","Yes","Other Non-Collision",10176,1]
[7,"MOT","Yes","Yes","Sideswipe - Passing",193185,10]
[4,"SUM","Yes","Yes","Fixed Object",390981,26]
[11,"BEL","Yes","Yes","Right Turn",10176,1]
[11,"TUS","Yes","Yes","Pedalcycles",111777,2]
[2,"FUL","Yes","No","Angle",1713129,35]
[10,"HOC","No","No","Overturning",7217643,83]
[5,"LIC","No","No","Pedalcycles",1735977,11]
[3,"ERI","Yes","Yes","Right Turn",30528,3]
[9,"HIG","Yes","No","Other Object",20352,2]
[2,"WOO","Yes","Yes","Rear End",11154198,356]
[6,"FAY","Yes","Yes","Left Turn",10176,1]
[4,"STA","Yes","No","Unknown",10176,1]
[10,"MOE","Yes","No","Left Turn",1117833,9]
[3,"CRA","Yes","No","Sideswipe - Meeting",50880,5]
[4,"SUM","Yes","Yes","Rear End",107325,5]
[4,"ATB","No","No","Other Object",258852,22]
[5,"LIC","Yes","No","Head On",545958,6]
[5,"LIC","Yes","No","Train",10176,1]
[8,"GRE","No","No","Fixed Object",46555218,1086]
[1,"DEF","No","No","Overturning",6661779,54]
[6,"FAY","Yes","No","Fixed Object",5043129,166]
[6,"DEL","No","Yes","Head On",223554,4]
[11,"CAR","No","No","Other Object",162657,7]
[4,"SUM","Yes","Yes","Overturning",198750,5]
[7,"SHE","Yes","No","Unknown",91584,9]
[10,"HOC","No","Yes","Sideswipe - Passing",1345728,41]
[8,"WAR","Yes","No","Fixed Object",49902486,1399]
[5,"COS","Yes","No","Rear End",20352,2]
[5,"COS","No","No","Fixed Object",32902986,610]
[7,"MOT","No","No","Sideswipe - Meeting",20352,2]
[10,"GAL","Yes","Yes","Parked Vehicle",20352,2]
[7,"AUG","Yes","No","Pedalcycles",265371,6]
[10,"GAL","Yes","No","Fixed Object",342327,17]
[8,"GRE","Yes","Yes","Right Turn",10176,1]
[9,"LAW","Yes","No","Unknown",10176,1]
[11,"JEF","Yes","Yes","Backing",10176,1]
[11,"JEF","No","Yes","Sideswipe - Passing",638655,13]
[2,"WOO","Yes","Yes","Left Turn",10176,1]
[3,"ASD","Yes","Yes","Other Non-Collision",71232,7]
[11,"TUS","Yes","Yes","Animal",45156,1]
[6,"UNI","No","Yes","Head On",1041036,7]
[4,"MAH","Yes","Yes","Pedestrian",66621,1]
[6,"FRA","Yes","Yes","Rear End",2263794,62]
[3,"RIC","Yes","Yes","Other Non-Collision",914250,65]
[4,"POR","Yes","No","Unknown",20352,2]
[3,"WAY","Yes","No","Rear End",10176,1]
[2,"FUL","Yes","No","Parked Vehicle",666528,33]
[4,"TRU","No","Yes","Rear End",2045280,51]
[10,"MEG","No","No","Other Non-Collision",1067112,13]
[1,"ALL","Yes","No","Unknown",30528,3]
[2,"LUC","Yes","No","Other Non-Vehicle",10176,1]
[6,"MAD","Yes","No","Sideswipe - Meeting",71232,7]
[6,"FAY","No","Yes","Rear End",4338234,94]
[6,"FAY","Yes","No","Rear End",7469247,353]
[6,"PIC","No","Yes","Other Object",168381,11]
[11,"BEL","Yes","No","Sideswipe - Passing",30528,3]
[8,"BUT","No","No","Animal",9662556,598]
[1,"DEF","Yes","No","Pedalcycles",1252713,16]
[4,"MAH","No","No","Fixed Object",48022770,1064]
[2,"LUC","Yes","Yes","Angle",271095,10]
[2,"SAN","Yes","Yes","Fixed Object",2347491,60]
[11,"JEF","Yes","Yes","Other Non-Collision",10176,1]
[1,"HAN","Yes","Yes","Animal",20352,2]
[2,"HEN","Yes","Yes","Fixed Object",66621,1]
[8,"GRE","No","No","Sideswipe - Meeting",500802,5]
[4,"SUM","Yes","Yes","Backing",524382,37]
[4,"ATB","Yes","Yes","Other Non-Collision",490626,4]
[8,"CLE","Yes","Yes","Angle",1090215,18]
[2,"HEN","Yes","No","Sideswipe - Passing",97149,4]
[12,"CUY","Yes","Yes","Pedestrian",66621,1]
[11,"BEL","No","Yes","Fixed Object",7034826,174]
[3,"LOR","No","No","Left Turn",14592522,243]
[4,"MAH","Yes","Yes","Overturning",65508,3]
[1,"HAR","Yes","No","Sideswipe - Passing",192072,12]
[3,"MED","Yes","Yes","Sideswipe - Passing",45156,1]
[2,"SEN","Yes","No","Parked Vehicle",10176,1]
[2,"WOO","Yes","Yes","Backing",10176,1]
[6,"FRA","Yes","No","Parked Vehicle",17323971,1208]
[3,"WAY","Yes","Yes","Other Non-Collision",137853,8]
[12,"CUY","No","No","Other Object",76797,2]
[1,"ALL","Yes","No","Fixed Object",47081268,1206]
[2,"WOO","Yes","Yes","Rear End",66621,1]
[3,"LOR","Yes","No","Angle",102863484,2666]
[10,"HOC","Yes","No","Other Non-Collision",10176,1]
[12,"CUY","Yes","Yes","Other Object",10176,1]
[8,"WAR","Yes","No","Sideswipe - Meeting",10176,1]
[11,"COL","Yes","No","Angle",14453478,379]
[7,"LOG","Yes","No","Other Object",20352,2]
[5,"FAI","No","Yes","Parked Vehicle",490626,4]
[7,"MIA","Yes","Yes","Angle",1037697,8]
[10,"VIN","No","No","Rear End",3109419,63]
[2,"WOO","Yes","No","Fixed Object",148029,9]
[4,"MAH","No","Yes","Left Turn",163770,5]
[12,"CUY","Yes","Yes","Angle",1312131,17]
[8,"BUT","Yes","Yes","Sideswipe - Passing",45156,1]
[4,"ATB","Yes","No","Other Object",117501,6]
[7,"CHP","No","No","Other Non-Collision",1575324,67]
[8,"CLE","No","No","Other Object",331197,27]
[8,"HAM","No","Yes","Pedestrian",66621,1]
[8,"WAR","Yes","Yes","Fixed Object",9690825,299]
[10,"ATH","No","Yes","Fixed Object",852351,34]
[3,"LOR","Yes","Yes","Angle",1213869,15]
[2,"SAN","Yes","Yes","Overturning",571875,3]
[12,"CUY","Yes","Yes","Sideswipe - Passing",811377,57]
[4,"SUM","Yes","No","Right Turn",10176,1]
[7,"LOG","No","Yes","Overturning",20352,2]
[4,"STA","Yes","Yes","Fixed Object",759495,18]
[5,"FAI","Yes","No","Pedestrian",4586877,19]
[9,"JAC","No","Yes","Sideswipe - Passing",30528,3]
[7,"SHE","No","Yes","Angle",10176,1]
[6,"PIC","Yes","No","Sideswipe - Passing",163770,5]
[5,"GUE","No","No","Pedalcycles",526719,2]
[5,"FAI","Yes","Yes","Head On",10176,1]
[12,"GEA","No","No","Other Object",468891,26]
[7,"AUG","No","Yes","Rear End",3452016,53]
[4,"STA","Yes","No","Angle",208353828,5941]
[1,"WYA","Yes","No","Rear End",4210605,127]
[1,"HAR","Yes","No","Other Non-Collision",888285,23]
[6,"UNI","Yes","Yes","Angle",10176,1]
[4,"SUM","Yes","No","Other Object",2736024,152]
[4,"STA","No","No","Rear End",18949506,583]
[1,"HAN","Yes","Yes","Parked Vehicle",30528,3]
[4,"SUM","Yes","Yes","Other Non-Collision",1420458,56]
[8,"CLE","No","No","Angle",26404692,469]
[12,"LAK","No","Yes","Right Turn",500802,5]
[5,"FAI","Yes","No","Head On",10145658,116]
[6,"MAR","No","No","Sideswipe - Meeting",460098,1]
[7,"MOT","No","Yes","Head On",10176,1]
[10,"VIN","No","No","Left Turn",1814730,31]
[3,"CRA","Yes","No","Backing",40704,4]
[2,"HEN","Yes","Yes","Rear End",10176,1]
[11,"JEF","Yes","No","Head On",10176,1]
[5,"PER","Yes","No","Angle",10176,1]
[4,"STA","Yes","Yes","Rear End",30528,3]
[1,"WYA","Yes","No","Left Turn",1943361,32]
[10,"GAL","Yes","Yes","Overturning",297012,7]
[6,"FAY","Yes","No","Angle",10176,1]
[2,"WOO","Yes","Yes","Rear End",96036,6]
[6,"PIC","Yes","No","Other Non-Collision",1323579,25]
[6,"DEL","Yes","No","Backing",5341875,398]
[2,"WOO","No","No","Head On",4267701,47]
[2,"WOO","No","No","Train",132129,4]
[4,"STA","Yes","No","Animal",40704,4]
[7,"MOT","Yes","Yes","Parked Vehicle",2594577,56]
[6,"FAY","No","Yes","Fixed Object",5981976,176]
[1,"VAN","Yes","No","Parked Vehicle",1690917,95]
[7,"SHE","Yes","No","Animal",3379386,321]
[5,"PER","No","No","Angle",15622173,231]
[4,"STA","Yes","Yes","Right Turn",106212,7]
[7,"MOT","Yes","No","Backing",24487716,1858]
[5,"GUE","Yes","Yes","Animal",20352,2]
[11,"BEL","Yes","Yes","Backing",10176,1]
[6,"FAY","Yes","Yes","Left Turn",10176,1]
[2,"WOO","Yes","No","Rear End",187620,15]
[8,"WAR","Yes","No","Left Turn",631548,33]
[7,"AUG","Yes","Yes","Angle",10176,1]
[2,"FUL","No","No","Rear End",13068000,323]
[4,"SUM","No","No","Fixed Object",11813760,271]
[7,"MOT","Yes","No","Rear End",2236287,105]
[4,"MAH","Yes","No","Animal",10176,1]
[12,"CUY","Yes","Yes","Head On",15636291,186]
[12,"CUY","Yes","Yes","Train",10176,1]
[2,"WOO","Yes","Yes","Left Turn",86973,3]
[4,"TRU","Yes","No","Animal",86973,3]
[10,"MOE","Yes","No","Fixed Object",1339320,21]
[6,"MAR","Yes","Yes","Overturning",10176,1]
[10,"VIN","No","No","Fixed Object",31642197,556]
[2,"WOO","Yes","Yes","Rear End",10176,1]
[4,"SUM","Yes","Yes","Animal",132129,4]
[7,"AUG","Yes","Yes","Other Object",50880,5]
[10,"HOC","Yes","No","Backing",1338414,77]
[3,"ASD","No","Yes","Sideswipe - Passing",6779949,192]
[7,"MIA","No","No","Sideswipe - Passing",2986719,120]
[2,"WOO","Yes","Yes","Fixed Object",15297306,426]
[4,"TRU","No","Yes","Fixed Object",5295351,165]
[9,"ROS","Yes","No","Animal",2416959,214]
[3,"ASD","Yes","No","Parked Vehicle",20352,2]
[6,"DEL","No","No","Sideswipe - Meeting",81408,8]
[4,"MAH","No","Yes","Head On",1082853,9]
[5,"FAI","Yes","No","Right Turn",203361,11]
[10,"ATH","No","Yes","Parked Vehicle",10176,1]
[3,"MED","Yes","Yes","Angle",50880,5]
[4,"SUM","No","No","Parked Vehicle",597951,9]
[12,"LAK","Yes","No","Sideswipe - Meeting",10176,1]
[3,"ERI","No","Yes","Sideswipe - Passing",9554547,367]
[11,"JEF","Yes","No","Overturning",76797,2]
[6,"FRA","No","No","Parked Vehicle",481452,37]
[2,"OTT","Yes","No","Pedalcycles",603516,4]
[5,"COS","Yes","No","Animal",482724,44]
[4,"POR","Yes","Yes","Parked Vehicle",165996,6]
[1,"ALL","No","Yes","Angle",76797,2]
[4,"STA","Yes","Yes","Other Object",10176,1]
[11,"JEF","Yes","Yes","Other Object",314184,24]
[10,"HOC","Yes","No","Unknown",30528,3]
[11,"BEL","No","Yes","Overturning",470958,13]
[9,"HIG","Yes","No","Sideswipe - Passing",1966734,80]
[10,"ATH","No","Yes","Rear End",280158,13]
[3,"MED","No","Yes","Other Non-Collision",636318,48]
[7,"CLA","No","No","Fixed Object",32638683,725]
[3,"WAY","Yes","No","Sideswipe - Passing",10176,1]
[8,"BUT","No","Yes","Other Object",45156,1]
[3,"WAY","Yes","Yes","Other Non-Collision",10176,1]
[1,"HAN","No","No","Animal",21062967,1667]
[2,"WOO","Yes","Yes","Sideswipe - Passing",61056,6]
[12,"LAK","Yes","Yes","Parked Vehicle",1530120,26]
[2,"HEN","No","Yes","Rear End",1247736,12]
[5,"GUE","No","No","Right Turn",1133733,14]
[8,"CLE","Yes","Yes","Other Object",839838,68]
[8,"BUT","Yes","Yes","Other Object",1731828,148]
[4,"ATB","No","No","Angle",36409728,432]
[4,"SUM","Yes","No","Other Non-Collision",480450,3]
[2,"FUL","Yes","No","Animal",30528,3]
[6,"DEL","No","No","Pedestrian",1343613,9]
[4,"STA","Yes","Yes","Rear End",111777,2]
[3,"MED","Yes","No","Overturning",714180,8]
[1,"HAN","Yes","Yes","Backing",116388,8]
[10,"NOB","No","Yes","Overturning",133242,2]
[8,"BUT","Yes","No","Pedalcycles",5173476,35]
[6,"FRA","Yes","No","Fixed Object",2933088,52]
[11,"TUS","No","No","Pedestrian",859824,7]
[3,"MED","No","No","Angle",52521054,867]
[8,"GRE","No","Yes","Overturning",475410,10]
[5,"FAI","No","No","Sideswipe - Meeting",10176,1]
[4,"STA","Yes","Yes","Other Non-Collision",1092807,77]
[8,"HAM","No","Yes","Other Non-Collision",110664,4]
[7,"MOT","Yes","Yes","Sideswipe - Meeting",460098,1]
[1,"WYA","No","Yes","Angle",10176,1]
[4,"MAH","Yes","No","Left Turn",602403,6]
[6,"FRA","Yes","No","Overturning",18678294,188]
[11,"JEF","No","Yes","Head On",45156,1]
[6,"UNI","Yes","No","Overturning",749160,8]
[7,"MOT","Yes","Yes","Parked Vehicle",65508,3]
[12,"CUY","Yes","Yes","Sideswipe - Passing",422622,27]
[2,"HEN","Yes","No","Pedalcycles",223554,4]
[2,"WOO","Yes","Yes","Right Turn",55332,2]
[4,"ATB","No","Yes","Parked Vehicle",61056,6]
[2,"LUC","Yes","No","Fixed Object",204489186,5112]
[8,"CLE","Yes","Yes","Other Non-Collision",605949,54]
[4,"SUM","Yes","No","Angle",412287,17]
[8,"WAR","Yes","Yes","Overturning",265371,6]
[6,"DEL","Yes","No","Other Non-Collision",20352,2]
[12,"CUY","Yes","Yes","Fixed Object",242069412,5351]
[7,"MER","No","No","Animal",11346144,900]
[2,"OTT","No","No","Fixed Object",35650632,643]
[1,"HAN","Yes","No","Parked Vehicle",673635,13]
[5,"COS","Yes","No","Backing",1168968,108]
[2,"FUL","Yes","No","Unknown",10176,1]
[4,"POR","Yes","Yes","Unknown",50880,5]
[4,"POR","Yes","Yes","Animal",50880,5]
[7,"MIA","Yes","Yes","Sideswipe - Passing",8208390,344]
[8,"CLI","Yes","No","Overturning",592227,5]
[11,"BEL","No","Yes","Rear End",4787727,107]
[7,"AUG","Yes","No","Right Turn",127677,7]
[12,"CUY","Yes","No","Head On",4335165,78]
[12,"CUY","Yes","No","Train",10176,1]
[2,"FUL","Yes","No","Backing",906300,65]
[3,"ERI","Yes","No","Sideswipe - Passing",11247309,671]
[4,"POR","Yes","No","Animal",7398873,430]
[3,"LOR","Yes","Yes","Unknown",264576,26]
[6,"FRA","Yes","No","Left Turn",172833,8]
[7,"SHE","Yes","Yes","Rear End",2860521,109]
[6,"MAD","Yes","No","Overturning",593340,3]
[9,"BRO","No","No","Fixed Object",56234307,1262]
[3,"CRA","No","No","Overturning",4198695,36]
[4,"POR","Yes","Yes","Rear End",155820,5]
[3,"MED","Yes","Yes","Other Non-Collision",10176,1]
[3,"LOR","Yes","No","Other Non-Collision",545958,6]
[2,"SAN","Yes","No","Backing",1817640,113]
[5,"MUS","Yes","Yes","Angle",162657,7]
[3,"HUR","No","No","Other Non-Collision",4446465,113]
[6,"PIC","Yes","No","Other Object",20352,2]
[5,"COS","No","No","Other Non-Vehicle",460098,1]
[8,"WAR","Yes","No","Sideswipe - Passing",30528,3]
[7,"AUG","No","No","Backing",456648,38]
[9,"LAW","Yes","Yes","Sideswipe - Passing",2001285,93]
[4,"POR","No","No","Overturning",6349122,61]
[3,"HUR","Yes","No","Sideswipe - Passing",340101,21]
[11,"BEL","Yes","Yes","Rear End",55332,2]
[10,"ATH","Yes","No","Animal",306234,19]
[7,"CLA","No","Yes","Animal",1926237,125]
[9,"LAW","Yes","Yes","Angle",45156,1]
[10,"WAS","Yes","No","Fixed Object",30528,3]
[3,"CRA","Yes","No","Sideswipe - Passing",1362948,98]
[2,"WIL","Yes","No","Angle",97149,4]
[10,"MEG","No","No","Unknown",40704,4]
[5,"PER","No","No","Other Non-Collision",1530009,62]
[12,"CUY","Yes","Yes","Pedalcycles",178398,3]
[0,"BUT","Yes","No","Left Turn",66621,1]
[2,"FUL","Yes","No","Sideswipe - Passing",277932,17]
[10,"ATH","Yes","Yes","Rear End",2177409,55]
[4,"SUM","Yes","No","Angle",26901156,814]
[1,"DEF","Yes","No","Angle",11157060,333]
[12,"GEA","Yes","No","Other Non-Collision",541506,9]
[7,"MOT","Yes","No","Right Turn",523110,30]
[2,"HEN","No","No","Other Non-Collision",980982,35]
[8,"HAM","No","No","Unknown",61056,6]
[12,"LAK","Yes","No","Sideswipe - Meeting",61056,6]
[2,"WOO","Yes","No","Angle",1748109,35]
[12,"CUY","Yes","Yes","Sideswipe - Passing",2007120,66]
[8,"CLE","Yes","Yes","Pedalcycles",10176,1]
[2,"OTT","No","No","Rear End",8616510,231]
[4,"TRU","Yes","No","Animal",120840,5]
[3,"LOR","Yes","No","Right Turn",269982,12]
[7,"MOT","Yes","Yes","Left Turn",66621,1]
[8,"HAM","Yes","Yes","Unknown",1115385,75]
[4,"POR","Yes","Yes","Parked Vehicle",66621,1]
[3,"RIC","No","No","Head On",8335380,72]
[3,"RIC","No","No","Train",10176,1]
[3,"WAY","No","No","Animal",11416740,801]
[1,"HAN","Yes","Yes","Sideswipe - Passing",20352,2]
[8,"PRE","No","No","Unknown",97149,4]
[2,"FUL","No","Yes","Overturning",265371,6]
[6,"DEL","Yes","Yes","Left Turn",133242,2]
[1,"HAN","Yes","No","Left Turn",20352,2]
[3,"MED","No","Yes","Fixed Object",9925509,363]
[7,"MIA","No","No","Angle",26731959,383]
[10,"MEG","Yes","No","Sideswipe - Passing",396705,30]
[8,"PRE","Yes","No","Animal",533604,49]
[10,"MOE","Yes","No","Parked Vehicle",86973,3]
[6,"MRW","Yes","Yes","Sideswipe - Passing",65508,3]
[3,"LOR","Yes","Yes","Parked Vehicle",20352,2]
[4,"STA","Yes","Yes","Pedalcycles",10176,1]
[3,"RIC","Yes","Yes","Rear End",66621,1]
[7,"SHE","Yes","No","Left Turn",97149,4]
[10,"NOB","No","No","Right Turn",40704,4]
[8,"PRE","No","No","Backing",2023020,71]
[6,"FRA","Yes","Yes","Pedalcycles",66621,1]
[4,"TRU","Yes","Yes","Rear End",10176,1]
[4,"STA","Yes","No","Animal",1144005,100]
[2,"LUC","Yes","Yes","Fixed Object",61884516,1632]
[2,"HEN","No","No","Sideswipe - Passing",3836907,87]
[7,"DAR","Yes","No","Angle",198750,5]
[11,"HAS","No","No","Animal",3968766,173]
[4,"SUM","Yes","No","Rear End",456489,29]
[12,"LAK","Yes","No","Pedestrian",18699393,125]
[4,"STA","No","Yes","Overturning",920196,2]
[4,"POR","Yes","No","Sideswipe - Passing",5498442,273]
[2,"SEN","Yes","No","Unknown",10176,1]
[5,"LIC","No","No","Other Object",187620,15]
[1,"VAN","Yes","No","Left Turn",2645298,52]
[4,"MAH","Yes","Yes","Pedalcycles",76797,2]
[7,"SHE","Yes","Yes","Other Non-Collision",10176,1]
[11,"HOL","No","No","Unknown",228165,10]
[8,"BUT","Yes","No","Right Turn",22383747,1024]
[8,"PRE","Yes","No","Parked Vehicle",20352,2]
[3,"ERI","No","Yes","Rear End",6394167,108]
[2,"WOO","Yes","No","Fixed Object",10176,1]
[8,"HAM","Yes","Yes","Overturning",15274281,154]
[1,"ALL","Yes","No","Sideswipe - Meeting",65508,3]
[12,"GEA","Yes","No","Fixed Object",6816216,148]
[5,"LIC","No","Yes","Head On",168381,11]
[3,"MED","Yes","Yes","Head On",10176,1]
[8,"WAR","Yes","No","Sideswipe - Passing",2724846,122]
[4,"SUM","Yes","Yes","Rear End",3805299,182]
[6,"FRA","Yes","No","Other Object",4006227,198]
[9,"PIK","Yes","No","Parked Vehicle",492741,36]
[1,"VAN","Yes","No","Head On",10176,1]
[4,"POR","Yes","Yes","Left Turn",20352,2]
[2,"SEN","Yes","No","Fixed Object",2536479,107]
[4,"SUM","Yes","Yes","Rear End",1333215,80]
[4,"TRU","Yes","No","Fixed Object",872385,18]
[11,"HAS","No","No","Rear End",6930267,131]
[6,"FAY","Yes","Yes","Other Object",91584,9]
[6,"MAR","No","No","Other Non-Collision",1270362,55]
[4,"MAH","No","No","Other Non-Collision",2601891,85]
[3,"LOR","Yes","No","Head On",18878412,240]
[3,"LOR","Yes","No","Train",20352,2]
[6,"UNI","Yes","No","Sideswipe - Passing",1193454,89]
[9,"ROS","Yes","No","Overturning",2157756,13]
[4,"SUM","Yes","No","Head On",55558365,987]
[4,"SUM","Yes","No","Train",470274,2]
[5,"COS","No","No","Right Turn",151368,8]
[11,"BEL","No","Yes","Other Object",371742,22]
[9,"JAC","Yes","Yes","Other Non-Collision",10176,1]
[7,"MIA","Yes","No","Fixed Object",9368055,304]
[11,"HOL","Yes","No","Angle",10176,1]
[2,"OTT","No","No","Right Turn",796860,23]
[6,"FRA","No","No","Pedalcycles",526719,2]
[7,"AUG","Yes","No","Backing",10176,1]
[1,"ALL","Yes","Yes","Pedestrian",143418,3]
[6,"UNI","Yes","Yes","Other Object",20352,2]
[9,"PIK","No","Yes","Left Turn",460098,1]
[3,"ERI","Yes","Yes","Fixed Object",7690239,176]
[11,"COL","Yes","Yes","Rear End",40704,4]
[12,"CUY","Yes","Yes","Pedestrian",460098,1]
[1,"HAN","Yes","Yes","Rear End",284610,10]
[8,"WAR","Yes","Yes","Animal",1282812,97]
[1,"PAU","No","No","Fixed Object",28039416,470]
[7,"CLA","Yes","No","Angle",5453079,148]
[2,"WOO","No","Yes","Rear End",9339975,175]
[3,"LOR","No","No","Sideswipe - Passing",9119856,250]
[4,"MAH","No","Yes","Animal",4160028,256]
[6,"FAY","Yes","No","Pedalcycles",2047617,16]
[5,"MUS","Yes","No","Backing",137853,8]
[2,"SAN","Yes","No","Angle",3926631,88]
[11,"JEF","No","Yes","Backing",10176,1]
[5,"LIC","Yes","No","Unknown",794046,31]
[10,"NOB","No","Yes","Sideswipe - Passing",567153,33]
[4,"ATB","Yes","No","Head On",1579044,8]
[4,"ATB","Yes","No","Train",10176,1]
[9,"LAW","Yes","Yes","Pedestrian",1380294,3]
[6,"MAR","Yes","No","Angle",107325,5]
[5,"FAI","Yes","No","Sideswipe - Passing",8307717,439]
[8,"PRE","Yes","No","Parked Vehicle",976260,60]
[5,"PER","No","No","Head On",12278880,103]
[5,"PER","No","No","Train",460098,1]
[11,"COL","Yes","No","Unknown",71232,7]
[2,"OTT","Yes","Yes","Overturning",470274,2]
[2,"WOO","Yes","No","Sideswipe - Passing",50880,5]
[5,"MUS","Yes","No","Unknown",10176,1]
[1,"ALL","Yes","No","Unknown",402429,34]
[2,"WIL","No","Yes","Unknown",106212,7]
[3,"WAY","Yes","Yes","Fixed Object",61056,6]
[3,"RIC","No","No","Animal",17202987,1213]
[7,"AUG","Yes","Yes","Sideswipe - Passing",371742,22]
[4,"MAH","Yes","No","Backing",13387656,990]
[8,"WAR","Yes","Yes","Parked Vehicle",66621,1]
[12,"GEA","Yes","Yes","Other Object",10176,1]
[1,"HAR","Yes","No","Pedestrian",1040448,11]
[11,"COL","Yes","Yes","Other Object",101760,10]
[11,"BEL","No","Yes","Animal",991206,76]
[5,"LIC","Yes","No","Sideswipe - Meeting",133242,2]
[8,"BUT","Yes","No","Pedestrian",1939179,13]
[3,"HUR","Yes","No","Pedestrian",638496,4]
[4,"SUM","Yes","Yes","Overturning",343281,6]
[5,"LIC","Yes","Yes","Fixed Object",193185,10]
[9,"JAC","Yes","Yes","Other Object",20352,2]
[8,"HAM","Yes","Yes","Pedestrian",10176,1]
[11,"COL","Yes","No","Left Turn",249630,10]
[1,"HAN","No","No","Parked Vehicle",1028364,32]
[8,"PRE","Yes","No","Fixed Object",3814218,115]
[8,"HAM","No","Yes","Sideswipe - Passing",769401,46]
[8,"WAR","No","No","Unknown",644220,8]
[2,"SAN","Yes","Yes","Animal",452196,41]
[10,"WAS","Yes","Yes","Backing",10176,1]
[1,"PUT","No","No","Pedestrian",571875,3]
[1,"WYA","Yes","No","Pedalcycles",76797,2]
[6,"FAY","No","Yes","Backing",111936,11]
[10,"WAS","Yes","No","Animal",1190115,90]
[7,"AUG","Yes","No","Unknown",10176,1]
[2,"LUC","Yes","Yes","Overturning",378261,6]
[7,"LOG","No","Yes","Angle",2269533,15]
[12,"LAK","Yes","No","Sideswipe - Passing",27595815,1624]
[3,"MED","No","Yes","Sideswipe - Passing",6157878,265]
[11,"CAR","No","No","Head On",5445906,46]
[11,"CAR","No","No","Train",66621,1]
[3,"ERI","Yes","Yes","Parked Vehicle",76797,2]
[7,"LOG","Yes","No","Other Object",71232,7]
[4,"POR","Yes","No","Pedestrian",1276992,8]
[2,"WOO","Yes","Yes","Right Turn",10176,1]
[4,"TRU","Yes","No","Parked Vehicle",71232,7]
[2,"OTT","Yes","Yes","Angle",55332,2]
[3,"RIC","Yes","Yes","Fixed Object",76797,2]
[6,"MRW","No","No","Angle",25252689,384]
[5,"FAI","No","Yes","Animal",1105209,74]
[8,"WAR","No","No","Pedalcycles",1600509,8]
[11,"JEF","No","Yes","Unknown",20352,2]
[4,"POR","Yes","No","Left Turn",20062044,540]
[9,"PIK","No","No","Pedestrian",2805744,7]
[1,"ALL","Yes","Yes","Other Object",183168,18]
[8,"GRE","No","No","Animal",12199830,800]
[9,"ROS","Yes","Yes","Overturning",143418,3]
[5,"KNO","Yes","No","Right Turn",1458936,64]
[8,"BUT","Yes","No","Other Object",30528,3]
[8,"WAR","No","No","Backing",1164039,84]
[8,"GRE","No","No","Other Object",325473,23]
[1,"HAN","Yes","Yes","Animal",10176,1]
[7,"MOT","Yes","Yes","Pedalcycles",460098,1]
[1,"WYA","Yes","Yes","Fixed Object",20352,2]
[3,"RIC","Yes","No","Pedestrian",12583047,75]
[2,"WOO","Yes","Yes","Sideswipe - Passing",97149,4]
[7,"MOT","Yes","Yes","Left Turn",45156,1]
[6,"MRW","No","No","Other Non-Collision",1325964,35]
[8,"CLE","No","No","Sideswipe - Meeting",233889,14]
[7,"CLA","Yes","No","Other Object",732195,45]
[8,"WAR","Yes","Yes","Other Non-Collision",71232,7]
[1,"ALL","Yes","No","Backing",127677,7]
[7,"MOT","Yes","No","Pedalcycles",86973,3]
[12,"GEA","No","Yes","Head On",526719,2]
[5,"COS","No","No","Unknown",20352,2]
[4,"MAH","Yes","Yes","Pedestrian",986817,3]
[8,"CLE","Yes","No","Other Non-Collision",10176,1]
[8,"CLI","Yes","Yes","Animal",10176,1]
[5,"FAI","Yes","No","Sideswipe - Meeting",10176,1]
[4,"STA","No","Yes","Angle",100488,3]
[7,"MOT","Yes","No","Fixed Object",1169826,12]
[4,"ATB","Yes","Yes","Other Non-Collision",10176,1]
[4,"TRU","Yes","No","Overturning",536895,3]
[7,"LOG","No","No","Pedalcycles",188574,4]
[7,"DAR","Yes","No","Other Object",111936,11]
[2,"LUC","Yes","Yes","Right Turn",10176,1]
[7,"CLA","No","Yes","Rear End",9834003,167]
[7,"CLA","Yes","No","Angle",108088875,2386]
[10,"WAS","Yes","Yes","Right Turn",10176,1]
[2,"FUL","Yes","Yes","Fixed Object",263304,19]
[3,"LOR","Yes","No","Head On",1072677,8]
[7,"AUG","Yes","No","Parked Vehicle",1019301,29]
[6,"MAD","Yes","No","Other Non-Collision",203361,11]
[11,"JEF","Yes","No","Animal",30528,3]
[9,"LAW","Yes","No","Overturning",1491642,18]
[6,"MRW","No","Yes","Backing",91584,9]
[12,"GEA","No","No","Sideswipe - Meeting",97149,4]
[11,"COL","Yes","Yes","Left Turn",10176,1]
[7,"CLA","Yes","Yes","Right Turn",30528,3]
[4,"POR","Yes","No","Overturning",10176,1]
[3,"MED","Yes","No","Pedalcycles",2140839,25]
[2,"WOO","Yes","No","Angle",23724813,651]
[8,"WAR","Yes","Yes","Angle",20352,2]
[8,"CLI","Yes","No","Pedalcycles",683652,5]
[3,"RIC","Yes","No","Fixed Object",249630,10]
[6,"PIC","Yes","No","Animal",10176,1]
[11,"JEF","No","No","Other Object",684924,12]
[3,"ERI","Yes","Yes","Left Turn",10176,1]
[2,"HEN","Yes","No","Overturning",145644,4]
[4,"TRU","Yes","Yes","Sideswipe - Passing",55332,2]
[10,"WAS","Yes","No","Animal",20352,2]
[1,"HAN","No","No","Overturning",5053050,68]
[8,"HAM","Yes","Yes","Parked Vehicle",11548929,201]
[7,"MIA","Yes","No","Left Turn",20352,2]
[3,"MED","Yes","Yes","Right Turn",143418,3]
[4,"SUM","Yes","No","Sideswipe - Meeting",1316742,23]
[1,"WYA","No","No","Rear End",6208836,78]
[8,"WAR","No","No","Right Turn",1314771,56]
[4,"ATB","Yes","Yes","Fixed Object",10176,1]
[1,"ALL","No","Yes","Head On",10176,1]
[2,"LUC","No","Yes","Fixed Object",2929113,82]
[7,"CHP","Yes","No","Angle",9564579,253]
[1,"VAN","Yes","No","Overturning",10176,1]
[5,"FAI","Yes","Yes","Rear End",509595,30]
[5,"FAI","Yes","Yes","Rear End",355842,17]
[4,"ATB","Yes","No","Sideswipe - Passing",1120107,50]
[7,"SHE","No","Yes","Parked Vehicle",10176,1]
[7,"LOG","Yes","Yes","Fixed Object",1702269,18]
[7,"LOG","Yes","No","Parked Vehicle",71232,7]
[4,"STA","Yes","No","Overturning",10176,1]
[8,"GRE","Yes","Yes","Other Non-Collision",1242903,73]
[9,"HIG","Yes","No","Other Non-Collision",1449984,25]
[9,"BRO","No","No","Sideswipe - Passing",7273548,197]
[11,"BEL","Yes","Yes","Left Turn",10176,1]
[11,"TUS","Yes","No","Backing",4447230,395]
[7,"CLA","Yes","No","Other Non-Collision",3575988,68]
[4,"ATB","Yes","No","Sideswipe - Meeting",10176,1]
[11,"TUS","Yes","Yes","Rear End",86973,3]
[12,"CUY","Yes","Yes","Parked Vehicle",107325,5]
[10,"MOE","No","No","Rear End",3421377,96]
[7,"DAR","Yes","No","Sideswipe - Passing",10176,1]
[4,"SUM","Yes","Yes","Angle",1145865,38]
[11,"BEL","Yes","Yes","Rear End",10176,1]
[7,"MIA","Yes","Yes","Left Turn",1052325,6]
[6,"MRW","No","Yes","Unknown",477954,29]
[2,"LUC","No","Yes","Left Turn",187461,6]
[2,"HEN","Yes","No","Fixed Object",116388,8]
[2,"SEN","Yes","No","Head On",2595372,31]
[2,"SEN","Yes","No","Train",470274,2]
[7,"DAR","No","No","Backing",2111583,99]
[5,"PER","No","No","Parked Vehicle",2764389,83]
[7,"CLA","Yes","No","Pedalcycles",505254,2]
[5,"GUE","Yes","Yes","Overturning",143418,3]
[7,"AUG","Yes","No","Fixed Object",930372,3]
[11,"TUS","Yes","No","Unknown",96036,6]
[7,"MIA","Yes","No","Rear End",9568047,453]
[3,"MED","Yes","Yes","Animal",1994448,91]
[2,"OTT","Yes","No","Head On",470274,2]
[9,"PIK","Yes","No","Other Non-Collision",10176,1]
[7,"MIA","No","No","Pedestrian",1624200,9]
[8,"BUT","Yes","No","Other Object",490626,4]
[7,"AUG","No","Yes","Angle",254082,7]
[12,"LAK","Yes","Yes","Animal",20352,2]
[3,"RIC","Yes","Yes","Animal",45156,1]
[4,"SUM","Yes","Yes","Angle",85860,5]
[6,"UNI","Yes","No","Other Non-Collision",531330,8]
[4,"SUM","Yes","Yes","Animal",10176,1]
[4,"SUM","Yes","Yes","Fixed Object",6212907,138]
[4,"SUM","Yes","Yes","Fixed Object",535512,27]
[11,"HOL","No","No","Parked Vehicle",1257960,58]
[2,"SAN","Yes","No","Sideswipe - Passing",162816,16]
[5,"FAI","Yes","Yes","Sideswipe - Passing",120840,5]
[2,"WOO","Yes","No","Sideswipe - Passing",146916,11]
[4,"MAH","Yes","Yes","Overturning",66621,1]
[4,"POR","No","Yes","Other Non-Collision",432957,37]
[7,"LOG","Yes","No","Angle",6455193,286]
[10,"WAS","Yes","No","Right Turn",544575,30]
[7,"CLA","Yes","Yes","Other Object",61056,6]
[1,"VAN","Yes","No","Pedalcycles",510390,10]
[8,"HAM","Yes","Yes","Other Non-Vehicle",460098,1]
[8,"BUT","Yes","No","Pedestrian",12725319,44]
[5,"FAI","Yes","No","Angle",38059662,1042]
[1,"PAU","Yes","No","Animal",10176,1]
[6,"FRA","No","No","Unknown",30528,3]
[6,"DEL","No","Yes","Unknown",101760,10]
[6,"FRA","Yes","Yes","Sideswipe - Passing",194298,8]
[4,"MAH","Yes","Yes","Other Non-Collision",1342707,65]
[9,"HIG","Yes","No","Angle",6372687,229]
[7,"SHE","Yes","No","Overturning",842970,13]
[6,"MAD","Yes","No","Rear End",66621,1]
[3,"MED","Yes","No","Rear End",2325867,51]
[1,"ALL","No","No","Overturning",8108853,67]
[12,"LAK","Yes","Yes","Fixed Object",239454,9]
[3,"ERI","No","Yes","Left Turn",45156,1]
[1,"HAN","Yes","No","Left Turn",12812235,454]
[2,"OTT","Yes","No","Rear End",12483420,309]
[8,"BUT","Yes","No","Pedalcycles",133242,2]
[12,"LAK","Yes","Yes","Rear End",2620272,125]
[10,"MRG","No","No","Animal",2258340,101]
[1,"VAN","No","No","Left Turn",3057330,40]
[5,"MUS","No","No","Pedestrian",1120059,5]
[6,"MAR","Yes","No","Unknown",402270,25]
[11,"TUS","No","No","Other Non-Collision",1331577,70]
[12,"LAK","Yes","No","Other Non-Collision",61056,6]
[12,"CUY","Yes","Yes","Fixed Object",876567,42]
[8,"WAR","Yes","No","Animal",290493,23]
[5,"GUE","No","No","Falling From Or In Vehicle",460098,1]
[3,"ASD","No","Yes","Parked Vehicle",194298,8]
[4,"SUM","Yes","Yes","Other Object",10176,1]
[3,"LOR","Yes","Yes","Sideswipe - Passing",12887250,526]
[5,"FAI","No","No","Sideswipe - Passing",5919696,203]
[8,"PRE","No","Yes","Angle",121953,3]
[8,"WAR","Yes","Yes","Left Turn",378420,15]
[9,"JAC","Yes","No","Angle",8045319,229]
[3,"MED","Yes","No","Right Turn",131016,6]
[8,"WAR","Yes","No","Other Object",106212,7]
[7,"CLA","No","No","Backing",1593720,46]
[3,"HUR","Yes","No","Right Turn",20352,2]
[2,"HEN","No","No","Head On",3704046,22]
[2,"HEN","No","No","Train",460098,1]
[10,"ATH","No","No","Head On",4879851,62]
[6,"FRA","Yes","No","Pedalcycles",94402674,1012]
[12,"LAK","Yes","No","Other Object",30528,3]
[7,"MOT","Yes","Yes","Sideswipe - Passing",10176,1]
[11,"HAS","No","No","Overturning",7162311,76]
[1,"ALL","Yes","No","Fixed Object",1724577,43]
[5,"GUE","No","Yes","Head On",1062501,7]
[4,"POR","Yes","No","Head On",8404737,127]
[4,"POR","Yes","No","Train",66621,1]
[9,"HIG","Yes","No","Left Turn",158205,10]
[4,"TRU","Yes","Yes","Animal",10176,1]
[6,"FAY","No","Yes","Right Turn",10176,1]
[1,"PAU","No","No","Unknown",61056,6]
[8,"CLE","Yes","No","Pedestrian",10176,1]
[2,"WOO","Yes","No","Other Object",71232,7]
[3,"CRA","Yes","Yes","Unknown",20352,2]
[4,"SUM","Yes","Yes","Parked Vehicle",10176,1]
[7,"CLA","Yes","Yes","Other Object",478113,38]
[8,"CLE","Yes","Yes","Sideswipe - Passing",270141,21]
[3,"LOR","Yes","No","Sideswipe - Meeting",1663791,15]
[3,"HUR","Yes","No","Pedalcycles",2661993,37]
[5,"MUS","Yes","No","Left Turn",20004294,592]
[5,"GUE","Yes","Yes","Head On",55332,2]
[9,"SCI","Yes","No","Parked Vehicle",14469108,601]
[9,"HIG","Yes","No","Rear End",998520,45]
[4,"TRU","No","No","Head On",8985165,75]
[5,"FAI","Yes","No","Left Turn",245178,13]
[1,"ALL","Yes","No","Animal",8452122,727]
[8,"GRE","Yes","No","Head On",16176558,199]
[8,"PRE","Yes","No","Rear End",10176,1]
[7,"AUG","Yes","No","Fixed Object",20352,2]
[7,"LOG","No","No","Other Object",193344,19]
[8,"BUT","Yes","Yes","Backing",10176,1]
[8,"WAR","Yes","No","Pedalcycles",111777,2]
[3,"RIC","No","Yes","Backing",10176,1]
[7,"MER","No","No","Overturning",5003346,50]
[7,"AUG","Yes","Yes","Fixed Object",177444,14]
[4,"POR","Yes","Yes","Rear End",1327332,62]
[7,"CLA","Yes","Yes","Pedestrian",1446915,4]
[7,"CLA","Yes","No","Sideswipe - Passing",2894292,91]
[8,"GRE","Yes","Yes","Animal",3007167,207]
[7,"CLA","Yes","Yes","Other Non-Collision",91584,9]
[10,"ATH","Yes","No","Overturning",66621,1]
[3,"LOR","No","Yes","Animal",1104255,85]
[3,"WAY","Yes","No","Backing",30528,3]
[6,"FRA","Yes","Yes","Left Turn",110664,4]
[12,"GEA","No","No","Overturning",8357799,66]
[8,"WAR","Yes","No","Sideswipe - Passing",18251178,940]
[5,"KNO","No","No","Rear End",11333184,285]
[9,"ROS","Yes","No","Pedestrian",45156,1]
[3,"MED","No","No","Sideswipe - Meeting",991428,9]
[10,"HOC","Yes","No","Head On",526719,2]
[10,"MEG","Yes","No","Fixed Object",10176,1]
[3,"ERI","Yes","Yes","Other Object",521154,7]
[8,"HAM","Yes","No","Rear End",11771040,608]
[12,"CUY","Yes","Yes","Sideswipe - Meeting",20352,2]
[4,"POR","Yes","Yes","Left Turn",10176,1]
[10,"MRG","No","No","Pedalcycles",66621,1]
[11,"BEL","Yes","No","Sideswipe - Passing",3495249,202]
[12,"GEA","Yes","Yes","Angle",10176,1]
[5,"PER","Yes","No","Pedestrian",45156,1]
[1,"PUT","No","No","Overturning",7407075,66]
[4,"ATB","Yes","Yes","Fixed Object",20352,2]
[3,"CRA","No","Yes","Angle",505254,2]
[8,"CLE","Yes","No","Parked Vehicle",4614402,253]
[7,"CLA","Yes","Yes","Fixed Object",545958,6]
[11,"JEF","No","Yes","Rear End",842970,13]
[3,"WAY","Yes","No","Fixed Object",4739550,125]
[10,"WAS","Yes","Yes","Fixed Object",1175121,34]
[4,"MAH","Yes","Yes","Other Object",10176,1]
[10,"GAL","No","No","Overturning",4145415,67]
[7,"SHE","No","Yes","Head On",1042149,5]
[7,"MOT","Yes","Yes","Sideswipe - Passing",171720,10]
[1,"PUT","Yes","No","Angle",10176,1]
[5,"LIC","Yes","No","Backing",4727658,381]
[4,"MAH","No","No","Sideswipe - Passing",7215720,226]
[4,"SUM","Yes","Yes","Unknown",10176,1]
[3,"WAY","Yes","Yes","Head On",470274,2]
[9,"LAW","No","No","Unknown",10176,1]
[8,"HAM","No","No","Parked Vehicle",1253508,61]
[9,"PIK","Yes","No","Fixed Object",9435279,185]
[11,"TUS","No","Yes","Other Non-Collision",453309,39]
[9,"ROS","Yes","No","Other Object",20352,2]
[6,"MAD","No","No","Left Turn",9695721,167]
[8,"HAM","No","No","Fixed Object",19427808,523]
[3,"ERI","Yes","No","Pedestrian",8788323,53]
[7,"MOT","No","No","Other Object",490626,4]
[3,"HUR","Yes","No","Animal",3939972,325]
[11,"JEF","Yes","No","Backing",30528,3]
[7,"DAR","Yes","No","Other Object",10176,1]
[1,"HAN","No","No","Rear End",7652430,240]
[4,"SUM","Yes","Yes","Pedestrian",66621,1]
[8,"PRE","Yes","No","Right Turn",10176,1]
[8,"HAM","Yes","No","Rear End",662282430,30944]
[5,"MUS","Yes","Yes","Angle",61056,6]
[7,"AUG","Yes","Yes","Head On",460098,1]
[5,"MUS","No","Yes","Pedestrian",505254,2]
[1,"WYA","Yes","Yes","Rear End",55332,2]
[1,"ALL","Yes","No","Parked Vehicle",162816,16]
[5,"FAI","Yes","Yes","Other Object",30528,3]
[8,"GRE","Yes","No","Pedestrian",45156,1]
[8,"HAM","No","Yes","Overturning",45156,1]
[6,"UNI","No","No","Parked Vehicle",1030749,37]
[3,"LOR","Yes","No","Pedestrian",1492071,5]
[4,"SUM","Yes","Yes","Angle",30528,3]
[3,"WAY","No","Yes","Angle",153594,4]
[4,"MAH","Yes","No","Rear End",324201,16]
[6,"DEL","Yes","Yes","Rear End",7157034,221]
[3,"ERI","Yes","No","Head On",10176,1]
[3,"LOR","Yes","Yes","Animal",4439598,343]
[3,"LOR","Yes","Yes","Rear End",137853,8]
[9,"ROS","Yes","Yes","Pedestrian",460098,1]
[6,"UNI","Yes","No","Sideswipe - Passing",3635439,175]
[10,"HOC","Yes","No","Overturning",45156,1]
[12,"CUY","Yes","Yes","Fixed Object",1206078,19]
[7,"SHE","No","Yes","Other Non-Collision",280317,22]
[2,"WOO","Yes","No","Overturning",66621,1]
[8,"GRE","Yes","Yes","Head On",1133733,14]
[2,"SEN","No","No","Falling From Or In Vehicle",460098,1]
[5,"FAI","No","Yes","Fixed Object",3855717,99]
[2,"WOO","Yes","No","Animal",3119214,252]
[3,"RIC","Yes","No","Sideswipe - Passing",40704,4]
[6,"PIC","Yes","No","Angle",10087959,266]
[1,"PAU","No","Yes","Other Non-Collision",254400,25]
[12,"CUY","Yes","Yes","Overturning",602403,6]
[4,"SUM","Yes","No","Angle",132129,4]
[10,"GAL","No","No","Rear End",6759231,132]
[11,"JEF","Yes","Yes","Angle",2485455,37]
[11,"HAS","No","No","Unknown",122112,12]
[6,"PIC","Yes","No","Sideswipe - Passing",2514648,104]
[5,"FAI","Yes","No","Angle",10176,1]
[4,"MAH","Yes","Yes","Right Turn",20352,2]
[2,"LUC","No","Yes","Other Object",116388,8]
[11,"TUS","No","No","Head On",7051122,75]
[11,"TUS","No","No","Train",66621,1]
[5,"FAI","Yes","No","Other Object",40704,4]
[11,"BEL","No","No","Right Turn",1394541,54]
[6,"MRW","No","No","Backing",1410171,86]
[10,"MEG","Yes","Yes","Rear End",10176,1]
[3,"HUR","Yes","No","Angle",748890,30]
[8,"WAR","No","No","Rear End",12998979,433]
[4,"STA","Yes","No","Head On",1329144,20]
[3,"HUR","Yes","No","Sideswipe - Meeting",10176,1]
[10,"VIN","Yes","No","Rear End",699552,10]
[4,"POR","Yes","No","Backing",4552170,390]
[8,"WAR","Yes","Yes","Right Turn",85860,5]
[3,"HUR","Yes","No","Pedalcycles",20352,2]
[11,"BEL","Yes","Yes","Unknown",172992,17]
[2,"WOO","Yes","Yes","Backing",218148,18]
[9,"SCI","Yes","No","Right Turn",3517938,164]
[6,"FAY","Yes","Yes","Backing",20352,2]
[3,"MED","Yes","No","Sideswipe - Passing",2930163,156]
[10,"NOB","Yes","Yes","Rear End",45156,1]
[3,"LOR","Yes","No","Other Non-Collision",6398475,110]
[5,"FAI","Yes","Yes","Right Turn",10176,1]
[3,"ERI","Yes","Yes","Rear End",2272857,70]
[2,"LUC","Yes","No","Sideswipe - Passing",30528,3]
[7,"CLA","Yes","Yes","Other Non-Collision",10176,1]
[4,"SUM","Yes","No","Sideswipe - Passing",118929984,6855]
[5,"LIC","Yes","No","Parked Vehicle",7275855,404]
[11,"TUS","Yes","Yes","Sideswipe - Passing",45156,1]
[11,"BEL","Yes","No","Parked Vehicle",1810215,115]
[10,"ATH","Yes","Yes","Rear End",10176,1]
[6,"DEL","No","Yes","Sideswipe - Passing",3695319,189]
[7,"SHE","Yes","No","Sideswipe - Passing",137853,8]
[10,"MRG","Yes","No","Fixed Object",10176,1]
[7,"DAR","Yes","No","Head On",536895,3]
[4,"ATB","Yes","No","Left Turn",20352,2]
[9,"PIK","Yes","No","Backing",570810,45]
[11,"JEF","No","No","Pedestrian",1053438,4]
[2,"WIL","No","Yes","Backing",645381,51]
[9,"JAC","Yes","Yes","Fixed Object",40704,4]
[2,"LUC","Yes","No","Rear End",430974612,16873]
[10,"ATH","Yes","No","Sideswipe - Passing",2681964,162]
[7,"MOT","No","No","Sideswipe - Passing",3423603,87]
[12,"CUY","No","Yes","Sideswipe - Passing",1054440,38]
[5,"GUE","No","No","Angle",4468821,108]
[7,"MOT","Yes","No","Other Non-Vehicle",133242,2]
[5,"LIC","Yes","No","Backing",1450239,119]
[5,"FAI","No","No","Head On",9699345,88]
[7,"MOT","No","Yes","Parked Vehicle",76797,2]
[2,"WOO","Yes","Yes","Unknown",50880,5]
[2,"WOO","Yes","Yes","Backing",10176,1]
[12,"CUY","Yes","No","Other Non-Collision",86973,3]
[11,"TUS","Yes","Yes","Rear End",30528,3]
[8,"WAR","Yes","No","Fixed Object",3603861,88]
[7,"AUG","Yes","Yes","Backing",30528,3]
[4,"STA","Yes","Yes","Animal",126564,9]
[5,"GUE","Yes","No","Backing",1052421,91]
[1,"VAN","No","No","Unknown",222600,15]
[6,"MAD","No","Yes","Rear End",16322505,277]
[6,"MAD","Yes","No","Pedalcycles",10176,1]
[6,"MAD","No","No","Sideswipe - Passing",5462523,158]
[6,"FRA","Yes","Yes","Other Non-Collision",16339806,410]
[10,"GAL","Yes","No","Animal",107325,5]
[3,"ASD","Yes","Yes","Head On",45156,1]
[8,"GRE","No","Yes","Sideswipe - Passing",2388354,73]
[7,"MOT","Yes","No","Right Turn",46853796,1986]
[9,"JAC","Yes","No","Overturning",1574592,11]
[4,"POR","Yes","No","Left Turn",592227,5]
[2,"WOO","Yes","Yes","Backing",30528,3]
[12,"LAK","Yes","Yes","Animal",3427722,247]
[2,"OTT","Yes","No","Right Turn",10176,1]
[4,"SUM","No","No","Animal",544893,48]
[8,"WAR","Yes","Yes","Parked Vehicle",66621,1]
[11,"COL","Yes","Yes","Right Turn",20352,2]
[3,"LOR","Yes","Yes","Right Turn",85860,5]
[3,"WAY","Yes","Yes","Fixed Object",20352,2]
[10,"MOE","Yes","No","Fixed Object",111777,2]
[9,"JAC","Yes","Yes","Parked Vehicle",10176,1]
[2,"WOO","No","Yes","Right Turn",65508,3]
[9,"BRO","Yes","No","Rear End",10176,1]
[9,"LAW","No","Yes","Overturning",66621,1]
[1,"HAN","Yes","Yes","Fixed Object",173946,6]
[7,"MOT","Yes","No","Pedalcycles",571875,3]
[4,"POR","Yes","No","Left Turn",111777,2]
[2,"WOO","Yes","Yes","Unknown",270141,21]
[8,"HAM","Yes","Yes","Angle",40704,4]
[4,"POR","Yes","No","Unknown",202248,13]
[6,"DEL","Yes","Yes","Rear End",20352,2]
[6,"PIC","Yes","No","Animal",497193,33]
[12,"CUY","Yes","No","Sideswipe - Passing",238341,11]
[10,"GAL","Yes","No","Angle",10176,1]
[8,"HAM","Yes","No","Pedalcycles",223554,4]
[6,"UNI","Yes","Yes","Rear End",1336554,79]
[4,"TRU","Yes","No","Right Turn",10176,1]
[6,"FRA","Yes","No","Overturning",66621,1]
[8,"HAM","Yes","No","Overturning",20352,2]
[8,"PRE","Yes","No","Other Non-Collision",260919,9]
[2,"SAN","Yes","No","Other Object",20352,2]
[7,"MIA","Yes","No","Right Turn",994386,66]
[3,"CRA","Yes","No","Sideswipe - Passing",1495506,89]
[12,"LAK","Yes","No","Head On",19636524,257]
[12,"LAK","Yes","No","Train",490626,4]
[2,"SAN","Yes","Yes","Backing",10176,1]
[10,"HOC","Yes","Yes","Fixed Object",107325,5]
[8,"BUT","Yes","Yes","Overturning",1522695,23]
[2,"FUL","Yes","Yes","Parked Vehicle",10176,1]
[10,"ATH","Yes","Yes","Other Non-Collision",10176,1]
[8,"CLI","Yes","Yes","Other Non-Collision",40704,4]
[11,"TUS","Yes","No","Left Turn",12607695,338]
[7,"AUG","Yes","No","Left Turn",66621,1]
[10,"WAS","Yes","Yes","Sideswipe - Passing",20352,2]
[10,"NOB","Yes","Yes","Fixed Object",10176,1]
[4,"TRU","Yes","Yes","Fixed Object",30528,3]
[11,"BEL","No","Yes","Pedestrian",526719,2]
[7,"CLA","Yes","Yes","Rear End",30528,3]
[8,"HAM","Yes","No","Parked Vehicle",3830691,232]
[5,"COS","Yes","No","Left Turn",1850982,43]
[6,"UNI","Yes","Yes","Fixed Object",122112,12]
[2,"HEN","Yes","No","Left Turn",526719,2]
[1,"HAN","No","No","Right Turn",836451,29]
[7,"DAR","No","No","Animal",14572380,1088]
[1,"HAN","No","Yes","Pedestrian",66621,1]
[3,"WAY","Yes","No","Rear End",10176,1]
[3,"WAY","Yes","Yes","Rear End",90312,2]
[6,"PIC","Yes","No","Other Non-Collision",65508,3]
[10,"WAS","Yes","No","Other Object",76797,2]
[2,"LUC","Yes","No","Rear End",3538338,151]
[4,"MAH","Yes","No","Parked Vehicle",192072,12]
[2,"WOO","No","No","Backing",2301477,155]
[9,"JAC","No","No","Overturning",7468290,71]
[2,"OTT","Yes","No","Sideswipe - Passing",775236,14]
[6,"DEL","No","No","Other Non-Collision",1813395,100]
[3,"WAY","Yes","Yes","Angle",66621,1]
[3,"LOR","Yes","No","Fixed Object",2930910,91]
[4,"ATB","Yes","No","Sideswipe - Passing",628050,25]
[5,"KNO","Yes","No","Right Turn",20352,2]
[12,"GEA","No","Yes","Other Non-Collision",50880,5]
[4,"SUM","Yes","Yes","Other Non-Collision",45156,1]
[5,"GUE","Yes","Yes","Rear End",797814,12]
[9,"JAC","No","Yes","Angle",133242,2]
[1,"WYA","No","No","Right Turn",745980,18]
[3,"MED","Yes","No","Backing",4158867,283]
[12,"CUY","Yes","Yes","Animal",30528,3]
[4,"SUM","No","Yes","Left Turn",97149,4]
[8,"BUT","Yes","No","Right Turn",4107447,197]
[12,"CUY","Yes","No","Other Non-Collision",28500168,674]
[2,"OTT","Yes","No","Overturning",490626,4]
[11,"TUS","No","Yes","Parked Vehicle",30528,3]
[11,"JEF","Yes","No","Parked Vehicle",5009739,191]
[7,"CLA","Yes","Yes","Rear End",96036,6]
[9,"HIG","Yes","No","Fixed Object",2213931,40]
[4,"SUM","Yes","Yes","Backing",10176,1]
[5,"FAI","Yes","No","Backing",5490651,407]
[3,"ASD","No","Yes","Head On",10176,1]
[12,"CUY","Yes","Yes","Angle",219102,7]
[6,"DEL","Yes","No","Other Non-Collision",1802106,101]
[2,"FUL","No","No","Pedalcycles",1332324,10]
[7,"MOT","Yes","Yes","Fixed Object",74985174,1839]
[6,"MAD","No","No","Parked Vehicle",2168664,70]
[4,"MAH","Yes","Yes","Other Non-Collision",10176,1]
[10,"MOE","No","No","Right Turn",637542,15]
[12,"CUY","Yes","Yes","Parked Vehicle",595566,4]
[4,"MAH","Yes","No","Fixed Object",1438266,44]
[11,"JEF","No","No","Angle",4589343,90]
[4,"SUM","Yes","Yes","Angle",76797,2]
[1,"ALL","Yes","No","Rear End",70216236,2630]
[3,"MED","No","Yes","Left Turn",66621,1]
[7,"MOT","Yes","Yes","Other Object",65508,3]
[1,"WYA","Yes","No","Rear End",10176,1]
[10,"HOC","Yes","Yes","Animal",20352,2]
[3,"MED","No","Yes","Head On",40704,4]
[7,"MOT","Yes","No","Head On",79412565,977]
[7,"MOT","Yes","No","Train",577599,7]
[11,"BEL","Yes","No","Fixed Object",111777,2]
[7,"DAR","Yes","Yes","Animal",20352,2]
[7,"CLA","Yes","Yes","Fixed Object",628479,12]
[4,"ATB","Yes","No","Head On",1914789,52]
[12,"CUY","Yes","Yes","Right Turn",5565969,223]
[10,"MEG","Yes","No","Angle",1557309,30]
[9,"SCI","No","Yes","Overturning",470274,2]
[6,"UNI","No","No","Backing",784506,66]
[3,"MED","Yes","No","Pedalcycles",286836,6]
[3,"LOR","Yes","Yes","Other Object",203520,20]
[10,"WAS","Yes","Yes","Head On",10176,1]
[5,"GUE","Yes","Yes","Fixed Object",559044,19]
[3,"ERI","No","Yes","Head On",117501,6]
[5,"LIC","Yes","Yes","Right Turn",10176,1]
[7,"DAR","Yes","No","Other Object",10176,1]
[9,"SCI","No","Yes","Animal",158205,10]
[7,"SHE","Yes","No","Parked Vehicle",264258,8]
[8,"HAM","Yes","Yes","Animal",6779394,437]
[11,"COL","Yes","No","Right Turn",787686,56]
[1,"ALL","Yes","Yes","Rear End",142305,5]
[6,"DEL","Yes","Yes","Fixed Object",5194323,211]
[6,"DEL","Yes","Yes","Fixed Object",61056,6]
[6,"MAR","Yes","No","Rear End",36251091,1283]
[5,"LIC","Yes","No","Fixed Object",34953324,856]
[2,"LUC","Yes","No","Pedalcycles",40899030,403]
[6,"UNI","Yes","Yes","Angle",580938,6]
[3,"LOR","Yes","No","Sideswipe - Passing",716613,58]
[7,"LOG","No","No","Falling From Or In Vehicle",460098,1]
[10,"HOC","Yes","No","Pedalcycles",100488,3]
[8,"WAR","Yes","No","Head On",17572815,206]
[8,"WAR","Yes","No","Train",55332,2]
[7,"CLA","Yes","Yes","Fixed Object",81408,8]
[10,"GAL","Yes","No","Pedestrian",460098,1]
[10,"HOC","Yes","Yes","Animal",61056,6]
[1,"WYA","Yes","Yes","Angle",10176,1]
[5,"COS","No","No","Left Turn",2215203,47]
[12,"LAK","No","Yes","Animal",1292670,80]
[2,"HEN","Yes","Yes","Sideswipe - Passing",45156,1]
[6,"MAD","Yes","No","Sideswipe - Passing",1704273,86]
[7,"AUG","Yes","No","Right Turn",222600,15]
[6,"MAD","No","No","Fixed Object",47158509,914]
[12,"LAK","Yes","Yes","Sideswipe - Passing",460098,1]
[4,"TRU","No","Yes","Animal",1495077,102]
[7,"MIA","Yes","No","Parked Vehicle",7805007,466]
[4,"POR","Yes","No","Other Non-Collision",275706,16]
[3,"HUR","Yes","No","Overturning",10176,1]
[6,"UNI","No","No","Unknown",248676,21]
[11,"JEF","No","Yes","Animal",393207,22]
[7,"MIA","Yes","Yes","Rear End",5330172,151]
[11,"BEL","Yes","Yes","Backing",669183,16]
[10,"GAL","No","Yes","Fixed Object",1618524,45]
[5,"MUS","Yes","Yes","Sideswipe - Passing",97149,4]
[2,"LUC","Yes","Yes","Angle",3804519,81]
[10,"GAL","Yes","No","Pedalcycles",188574,4]
[2,"LUC","No","Yes","Overturning",1363965,11]
[4,"STA","Yes","Yes","Animal",207972,17]
[2,"OTT","No","No","Pedalcycles",715293,6]
[2,"WIL","Yes","Yes","Animal",10176,1]
[10,"GAL","Yes","No","Animal",1090740,85]
[3,"ASD","No","No","Other Non-Collision",1927827,90]
[10,"VIN","No","No","Pedalcycles",460098,1]
[11,"JEF","No","Yes","Fixed Object",873657,25]
[2,"WOO","Yes","Yes","Rear End",2177679,33]
[5,"KNO","No","No","Parked Vehicle",1374030,48]
[5,"LIC","No","No","Sideswipe - Meeting",1609572,11]
[9,"JAC","Yes","No","Sideswipe - Passing",3906597,104]
[12,"CUY","Yes","No","Unknown",10176,1]
[3,"HUR","Yes","No","Unknown",91584,9]
[3,"RIC","No","Yes","Parked Vehicle",76797,2]
[10,"MOE","No","No","Fixed Object",26004075,548]
[4,"TRU","Yes","Yes","Angle",1316154,27]
[3,"RIC","Yes","Yes","Head On",831681,14]
[8,"CLI","Yes","No","Other Object",40704,4]
[2,"HEN","Yes","No","Rear End",85860,5]
[2,"SAN","No","No","Sideswipe - Passing",7292898,165]
[1,"ALL","Yes","No","Overturning",45156,1]
[4,"STA","Yes","No","Left Turn",2977449,68]
[3,"MED","Yes","Yes","Overturning",536895,3]
[3,"WAY","No","No","Other Non-Vehicle",603516,4]
[2,"HEN","No","No","Fixed Object",32528574,666]
[6,"FAY","No","Yes","Animal",1941549,139]
[10,"MOE","Yes","No","Rear End",10176,1]
[11,"COL","Yes","No","Overturning",868887,10]
[5,"GUE","Yes","Yes","Fixed Object",6957075,183]
[5,"KNO","Yes","No","Animal",2044581,156]
[7,"AUG","Yes","No","Rear End",505254,2]
[8,"WAR","Yes","No","Angle",19171452,470]
[5,"LIC","Yes","Yes","Pedestrian",66621,1]
[7,"MIA","Yes","No","Pedestrian",5510508,35]
[9,"HIG","No","No","Animal",6305001,330]
[1,"WYA","Yes","No","Backing",997248,98]
[7,"MIA","Yes","No","Left Turn",4075662,136]
[9,"LAW","Yes","Yes","Sideswipe - Meeting",45156,1]
[11,"BEL","Yes","Yes","Sideswipe - Passing",490626,4]
[8,"HAM","Yes","No","Fixed Object",7951779,272]
[7,"AUG","Yes","No","Parked Vehicle",71232,7]
[2,"SAN","No","Yes","Backing",600384,59]
[5,"GUE","No","No","Overturning",7014345,61]
[2,"OTT","Yes","No","Pedestrian",1308633,9]
[4,"SUM","Yes","Yes","Other Object",10176,1]
[4,"STA","Yes","No","Head On",2194104,40]
[4,"STA","Yes","No","Train",40704,4]
[3,"WAY","Yes","No","Rear End",2855703,119]
[10,"WAS","Yes","Yes","Rear End",294786,11]
[3,"MED","Yes","Yes","Other Object",111936,11]
[8,"BUT","Yes","No","Unknown",812490,55]
[6,"DEL","Yes","Yes","Left Turn",438204,14]
[5,"MUS","No","No","Overturning",11552235,104]
[3,"HUR","Yes","No","Right Turn",879111,56]
[5,"LIC","Yes","No","Right Turn",5995221,263]
[11,"HAS","No","No","Left Turn",3750300,72]
[4,"POR","Yes","Yes","Fixed Object",2846847,100]
[7,"MER","No","No","Parked Vehicle",985434,27]
[12,"LAK","No","No","Left Turn",1559106,44]
[6,"MRW","No","Yes","Right Turn",45156,1]
[9,"LAW","No","No","Other Object",541506,9]
[3,"MED","Yes","No","Pedestrian",10176,1]
[8,"GRE","No","Yes","Other Non-Collision",248676,21]
[7,"MIA","Yes","No","Animal",10176,1]
[4,"STA","No","Yes","Sideswipe - Passing",838248,43]
[12,"LAK","Yes","Yes","Unknown",148029,9]
[11,"JEF","Yes","Yes","Sideswipe - Passing",50880,5]
[7,"MOT","No","Yes","Unknown",50880,5]
[6,"PIC","Yes","No","Overturning",276660,5]
[6,"MAD","Yes","Yes","Left Turn",45156,1]
[7,"CLA","No","Yes","Left Turn",65508,3]
[4,"MAH","No","Yes","Backing",690537,52]
[5,"MUS","Yes","No","Overturning",2186154,35]
[11,"BEL","Yes","Yes","Right Turn",617190,13]
[6,"FRA","No","No","Right Turn",258693,13]
[4,"TRU","Yes","Yes","Other Non-Collision",10176,1]
[12,"CUY","Yes","No","Other Object",132288,13]
[2,"OTT","No","No","Backing",2032290,123]
[8,"PRE","Yes","No","Backing",81408,8]
[7,"MIA","Yes","Yes","Other Non-Vehicle",10176,1]
[4,"POR","Yes","No","Animal",101760,10]
[12,"LAK","No","No","Parked Vehicle",181896,11]
[10,"HOC","Yes","No","Parked Vehicle",1724466,79]
[4,"SUM","No","Yes","Unknown",86973,3]
[2,"WOO","Yes","No","Head On",6112800,72]
[2,"WOO","Yes","No","Train",10176,1]
[11,"TUS","Yes","No","Fixed Object",22339845,708]
[1,"HAN","No","No","Fixed Object",33148008,932]
[7,"CHP","Yes","No","Backing",40704,4]
[12,"CUY","Yes","Yes","Angle",76797,2]
[12,"LAK","Yes","Yes","Fixed Object",10176,1]
[7,"MOT","Yes","Yes","Pedestrian",526719,2]
[2,"LUC","Yes","Yes","Animal",3905469,222]
[1,"VAN","No","No","Head On",2130726,18]
[1,"VAN","No","No","Train",10176,1]
[6,"MAR","Yes","No","Animal",3786585,305]
[7,"MOT","Yes","No","Left Turn",76797,2]
[8,"BUT","No","No","Parked Vehicle",1054011,51]
[4,"SUM","No","Yes","Backing",40704,4]
[2,"WOO","Yes","Yes","Right Turn",10176,1]
[9,"PIK","No","Yes","Fixed Object",10176,1]
[7,"CLA","No","Yes","Overturning",432639,19]
[5,"GUE","Yes","No","Parked Vehicle",1982364,107]
[7,"DAR","Yes","No","Right Turn",1054011,56]
[3,"CRA","Yes","No","Other Object",30528,3]
[4,"POR","Yes","No","Parked Vehicle",229278,8]
[7,"CHP","Yes","No","Rear End",505254,2]
[1,"WYA","Yes","No","Animal",1378053,123]
[4,"TRU","Yes","No","Rear End",45156,1]
[8,"WAR","Yes","No","Pedalcycles",399726,6]
[2,"WOO","Yes","Yes","Animal",1873131,124]
[3,"ERI","No","No","Angle",16562754,256]
[12,"GEA","Yes","No","Pedalcycles",726582,5]
[8,"GRE","Yes","Yes","Sideswipe - Passing",8998827,478]
[4,"ATB","No","No","Sideswipe - Meeting",940548,4]
[8,"WAR","No","Yes","Overturning",212265,5]
[3,"RIC","Yes","No","Backing",716772,67]
[7,"MOT","No","Yes","Backing",50880,5]
[6,"FRA","No","Yes","Pedestrian",593340,3]
[4,"POR","No","No","Sideswipe - Passing",7720848,235]
[4,"SUM","Yes","Yes","Angle",7151484,170]
[8,"WAR","Yes","Yes","Backing",116388,8]
[8,"BUT","No","No","Fixed Object",67434801,1247]
[11,"COL","Yes","No","Right Turn",107325,5]
[4,"SUM","Yes","No","Sideswipe - Passing",106212,7]
[4,"ATB","Yes","No","Rear End",120840,5]
[7,"MIA","No","Yes","Sideswipe - Passing",197796,16]
[3,"RIC","No","No","Fixed Object",57928086,1249]
[2,"OTT","No","Yes","Pedestrian",920196,2]
[6,"FRA","Yes","Yes","Head On",45156,1]
[3,"ERI","Yes","Yes","Rear End",905187,62]
[12,"LAK","No","Yes","Other Object",653442,20]
[7,"SHE","No","Yes","Left Turn",10176,1]
[11,"COL","Yes","No","Fixed Object",4227729,94]
[3,"RIC","Yes","Yes","Fixed Object",1725690,41]
[7,"MER","No","Yes","Rear End",66621,1]
[3,"HUR","No","No","Backing",431844,39]
[6,"FRA","Yes","Yes","Sideswipe - Passing",555705,20]
[9,"LAW","Yes","No","Right Turn",2134638,64]
[4,"ATB","Yes","No","Other Non-Collision",1353948,19]
[4,"STA","Yes","No","Fixed Object",10154199,325]
[2,"SAN","Yes","No","Sideswipe - Passing",854148,48]
[5,"COS","No","Yes","Animal",10176,1]
[10,"VIN","No","No","Overturning",5624829,46]
[8,"CLE","No","No","Overturning",7738479,72]
[5,"GUE","No","Yes","Other Object",406881,31]
[12,"GEA","Yes","No","Other Non-Collision",459828,28]
[2,"WIL","Yes","No","Pedestrian",66621,1]
[12,"GEA","Yes","No","Backing",20352,2]
[11,"TUS","Yes","Yes","Animal",20352,2]
[9,"PIK","No","No","Angle",9796908,130]
[4,"SUM","Yes","No","Pedalcycles",255195,5]
[7,"AUG","Yes","No","Parked Vehicle",526719,2]
[2,"FUL","Yes","Yes","Rear End",20352,2]
[1,"WYA","No","No","Overturning",4368030,36]
[1,"DEF","Yes","No","Rear End",17536458,721]
[8,"CLE","Yes","No","Left Turn",35730123,1060]
[1,"ALL","Yes","No","Left Turn",728967,15]
[6,"UNI","Yes","No","Other Non-Collision",86973,3]
[11,"BEL","No","No","Overturning",14311710,112]
[2,"LUC","No","Yes","Unknown",30528,3]
[9,"LAW","No","No","Left Turn",3500973,131]
[2,"OTT","Yes","No","Other Object",10176,1]
[10,"NOB","No","No","Rear End",739143,16]
[4,"POR","Yes","No","Rear End",871161,56]
[3,"WAY","Yes","No","Other Object",10176,1]
[6,"DEL","Yes","Yes","Unknown",106212,7]
[5,"LIC","Yes","Yes","Overturning",975528,4]
[6,"DEL","Yes","No","Backing",534717,47]
[7,"LOG","No","No","Unknown",61056,6]
[6,"PIC","Yes","Yes","Overturning",66621,1]
[1,"HAN","Yes","No","Head On",6207978,104]
[1,"HAN","Yes","No","Train",10176,1]
[9,"ADA","No","No","Left Turn",5714331,119]
[1,"DEF","No","Yes","Sideswipe - Passing",40704,4]
[8,"BUT","Yes","No","Angle",46266063,1057]
[6,"UNI","No","No","Other Non-Collision",3137085,94]
[11,"CAR","Yes","No","Angle",10176,1]
[3,"MED","No","Yes","Parked Vehicle",284610,10]
[6,"DEL","Yes","No","Unknown",20352,2]
[11,"COL","No","Yes","Unknown",20352,2]
[3,"LOR","Yes","Yes","Left Turn",10176,1]
[6,"FRA","Yes","Yes","Backing",20352,2]
[7,"AUG","Yes","Yes","Fixed Object",30528,3]
[12,"LAK","Yes","No","Animal",10176,1]
[5,"LIC","Yes","Yes","Rear End",75684,4]
[9,"ROS","No","No","Pedestrian",3487170,11]
[7,"AUG","Yes","Yes","Rear End",10176,1]
[1,"HAN","No","No","Backing",1173372,60]
[2,"SEN","Yes","No","Rear End",5085900,167]
[3,"MED","Yes","Yes","Rear End",3853698,87]
[2,"HEN","No","Yes","Unknown",10176,1]
[8,"WAR","Yes","No","Right Turn",2127579,129]
[9,"JAC","Yes","No","Other Non-Collision",939165,28]
[5,"FAI","Yes","No","Parked Vehicle",204474,9]
[5,"KNO","Yes","No","Head On",1576389,25]
[10,"HOC","Yes","Yes","Other Non-Collision",20352,2]
[10,"GAL","No","No","Unknown",81408,8]
[1,"DEF","Yes","No","Right Turn",1877631,96]
[9,"BRO","Yes","No","Sideswipe - Passing",142305,5]
[4,"SUM","No","No","Right Turn",101760,10]
[8,"CLE","Yes","Yes","Sideswipe - Passing",85860,5]
[3,"ERI","No","No","Sideswipe - Passing",2499972,66]
[1,"DEF","Yes","No","Angle",100488,3]
[4,"POR","Yes","No","Sideswipe - Passing",91584,9]
[5,"FAI","No","Yes","Left Turn",86973,3]
[2,"WOO","Yes","Yes","Rear End",588618,33]
[8,"HAM","No","No","Left Turn",4052241,108]
[6,"MAR","Yes","Yes","Angle",10176,1]
[12,"GEA","Yes","No","Angle",107325,5]
[1,"ALL","Yes","No","Backing",7744842,585]
[4,"ATB","Yes","Yes","Backing",30528,3]
[11,"COL","No","Yes","Backing",10176,1]
[1,"PUT","Yes","No","Unknown",10176,1]
[11,"BEL","Yes","Yes","Fixed Object",188574,4]
[10,"GAL","No","No","Backing",555864,29]
[8,"WAR","Yes","Yes","Rear End",1033929,27]
[7,"CHP","Yes","No","Other Object",40704,4]
[4,"POR","Yes","No","Other Non-Collision",40704,4]
[3,"WAY","Yes","No","Unknown",10176,1]
[5,"LIC","Yes","No","Animal",1767603,133]
[4,"MAH","Yes","Yes","Unknown",55332,2]
[3,"RIC","No","Yes","Fixed Object",6262881,184]
[6,"FRA","Yes","Yes","Other Non-Collision",460098,1]
[11,"BEL","Yes","Yes","Sideswipe - Passing",10176,1]
[4,"SUM","Yes","Yes","Left Turn",228165,10]
[3,"WAY","Yes","No","Sideswipe - Passing",812649,64]
[11,"CAR","No","No","Overturning",6861801,71]
[5,"LIC","No","Yes","Angle",493536,16]
[7,"LOG","Yes","No","Overturning",388437,7]
[4,"STA","No","Yes","Other Object",81408,8]
[1,"HAN","Yes","No","Unknown",40704,4]
[4,"MAH","Yes","No","Rear End",140839185,5774]
[3,"CRA","Yes","Yes","Other Non-Collision",173946,6]
[2,"WOO","Yes","Yes","Right Turn",217989,9]
[12,"GEA","No","No","Sideswipe - Passing",12722508,320]
[5,"LIC","Yes","Yes","Rear End",111777,2]
[3,"RIC","Yes","No","Right Turn",442974,29]
[3,"CRA","Yes","Yes","Left Turn",66621,1]
[4,"TRU","Yes","No","Sideswipe - Passing",91584,9]
[4,"SUM","Yes","No","Animal",483837,42]
[8,"CLI","No","No","Animal",9824943,692]
[6,"MAR","No","No","Sideswipe - Passing",4748025,132]
[3,"LOR","Yes","No","Overturning",2035215,14]
[5,"LIC","Yes","No","Pedalcycles",617031,4]
[8,"PRE","Yes","No","Rear End",81408,8]
[5,"KNO","Yes","Yes","Rear End",10176,1]
[6,"MRW","Yes","No","Animal",10176,1]
[3,"ERI","Yes","No","Angle",1015803,21]
[7,"MIA","Yes","Yes","Head On",853146,14]
[7,"MIA","Yes","Yes","Train",66621,1]
[3,"RIC","Yes","Yes","Backing",85860,5]
[3,"ASD","Yes","No","Sideswipe - Passing",3779445,164]
[5,"FAI","Yes","Yes","Rear End",5167419,139]
[10,"WAS","No","No","Animal",7398078,450]
[11,"JEF","Yes","No","Sideswipe - Meeting",20352,2]
[6,"PIC","No","No","Unknown",846627,30]
[3,"LOR","No","No","Right Turn",3022764,83]
[7,"AUG","Yes","No","Sideswipe - Passing",1073568,73]
[11,"BEL","Yes","Yes","Angle",594024,19]
[9,"SCI","No","No","Pedestrian",5091018,18]
[11,"BEL","Yes","No","Animal",10176,1]
[4,"TRU","Yes","Yes","Rear End",15053529,406]
[5,"MUS","Yes","Yes","Sideswipe - Passing",10176,1]
[4,"MAH","Yes","No","Angle",376194,19]
[6,"MAD","Yes","No","Fixed Object",5217615,123]
[11,"JEF","Yes","No","Backing",71232,7]
[7,"LOG","Yes","No","Pedestrian",45156,1]
[1,"VAN","Yes","Yes","Angle",66621,1]
[10,"HOC","Yes","No","Angle",20352,2]
[6,"FRA","No","Yes","Right Turn",249630,10]
[9,"SCI","Yes","No","Angle",647559,7]
[3,"WAY","Yes","Yes","Rear End",141192,7]
[12,"LAK","Yes","No","Fixed Object",500802,5]
[10,"ATH","No","No","Left Turn",5228061,97]
[1,"HAR","Yes","No","Angle",10176,1]
[4,"SUM","Yes","No","Other Non-Collision",66621,1]
[2,"SAN","Yes","No","Rear End",11980410,415]
[10,"ATH","Yes","No","Animal",1318110,115]
[2,"SAN","Yes","No","Fixed Object",366018,18]
[3,"WAY","No","No","Rear End",29308098,671]
[4,"POR","Yes","Yes","Animal",50880,5]
[5,"MUS","No","Yes","Head On",1027521,7]
[4,"ATB","Yes","No","Right Turn",2766345,106]
[11,"TUS","Yes","No","Sideswipe - Passing",122112,12]
[8,"CLE","Yes","No","Sideswipe - Meeting",1391202,60]
[2,"WOO","No","Yes","Left Turn",107325,5]
[8,"CLI","Yes","Yes","Other Non-Collision",66621,1]
[12,"LAK","Yes","Yes","Animal",10176,1]
[2,"SEN","Yes","No","Left Turn",1974048,49]
[7,"DAR","No","No","Parked Vehicle",2830581,102]
[7,"AUG","Yes","No","Pedestrian",571875,3]
[5,"LIC","Yes","Yes","Right Turn",30528,3]
[10,"HOC","Yes","No","Rear End",86973,3]
[3,"RIC","Yes","Yes","Sideswipe - Passing",7413453,318]
[8,"HAM","No","Yes","Angle",557247,5]
[6,"MAD","Yes","No","Backing",40704,4]
[6,"UNI","Yes","No","Overturning",65508,3]
[2,"OTT","No","No","Unknown",214650,10]
[8,"CLI","No","Yes","Right Turn",20352,2]
[5,"FAI","No","No","Other Non-Collision",2267721,57]
[6,"DEL","No","No","Head On",6254262,52]
[2,"SAN","Yes","No","Rear End",948228,31]
[4,"ATB","Yes","No","Other Non-Collision",127677,7]
[8,"HAM","Yes","Yes","Rear End",308480901,12254]
[9,"JAC","Yes","No","Pedalcycles",45156,1]
[7,"MOT","No","Yes","Fixed Object",7594314,134]
[2,"SEN","Yes","No","Pedalcycles",1794219,20]
[3,"ERI","Yes","No","Right Turn",20352,2]
[11,"COL","Yes","No","Pedestrian",1425450,4]
[8,"HAM","No","No","Rear End",10464933,391]
[8,"HAM","Yes","Yes","Left Turn",10176,1]
[4,"POR","Yes","Yes","Right Turn",30528,3]
[7,"MOT","Yes","Yes","Head On",66621,1]
[9,"HIG","Yes","No","Other Non-Collision",45156,1]
[6,"FRA","Yes","Yes","Other Non-Collision",280158,13]
[2,"SEN","Yes","No","Fixed Object",8813988,289]
[9,"LAW","Yes","No","Rear End",18057198,600]
[6,"FAY","Yes","Yes","Sideswipe - Passing",20352,2]
[6,"FRA","Yes","No","Right Turn",2236128,101]
[10,"MEG","No","No","Fixed Object",39347955,725]
[2,"WOO","Yes","Yes","Fixed Object",2384427,83]
[12,"CUY","Yes","Yes","Head On",65508,3]
[8,"HAM","No","No","Pedalcycles",593340,3]
[10,"HOC","No","Yes","Parked Vehicle",547071,4]
[5,"MUS","No","No","Other Object",158205,10]
[4,"TRU","No","No","Pedalcycles",3237111,14]
[11,"JEF","Yes","No","Rear End",14004894,548]
[2,"SAN","No","Yes","Parked Vehicle",3047616,182]
[6,"MRW","No","Yes","Left Turn",76797,2]
[6,"PIC","Yes","No","Unknown",20352,2]
[6,"PIC","No","No","Sideswipe - Meeting",10176,1]
[8,"CLI","No","No","Left Turn",6352557,145]
[7,"MOT","Yes","Yes","Other Non-Collision",66621,1]
[9,"SCI","No","Yes","Rear End",20352,2]
[12,"LAK","No","No","Right Turn",224826,11]
[2,"WIL","Yes","No","Head On",728967,15]
[2,"WIL","Yes","No","Train",460098,1]
[1,"ALL","Yes","No","Right Turn",360294,14]
[8,"WAR","Yes","No","Other Object",81408,8]
[10,"ATH","Yes","Yes","Overturning",670137,5]
[8,"HAM","Yes","No","Right Turn",94012416,5090]
[1,"ALL","Yes","Yes","Angle",679200,8]
[3,"HUR","No","No","Head On",8228484,54]
[9,"LAW","Yes","No","Pedestrian",1906425,14]
[9,"SCI","No","No","Parked Vehicle",1764852,60]
[11,"COL","Yes","No","Other Object",40704,4]
[4,"ATB","Yes","Yes","Fixed Object",100488,3]
[1,"HAN","Yes","Yes","Left Turn",10176,1]
[4,"MAH","Yes","No","Sideswipe - Passing",531330,8]
[4,"SUM","Yes","No","Overturning",2380197,19]
[7,"LOG","No","Yes","Other Non-Collision",162816,16]
[3,"WAY","Yes","No","Angle",96036,6]
[3,"MED","Yes","No","Other Non-Collision",10176,1]
[3,"WAY","Yes","No","Parked Vehicle",30528,3]
[9,"SCI","No","Yes","Fixed Object",10176,1]
[2,"WOO","Yes","No","Parked Vehicle",2619000,173]
[4,"ATB","Yes","Yes","Fixed Object",172833,8]
[4,"TRU","No","No","Parked Vehicle",1949673,32]
[4,"TRU","Yes","Yes","Animal",10176,1]
[9,"HIG","Yes","No","Parked Vehicle",674478,38]
[3,"MED","Yes","No","Animal",4121391,309]
[7,"AUG","Yes","No","Unknown",10176,1]
[2,"SEN","Yes","No","Rear End",13311288,585]
[8,"HAM","No","No","Sideswipe - Meeting",930372,3]
[7,"CHP","No","No","Sideswipe - Passing",4699704,95]
[4,"SUM","Yes","No","Other Object",10176,1]
[2,"FUL","Yes","No","Left Turn",1660866,54]
[9,"BRO","Yes","No","Animal",20352,2]
[2,"WOO","Yes","No","Pedalcycles",2141952,23]
[11,"COL","No","No","Head On",8391396,85]
[8,"BUT","Yes","No","Sideswipe - Meeting",85860,5]
[11,"COL","No","No","Train",10176,1]
[5,"LIC","No","No","Overturning",9380535,109]
[10,"MEG","No","No","Rear End",5737641,113]
[9,"ADA","No","No","Pedalcycles",133242,2]
[3,"LOR","No","Yes","Fixed Object",3804837,89]
[11,"TUS","No","Yes","Sideswipe - Passing",4162539,114]
[12,"LAK","Yes","No","Other Non-Collision",5541831,83]
[7,"MER","No","No","Fixed Object",22923579,494]
[7,"DAR","Yes","No","Other Non-Collision",30528,3]
[1,"PAU","Yes","No","Other Non-Collision",10176,1]
[4,"TRU","Yes","No","Fixed Object",602403,6]
[11,"BEL","No","Yes","Right Turn",10176,1]
[6,"PIC","Yes","No","Backing",111936,11]
[4,"MAH","No","Yes","Right Turn",117501,6]
[11,"TUS","No","No","Angle",20002590,315]
[6,"UNI","Yes","No","Pedalcycles",593340,3]
[2,"WOO","No","Yes","Fixed Object",18348024,575]
[5,"GUE","Yes","Yes","Left Turn",20352,2]
[3,"WAY","Yes","No","Other Non-Collision",316410,20]
[3,"CRA","Yes","Yes","Angle",10176,1]
[1,"HAN","Yes","No","Angle",85860,5]
[10,"NOB","Yes","No","Animal",20352,2]
[6,"MAR","Yes","No","Right Turn",3323736,171]
[6,"DEL","Yes","Yes","Overturning",55332,2]
[3,"WAY","No","No","Overturning",8943858,126]
[9,"ROS","Yes","No","Rear End",32333919,1264]
[6,"FRA","Yes","Yes","Parked Vehicle",76797,2]
[5,"LIC","Yes","Yes","Overturning",1217208,9]
[10,"GAL","Yes","Yes","Unknown",10176,1]
[11,"CAR","No","No","Pedestrian",1153926,7]
[11,"TUS","No","No","Other Object",549186,36]
[2,"WOO","Yes","Yes","Backing",10176,1]
[5,"FAI","No","Yes","Unknown",30528,3]
[2,"SAN","Yes","Yes","Other Object",162816,16]
[8,"BUT","No","No","Left Turn",5218824,141]
[5,"COS","Yes","No","Angle",76797,2]
[11,"HAS","No","No","Fixed Object",36434676,611]
[7,"AUG","Yes","Yes","Overturning",55332,2]
[12,"CUY","Yes","Yes","Sideswipe - Passing",177444,14]
[8,"BUT","Yes","Yes","Right Turn",30528,3]
[4,"TRU","Yes","No","Other Object",678135,50]
[3,"WAY","No","No","Left Turn",14391753,276]
[9,"JAC","No","No","Other Non-Collision",964128,36]
[5,"MUS","Yes","No","Parked Vehicle",9747096,546]
[4,"POR","Yes","No","Head On",66621,1]
[11,"COL","Yes","No","Backing",97149,4]
[6,"FRA","Yes","Yes","Animal",10176,1]
[5,"MUS","No","Yes","Sideswipe - Meeting",10176,1]
[2,"WOO","Yes","Yes","Overturning",30528,3]
[8,"WAR","No","Yes","Left Turn",76797,2]
[4,"SUM","Yes","Yes","Angle",65508,3]
[11,"JEF","Yes","No","Right Turn",10176,1]
[10,"NOB","No","Yes","Head On",460098,1]
[8,"WAR","Yes","Yes","Right Turn",76797,2]
[11,"HAS","Yes","Yes","Rear End",30528,3]
[1,"PUT","Yes","No","Right Turn",10176,1]
[8,"BUT","Yes","No","Other Non-Collision",148029,9]
[2,"SEN","Yes","No","Angle",30528,3]
[6,"UNI","No","No","Sideswipe - Passing",5011917,147]
[4,"SUM","Yes","No","Rear End",152481,6]
[5,"MUS","Yes","No","Rear End",47232264,2201]
[8,"CLE","Yes","No","Unknown",934602,67]
[10,"WAS","Yes","Yes","Fixed Object",10176,1]
[2,"LUC","Yes","No","Sideswipe - Passing",2438964,105]
[7,"CLA","Yes","Yes","Other Non-Collision",1163196,59]
[4,"ATB","Yes","Yes","Fixed Object",460098,1]
[9,"ROS","Yes","Yes","Fixed Object",265530,15]
[10,"ATH","Yes","No","Head On",1723830,38]
[2,"FUL","Yes","No","Sideswipe - Passing",533445,40]
[11,"BEL","Yes","Yes","Fixed Object",10176,1]
[8,"BUT","No","No","Overturning",3549690,64]
[11,"TUS","Yes","Yes","Rear End",8741739,254]
[1,"WYA","Yes","No","Animal",20352,2]
[1,"ALL","No","No","Sideswipe - Meeting",10176,1]
[3,"HUR","Yes","No","Sideswipe - Meeting",85860,5]
[8,"CLE","Yes","Yes","Pedestrian",133242,2]
[2,"HEN","Yes","Yes","Fixed Object",40704,4]
[6,"DEL","Yes","Yes","Rear End",2788860,125]
[7,"MOT","Yes","No","Head On",287949,9]
[4,"TRU","Yes","No","Fixed Object",45156,1]
[6,"FRA","No","Yes","Backing",20352,2]
[3,"LOR","No","No","Other Non-Collision",2988801,56]
[3,"CRA","No","No","Other Object",50880,5]
[1,"PAU","No","No","Rear End",4678446,84]
[8,"BUT","Yes","No","Right Turn",579555,30]
[10,"ATH","Yes","Yes","Overturning",76797,2]
[7,"LOG","No","No","Animal",9007983,358]
[6,"PIC","Yes","No","Parked Vehicle",111936,11]
[6,"FAY","Yes","Yes","Angle",20352,2]
[2,"SAN","No","No","Other Object",836451,29]
[9,"SCI","No","No","Head On",15751851,103]
[9,"SCI","No","No","Train",10176,1]
[1,"PAU","Yes","Yes","Angle",470274,2]
[10,"GAL","No","No","Left Turn",4988862,112]
[7,"AUG","Yes","No","Fixed Object",1372233,34]
[3,"ASD","Yes","No","Sideswipe - Passing",10176,1]
[9,"JAC","No","No","Other Object",122112,12]
[8,"PRE","No","Yes","Other Object",392253,33]
[4,"POR","No","Yes","Angle",163770,5]
[7,"MIA","No","No","Sideswipe - Meeting",10176,1]
[4,"TRU","Yes","No","Animal",11579508,847]
[4,"ATB","Yes","Yes","Sideswipe - Passing",116388,8]
[5,"COS","No","No","Backing",673794,22]
[6,"FRA","Yes","No","Right Turn",104426037,4516]
[8,"WAR","No","Yes","Rear End",3590172,135]
[6,"FRA","Yes","No","Animal",168381,11]
[5,"LIC","Yes","Yes","Backing",10176,1]
[12,"LAK","Yes","No","Other Object",1029795,48]
[7,"MOT","Yes","Yes","Unknown",1208034,42]
[12,"CUY","No","No","Pedestrian",133242,2]
[11,"TUS","Yes","Yes","Sideswipe - Passing",10176,1]
[10,"WAS","Yes","No","Backing",50880,5]
[3,"WAY","Yes","No","Overturning",429141,11]
[8,"CLI","Yes","No","Right Turn",1722351,47]
[1,"VAN","Yes","No","Animal",757476,71]
[4,"SUM","Yes","Yes","Sideswipe - Passing",76302339,3564]
[7,"LOG","Yes","No","Pedalcycles",893691,9]
[11,"COL","Yes","No","Parked Vehicle",587775,8]
[4,"SUM","Yes","No","Fixed Object",3513279,113]
[3,"ASD","Yes","Yes","Other Object",213537,12]
[0,"WOO","No","No","Rear End",10176,1]
[6,"FRA","No","Yes","Unknown",76797,2]
[6,"PIC","Yes","No","Fixed Object",4875558,79]
[5,"MUS","Yes","No","Right Turn",20352,2]
[6,"MRW","No","No","Sideswipe - Passing",5946996,166]
[4,"MAH","Yes","No","Left Turn",203361,11]
[11,"TUS","Yes","Yes","Parked Vehicle",230391,6]
[12,"CUY","Yes","Yes","Rear End",955860,18]
[8,"CLE","No","No","Pedestrian",3632910,25]
[12,"LAK","Yes","Yes","Overturning",111777,2]
[5,"LIC","Yes","No","Fixed Object",14330094,425]
[11,"COL","No","No","Pedestrian",5045862,17]
[7,"LOG","No","Yes","Other Object",111936,11]
[8,"WAR","No","Yes","Right Turn",10176,1]
[6,"PIC","Yes","No","Right Turn",10176,1]
[12,"CUY","Yes","No","Rear End",141192,7]
[8,"CLE","No","No","Falling From Or In Vehicle",460098,1]
[2,"SEN","Yes","No","Sideswipe - Passing",50880,5]
[3,"WAY","Yes","Yes","Animal",10176,1]
[9,"SCI","Yes","No","Left Turn",9746904,246]
[5,"MUS","Yes","No","Animal",40704,4]
[4,"STA","Yes","No","Left Turn",371583,13]
[1,"PUT","Yes","No","Sideswipe - Meeting",10176,1]
[11,"BEL","Yes","No","Head On",4884891,60]
[11,"BEL","Yes","No","Train",10176,1]
[10,"ATH","Yes","No","Left Turn",76797,2]
[4,"SUM","Yes","Yes","Angle",995880,6]
[4,"SUM","Yes","Yes","Left Turn",71232,7]
[7,"AUG","Yes","Yes","Backing",10176,1]
[12,"CUY","Yes","No","Fixed Object",30528,3]
[12,"GEA","Yes","No","Parked Vehicle",207813,8]
[11,"HOL","No","No","Backing",1433226,116]
[3,"LOR","Yes","No","Left Turn",17282469,456]
[7,"DAR","No","No","Rear End",12751335,274]
[11,"TUS","Yes","Yes","Sideswipe - Passing",10176,1]
[9,"HIG","Yes","No","Pedestrian",593340,3]
[10,"HOC","Yes","No","Left Turn",86973,3]
[8,"BUT","Yes","No","Rear End",32183298,1216]
[8,"PRE","No","Yes","Sideswipe - Passing",4221147,186]
[8,"HAM","Yes","No","Backing",2485965,225]
[11,"COL","Yes","No","Overturning",858711,9]
[9,"PIK","Yes","No","Rear End",5970036,262]
[3,"WAY","Yes","No","Backing",616125,55]
[8,"CLI","No","Yes","Backing",71232,7]
[1,"HAN","Yes","Yes","Rear End",107325,5]
[7,"MIA","Yes","No","Right Turn",85860,5]
[9,"LAW","Yes","No","Unknown",618303,11]
[2,"WOO","No","No","Unknown",229437,17]
[10,"WAS","Yes","Yes","Fixed Object",152481,6]
[9,"PIK","Yes","No","Sideswipe - Passing",50880,5]
[4,"MAH","Yes","No","Left Turn",10176,1]
[11,"JEF","Yes","No","Unknown",148029,9]
[7,"LOG","Yes","Yes","Other Object",20352,2]
[3,"RIC","Yes","No","Unknown",10176,1]
[6,"MRW","No","Yes","Parked Vehicle",1068225,11]
[11,"TUS","Yes","Yes","Left Turn",61056,6]
[7,"AUG","Yes","Yes","Rear End",184122,7]
[12,"CUY","Yes","Yes","Other Non-Collision",20352,2]
[8,"GRE","Yes","Yes","Fixed Object",50880,5]
[4,"POR","No","Yes","Sideswipe - Passing",5983980,234]
[10,"HOC","No","No","Angle",5874189,88]
[4,"STA","Yes","No","Parked Vehicle",387642,27]
[8,"CLI","No","Yes","Animal",1360404,79]
[11,"COL","No","Yes","Head On",10176,1]
[10,"GAL","No","No","Other Non-Vehicle",66621,1]
[5,"GUE","Yes","No","Right Turn",480450,3]
[2,"FUL","No","Yes","Other Object",356160,35]
[8,"HAM","No","No","Overturning",2534904,21]
[11,"JEF","Yes","No","Backing",2084283,131]
[10,"ATH","Yes","No","Parked Vehicle",20352,2]
[4,"SUM","No","Yes","Animal",785460,55]
[3,"ERI","Yes","No","Animal",10176,1]
[1,"WYA","Yes","No","Right Turn",264417,17]
[7,"MIA","Yes","No","Rear End",314025,15]
[6,"DEL","Yes","No","Head On",76797,2]
[6,"DEL","Yes","No","Sideswipe - Passing",19783557,1128]
[2,"LUC","No","Yes","Rear End",3055089,100]
[5,"MUS","Yes","No","Fixed Object",35669622,1084]
[12,"CUY","Yes","Yes","Overturning",557247,5]
[10,"GAL","Yes","Yes","Animal",426120,35]
[11,"TUS","Yes","Yes","Fixed Object",9781089,256]
[4,"POR","Yes","No","Fixed Object",386211,11]
[6,"MAR","Yes","No","Pedalcycles",6181854,53]
[11,"BEL","Yes","Yes","Animal",1398087,107]
[1,"ALL","Yes","Yes","Rear End",30528,3]
[1,"DEF","No","No","Other Object",178557,12]
[10,"MOE","Yes","No","Animal",40704,4]
[10,"MEG","No","No","Head On",6039087,35]
[5,"FAI","No","No","Other Object",142464,14]
[3,"RIC","Yes","Yes","Sideswipe - Passing",168381,11]
[4,"ATB","No","No","Pedestrian",3260802,15]
[2,"WIL","Yes","No","Sideswipe - Passing",1114431,86]
[11,"COL","Yes","No","Animal",20352,2]
[9,"ROS","No","Yes","Other Object",612738,16]
[12,"LAK","Yes","No","Right Turn",10176,1]
[4,"MAH","Yes","No","Unknown",2053230,56]
[1,"PAU","Yes","No","Sideswipe - Passing",10176,1]
[3,"ERI","Yes","No","Rear End",45156,1]
[7,"SHE","No","No","Sideswipe - Meeting",460098,1]
[10,"WAS","No","No","Pedestrian",1513536,5]
[9,"ROS","Yes","No","Left Turn",13993158,375]
[4,"STA","Yes","No","Fixed Object",803268,43]
[6,"UNI","Yes","Yes","Other Non-Collision",97149,4]
[2,"WOO","Yes","No","Sideswipe - Passing",2685828,228]
[6,"FRA","No","No","Animal",712002,52]
[7,"CHP","Yes","No","Sideswipe - Passing",1878426,146]
[5,"LIC","Yes","No","Other Non-Vehicle",10176,1]
[7,"MER","No","No","Left Turn",6267507,79]
[5,"KNO","Yes","No","Backing",1677609,149]
[9,"ROS","No","Yes","Angle",924219,12]
[11,"JEF","Yes","Yes","Pedestrian",1053438,4]
[10,"MEG","No","No","Parked Vehicle",893850,18]
[8,"HAM","Yes","Yes","Overturning",515430,3]
[4,"ATB","No","Yes","Head On",1477443,7]
[4,"ATB","No","Yes","Train",460098,1]
[7,"MOT","Yes","Yes","Overturning",133242,2]
[4,"SUM","Yes","Yes","Sideswipe - Passing",81408,8]
[8,"GRE","No","No","Pedalcycles",1462227,13]
[6,"UNI","Yes","Yes","Right Turn",50880,5]
[7,"AUG","Yes","No","Fixed Object",71232,7]
[8,"BUT","Yes","No","Angle",5836110,239]
[4,"ATB","Yes","Yes","Fixed Object",10176,1]
[11,"TUS","No","No","Sideswipe - Passing",6268716,157]
[2,"WOO","No","No","Other Non-Collision",2852634,93]
[12,"CUY","Yes","No","Unknown",10176,1]
[2,"FUL","Yes","No","Fixed Object",10176,1]
[3,"RIC","Yes","Yes","Animal",50880,5]
[3,"RIC","Yes","Yes","Sideswipe - Passing",86973,3]
[12,"CUY","Yes","Yes","Fixed Object",560586,4]
[1,"PAU","No","Yes","Overturning",1712286,10]
[1,"HAN","No","No","Left Turn",3467121,78]
[2,"FUL","Yes","No","Left Turn",55332,2]
[1,"HAN","Yes","Yes","Head On",353457,7]
[6,"PIC","Yes","No","Head On",535782,5]
[3,"CRA","Yes","No","Angle",7731294,229]
[10,"MEG","Yes","No","Other Non-Collision",96036,6]
[2,"OTT","No","Yes","Right Turn",10176,1]
[10,"WAS","Yes","Yes","Fixed Object",10176,1]
[7,"DAR","Yes","Yes","Sideswipe - Passing",10176,1]
[2,"LUC","Yes","Yes","Right Turn",1383093,51]
[3,"CRA","No","Yes","Other Non-Collision",111936,11]
[9,"HIG","Yes","No","Sideswipe - Passing",10176,1]
[1,"HAR","Yes","No","Pedestrian",133242,2]
[10,"ATH","Yes","Yes","Head On",66621,1]
[3,"LOR","Yes","Yes","Head On",3429612,13]
[3,"CRA","Yes","No","Head On",1193088,26]
[8,"PRE","Yes","No","Fixed Object",1760670,41]
[7,"MIA","Yes","Yes","Other Non-Collision",356160,35]
[3,"LOR","Yes","No","Other Object",1764486,67]
[12,"CUY","Yes","Yes","Other Non-Collision",20352,2]
[4,"ATB","Yes","Yes","Animal",493854,34]
[10,"GAL","Yes","No","Rear End",11112366,425]
[4,"SUM","Yes","Yes","Backing",40704,4]
[2,"HEN","Yes","No","Sideswipe - Passing",10176,1]
[1,"VAN","Yes","No","Rear End",7329057,315]
[10,"WAS","Yes","Yes","Overturning",76797,2]
[1,"HAN","No","Yes","Right Turn",10176,1]
[8,"HAM","No","No","Backing",855738,73]
[6,"PIC","Yes","No","Pedalcycles",276660,5]
[2,"LUC","Yes","No","Head On",1338048,14]
[5,"FAI","No","No","Pedestrian",2197188,10]
[8,"WAR","Yes","Yes","Head On",658848,6]
[1,"DEF","Yes","Yes","Pedestrian",460098,1]
[6,"PIC","Yes","No","Fixed Object",86973,3]
[6,"PIC","No","Yes","Other Non-Collision",85860,5]
[8,"CLE","Yes","Yes","Sideswipe - Passing",10176,1]
[7,"LOG","Yes","No","Animal",20352,2]
[2,"SAN","Yes","No","Other Non-Collision",20352,2]
[2,"WOO","Yes","Yes","Fixed Object",76797,2]
[2,"WOO","No","No","Parked Vehicle",1633470,61]
[6,"MRW","Yes","Yes","Other Non-Collision",20352,2]
[11,"COL","Yes","No","Rear End",96036,6]
[2,"WOO","Yes","No","Unknown",172992,17]
[1,"HAR","Yes","No","Angle",3587388,41]
[9,"SCI","Yes","No","Animal",3170364,165]
[1,"PUT","Yes","No","Other Non-Collision",20352,2]
[8,"HAM","Yes","Yes","Right Turn",345666,16]
[3,"LOR","Yes","Yes","Other Non-Collision",812649,64]
[3,"WAY","Yes","No","Sideswipe - Passing",839361,41]
[8,"BUT","No","No","Backing",1823157,68]
[6,"FRA","No","No","Left Turn",1338891,39]
[6,"FRA","Yes","No","Sideswipe - Passing",10176,1]
[9,"LAW","No","No","Overturning",11456358,112]
[10,"NOB","Yes","No","Left Turn",61056,6]
[5,"MUS","Yes","No","Right Turn",4889520,278]
[3,"RIC","No","No","Left Turn",5930937,152]
[8,"GRE","Yes","Yes","Animal",460098,1]
[3,"ERI","Yes","No","Pedestrian",188574,4]
[3,"WAY","Yes","No","Other Non-Collision",106212,7]
[4,"TRU","Yes","Yes","Overturning",1318380,23]
[2,"LUC","Yes","Yes","Rear End",51860895,1828]
[11,"JEF","No","No","Sideswipe - Meeting",10176,1]
[4,"SUM","No","No","Left Turn",585120,30]
[2,"LUC","Yes","Yes","Other Non-Collision",85860,5]
[11,"COL","Yes","No","Left Turn",10176,1]
[6,"FRA","Yes","Yes","Overturning",76797,2]
[7,"MIA","Yes","Yes","Right Turn",100488,3]
[12,"LAK","Yes","Yes","Rear End",428187,22]
[8,"WAR","Yes","Yes","Fixed Object",183009,9]
[5,"MUS","Yes","No","Fixed Object",122112,12]
[3,"MED","Yes","No","Left Turn",12274734,383]
[4,"TRU","Yes","Yes","Angle",97149,4]
[6,"MAD","No","No","Other Non-Collision",3553140,92]
[2,"HEN","No","Yes","Parked Vehicle",20352,2]
[2,"SEN","Yes","No","Backing",999156,81]
[4,"SUM","Yes","Yes","Other Object",804858,68]
[10,"WAS","No","Yes","Other Non-Collision",152640,15]
[5,"FAI","No","Yes","Head On",85860,5]
[3,"MED","Yes","Yes","Sideswipe - Passing",2503041,87]
[11,"COL","Yes","Yes","Fixed Object",86973,3]
[3,"ERI","Yes","No","Sideswipe - Meeting",40704,4]
[4,"MAH","Yes","No","Rear End",523110,30]
[4,"POR","No","Yes","Pedestrian",111777,2]
[4,"ATB","Yes","No","Angle",3802023,97]
[1,"HAN","Yes","No","Fixed Object",869889,44]
[10,"GAL","No","No","Right Turn",468732,17]
[12,"LAK","No","Yes","Unknown",91584,9]
[3,"MED","Yes","No","Fixed Object",23945853,609]
[4,"POR","Yes","Yes","Backing",20352,2]
[2,"WOO","Yes","Yes","Angle",55332,2]
[7,"MOT","Yes","No","Parked Vehicle",1930530,113]
[12,"GEA","Yes","No","Head On",90312,2]
[11,"COL","Yes","No","Fixed Object",11146611,211]
[4,"STA","Yes","Yes","Backing",96036,6]
[8,"CLE","No","No","Other Non-Collision",3124572,123]
[3,"CRA","Yes","No","Other Non-Collision",1920258,27]
[4,"ATB","No","No","Sideswipe - Passing",8735298,183]
[4,"STA","No","No","Right Turn",1569600,63]
[6,"FRA","No","No","Head On",1621386,17]
[1,"DEF","No","No","Sideswipe - Meeting",10176,1]
[4,"ATB","Yes","No","Pedestrian",838359,7]
[1,"ALL","Yes","No","Parked Vehicle",122112,12]
[4,"MAH","Yes","No","Fixed Object",1260027,45]
[4,"STA","Yes","Yes","Unknown",10176,1]
[5,"KNO","No","No","Pedalcycles",199863,3]
[3,"HUR","Yes","No","Sideswipe - Passing",917859,37]
[5,"GUE","Yes","Yes","Unknown",40704,4]
[2,"WOO","Yes","Yes","Animal",305280,30]
[1,"HAN","Yes","No","Angle",29252052,980]
[11,"TUS","No","No","Sideswipe - Meeting",634044,7]
[7,"CHP","No","No","Other Object",607014,12]
[6,"PIC","Yes","No","Rear End",30528,3]
[7,"CLA","Yes","No","Overturning",1487031,12]
[3,"CRA","Yes","No","Right Turn",66621,1]
[7,"CLA","No","No","Head On",4101546,32]
[11,"JEF","Yes","No","Fixed Object",18568380,457]
[12,"LAK","Yes","Yes","Head On",723243,11]
[2,"HEN","No","No","Backing",503076,46]
[12,"CUY","No","Yes","Other Non-Collision",10176,1]
[3,"HUR","Yes","No","Fixed Object",11803488,305]
[6,"FRA","Yes","Yes","Pedestrian",460098,1]
[9,"ROS","Yes","Yes","Right Turn",20352,2]
[7,"MOT","Yes","Yes","Left Turn",3149010,69]
[3,"WAY","Yes","No","Pedalcycles",1930800,21]
[9,"ROS","Yes","No","Angle",531330,8]
[12,"LAK","Yes","Yes","Left Turn",76797,2]
[10,"WAS","No","No","Sideswipe - Passing",4800288,118]
[9,"JAC","No","No","Falling From Or In Vehicle",460098,1]
[4,"MAH","Yes","No","Right Turn",20352,2]
[12,"CUY","No","No","Sideswipe - Passing",810375,23]
[6,"FAY","Yes","Yes","Overturning",996993,4]
[4,"TRU","No","No","Unknown",50880,5]
[11,"BEL","Yes","Yes","Parked Vehicle",155820,5]
[3,"ASD","No","No","Sideswipe - Meeting",10176,1]
[2,"WOO","Yes","No","Head On",988773,26]
[2,"FUL","No","No","Right Turn",661917,27]
[10,"GAL","No","Yes","Rear End",815940,18]
[5,"LIC","Yes","Yes","Left Turn",220215,5]
[4,"MAH","Yes","No","Rear End",697056,36]
[6,"FRA","No","Yes","Left Turn",252969,9]
[11,"TUS","Yes","No","Head On",5041236,67]
[12,"CUY","Yes","No","Pedestrian",8762772,59]
[6,"MAR","Yes","No","Right Turn",153594,4]
[12,"CUY","Yes","Yes","Overturning",45156,1]
[6,"MAD","Yes","No","Fixed Object",117501,6]
[5,"KNO","No","No","Backing",1175328,83]
[8,"WAR","Yes","Yes","Backing",10176,1]
[8,"GRE","Yes","No","Sideswipe - Passing",50880,5]
[5,"LIC","Yes","Yes","Left Turn",20352,2]
[7,"CHP","No","No","Head On",7068405,61]
[7,"CHP","No","No","Train",10176,1]
[3,"WAY","Yes","No","Angle",20713260,664]
[9,"LAW","Yes","No","Backing",2272062,150]
[7,"AUG","Yes","Yes","Overturning",659961,4]
[3,"LOR","Yes","Yes","Parked Vehicle",1611576,74]
[2,"OTT","Yes","No","Other Object",152640,15]
[9,"ROS","No","Yes","Other Non-Collision",310845,25]
[10,"GAL","No","Yes","Pedestrian",460098,1]
[11,"JEF","Yes","No","Overturning",2725179,19]
[9,"SCI","Yes","No","Sideswipe - Passing",50880,5]
[1,"ALL","Yes","Yes","Sideswipe - Passing",4636455,189]
[5,"FAI","Yes","No","Left Turn",163770,5]
[4,"POR","Yes","No","Angle",10176,1]
[12,"CUY","Yes","Yes","Other Non-Collision",10176,1]
[2,"HEN","Yes","No","Other Non-Collision",816099,27]
[11,"COL","Yes","No","Other Non-Collision",50880,5]
[4,"SUM","Yes","No","Pedestrian",71268249,467]
[6,"PIC","No","No","Overturning",7179690,82]
[2,"SAN","Yes","No","Overturning",1813887,11]
[10,"GAL","Yes","No","Right Turn",1342548,56]
[12,"CUY","Yes","Yes","Sideswipe - Passing",20352,2]
[7,"AUG","No","Yes","Overturning",117501,6]
[6,"FRA","Yes","Yes","Animal",65508,3]
[4,"TRU","Yes","Yes","Sideswipe - Passing",11402286,511]
[12,"CUY","No","Yes","Fixed Object",1463499,25]
[10,"ATH","Yes","No","Fixed Object",13124508,302]
[4,"ATB","Yes","Yes","Other Object",20352,2]
[5,"LIC","Yes","No","Rear End",42253341,1958]
[9,"BRO","No","No","Head On",8123529,100]
[7,"CLA","Yes","Yes","Sideswipe - Passing",7757991,387]
[7,"AUG","Yes","No","Backing",111936,11]
[4,"ATB","No","Yes","Left Turn",10176,1]
[10,"GAL","No","No","Fixed Object",45412356,947]
[6,"MAR","Yes","No","Fixed Object",28607907,692]
[7,"MOT","Yes","No","Rear End",4102581,167]
[4,"ATB","Yes","No","Pedestrian",199863,3]
[12,"CUY","Yes","No","Other Non-Collision",460098,1]
[7,"AUG","No","No","Animal",10470786,886]
[8,"WAR","No","No","Animal",9262035,602]
[5,"GUE","No","Yes","Angle",1052325,6]
[3,"WAY","Yes","Yes","Rear End",153594,4]
[12,"CUY","No","Yes","Parked Vehicle",20352,2]
[3,"CRA","Yes","Yes","Sideswipe - Passing",259806,11]
[11,"COL","Yes","No","Fixed Object",5413440,162]
[1,"ALL","Yes","No","Other Non-Collision",470274,2]
[9,"PIK","No","No","Other Non-Collision",1987038,37]
[9,"LAW","Yes","Yes","Pedestrian",460098,1]
[4,"ATB","Yes","No","Angle",6683865,156]
[11,"TUS","Yes","No","Angle",948069,22]
[4,"POR","Yes","No","Other Non-Collision",10176,1]
[6,"DEL","Yes","No","Head On",17568507,209]
[6,"DEL","Yes","No","Train",480450,3]
[11,"COL","Yes","Yes","Overturning",66621,1]
[2,"WOO","Yes","Yes","Other Object",10176,1]
[10,"GAL","Yes","No","Rear End",482247,17]
[10,"MOE","No","Yes","Rear End",10176,1]
[7,"MOT","Yes","Yes","Rear End",87431208,2899]
[5,"GUE","Yes","No","Backing",40704,4]
[10,"GAL","Yes","No","Head On",2650179,31]
[7,"AUG","Yes","No","Sideswipe - Passing",766380,65]
[11,"COL","No","Yes","Sideswipe - Passing",367290,25]
[7,"SHE","Yes","No","Fixed Object",12055806,399]
[6,"UNI","Yes","Yes","Animal",10176,1]
[10,"HOC","Yes","No","Rear End",5156385,239]
[5,"MUS","No","Yes","Sideswipe - Passing",3556941,174]
[9,"JAC","No","No","Angle",14062749,154]
[7,"LOG","Yes","No","Sideswipe - Passing",416898,23]
[4,"ATB","No","Yes","Other Non-Collision",1218528,61]
[8,"HAM","Yes","No","Head On",159017271,2136]
[8,"HAM","Yes","No","Train",604359,29]
[4,"POR","Yes","No","Sideswipe - Passing",1834398,22]
[7,"SHE","Yes","No","Parked Vehicle",5736147,373]
[3,"RIC","Yes","No","Left Turn",66621,1]
[8,"WAR","No","Yes","Backing",167268,13]
[7,"CLA","Yes","No","Sideswipe - Meeting",500802,5]
[11,"COL","Yes","No","Rear End",8724678,261]
[12,"LAK","Yes","No","Sideswipe - Passing",998154,47]
[2,"SAN","Yes","No","Parked Vehicle",3306261,90]
[10,"HOC","No","No","Pedestrian",2893830,8]
[9,"SCI","Yes","No","Overturning",66621,1]
[2,"FUL","Yes","Yes","Sideswipe - Passing",521154,7]
[1,"WYA","No","Yes","Sideswipe - Passing",177444,14]
[7,"MOT","Yes","No","Fixed Object",5939316,149]
[8,"BUT","Yes","No","Pedalcycles",12079878,127]
[2,"SAN","Yes","No","Sideswipe - Passing",61056,6]
[2,"HEN","Yes","Yes","Sideswipe - Passing",659007,15]
[6,"FRA","Yes","Yes","Fixed Object",1274925,21]
[5,"LIC","Yes","Yes","Angle",10176,1]
[9,"BRO","No","No","Other Non-Collision",1096146,71]
[6,"DEL","No","Yes","Other Non-Collision",341373,28]
[8,"CLI","Yes","No","Right Turn",20352,2]
[7,"MER","No","No","Unknown",652170,13]
[7,"SHE","No","No","Other Non-Collision",426915,15]
[5,"KNO","Yes","No","Unknown",71232,7]
[2,"WIL","No","No","Sideswipe - Passing",3558006,122]
[7,"CLA","Yes","No","Pedestrian",22798029,140]
[4,"TRU","Yes","Yes","Other Non-Collision",10176,1]
[6,"FRA","Yes","Yes","Other Object",132129,4]
[1,"DEF","Yes","Yes","Other Object",50880,5]
[2,"FUL","Yes","No","Other Non-Collision",86973,3]
[1,"WYA","Yes","No","Unknown",10176,1]
[11,"COL","Yes","No","Parked Vehicle",50880,5]
[10,"GAL","No","No","Parked Vehicle",826275,28]
[8,"WAR","Yes","No","Other Non-Collision",644220,8]
[8,"HAM","No","No","Animal",2520579,162]
[6,"DEL","Yes","Yes","Parked Vehicle",525177,17]
[9,"LAW","No","No","Pedalcycles",266484,4]
[2,"LUC","Yes","No","Backing",34592214,2703]
[8,"WAR","Yes","No","Overturning",1505157,18]
[2,"SAN","Yes","Yes","Overturning",985704,5]
[3,"RIC","Yes","No","Other Non-Collision",10176,1]
[7,"SHE","Yes","No","Rear End",12927477,543]
[6,"DEL","Yes","No","Sideswipe - Passing",270141,21]
[6,"PIC","Yes","No","Pedestrian",223554,4]
[9,"ADA","No","No","Parked Vehicle",562542,22]
[3,"HUR","Yes","No","Pedestrian",5215881,33]
[10,"GAL","Yes","Yes","Sideswipe - Passing",20352,2]
[6,"MRW","Yes","No","Left Turn",10176,1]
[5,"FAI","Yes","No","Backing",91584,9]
[3,"RIC","Yes","No","Other Non-Collision",2489526,87]
[3,"RIC","No","No","Backing",1372122,65]
[3,"LOR","Yes","Yes","Other Non-Collision",50880,5]
[9,"PIK","No","No","Other Object",178557,12]
[11,"TUS","Yes","Yes","Fixed Object",71232,7]
[1,"HAR","No","No","Sideswipe - Passing",1434927,45]
[7,"MIA","Yes","Yes","Backing",146916,11]
[9,"LAW","Yes","No","Sideswipe - Meeting",76797,2]
[10,"ATH","Yes","Yes","Sideswipe - Passing",477795,20]
[11,"JEF","No","No","Sideswipe - Passing",1713129,35]
[11,"TUS","Yes","Yes","Overturning",66621,1]
[1,"HAN","No","Yes","Angle",480450,3]
[8,"CLE","Yes","No","Animal",12839535,897]
[11,"TUS","Yes","Yes","Sideswipe - Passing",10176,1]
[1,"ALL","No","No","Angle",34746573,393]
[1,"PAU","Yes","No","Parked Vehicle",20352,2]
[6,"FRA","Yes","Yes","Right Turn",10176,1]
[2,"WOO","Yes","No","Fixed Object",25434411,662]
[8,"HAM","Yes","Yes","Right Turn",30528,3]
[6,"PIC","Yes","No","Backing",101760,10]
[12,"GEA","Yes","No","Angle",11569617,333]
[4,"TRU","No","No","Fixed Object",60908079,1326]
[1,"PUT","No","No","Pedalcycles",920196,2]
[4,"STA","Yes","No","Left Turn",5862186,185]
[12,"CUY","Yes","No","Other Non-Collision",66621,1]
[3,"HUR","Yes","Yes","Angle",10176,1]
[12,"CUY","Yes","No","Head On",182213916,2737]
[12,"CUY","Yes","No","Train",1589379,18]
[11,"COL","Yes","No","Parked Vehicle",10176,1]
[2,"WOO","Yes","No","Rear End",41808744,1898]
[2,"SAN","Yes","Yes","Other Non-Collision",133242,2]
[10,"HOC","No","No","Sideswipe - Passing",2290458,64]
[1,"HAN","Yes","Yes","Unknown",10176,1]
[10,"MOE","No","No","Head On",4944516,45]
[1,"HAR","No","No","Pedestrian",460098,1]
[11,"COL","Yes","No","Backing",539169,44]
[7,"MOT","Yes","No","Animal",269028,23]
[2,"HEN","Yes","Yes","Fixed Object",10176,1]
[4,"TRU","No","Yes","Pedalcycles",45156,1]
[10,"NOB","Yes","No","Backing",61056,6]
[8,"BUT","Yes","Yes","Other Non-Collision",66621,1]
[3,"RIC","Yes","No","Left Turn",1439538,46]
[4,"TRU","No","Yes","Backing",50880,5]
[8,"PRE","Yes","No","Left Turn",85860,5]
[9,"JAC","Yes","No","Fixed Object",664572,10]
[2,"HEN","Yes","No","Other Non-Collision",65508,3]
[12,"LAK","Yes","Yes","Angle",10176,1]
[5,"KNO","No","No","Left Turn",7501014,177]
[9,"LAW","No","No","Fixed Object",48093765,1099]
[8,"CLE","Yes","Yes","Fixed Object",983367,40]
[6,"MAD","No","Yes","Animal",1653123,103]
[10,"WAS","Yes","Yes","Rear End",10176,1]
[2,"HEN","Yes","Yes","Other Non-Collision",10176,1]
[6,"MAD","Yes","No","Angle",5787789,132]
[2,"HEN","No","No","Left Turn",4531005,66]
[7,"LOG","Yes","No","Rear End",30528,3]
[12,"LAK","No","Yes","Pedestrian",460098,1]
[3,"ERI","Yes","No","Other Non-Collision",423576,16]
[8,"BUT","Yes","No","Other Object",183009,9]
[8,"BUT","Yes","No","Rear End",230204694,9520]
[2,"FUL","Yes","Yes","Rear End",30528,3]
[12,"CUY","No","No","Head On",536895,3]
[7,"AUG","Yes","No","Other Object",20352,2]
[7,"MOT","Yes","Yes","Other Non-Collision",50880,5]
[4,"POR","Yes","No","Animal",497352,42]
[10,"NOB","Yes","No","Unknown",10176,1]
[4,"POR","Yes","No","Right Turn",10176,1]
[2,"WOO","Yes","Yes","Animal",10176,1]
[4,"TRU","No","No","Rear End",12727629,314]
[5,"MUS","Yes","Yes","Other Object",325632,32]
[6,"FRA","Yes","Yes","Parked Vehicle",470274,2]
[3,"LOR","No","Yes","Rear End",2447661,40]
[11,"COL","Yes","No","Pedalcycles",66621,1]
[5,"GUE","No","Yes","Sideswipe - Passing",4671753,202]
[10,"HOC","No","Yes","Angle",66621,1]
[4,"STA","Yes","No","Backing",427392,42]
[2,"OTT","Yes","No","Right Turn",1445532,28]
[5,"FAI","Yes","Yes","Angle",996993,4]
[3,"CRA","Yes","No","Head On",623868,6]
[3,"CRA","Yes","No","Train",10176,1]
[3,"WAY","Yes","No","Backing",564132,52]
[12,"LAK","Yes","Yes","Right Turn",146916,11]
[9,"ROS","No","No","Other Object",882720,28]
[10,"GAL","No","Yes","Animal",1389183,113]
[9,"LAW","Yes","No","Animal",10176,1]
[4,"STA","Yes","No","Sideswipe - Meeting",71232,7]
[2,"SAN","Yes","No","Pedalcycles",1314882,15]
[6,"UNI","No","Yes","Left Turn",10176,1]
[5,"FAI","Yes","Yes","Right Turn",40704,4]
[2,"LUC","Yes","Yes","Overturning",55332,2]
[10,"HOC","Yes","Yes","Rear End",10176,1]
[8,"GRE","Yes","No","Angle",501486,21]
[12,"GEA","No","Yes","Other Object",10176,1]
[7,"CHP","No","Yes","Fixed Object",1117833,9]
[5,"LIC","Yes","Yes","Pedalcycles",66621,1]
[4,"SUM","Yes","Yes","Sideswipe - Passing",122112,12]
[4,"ATB","Yes","Yes","Other Object",10176,1]
[7,"CHP","Yes","No","Parked Vehicle",20352,2]
[3,"ASD","Yes","No","Other Object",30528,3]
[9,"ROS","Yes","No","Angle",648672,5]
[9,"JAC","No","No","Sideswipe - Passing",4710501,108]
[2,"SAN","No","Yes","Fixed Object",12506778,328]
[12,"LAK","Yes","No","Pedestrian",266484,4]
[1,"PAU","Yes","No","Other Non-Collision",10176,1]
[1,"DEF","Yes","Yes","Other Non-Collision",198909,14]
[10,"NOB","Yes","Yes","Other Non-Collision",10176,1]
[8,"CLI","No","No","Other Non-Collision",1669563,59]
[3,"WAY","Yes","No","Angle",162657,7]
[2,"WIL","No","No","Angle",25910613,309]
[6,"PIC","Yes","No","Other Non-Collision",734691,19]
[10,"HOC","Yes","No","Sideswipe - Passing",55332,2]
[4,"POR","Yes","No","Other Object",50880,5]
[7,"MIA","Yes","Yes","Unknown",122112,12]
[3,"RIC","Yes","Yes","Parked Vehicle",1230882,18]
[6,"MAR","Yes","Yes","Other Non-Collision",10176,1]
[6,"MAD","Yes","Yes","Sideswipe - Passing",86973,3]
[7,"MOT","Yes","No","Angle",3771924,86]
[4,"STA","Yes","No","Right Turn",700554,44]
[7,"AUG","Yes","No","Backing",380964,34]
[5,"FAI","Yes","Yes","Head On",10176,1]
[10,"ATH","Yes","Yes","Parked Vehicle",10176,1]
[8,"BUT","Yes","No","Fixed Object",113964996,2849]
[10,"HOC","Yes","Yes","Overturning",480450,3]
[5,"FAI","Yes","Yes","Left Turn",45156,1]
[2,"WOO","Yes","Yes","Other Non-Collision",20352,2]
[12,"CUY","Yes","No","Other Object",5345865,182]
[9,"ADA","No","No","Rear End",6282741,215]
[6,"FAY","No","No","Head On",2166390,29]
[2,"WOO","Yes","Yes","Parked Vehicle",76797,2]
[11,"COL","Yes","No","Fixed Object",1021527,25]
[5,"GUE","No","No","Pedestrian",986817,3]
[7,"AUG","Yes","No","Left Turn",10176,1]
[12,"CUY","Yes","No","Sideswipe - Passing",12595899,809]
[1,"WYA","No","Yes","Other Non-Collision",50880,5]
[3,"CRA","Yes","Yes","Head On",526719,2]
[7,"MOT","No","Yes","Animal",81408,8]
[9,"LAW","No","No","Rear End",6051030,162]
[5,"PER","No","No","Left Turn",8209008,163]
[9,"LAW","Yes","No","Fixed Object",13579551,366]
[5,"KNO","Yes","No","Left Turn",50880,5]
[11,"BEL","Yes","Yes","Sideswipe - Passing",10176,1]
[2,"OTT","Yes","Yes","Sideswipe - Passing",1078401,12]
[10,"MRG","No","No","Right Turn",577599,7]
[10,"VIN","Yes","No","Right Turn",132129,4]
[4,"POR","No","No","Other Object",412446,26]
[5,"MUS","Yes","No","Unknown",61056,6]
[7,"CHP","No","No","Pedestrian",1063614,5]
[4,"POR","Yes","Yes","Overturning",153594,4]
[7,"MER","Yes","No","Overturning",1236972,15]
[1,"ALL","Yes","Yes","Angle",66621,1]
[6,"FAY","Yes","No","Right Turn",1034247,45]
[6,"MAR","No","No","Other Object",341373,28]
[3,"RIC","Yes","No","Other Non-Collision",10176,1]
[7,"LOG","Yes","No","Fixed Object",607014,12]
[1,"VAN","Yes","No","Angle",1463229,47]
[7,"LOG","Yes","No","Angle",3030396,60]
[1,"HAN","Yes","Yes","Right Turn",61056,6]
[5,"FAI","Yes","No","Other Non-Collision",1031703,26]
[6,"FRA","Yes","Yes","Falling From Or In Vehicle",45156,1]
[9,"SCI","No","No","Fixed Object",83007699,1572]
[4,"MAH","No","No","Head On",5276667,61]
[8,"GRE","No","No","Right Turn",1135260,50]
[9,"JAC","Yes","No","Sideswipe - Meeting",86973,3]
[8,"GRE","Yes","Yes","Rear End",20352,2]
[11,"COL","No","Yes","Other Non-Collision",81408,8]
[5,"COS","Yes","No","Right Turn",45156,1]
[10,"HOC","Yes","No","Fixed Object",1930005,41]
[7,"SHE","Yes","Yes","Angle",177285,5]
[8,"GRE","Yes","No","Other Object",513252,47]
[7,"CLA","Yes","Yes","Sideswipe - Passing",20352,2]
[4,"ATB","Yes","Yes","Fixed Object",1644282,33]
[7,"AUG","No","No","Fixed Object",23638395,468]
[5,"FAI","Yes","Yes","Pedestrian",460098,1]
[7,"MIA","Yes","No","Head On",816624,29]
[10,"HOC","Yes","No","Animal",319908,28]
[7,"AUG","Yes","No","Rear End",3627108,158]
[4,"MAH","Yes","No","Other Non-Collision",40704,4]
[4,"ATB","Yes","Yes","Rear End",569220,20]
[7,"AUG","No","No","Rear End",3572157,98]
[1,"PUT","Yes","No","Pedestrian",66621,1]
[7,"AUG","Yes","No","Angle",4345215,166]
[12,"LAK","Yes","No","Angle",813603,53]
[7,"AUG","Yes","Yes","Rear End",55332,2]
[8,"WAR","Yes","Yes","Right Turn",107325,5]
[8,"WAR","No","Yes","Fixed Object",4910841,153]
[3,"ASD","Yes","No","Left Turn",10176,1]
[6,"FRA","Yes","Yes","Other Object",5512449,244]
[10,"ATH","Yes","Yes","Animal",909957,77]
[1,"PUT","Yes","No","Sideswipe - Passing",419124,19]
[4,"STA","Yes","Yes","Right Turn",20352,2]
[5,"KNO","No","No","Animal",13795140,876]
[2,"FUL","Yes","No","Other Non-Collision",137853,8]
[4,"POR","Yes","Yes","Left Turn",10176,1]
[7,"MOT","No","No","Pedestrian",1188906,7]
[8,"BUT","Yes","Yes","Other Object",66621,1]
[6,"FAY","No","No","Other Non-Collision",536784,39]
[2,"SAN","No","No","Head On",6411783,51]
[2,"SAN","No","No","Train",10176,1]
[12,"CUY","Yes","No","Rear End",450765,25]
[8,"PRE","No","No","Left Turn",8504334,135]
[7,"CHP","Yes","No","Fixed Object",10176,1]
[1,"ALL","Yes","Yes","Overturning",1700997,11]
[7,"CLA","Yes","Yes","Angle",715293,6]
[7,"CLA","No","No","Right Turn",403383,23]
[9,"BRO","Yes","No","Parked Vehicle",10176,1]
[8,"WAR","No","Yes","Parked Vehicle",96036,6]
[10,"WAS","No","No","Sideswipe - Meeting",920196,2]
[2,"FUL","Yes","No","Backing",30528,3]
[5,"GUE","Yes","No","Angle",12641355,351]
[11,"COL","Yes","No","Animal",248676,21]
[2,"LUC","No","Yes","Right Turn",161544,9]
[7,"MIA","Yes","No","Angle",27480663,814]
[7,"DAR","Yes","Yes","Head On",10176,1]
[11,"COL","Yes","No","Rear End",2266179,72]
[11,"JEF","Yes","No","Sideswipe - Passing",61056,6]
[12,"CUY","Yes","Yes","Animal",10176,1]
[11,"TUS","Yes","No","Overturning",76797,2]
[9,"SCI","No","No","Rear End",15501795,319]
[2,"LUC","Yes","No","Other Non-Collision",107325,5]
[2,"FUL","Yes","No","Other Object",10176,1]
[3,"ERI","Yes","Yes","Other Non-Collision",274752,27]
[1,"ALL","Yes","No","Right Turn",7161963,320]
[4,"STA","Yes","No","Parked Vehicle",259965,20]
[3,"WAY","No","No","Parked Vehicle",2115669,33]
[4,"TRU","Yes","Yes","Pedestrian",66621,1]
[9,"SCI","Yes","No","Pedestrian",133242,2]
[2,"SAN","No","Yes","Animal",1625139,119]
[3,"RIC","Yes","Yes","Other Non-Collision",76797,2]
[6,"DEL","No","Yes","Fixed Object",6882663,196]
[2,"WIL","Yes","No","Other Non-Collision",173946,6]
[12,"CUY","Yes","Yes","Rear End",309760488,10593]
[6,"MAD","No","No","Head On",5268033,45]
[4,"SUM","Yes","Yes","Animal",30528,3]
[1,"PAU","No","Yes","Sideswipe - Passing",2483229,36]
[5,"FAI","No","Yes","Other Non-Collision",126564,9]
[2,"WOO","No","No","Left Turn",10989360,185]
[12,"CUY","Yes","Yes","Backing",30528,3]
[9,"SCI","No","No","Sideswipe - Passing",4501209,114]
[6,"UNI","No","No","Angle",21298518,258]
[2,"FUL","No","No","Animal",14018886,1115]
[9,"LAW","No","No","Pedestrian",1425450,4]
[12,"LAK","Yes","Yes","Other Non-Collision",1171782,35]
[4,"STA","Yes","Yes","Backing",219261,16]
[7,"MIA","Yes","Yes","Animal",1055442,67]
[11,"JEF","Yes","No","Animal",523269,39]
[12,"LAK","No","Yes","Fixed Object",5960781,149]
[4,"MAH","Yes","No","Unknown",65508,3]
[4,"SUM","Yes","No","Pedalcycles",3917949,32]
[5,"MUS","Yes","No","Rear End",171720,10]
[12,"LAK","Yes","Yes","Fixed Object",315138,13]
[9,"ADA","No","No","Fixed Object",56819538,1251]
[11,"COL","Yes","No","Backing",146916,11]
[7,"DAR","Yes","No","Angle",12663234,329]
[12,"CUY","Yes","Yes","Other Non-Collision",65508,3]
[1,"WYA","Yes","No","Fixed Object",20352,2]
[8,"CLI","Yes","Yes","Sideswipe - Passing",136740,10]
[1,"WYA","Yes","No","Parked Vehicle",665574,44]
[5,"LIC","Yes","Yes","Overturning",515430,3]
[8,"HAM","No","Yes","Other Object",10176,1]
[5,"MUS","Yes","Yes","Pedestrian",66621,1]
[6,"FRA","No","Yes","Overturning",412128,8]
[10,"ATH","Yes","No","Left Turn",4506186,118]
[10,"WAS","No","Yes","Parked Vehicle",10176,1]
[2,"HEN","No","Yes","Fixed Object",2122077,58]
[11,"COL","No","No","Angle",19869699,352]
[10,"ATH","Yes","No","Fixed Object",881178,43]
[3,"RIC","No","No","Parked Vehicle",815511,31]
[6,"MRW","Yes","No","Rear End",10176,1]
[12,"LAK","Yes","Yes","Animal",30528,3]
[2,"HEN","No","Yes","Animal",1244493,103]
[8,"WAR","Yes","Yes","Pedestrian",526719,2]
[4,"SUM","No","No","Rear End",4596021,163]
[3,"MED","Yes","Yes","Head On",10176,1]
[10,"MRG","No","No","Backing",800358,31]
[12,"GEA","Yes","No","Other Object",510978,6]
[2,"WOO","Yes","Yes","Angle",111777,2]
[5,"LIC","Yes","Yes","Sideswipe - Meeting",10176,1]
[11,"JEF","Yes","No","Rear End",395274,14]
[7,"MIA","Yes","No","Fixed Object",358068,13]
[2,"WOO","Yes","Yes","Backing",142305,5]
[10,"HOC","No","Yes","Head On",490626,4]
[4,"STA","Yes","Yes","Left Turn",107325,5]
[8,"CLE","No","Yes","Sideswipe - Passing",61056,6]
[11,"COL","Yes","Yes","Unknown",10176,1]
[9,"ROS","No","No","Overturning",11617155,106]
[4,"MAH","Yes","Yes","Angle",955431,31]
[10,"HOC","Yes","Yes","Right Turn",10176,1]
[6,"UNI","Yes","Yes","Other Object",81408,8]
[5,"FAI","Yes","Yes","Animal",244224,24]
[7,"MER","No","No","Right Turn",919926,24]
[12,"CUY","Yes","Yes","Rear End",20352,2]
[12,"GEA","Yes","No","Pedestrian",1492071,5]
[3,"ERI","Yes","Yes","Backing",40704,4]
[3,"ERI","No","Yes","Unknown",239613,18]
[9,"LAW","No","Yes","Other Object",10176,1]
[4,"ATB","Yes","No","Unknown",183009,9]
[12,"GEA","No","Yes","Sideswipe - Passing",634887,32]
[3,"RIC","Yes","No","Rear End",2596470,155]
[2,"LUC","Yes","No","Backing",935874,74]
[1,"PUT","No","No","Right Turn",207972,17]
[5,"COS","Yes","No","Fixed Object",3598869,145]
[7,"MOT","Yes","No","Right Turn",582210,13]
[2,"OTT","Yes","No","Animal",1889190,138]
[7,"MIA","Yes","Yes","Left Turn",100488,3]
[5,"MUS","Yes","Yes","Pedestrian",66621,1]
[12,"LAK","Yes","No","Angle",80720643,2462]
[3,"ERI","No","Yes","Backing",122112,12]
[4,"TRU","No","Yes","Left Turn",10176,1]
[3,"LOR","No","No","Parked Vehicle",2211276,52]
[12,"LAK","No","Yes","Left Turn",117501,6]
[12,"CUY","Yes","No","Sideswipe - Passing",386818698,19020]
[6,"UNI","No","No","Head On",7509423,67]
[6,"UNI","No","No","Train",10176,1]
[6,"MAR","No","No","Overturning",2702697,36]
[3,"CRA","No","No","Pedestrian",460098,1]
[2,"OTT","Yes","No","Overturning",669024,7]
[6,"FAY","Yes","Yes","Rear End",20352,2]
[3,"RIC","Yes","Yes","Right Turn",10176,1]
[7,"MOT","Yes","Yes","Sideswipe - Passing",689265,45]
[8,"WAR","Yes","Yes","Angle",97149,4]
[11,"CAR","No","No","Sideswipe - Meeting",40704,4]
[5,"FAI","Yes","No","Other Non-Collision",3327471,61]
[10,"WAS","No","Yes","Head On",470274,2]
[9,"ROS","No","No","Sideswipe - Meeting",127677,7]
[4,"MAH","Yes","No","Right Turn",14697927,744]
[2,"WOO","Yes","No","Rear End",155820,5]
[1,"ALL","No","Yes","Sideswipe - Passing",2953695,143]
[1,"DEF","Yes","Yes","Angle",45156,1]
[2,"SEN","No","No","Sideswipe - Meeting",960900,6]
[10,"NOB","No","No","Overturning",3001839,24]
[6,"FRA","Yes","No","Overturning",460098,1]
[9,"ROS","Yes","No","Head On",505254,2]
[7,"DAR","Yes","No","Pedalcycles",704529,14]
[5,"LIC","Yes","Yes","Animal",10176,1]
[9,"JAC","Yes","Yes","Sideswipe - Passing",245178,13]
[5,"FAI","Yes","No","Backing",747300,70]
[6,"MRW","No","Yes","Animal",2817861,147]
[4,"POR","Yes","No","Animal",10176,1]
[2,"WOO","Yes","No","Parked Vehicle",10176,1]
[3,"RIC","No","Yes","Animal",1551522,102]
[11,"HOL","No","No","Sideswipe - Passing",8242494,228]
[3,"WAY","No","No","Backing",1401267,92]
[5,"COS","Yes","No","Pedalcycles",1073790,6]
[11,"HAS","Yes","No","Angle",86973,3]
[1,"HAN","Yes","Yes","Animal",942552,67]
[8,"WAR","Yes","Yes","Backing",40704,4]
[4,"MAH","Yes","Yes","Other Non-Collision",20352,2]
[2,"WOO","Yes","No","Other Non-Collision",45156,1]
[1,"HAN","Yes","Yes","Left Turn",30528,3]
[12,"LAK","Yes","No","Fixed Object",107325,5]
[4,"SUM","Yes","Yes","Head On",5365500,72]
[4,"SUM","Yes","Yes","Train",45156,1]
[9,"PIK","No","No","Sideswipe - Meeting",556134,7]
[7,"CLA","Yes","Yes","Rear End",45156,1]
[2,"SAN","Yes","No","Right Turn",1391727,67]
[4,"STA","Yes","Yes","Head On",1832172,26]
[4,"ATB","Yes","No","Parked Vehicle",2889729,125]
[7,"MOT","Yes","No","Other Non-Collision",10176,1]
[11,"COL","Yes","No","Left Turn",2281665,39]
[11,"TUS","Yes","Yes","Fixed Object",30528,3]
[3,"MED","Yes","Yes","Overturning",745821,9]
[5,"LIC","Yes","Yes","Right Turn",667911,9]
[9,"BRO","Yes","Yes","Rear End",40704,4]
[10,"NOB","Yes","No","Rear End",242952,17]
[1,"VAN","Yes","No","Unknown",30528,3]
[1,"PAU","No","No","Animal",11464806,1014]
[2,"WIL","Yes","Yes","Fixed Object",10176,1]
[11,"BEL","Yes","Yes","Head On",643107,10]
[3,"MED","No","No","Sideswipe - Passing",13487997,320]
[6,"DEL","Yes","Yes","Backing",10176,1]
[6,"FRA","Yes","Yes","Sideswipe - Passing",223824693,8366]
[4,"POR","Yes","Yes","Rear End",4083930,89]
[2,"WOO","Yes","No","Angle",148029,9]
[6,"UNI","Yes","No","Other Object",20352,2]
[4,"STA","Yes","No","Rear End",779577,47]
[3,"LOR","No","Yes","Backing",50880,5]
[6,"MRW","No","No","Head On",7261161,89]
[7,"MOT","Yes","Yes","Right Turn",1562604,52]
[8,"HAM","Yes","Yes","Rear End",4177041,204]
[1,"DEF","No","Yes","Other Non-Collision",81408,8]
[10,"NOB","Yes","No","Right Turn",65508,3]
[7,"CLA","Yes","No","Sideswipe - Passing",10176,1]
[7,"AUG","Yes","No","Left Turn",10176,1]
[3,"WAY","Yes","No","Sideswipe - Meeting",20352,2]
[6,"DEL","No","No","Sideswipe - Passing",8459673,313]
[3,"LOR","Yes","No","Right Turn",6317307,252]
[2,"WOO","Yes","Yes","Fixed Object",10176,1]
[8,"WAR","Yes","Yes","Other Object",616125,55]
[8,"WAR","Yes","No","Angle",9263895,275]
[5,"KNO","Yes","No","Backing",101760,10]
[4,"POR","No","Yes","Other Object",717726,56]
[6,"MAD","Yes","No","Other Object",377307,17]
[4,"SUM","Yes","No","Parked Vehicle",20352,2]
[11,"COL","Yes","No","Animal",2009982,98]
[3,"ERI","No","No","Other Non-Collision",2265813,79]
[6,"FRA","Yes","No","Head On",2680278,47]
[10,"ATH","Yes","No","Parked Vehicle",1931484,102]
[4,"POR","Yes","No","Angle",12315024,364]
[10,"NOB","No","No","Sideswipe - Meeting",10176,1]
[4,"ATB","Yes","No","Left Turn",9083460,178]
[3,"ERI","Yes","No","Other Non-Collision",2828625,74]
[6,"DEL","Yes","Yes","Animal",818373,68]
[11,"COL","Yes","No","Pedestrian",1625313,7]
[6,"UNI","No","Yes","Unknown",91584,9]
[2,"WOO","Yes","Yes","Head On",10176,1]
[12,"LAK","Yes","Yes","Right Turn",10176,1]
[11,"COL","No","No","Other Non-Collision",1976910,81]
[3,"WAY","Yes","Yes","Rear End",66621,1]
[7,"MOT","Yes","No","Fixed Object",709728,11]
[6,"MAD","Yes","No","Parked Vehicle",40704,4]
[4,"MAH","Yes","No","Other Object",20352,2]
[7,"CLA","Yes","Yes","Left Turn",470274,2]
[6,"UNI","Yes","Yes","Other Non-Collision",367131,16]
[5,"LIC","Yes","Yes","Right Turn",86973,3]
[9,"ROS","Yes","No","Parked Vehicle",6590406,390]
[9,"LAW","Yes","No","Sideswipe - Passing",65508,3]
[4,"POR","Yes","No","Head On",2004162,9]
[8,"CLE","No","Yes","Head On",66621,1]
[4,"MAH","Yes","Yes","Other Object",10176,1]
[3,"ERI","Yes","No","Other Object",75684,4]
[4,"SUM","Yes","Yes","Sideswipe - Passing",418011,21]
[5,"FAI","Yes","No","Angle",22715943,552]
[5,"LIC","Yes","No","Backing",671457,57]
[6,"FRA","No","Yes","Rear End",4334196,135]
[7,"AUG","Yes","No","Overturning",388437,7]
[2,"WOO","No","Yes","Backing",457761,36]
[9,"HIG","Yes","No","Overturning",593340,3]
[2,"SAN","Yes","No","Train",66621,1]
[2,"SAN","Yes","No","Head On",460098,1]
[11,"JEF","Yes","Yes","Overturning",10176,1]
[1,"PUT","Yes","No","Overturning",76797,2]
[9,"HIG","No","No","Right Turn",1075746,29]
[3,"MED","Yes","No","Pedestrian",460098,1]
[4,"SUM","Yes","Yes","Sideswipe - Passing",498465,40]
[7,"AUG","Yes","No","Head On",20352,2]
[6,"PIC","No","No","Pedestrian",4114377,16]
[9,"LAW","No","No","Animal",3502515,186]
[10,"GAL","Yes","No","Backing",10176,1]
[7,"CLA","Yes","Yes","Rear End",55332,2]
[2,"SEN","No","No","Other Non-Collision",1341435,53]
[4,"MAH","Yes","No","Angle",951408,21]
[10,"ATH","Yes","No","Rear End",864165,40]
[7,"MOT","Yes","Yes","Animal",2966097,210]
[8,"HAM","Yes","No","Left Turn",286354959,9015]
[12,"GEA","Yes","No","Head On",852033,16]
[5,"LIC","Yes","No","Unknown",162657,7]
[2,"LUC","Yes","Yes","Animal",10176,1]
[1,"WYA","No","No","Pedestrian",2310666,6]
[11,"TUS","Yes","Yes","Backing",10176,1]
[10,"HOC","No","Yes","Other Non-Collision",71232,7]
[3,"LOR","No","Yes","Unknown",30528,3]
[2,"SAN","Yes","Yes","Sideswipe - Passing",536895,3]
[7,"MOT","Yes","No","Left Turn",30528,3]
[7,"CLA","Yes","Yes","Angle",10176,1]
[2,"LUC","No","No","Unknown",30528,3]
[7,"AUG","Yes","Yes","Angle",307188,8]
[11,"COL","No","Yes","Parked Vehicle",66621,1]
[6,"FAY","No","No","Angle",8140368,160]
[6,"FAY","Yes","No","Animal",452196,41]
[2,"WOO","Yes","No","Head On",167109,4]
[8,"GRE","No","Yes","Other Object",198909,14]
[7,"MOT","No","No","Angle",12489096,203]
[4,"STA","Yes","No","Pedestrian",46782342,330]
[6,"DEL","Yes","Yes","Fixed Object",459669,14]
[2,"OTT","No","No","Animal",9407775,756]
[1,"ALL","Yes","No","Pedalcycles",9140763,82]
[3,"RIC","Yes","No","Overturning",5123598,54]
[4,"SUM","Yes","No","Fixed Object",1717740,41]
[5,"LIC","No","No","Pedestrian",4774926,16]
[1,"WYA","No","Yes","Overturning",76797,2]
[8,"CLE","Yes","No","Overturning",8093796,82]
[6,"PIC","Yes","No","Pedestrian",460098,1]
[1,"HAR","No","No","Left Turn",1079244,37]
[9,"ROS","Yes","Yes","Sideswipe - Passing",81408,8]
[10,"WAS","No","No","Left Turn",5348043,128]
[10,"ATH","No","No","Overturning",6729990,80]
[7,"MER","No","No","Other Non-Collision",2639208,50]
[8,"BUT","Yes","No","Left Turn",94570248,2062]
[12,"CUY","Yes","Yes","Parked Vehicle",20352,2]
[2,"WOO","Yes","Yes","Angle",197637,7]
[5,"COS","No","No","Sideswipe - Passing",3027120,55]
[2,"OTT","Yes","No","Parked Vehicle",1094874,64]
[9,"BRO","Yes","No","Parked Vehicle",127677,7]
[3,"MED","No","Yes","Overturning",587775,8]
[11,"COL","No","No","Overturning",15706887,137]
[10,"VIN","Yes","No","Left Turn",111777,2]
[7,"AUG","Yes","Yes","Head On",460098,1]
[2,"OTT","No","No","Sideswipe - Passing",3515505,109]
[4,"ATB","Yes","No","Overturning",2447931,18]
[3,"RIC","Yes","No","Pedalcycles",2401599,30]
[12,"CUY","Yes","Yes","Fixed Object",65508,3]
[9,"ROS","No","Yes","Unknown",30528,3]
[9,"LAW","Yes","Yes","Other Non-Collision",10176,1]
[6,"FRA","Yes","Yes","Backing",55332,2]
[3,"CRA","Yes","No","Angle",121953,3]
[12,"LAK","No","Yes","Backing",85860,5]
[6,"FRA","Yes","Yes","Pedalcycles",792090,8]
[8,"BUT","No","Yes","Rear End",1691283,93]
[2,"WOO","No","Yes","Sideswipe - Meeting",20352,2]
[7,"SHE","No","No","Backing",671457,57]
[9,"HIG","Yes","No","Fixed Object",490626,4]
[10,"HOC","No","No","Left Turn",3440871,109]
[3,"LOR","No","No","Overturning",7233129,50]
[5,"LIC","Yes","Yes","Left Turn",75684,4]
[2,"SEN","Yes","No","Angle",10176,1]
[6,"DEL","No","No","Parked Vehicle",2224266,50]
[4,"STA","Yes","No","Pedestrian",490626,4]
[11,"COL","Yes","No","Rear End",2540613,86]
[8,"BUT","Yes","No","Unknown",20352,2]
[9,"JAC","Yes","Yes","Fixed Object",720747,32]
[2,"WOO","Yes","Yes","Other Non-Collision",148029,9]
[7,"CHP","No","No","Unknown",586662,10]
[8,"BUT","No","Yes","Sideswipe - Passing",325632,32]
[11,"TUS","Yes","Yes","Other Object",10176,1]
[6,"UNI","Yes","Yes","Left Turn",30528,3]
[2,"WOO","Yes","No","Rear End",1496937,45]
[2,"HEN","Yes","No","Parked Vehicle",97149,4]
[3,"ERI","No","No","Animal",9092589,698]
[8,"CLE","No","No","Parked Vehicle",2057841,57]
[6,"FAY","Yes","No","Angle",13999359,411]
[7,"AUG","Yes","No","Backing",1116816,96]
[7,"MER","Yes","No","Head On",2448519,14]
[12,"GEA","No","Yes","Animal",838725,70]
[11,"HOL","No","No","Angle",20486889,435]
[11,"TUS","Yes","Yes","Sideswipe - Passing",10176,1]
[5,"FAI","No","No","Backing",1863861,67]
[8,"HAM","No","Yes","Right Turn",55332,2]
[3,"ERI","Yes","No","Animal",498624,49]
[1,"DEF","No","No","Head On",3603717,28]
[4,"SUM","Yes","No","Parked Vehicle",742689,64]
[3,"LOR","Yes","Yes","Animal",2513424,142]
[1,"PAU","No","No","Parked Vehicle",611196,31]
[10,"WAS","Yes","Yes","Overturning",153594,4]
[6,"FRA","Yes","No","Overturning",1512423,7]
[6,"UNI","Yes","No","Right Turn",157092,12]
[8,"WAR","Yes","No","Backing",1257006,69]
[2,"WOO","Yes","No","Other Object",249789,19]
[2,"WIL","No","Yes","Other Non-Collision",391140,35]
[3,"WAY","Yes","No","Animal",854625,75]
[9,"PIK","Yes","No","Other Non-Collision",126564,9]
[11,"HOL","No","No","Pedalcycles",7310355,39]
[8,"CLI","Yes","No","Fixed Object",7314840,132]
[3,"LOR","Yes","No","Angle",25294812,773]
[10,"HOC","Yes","No","Other Object",40704,4]
[1,"DEF","No","Yes","Animal",71232,7]
[6,"FRA","Yes","Yes","Fixed Object",223470510,4932]
[12,"CUY","Yes","Yes","Sideswipe - Passing",899304,49]
[2,"LUC","Yes","No","Other Object",3474960,114]
[9,"BRO","Yes","No","Fixed Object",2261043,59]
[3,"CRA","No","Yes","Rear End",864435,13]
[10,"WAS","Yes","No","Animal",726948,68]
[10,"ATH","No","No","Pedalcycles",133242,2]
[5,"MUS","Yes","Yes","Sideswipe - Passing",4870233,234]
[3,"MED","No","No","Pedalcycles",3353928,9]
[4,"TRU","Yes","No","Sideswipe - Passing",10176,1]
[1,"HAR","Yes","No","Overturning",20352,2]
[3,"MED","Yes","Yes","Rear End",2680326,97]
[6,"UNI","Yes","Yes","Parked Vehicle",10176,1]
[4,"MAH","Yes","Yes","Animal",4327503,323]
[3,"RIC","Yes","No","Backing",61056,6]
[5,"FAI","Yes","No","Rear End",41359710,1655]
[12,"GEA","Yes","No","Rear End",61056,6]
[7,"AUG","Yes","Yes","Other Object",30528,3]
[4,"MAH","Yes","Yes","Other Non-Collision",45156,1]
[4,"ATB","Yes","No","Pedalcycles",45156,1]
[8,"CLI","No","No","Rear End",11940786,353]
[3,"MED","Yes","No","Fixed Object",4576161,62]
[7,"LOG","Yes","Yes","Fixed Object",504984,24]
[7,"AUG","Yes","Yes","Fixed Object",66621,1]
[9,"JAC","Yes","No","Right Turn",1070340,43]
[6,"MAR","No","No","Pedalcycles",1053438,4]
[1,"DEF","Yes","No","Sideswipe - Passing",10176,1]
[12,"GEA","Yes","No","Right Turn",1086924,64]
[1,"PUT","Yes","No","Overturning",66621,1]
[12,"CUY","Yes","No","Parked Vehicle",10176,1]
[4,"ATB","Yes","Yes","Animal",10176,1]
[12,"CUY","Yes","Yes","Right Turn",20352,2]
[6,"MAD","No","Yes","Other Object",834432,82]
[8,"BUT","Yes","No","Other Non-Collision",4226346,123]
[5,"GUE","No","No","Unknown",490626,4]
[7,"SHE","Yes","Yes","Other Non-Collision",310845,25]
[7,"CHP","No","No","Backing",1897998,47]
[11,"BEL","Yes","No","Other Object",157092,12]
[7,"MIA","Yes","No","Sideswipe - Passing",132288,13]
[8,"GRE","Yes","Yes","Left Turn",20352,2]
[12,"CUY","Yes","No","Unknown",32734371,1090]
[4,"SUM","Yes","No","Right Turn",10176,1]
[8,"CLI","Yes","Yes","Animal",442974,29]
[11,"COL","Yes","No","Other Non-Collision",65508,3]
[3,"MED","Yes","Yes","Backing",10176,1]
[3,"ERI","Yes","No","Sideswipe - Meeting",769830,28]
[8,"WAR","Yes","Yes","Other Non-Collision",10176,1]
[10,"WAS","No","Yes","Overturning",97149,4]
[8,"GRE","No","Yes","Backing",30528,3]
[4,"STA","Yes","No","Left Turn",90155922,2322]
[2,"HEN","Yes","Yes","Unknown",10176,1]
[4,"POR","Yes","No","Parked Vehicle",244224,24]
[2,"HEN","Yes","Yes","Right Turn",66621,1]
[10,"NOB","Yes","No","Angle",315138,13]
[7,"LOG","Yes","Yes","Sideswipe - Passing",91584,9]
[2,"FUL","No","No","Fixed Object",34253820,801]
[8,"CLE","Yes","No","Backing",5581854,474]
[2,"SAN","No","Yes","Sideswipe - Passing",8303487,310]
[9,"LAW","Yes","No","Pedalcycles",1082265,13]
[7,"CHP","Yes","No","Pedalcycles",460098,1]
[3,"LOR","Yes","No","Pedalcycles",1389882,13]
[2,"OTT","Yes","No","Pedestrian",920196,2]
[6,"MAD","No","Yes","Fixed Object",15876066,461]
[1,"WYA","Yes","No","Fixed Object",10176,1]
[7,"SHE","Yes","Yes","Sideswipe - Meeting",460098,1]
[3,"ERI","Yes","Yes","Sideswipe - Passing",3241389,123]
[8,"WAR","No","Yes","Unknown",30528,3]
[7,"MIA","Yes","Yes","Fixed Object",5043288,170]
[2,"SAN","Yes","No","Parked Vehicle",171720,10]
[6,"FRA","Yes","No","Parked Vehicle",30528,3]
[2,"SEN","Yes","No","Animal",3170889,237]
[6,"DEL","Yes","No","Parked Vehicle",1125720,85]
[10,"MEG","Yes","Yes","Sideswipe - Passing",10176,1]
[4,"STA","No","No","Fixed Object",66035763,1494]
[4,"POR","Yes","Yes","Unknown",20352,2]
[7,"AUG","Yes","No","Overturning",121953,3]
[6,"FRA","Yes","Yes","Angle",10176,1]
[6,"MAD","No","Yes","Backing",162816,16]
[9,"JAC","No","No","Pedestrian",1973634,6]
[6,"FRA","Yes","Yes","Rear End",193185,10]
[9,"JAC","Yes","No","Animal",40704,4]
[5,"LIC","Yes","No","Animal",2302797,142]
[11,"TUS","No","Yes","Angle",658848,6]
[9,"BRO","Yes","No","Other Object",20352,2]
[4,"POR","Yes","Yes","Backing",20352,2]
[8,"GRE","Yes","No","Other Non-Collision",2524665,96]
[6,"UNI","No","Yes","Backing",50880,5]
[8,"BUT","Yes","No","Overturning",7258713,80]
[7,"LOG","Yes","No","Pedestrian",1885548,5]
[3,"RIC","Yes","Yes","Angle",1481466,17]
[3,"HUR","Yes","No","Pedestrian",66621,1]
[5,"MUS","No","No","Right Turn",1053168,31]
[3,"HUR","No","No","Sideswipe - Passing",3453177,91]
[11,"COL","Yes","No","Head On",10176,1]
[7,"MER","No","No","Backing",1065618,68]
[5,"FAI","Yes","Yes","Sideswipe - Passing",1357065,85]
[5,"MUS","Yes","No","Parked Vehicle",96036,6]
[8,"HAM","Yes","No","Other Non-Vehicle",45156,1]
[7,"MOT","No","Yes","Sideswipe - Passing",1137963,78]
[8,"WAR","Yes","Yes","Rear End",8776512,260]
[3,"ERI","No","No","Other Object",1403874,35]
[3,"RIC","Yes","No","Other Object",20352,2]
[1,"HAN","No","Yes","Overturning",188574,4]
[11,"BEL","No","No","Left Turn",6580341,228]
[11,"JEF","Yes","No","Left Turn",557247,5]
[6,"PIC","No","No","Left Turn",7853373,140]
[8,"GRE","Yes","No","Overturning",4860453,49]
[9,"LAW","Yes","No","Other Non-Collision",274593,18]
[10,"WAS","Yes","No","Parked Vehicle",2939385,168]
[8,"CLE","No","Yes","Fixed Object",416898,23]
[4,"SUM","Yes","Yes","Parked Vehicle",2023401,13]
[9,"HIG","Yes","No","Pedalcycles",66621,1]
[4,"ATB","Yes","Yes","Overturning",66621,1]
[7,"CLA","No","Yes","Angle",173946,6]
[7,"MIA","No","No","Parked Vehicle",2981694,76]
[7,"SHE","Yes","Yes","Fixed Object",122112,12]
[4,"SUM","Yes","No","Left Turn",113450337,3374]
[2,"LUC","No","No","Pedestrian",1625313,7]
[8,"BUT","Yes","No","Animal",1257960,58]
[6,"MAR","No","No","Fixed Object",36854184,770]
[4,"ATB","Yes","No","Angle",91584,9]
[6,"PIC","Yes","No","Backing",172992,17]
[9,"JAC","Yes","No","Head On",4230924,33]
[9,"JAC","Yes","No","Train",66621,1]
[1,"PAU","No","No","Angle",10664157,135]
[6,"UNI","Yes","Yes","Fixed Object",448380,15]
[5,"FAI","Yes","No","Animal",1481673,71]
[7,"MOT","Yes","No","Right Turn",10176,1]
[3,"RIC","Yes","No","Animal",20352,2]
[2,"SAN","Yes","No","Other Non-Collision",750591,24]
[2,"SEN","No","No","Parked Vehicle",944730,23]
[6,"DEL","Yes","No","Sideswipe - Meeting",321975,15]
[3,"RIC","Yes","No","Backing",5843727,477]
[6,"UNI","Yes","Yes","Fixed Object",470274,2]
[2,"WOO","No","Yes","Overturning",1264161,19]
[4,"POR","Yes","No","Sideswipe - Passing",10176,1]
[8,"BUT","Yes","No","Parked Vehicle",3898950,243]
[5,"LIC","Yes","Yes","Unknown",10176,1]
[2,"HEN","No","No","Overturning",5137113,59]
[8,"CLI","Yes","No","Parked Vehicle",3323862,89]
[3,"ASD","No","Yes","Animal",1149411,86]
[3,"MED","No","Yes","Animal",2768826,196]
[9,"SCI","Yes","No","Angle",42102363,1095]
[8,"CLI","Yes","Yes","Rear End",40704,4]
[12,"CUY","Yes","Yes","Sideswipe - Passing",40704,4]
[7,"CHP","Yes","No","Right Turn",1312020,48]
[4,"SUM","Yes","Yes","Rear End",100488,3]
[10,"ATH","No","No","Angle",11424972,140]
[8,"PRE","No","No","Angle",18682032,286]
[4,"TRU","Yes","Yes","Left Turn",2904786,40]
[8,"WAR","Yes","No","Fixed Object",76797,2]
[3,"WAY","Yes","Yes","Fixed Object",1532601,56]
[4,"SUM","Yes","Yes","Fixed Object",21418218,660]
[7,"DAR","Yes","No","Sideswipe - Passing",1718949,129]
[8,"HAM","Yes","Yes","Angle",10176,1]
[3,"CRA","Yes","No","Rear End",6611982,234]
[6,"PIC","Yes","No","Right Turn",1850871,74]
[6,"FRA","Yes","Yes","Fixed Object",3491178,77]
[6,"PIC","Yes","No","Backing",376353,28]
[7,"MOT","Yes","Yes","Backing",10176,1]
[7,"MIA","No","No","Right Turn",711684,34]
[2,"OTT","No","Yes","Sideswipe - Passing",1116339,64]
[7,"SHE","No","No","Fixed Object",25037658,577]
[6,"FRA","Yes","No","Sideswipe - Meeting",91584,9]
[11,"COL","No","No","Animal",8236803,450]
[6,"DEL","Yes","No","Overturning",4402422,40]
[1,"VAN","Yes","No","Left Turn",40704,4]
[6,"FRA","Yes","Yes","Fixed Object",754884,12]
[9,"BRO","Yes","No","Animal",270141,21]
[1,"PUT","No","No","Other Non-Collision",1970025,34]
[1,"ALL","No","Yes","Overturning",449493,13]
[12,"CUY","Yes","Yes","Left Turn",76797,2]
[12,"LAK","Yes","No","Left Turn",861096,19]
[7,"MOT","Yes","Yes","Left Turn",86973,3]
[11,"COL","Yes","No","Animal",950661,81]
[8,"PRE","Yes","No","Angle",10176,1]
[6,"FRA","Yes","No","Sideswipe - Passing",40704,4]
[3,"ASD","Yes","No","Fixed Object",6955008,196]
[3,"ERI","Yes","No","Animal",2841123,226]
[7,"SHE","Yes","Yes","Animal",20352,2]
[12,"GEA","No","No","Head On",13657203,134]
[5,"LIC","Yes","Yes","Parked Vehicle",198750,5]
[3,"WAY","Yes","No","Right Turn",10176,1]
[9,"ROS","Yes","No","Rear End",208926,6]
[8,"WAR","Yes","No","Animal",1424640,140]
[4,"SUM","Yes","No","Fixed Object",65508,3]
[3,"ASD","No","Yes","Overturning",188574,4]
[7,"SHE","No","No","Unknown",971076,7]
[2,"WIL","Yes","No","Rear End",20352,2]
[2,"FUL","Yes","No","Animal",132288,13]
[10,"MRG","No","No","Overturning",11210925,65]
[7,"MER","Yes","No","Sideswipe - Passing",10176,1]
[5,"KNO","Yes","No","Overturning",545958,6]
[3,"CRA","Yes","No","Right Turn",309732,27]
[9,"ROS","Yes","No","Animal",10176,1]
[7,"AUG","Yes","No","Other Non-Collision",20352,2]
[4,"ATB","Yes","Yes","Rear End",298284,19]
[1,"PUT","No","No","Left Turn",2499654,48]
[3,"HUR","Yes","No","Left Turn",142305,5]
[5,"LIC","Yes","No","Other Object",268869,14]
[2,"HEN","Yes","No","Backing",50880,5]
[11,"JEF","No","Yes","Other Object",10176,1]
[8,"HAM","Yes","Yes","Sideswipe - Passing",971649,54]
[2,"FUL","Yes","No","Other Non-Collision",45156,1]
[3,"ASD","No","No","Parked Vehicle",1136961,44]
[3,"RIC","Yes","Yes","Angle",526719,2]
[7,"MOT","Yes","No","Other Non-Collision",61056,6]
[7,"LOG","Yes","No","Head On",2037600,24]
[6,"MAR","Yes","Yes","Rear End",325314,14]
[9,"HIG","Yes","No","Right Turn",689265,45]
[5,"LIC","No","Yes","Rear End",8654511,202]
[8,"CLI","Yes","No","Head On",1093713,21]
[7,"MOT","Yes","Yes","Parked Vehicle",20352,2]
[9,"LAW","Yes","No","Other Object",61056,6]
[7,"CLA","Yes","Yes","Animal",301623,13]
[5,"LIC","Yes","No","Pedestrian",66621,1]
[1,"ALL","No","Yes","Animal",1230819,94]
[2,"HEN","Yes","No","Fixed Object",40704,4]
[6,"FAY","Yes","No","Backing",66621,1]
[11,"BEL","Yes","No","Sideswipe - Passing",45156,1]
[6,"FRA","Yes","Yes","Animal",4906374,282]
[5,"KNO","No","No","Other Object",142464,14]
[6,"UNI","Yes","No","Head On",557247,5]
[4,"POR","Yes","No","Angle",43828644,1245]
[2,"HEN","No","No","Sideswipe - Meeting",10176,1]
[7,"AUG","Yes","Yes","Sideswipe - Passing",20352,2]
[12,"GEA","Yes","Yes","Rear End",50880,5]
[6,"DEL","No","No","Backing",1296327,97]
[3,"ASD","Yes","No","Rear End",40704,4]
[6,"UNI","Yes","Yes","Other Non-Collision",45156,1]
[2,"WOO","Yes","No","Other Non-Collision",10176,1]
[3,"ERI","No","No","Fixed Object",27452979,646]
[3,"RIC","Yes","Yes","Overturning",970488,11]
[7,"MIA","Yes","No","Left Turn",10128807,320]
[4,"ATB","No","Yes","Rear End",6275871,117]
[4,"SUM","Yes","Yes","Overturning",470274,2]
[8,"GRE","Yes","No","Fixed Object",69201468,1743]
[7,"SHE","No","No","Parked Vehicle",734262,32]
[11,"JEF","Yes","Yes","Right Turn",20352,2]
[8,"HAM","Yes","No","Other Object",81408,8]
[2,"LUC","Yes","Yes","Rear End",2848803,133]
[7,"MOT","Yes","No","Head On",592227,5]
[8,"CLE","Yes","Yes","Fixed Object",30528,3]
[9,"ROS","Yes","No","Angle",28185957,840]
[12,"CUY","Yes","No","Backing",90445812,6271]
[5,"LIC","Yes","Yes","Other Non-Collision",366018,18]
[2,"SEN","Yes","No","Pedestrian",2042481,8]
[6,"UNI","Yes","Yes","Right Turn",20352,2]
[5,"GUE","Yes","Yes","Overturning",1406895,11]
[7,"AUG","No","Yes","Head On",480450,3]
[6,"MRW","Yes","No","Parked Vehicle",10176,1]
[6,"PIC","Yes","No","Unknown",30528,3]
[12,"CUY","Yes","No","Backing",10176,1]
[8,"CLE","Yes","Yes","Head On",766173,11]
[4,"SUM","Yes","Yes","Unknown",55332,2]
[10,"MEG","Yes","No","Left Turn",918654,17]
[1,"ALL","Yes","Yes","Left Turn",85860,5]
[4,"SUM","Yes","No","Sideswipe - Passing",1500753,66]
[4,"ATB","Yes","Yes","Other Non-Collision",10176,1]
[6,"FRA","Yes","No","Parked Vehicle",172667841,9507]
[11,"COL","Yes","Yes","Left Turn",20352,2]
[3,"ERI","Yes","Yes","Angle",1072677,8]
[6,"DEL","No","No","Unknown",254400,25]
[11,"HOL","No","No","Overturning",8287410,79]
[4,"TRU","Yes","Yes","Animal",10176,1]
[11,"HOL","No","No","Sideswipe - Meeting",65508,3]
[7,"MOT","Yes","Yes","Animal",20352,2]
[9,"HIG","No","No","Sideswipe - Passing",4911906,106]
[8,"GRE","Yes","No","Angle",61510347,1761]
[1,"VAN","Yes","No","Other Object",20352,2]
[10,"NOB","No","No","Pedestrian",996993,4]
[3,"HUR","Yes","No","Head On",2161254,21]
[3,"LOR","Yes","No","Other Object",10176,1]
[5,"FAI","Yes","No","Sideswipe - Meeting",10176,1]
[1,"WYA","No","No","Angle",8247549,100]
[7,"AUG","Yes","No","Train",460098,1]
[7,"AUG","Yes","No","Head On",361407,12]
[7,"AUG","Yes","No","Fixed Object",20352,2]
[2,"LUC","Yes","Yes","Sideswipe - Passing",639657,47]
[7,"MIA","Yes","No","Other Object",275706,16]
[5,"GUE","Yes","Yes","Animal",2536320,158]
[3,"MED","Yes","Yes","Sideswipe - Passing",162816,16]
[5,"LIC","Yes","Yes","Angle",121953,3]
[7,"CLA","Yes","No","Other Non-Collision",320862,17]
[2,"SEN","No","No","Sideswipe - Passing",5131167,117]
[4,"POR","Yes","No","Rear End",97149,4]
[4,"SUM","Yes","Yes","Angle",111777,2]
[10,"GAL","Yes","No","Unknown",30528,3]
[12,"LAK","Yes","No","Rear End",319749,19]
[11,"COL","Yes","No","Sideswipe - Meeting",76797,2]
[10,"HOC","Yes","No","Left Turn",780690,40]
[3,"CRA","No","Yes","Parked Vehicle",20352,2]
[7,"CLA","No","No","Parked Vehicle",1097211,29]
[3,"MED","Yes","No","Other Object",20352,2]
[4,"POR","Yes","Yes","Animal",1589682,92]
[3,"RIC","Yes","No","Rear End",10176,1]
[11,"BEL","Yes","Yes","Fixed Object",20352,2]
[11,"TUS","Yes","Yes","Unknown",157092,12]
[7,"CLA","Yes","Yes","Overturning",66621,1]
[4,"SUM","Yes","Yes","Left Turn",1717311,54]
[2,"OTT","No","No","Overturning",4669065,53]
[6,"UNI","Yes","Yes","Head On",65508,3]
[8,"HAM","Yes","No","Backing",72768351,5840]
[4,"MAH","Yes","Yes","Rear End",75684,4]
[5,"COS","Yes","Yes","Rear End",10176,1]
[8,"WAR","No","No","Left Turn",6179184,191]
[4,"POR","Yes","Yes","Unknown",10176,1]
[4,"SUM","Yes","No","Angle",20352,2]
[11,"COL","Yes","No","Unknown",10176,1]
[11,"COL","Yes","Yes","Animal",10176,1]
[4,"SUM","Yes","Yes","Right Turn",167268,13]
[5,"KNO","Yes","No","Rear End",203361,11]
[2,"WOO","Yes","Yes","Fixed Object",329925,20]
[10,"ATH","Yes","Yes","Angle",55332,2]
[2,"FUL","Yes","Yes","Fixed Object",20352,2]
[6,"FAY","No","Yes","Unknown",40704,4]
[4,"SUM","Yes","Yes","Other Non-Collision",10176,1]
[5,"FAI","Yes","No","Rear End",209085,15]
[1,"ALL","Yes","No","Pedalcycles",55332,2]
[3,"CRA","Yes","No","Fixed Object",603516,4]
[7,"CLA","Yes","No","Pedestrian",1209258,9]
[5,"GUE","Yes","No","Head On",4631334,55]
[9,"SCI","Yes","No","Pedalcycles",2795139,19]
[7,"AUG","Yes","Yes","Fixed Object",163770,5]
[3,"MED","Yes","Yes","Other Non-Collision",50880,5]
[2,"LUC","No","No","Parked Vehicle",188733,13]
[7,"CLA","No","Yes","Fixed Object",14505774,511]
[7,"SHE","No","Yes","Backing",20352,2]
[4,"TRU","Yes","No","Head On",76797,2]
[10,"NOB","Yes","Yes","Angle",10176,1]
[4,"MAH","Yes","No","Head On",198750,5]
[9,"ROS","Yes","No","Unknown",45156,1]
[6,"FRA","Yes","No","Rear End",10176,1]
[8,"PRE","Yes","No","Overturning",10176,1]
[1,"ALL","Yes","No","Rear End",183009,9]
[9,"SCI","Yes","No","Other Non-Collision",10176,1]
[8,"HAM","Yes","No","Fixed Object",55332,2]
[8,"BUT","Yes","No","Sideswipe - Passing",1931484,102]
[4,"MAH","Yes","No","Overturning",4908264,38]
[3,"LOR","Yes","No","Pedalcycles",2110899,18]
[6,"MAD","No","Yes","Left Turn",662187,5]
[6,"UNI","Yes","No","Angle",202248,13]
[4,"ATB","Yes","No","Fixed Object",842016,24]
[7,"CLA","Yes","Yes","Head On",116388,8]
[3,"RIC","No","No","Rear End",10352853,240]
[3,"RIC","Yes","No","Pedalcycles",199863,3]
[4,"STA","Yes","Yes","Unknown",10176,1]
[6,"PIC","No","No","Other Non-Collision",3192306,127]
[3,"ERI","Yes","Yes","Pedalcycles",66621,1]
[8,"CLE","No","Yes","Backing",20352,2]
[3,"WAY","Yes","No","Parked Vehicle",467937,37]
[4,"STA","Yes","No","Other Non-Collision",7744029,253]
[3,"MED","Yes","No","Angle",1599126,32]
[7,"CLA","Yes","Yes","Sideswipe - Passing",2652612,81]
[5,"LIC","No","Yes","Sideswipe - Passing",7677759,311]
[9,"JAC","No","Yes","Other Non-Collision",10176,1]
[10,"HOC","Yes","Yes","Other Object",116388,8]
[7,"MOT","Yes","Yes","Right Turn",152481,6]
[1,"DEF","Yes","No","Overturning",163770,5]
[5,"FAI","Yes","Yes","Fixed Object",1454007,35]
[3,"ASD","No","No","Pedestrian",3699435,16]
[5,"PER","No","No","Sideswipe - Passing",3434670,148]
[8,"PRE","No","No","Pedestrian",2018790,7]
[8,"BUT","No","Yes","Overturning",771738,6]
[4,"POR","Yes","No","Rear End",127677,7]
[11,"BEL","Yes","Yes","Rear End",229278,8]
[8,"WAR","Yes","No","Right Turn",188733,13]
[8,"GRE","Yes","Yes","Rear End",65508,3]
[7,"MOT","Yes","Yes","Parked Vehicle",10176,1]
[8,"HAM","Yes","No","Unknown",4728786,198]
[6,"FRA","No","No","Rear End",2478333,113]
[3,"LOR","Yes","No","Animal",2657526,221]
[12,"GEA","Yes","Yes","Sideswipe - Passing",927717,20]
[4,"SUM","Yes","No","Head On",121953,3]
[1,"HAR","Yes","No","Sideswipe - Passing",2400915,84]
[10,"MOE","Yes","No","Backing",50880,5]
[3,"ASD","No","Yes","Backing",151368,8]
[6,"FRA","Yes","No","Animal",301623,13]
[1,"HAN","No","No","Unknown",244224,24]
[5,"MUS","No","No","Sideswipe - Meeting",30528,3]
[7,"LOG","Yes","No","Backing",30528,3]
[5,"FAI","Yes","Yes","Other Object",10176,1]
[7,"MOT","Yes","No","Fixed Object",20352,2]
[9,"SCI","Yes","No","Backing",3306405,280]
[6,"MRW","Yes","No","Angle",10176,1]
[9,"SCI","No","No","Unknown",40704,4]
[8,"CLE","Yes","No","Right Turn",12263955,642]
[12,"LAK","No","No","Backing",269028,23]
[2,"OTT","Yes","No","Fixed Object",10176,1]
[2,"WOO","No","No","Fixed Object",75742689,1556]
[2,"WIL","No","No","Other Non-Collision",1632882,65]
[7,"MIA","No","No","Head On",9012099,60]
[7,"MIA","No","No","Train",480450,3]
[7,"MOT","No","Yes","Left Turn",1746312,21]
[2,"OTT","Yes","No","Angle",7445586,160]
[10,"WAS","Yes","Yes","Animal",583212,47]
[2,"LUC","Yes","No","Left Turn",175058913,4481]
[6,"PIC","Yes","No","Head On",3615531,34]
[8,"PRE","No","No","Sideswipe - Meeting",1380294,3]
[11,"COL","Yes","No","Right Turn",223872,22]
[7,"MOT","Yes","No","Rear End",148029,9]
[1,"ALL","No","No","Head On",6295713,61]
[1,"ALL","No","No","Train",10176,1]
[4,"POR","No","No","Angle",24212037,437]
[7,"LOG","Yes","Yes","Rear End",157092,12]
[12,"CUY","Yes","No","Angle",76797,2]
[7,"MIA","Yes","No","Backing",1211898,108]
[7,"CHP","No","No","Angle",21368478,273]
[2,"WOO","Yes","Yes","Rear End",10176,1]
[9,"SCI","Yes","No","Fixed Object",40366335,906]
[7,"LOG","Yes","No","Unknown",10176,1]
[7,"CLA","Yes","No","Other Object",204474,9]
[7,"MIA","No","Yes","Animal",50880,5]
[10,"ATH","No","No","Fixed Object",53538636,1095]
[1,"DEF","Yes","Yes","Sideswipe - Passing",1013736,34]
[7,"MOT","Yes","No","Other Object",76797,2]
[2,"WOO","Yes","No","Fixed Object",193185,10]
[3,"RIC","Yes","No","Pedestrian",278886,6]
[5,"LIC","Yes","Yes","Rear End",572877,37]
[2,"SEN","Yes","No","Overturning",111777,2]
[4,"MAH","Yes","No","Pedestrian",26292369,135]
[4,"STA","Yes","No","Unknown",172833,8]
[6,"MRW","Yes","No","Angle",10176,1]
[7,"MOT","Yes","No","Rear End",30528,3]
[8,"HAM","Yes","Yes","Sideswipe - Passing",91584,9]
[12,"CUY","Yes","No","Sideswipe - Passing",30528,3]
[3,"ASD","Yes","No","Pedalcycles",1262364,10]
[6,"FRA","Yes","No","Angle",847770165,22002]
[8,"PRE","No","No","Overturning",6988794,67]
[3,"HUR","Yes","No","Other Non-Collision",534558,38]
[12,"CUY","Yes","No","Left Turn",20352,2]
[4,"ATB","Yes","Yes","Overturning",10176,1]
[4,"POR","No","No","Pedestrian",2218653,10]
[5,"LIC","Yes","Yes","Other Object",188733,13]
[4,"TRU","Yes","No","Overturning",7466859,60]
[4,"ATB","No","Yes","Sideswipe - Passing",5334369,189]
[3,"ERI","Yes","Yes","Fixed Object",1253190,43]
[2,"WOO","Yes","No","Left Turn",13772799,310]
[4,"MAH","No","No","Unknown",50880,5]
[7,"AUG","Yes","Yes","Left Turn",10176,1]
[11,"HOL","No","No","Fixed Object",39666546,1074]
[7,"CHP","Yes","No","Left Turn",10176,1]
[4,"SUM","Yes","Yes","Animal",107325,5]
[7,"MOT","Yes","No","Unknown",6777738,150]
[12,"CUY","Yes","Yes","Overturning",890352,10]
[1,"ALL","Yes","No","Left Turn",28234863,675]
[6,"MAR","No","No","Angle",30890760,259]
[6,"DEL","No","Yes","Backing",194298,8]
[2,"WOO","No","Yes","Animal",3304449,187]
[11,"TUS","Yes","No","Parked Vehicle",4363914,279]
[9,"BRO","Yes","Yes","Backing",10176,1]
[2,"OTT","Yes","No","Unknown",10176,1]
[6,"FAY","Yes","No","Unknown",30528,3]
[12,"CUY","Yes","Yes","Backing",1963014,144]
[3,"LOR","Yes","Yes","Sideswipe - Passing",828390,60]
[6,"DEL","Yes","No","Animal",10771533,718]
[4,"POR","Yes","No","Parked Vehicle",2735706,134]
[1,"DEF","Yes","No","Animal",4715463,433]
[1,"WYA","Yes","Yes","Rear End",10176,1]
[7,"SHE","Yes","No","Unknown",10176,1]
[1,"HAN","Yes","Yes","Parked Vehicle",10176,1]
[9,"LAW","Yes","No","Left Turn",3452748,119]
[2,"SAN","Yes","No","Pedalcycles",111777,2]
[2,"LUC","No","No","Animal",4869804,377]
[4,"SUM","No","Yes","Overturning",2074806,20]
[7,"MOT","Yes","Yes","Backing",1147296,54]
[9,"ROS","Yes","No","Backing",2270043,203]
[10,"ATH","Yes","No","Sideswipe - Meeting",10176,1]
[4,"SUM","Yes","Yes","Other Non-Collision",40704,4]
[3,"MED","No","No","Other Non-Collision",1688373,76]
[6,"FRA","Yes","No","Pedestrian",348385998,2379]
[5,"FAI","Yes","Yes","Parked Vehicle",10176,1]
[6,"FAY","Yes","No","Parked Vehicle",2227701,134]
[4,"ATB","Yes","No","Backing",50880,5]
[6,"UNI","Yes","Yes","Pedestrian",460098,1]
[12,"LAK","Yes","No","Head On",10176,1]
[8,"PRE","Yes","No","Sideswipe - Meeting",45156,1]
[8,"CLE","Yes","Yes","Right Turn",871113,11]
[4,"TRU","Yes","No","Rear End",40704,4]
[1,"HAN","Yes","Yes","Other Non-Collision",20352,2]
[5,"COS","Yes","No","Overturning",20352,2]
[10,"WAS","Yes","No","Pedestrian",3011856,21]
[9,"JAC","Yes","Yes","Parked Vehicle",10176,1]
[4,"TRU","Yes","No","Other Non-Collision",66621,1]
[1,"DEF","Yes","No","Pedestrian",1803711,10]
[6,"UNI","No","Yes","Rear End",4870407,127]
[5,"MUS","No","No","Pedalcycles",133242,2]
[10,"ATH","Yes","Yes","Right Turn",10176,1]
[8,"CLI","Yes","No","Pedestrian",1446327,13]
[4,"POR","Yes","Yes","Overturning",407676,11]
[8,"HAM","Yes","No","Left Turn",5730486,168]
[4,"POR","Yes","Yes","Backing",279204,24]
[1,"VAN","Yes","No","Angle",20352,2]
[1,"ALL","Yes","No","Sideswipe - Passing",50880,5]
[1,"WYA","Yes","Yes","Animal",10176,1]
[2,"LUC","Yes","Yes","Overturning",4494006,49]
[12,"CUY","Yes","No","Pedestrian",526719,2]
[7,"AUG","Yes","No","Sideswipe - Passing",10176,1]
[10,"ATH","Yes","No","Overturning",66621,1]
[3,"CRA","Yes","Yes","Fixed Object",1052055,28]
[3,"CRA","Yes","Yes","Animal",442020,40]
[6,"MAD","Yes","No","Other Object",20352,2]
[6,"FAY","Yes","No","Right Turn",10176,1]
[5,"KNO","Yes","No","Fixed Object",117501,6]
[9,"SCI","No","No","Backing",823779,54]
[2,"SAN","Yes","No","Pedestrian",111777,2]
[6,"FRA","Yes","Yes","Other Object",10176,1]
[7,"LOG","No","No","Overturning",6719559,55]
[1,"HAR","Yes","No","Other Non-Collision",30528,3]
[11,"BEL","Yes","No","Left Turn",4664550,142]
[5,"FAI","Yes","No","Overturning",341055,10]
[5,"COS","No","No","Rear End",4845444,119]
[2,"WOO","Yes","Yes","Rear End",151368,8]
[3,"CRA","Yes","Yes","Unknown",61056,6]
[12,"CUY","Yes","No","Parked Vehicle",159419604,7027]
[9,"BRO","No","No","Unknown",331038,18]
[3,"CRA","No","No","Sideswipe - Passing",1286898,36]
[1,"PAU","No","Yes","Angle",2906916,21]
[7,"SHE","Yes","Yes","Other Object",351549,29]
[12,"GEA","No","No","Pedestrian",2811993,13]
[12,"GEA","Yes","No","Sideswipe - Passing",2924391,107]
[1,"DEF","No","No","Other Non-Collision",1771164,60]
[8,"BUT","Yes","No","Angle",2897457,137]
[1,"HAR","Yes","No","Right Turn",10176,1]
[4,"MAH","Yes","No","Animal",5429436,392]
[4,"SUM","Yes","Yes","Fixed Object",306234,19]
[8,"BUT","Yes","Yes","Rear End",230391,6]
[9,"SCI","Yes","No","Unknown",40704,4]
[7,"MIA","Yes","No","Other Non-Collision",1943949,28]
[11,"HAS","No","No","Right Turn",1010238,26]
[11,"JEF","No","Yes","Left Turn",10176,1]
[6,"MAD","Yes","Yes","Fixed Object",20352,2]
[1,"PUT","No","No","Other Object",183009,9]
[8,"PRE","No","No","Fixed Object",57428361,1018]
[11,"JEF","No","Yes","Other Non-Collision",50880,5]
[10,"MOE","No","No","Unknown",40704,4]
[5,"LIC","Yes","No","Fixed Object",1459620,75]
[1,"HAN","Yes","Yes","Right Turn",10176,1]
[6,"MRW","No","Yes","Rear End",5985012,101]
[7,"CLA","Yes","Yes","Angle",10176,1]
[5,"FAI","No","Yes","Backing",10176,1]
[9,"HIG","Yes","No","Angle",30528,3]
[8,"WAR","Yes","Yes","Sideswipe - Passing",8898450,369]
[3,"RIC","Yes","No","Overturning",163770,5]
[5,"LIC","Yes","No","Left Turn",13753959,480]
[4,"POR","Yes","No","Fixed Object",37424601,1062]
[3,"RIC","Yes","No","Sideswipe - Meeting",45156,1]
[2,"OTT","Yes","No","Backing",10176,1]
[7,"CLA","Yes","Yes","Animal",20352,2]
[11,"JEF","Yes","Yes","Fixed Object",791136,19]
[6,"FRA","Yes","Yes","Angle",525606,4]
[10,"WAS","Yes","No","Fixed Object",4725447,134]
[4,"POR","No","No","Pedalcycles",188574,4]
[5,"LIC","Yes","Yes","Pedestrian",66621,1]
[8,"GRE","Yes","No","Sideswipe - Meeting",631818,11]
[7,"AUG","Yes","Yes","Left Turn",460098,1]
[4,"POR","Yes","No","Left Turn",212265,5]
[6,"DEL","Yes","Yes","Unknown",20352,2]
[6,"FRA","Yes","Yes","Pedestrian",22238331,78]
[4,"STA","Yes","Yes","Sideswipe - Passing",24302430,1015]
[3,"LOR","Yes","No","Backing",1021893,88]
[1,"VAN","No","No","Sideswipe - Passing",4011171,106]
[3,"ERI","No","No","Pedestrian",111777,2]
[3,"MED","Yes","Yes","Angle",163770,5]
[7,"MOT","Yes","Yes","Fixed Object",506097,22]
[4,"POR","Yes","No","Fixed Object",71232,7]
[5,"LIC","Yes","No","Right Turn",3023241,105]
[3,"HUR","Yes","No","Other Object",61056,6]
[11,"BEL","Yes","No","Rear End",85860,5]
[7,"DAR","No","No","Right Turn",628050,30]
[2,"SEN","Yes","No","Animal",274752,27]
[4,"MAH","Yes","Yes","Overturning",3421758,28]
[8,"PRE","Yes","No","Animal",81408,8]
[1,"ALL","Yes","No","Animal",101760,10]
[7,"MOT","No","Yes","Other Non-Collision",245178,13]
[8,"BUT","Yes","No","Other Object",1524873,49]
[12,"CUY","Yes","No","Overturning",724356,9]
[10,"NOB","Yes","Yes","Overturning",132129,4]
[3,"ASD","No","No","Angle",31713507,391]
[5,"LIC","Yes","No","Parked Vehicle",1606170,88]
[4,"STA","Yes","Yes","Backing",10176,1]
[11,"JEF","Yes","Yes","Pedestrian",10176,1]
[1,"ALL","Yes","Yes","Right Turn",45156,1]
[11,"BEL","No","Yes","Angle",733419,12]
[4,"SUM","Yes","No","Parked Vehicle",20352,2]
[10,"WAS","Yes","No","Rear End",181896,11]
[6,"PIC","Yes","No","Right Turn",40704,4]
[10,"VIN","No","No","Unknown",50880,5]
[1,"PUT","Yes","No","Rear End",20352,2]
[12,"GEA","Yes","Yes","Sideswipe - Passing",10176,1]
[8,"PRE","No","Yes","Overturning",1359513,14]
[4,"SUM","Yes","Yes","Sideswipe - Passing",50880,5]
[6,"FRA","Yes","Yes","Sideswipe - Meeting",547071,4]
[6,"FAY","Yes","No","Backing",2183817,140]
[11,"BEL","No","No","Unknown",198909,14]
[7,"AUG","Yes","Yes","Other Non-Collision",142464,14]
[4,"MAH","Yes","No","Sideswipe - Meeting",1064298,21]
[3,"RIC","Yes","Yes","Fixed Object",30528,3]
[3,"CRA","Yes","No","Parked Vehicle",30528,3]
[1,"DEF","Yes","Yes","Overturning",76797,2]
[6,"MAR","No","No","Pedestrian",2566974,9]
[3,"LOR","Yes","No","Parked Vehicle",1958355,93]
[6,"FAY","Yes","Yes","Fixed Object",121953,3]
[5,"KNO","Yes","No","Parked Vehicle",116388,8]
[4,"SUM","Yes","Yes","Right Turn",627366,14]
[8,"CLI","Yes","Yes","Angle",536895,3]
[12,"GEA","Yes","No","Left Turn",1834287,58]
[9,"LAW","Yes","Yes","Overturning",153594,4]
[6,"DEL","No","No","Angle",31481736,502]
[11,"HOL","No","No","Animal",5338329,340]
[4,"STA","Yes","Yes","Other Non-Collision",121953,3]
[3,"ERI","Yes","No","Overturning",10176,1]
[8,"CLE","No","No","Head On",16309767,175]
[8,"WAR","Yes","No","Head On",208926,6]
[4,"TRU","Yes","No","Right Turn",66621,1]
[3,"WAY","Yes","No","Right Turn",2791578,92]
[2,"WOO","Yes","No","Sideswipe - Passing",247404,14]
[2,"LUC","No","No","Pedalcycles",321816,6]
[3,"ASD","Yes","No","Sideswipe - Meeting",10176,1]
[4,"STA","Yes","No","Sideswipe - Passing",4556463,313]
[2,"HEN","Yes","No","Angle",10176,1]
[3,"ASD","Yes","No","Pedestrian",2130567,9]
[10,"WAS","No","No","Other Non-Collision",652059,44]
[10,"ATH","No","Yes","Overturning",76797,2]
[5,"KNO","Yes","Yes","Fixed Object",460098,1]
[8,"CLE","Yes","No","Sideswipe - Passing",146916,11]
[12,"LAK","Yes","Yes","Left Turn",1651644,42]
[10,"GAL","Yes","No","Left Turn",10176,1]
[8,"WAR","Yes","No","Sideswipe - Meeting",10176,1]
[6,"PIC","No","Yes","Sideswipe - Passing",572877,37]
[10,"NOB","No","No","Angle",1010238,26]
[10,"GAL","Yes","No","Backing",813762,62]
[6,"PIC","Yes","No","Rear End",3352212,71]
[7,"CLA","No","No","Rear End",8975118,195]
[7,"SHE","No","No","Angle",14167848,178]
[12,"CUY","No","Yes","Left Turn",96036,6]
[6,"PIC","Yes","No","Angle",815781,9]
[10,"GAL","No","Yes","Other Object",71232,7]
[6,"FRA","No","Yes","Fixed Object",4770285,117]
[2,"SAN","No","Yes","Other Non-Collision",498624,49]
[1,"HAN","Yes","No","Sideswipe - Passing",9632235,579]
[5,"GUE","Yes","No","Left Turn",20352,2]
[12,"GEA","No","Yes","Angle",654396,9]
[10,"WAS","Yes","Yes","Rear End",10176,1]
[8,"HAM","Yes","Yes","Fixed Object",168381,11]
[7,"MIA","No","Yes","Fixed Object",260919,9]
[9,"ADA","Yes","No","Other Object",45156,1]
[4,"ATB","Yes","Yes","Fixed Object",10176,1]
[1,"DEF","Yes","No","Rear End",20352,2]
[2,"LUC","No","Yes","Backing",10176,1]
[2,"WIL","No","No","Other Object",355842,17]
[4,"SUM","Yes","No","Right Turn",3539292,205]
[4,"STA","Yes","No","Backing",447744,44]
[9,"ROS","Yes","No","Fixed Object",21304641,481]
[3,"RIC","No","Yes","Rear End",4270341,81]
[3,"LOR","Yes","Yes","Left Turn",40704,4]
[11,"JEF","Yes","No","Left Turn",8854707,187]
[5,"MUS","Yes","Yes","Rear End",3322098,106]
[4,"SUM","Yes","Yes","Head On",1734864,13]
[2,"WIL","No","Yes","Animal",1697325,115]
[11,"TUS","No","Yes","Left Turn",30528,3]
[4,"ATB","Yes","No","Parked Vehicle",50880,5]
[8,"PRE","Yes","No","Fixed Object",173946,6]
[12,"GEA","Yes","No","Sideswipe - Passing",30528,3]
[7,"MOT","Yes","No","Parked Vehicle",84305634,4122]
[4,"MAH","Yes","No","Pedalcycles",4856796,37]
[12,"LAK","No","No","Unknown",10176,1]
[6,"UNI","Yes","Yes","Angle",66621,1]
[4,"SUM","Yes","Yes","Other Non-Collision",4345008,172]
[3,"MED","Yes","Yes","Fixed Object",5221734,223]
[11,"COL","No","No","Sideswipe - Meeting",1420998,7]
[4,"MAH","Yes","No","Other Non-Collision",30528,3]
[7,"MOT","Yes","Yes","Angle",40704,4]
[3,"MED","Yes","Yes","Other Object",96036,6]
[8,"CLI","No","No","Sideswipe - Passing",3932562,141]
[7,"AUG","Yes","No","Rear End",1612530,68]
[10,"VIN","No","No","Parked Vehicle",883674,17]
[10,"VIN","No","No","Backing",344712,27]
[7,"CLA","No","Yes","Parked Vehicle",229278,8]
[4,"POR","Yes","No","Backing",405768,33]
[2,"OTT","Yes","No","Parked Vehicle",490626,4]
[6,"UNI","Yes","Yes","Angle",20352,2]
[11,"COL","Yes","No","Backing",61056,6]
[1,"WYA","Yes","No","Overturning",1108770,6]
[3,"RIC","Yes","No","Sideswipe - Meeting",917700,28]
[3,"MED","Yes","No","Other Non-Collision",142305,5]
[3,"CRA","No","Yes","Sideswipe - Passing",248517,12]
[7,"AUG","Yes","Yes","Fixed Object",20352,2]
[11,"BEL","Yes","Yes","Fixed Object",10176,1]
[8,"GRE","Yes","No","Pedestrian",15059217,101]
[10,"MEG","No","No","Left Turn",4051668,56]
[9,"ROS","No","No","Sideswipe - Passing",6124599,189]
[2,"HEN","Yes","No","Animal",10176,1]
[5,"FAI","Yes","No","Sideswipe - Passing",12518418,661]
[5,"COS","Yes","No","Rear End",4323480,258]
[6,"MAR","Yes","No","Backing",3453639,309]
[8,"HAM","Yes","Yes","Backing",1746138,133]
[3,"MED","Yes","No","Pedalcycles",10176,1]
[7,"MER","Yes","No","Right Turn",588777,42]
[1,"ALL","No","No","Other Non-Collision",1555974,99]
[11,"JEF","Yes","No","Fixed Object",979710,23]
[3,"WAY","Yes","No","Head On",275547,7]
[3,"WAY","Yes","No","Train",10176,1]
[2,"LUC","No","Yes","Animal",696102,47]
[8,"BUT","Yes","No","Overturning",1832697,28]
[9,"HIG","No","No","Rear End",11868789,194]
[1,"DEF","No","No","Pedestrian",1492071,5]
[10,"NOB","Yes","No","Fixed Object",1693890,31]
[3,"RIC","Yes","No","Animal",529152,52]
[3,"ASD","Yes","No","Fixed Object",10176,1]
[10,"WAS","No","No","Other Object",146916,11]
[12,"CUY","Yes","No","Angle",804189216,22062]
[11,"BEL","Yes","No","Rear End",76797,2]
[5,"COS","Yes","No","Overturning",66621,1]
[7,"SHE","Yes","Yes","Angle",85860,5]
[12,"CUY","Yes","No","Sideswipe - Meeting",10176,1]
[3,"ERI","Yes","Yes","Animal",20352,2]
[9,"BRO","Yes","Yes","Fixed Object",460098,1]
[11,"TUS","Yes","Yes","Rear End",274434,9]
[9,"ROS","Yes","Yes","Rear End",666528,33]
[8,"WAR","Yes","Yes","Left Turn",249630,10]
[10,"HOC","No","No","Other Object",628479,12]
[3,"LOR","Yes","No","Backing",3161715,270]
[7,"CLA","No","Yes","Backing",617190,13]
[1,"HAN","Yes","No","Animal",244224,24]
[4,"SUM","Yes","Yes","Other Object",20352,2]
[2,"SAN","Yes","No","Left Turn",153594,4]
[10,"GAL","Yes","No","Parked Vehicle",2409549,100]
[3,"WAY","Yes","No","Head On",10176,1]
[9,"ROS","Yes","No","Sideswipe - Passing",76797,2]
[6,"FRA","Yes","No","Fixed Object",17363289,588]
[0,"CLA","Yes","No","Backing",10176,1]
[8,"BUT","Yes","No","Sideswipe - Meeting",470274,2]
[11,"JEF","Yes","Yes","Animal",101760,10]
[10,"GAL","Yes","No","Fixed Object",6862740,181]
[11,"BEL","No","No","Parked Vehicle",1216032,87]
[5,"FAI","No","No","Angle",38625138,463]
[2,"WOO","Yes","Yes","Fixed Object",177444,14]
[1,"DEF","Yes","No","Sideswipe - Meeting",20352,2]
[1,"HAN","Yes","Yes","Rear End",4104489,140]
[4,"POR","Yes","Yes","Fixed Object",7312965,240]
[3,"RIC","Yes","Yes","Left Turn",10176,1]
[7,"DAR","No","No","Head On",10709487,94]
[7,"DAR","No","No","Train",20352,2]
[1,"HAR","Yes","No","Other Object",20352,2]
[12,"CUY","Yes","Yes","Left Turn",30528,3]
[8,"PRE","No","No","Animal",7992993,594]
[7,"CLA","No","Yes","Unknown",223872,22]
[3,"HUR","Yes","No","Pedestrian",1087305,6]
[10,"ATH","No","No","Animal",7499457,513]
[8,"BUT","Yes","Yes","Angle",10176,1]
[5,"MUS","Yes","No","Left Turn",75684,4]
[10,"MEG","Yes","No","Other Object",50880,5]
[3,"ASD","Yes","No","Overturning",613692,5]
[4,"SUM","Yes","Yes","Pedestrian",986817,3]
[8,"HAM","Yes","No","Parked Vehicle",189378186,10957]
[6,"PIC","No","No","Other Object",555864,29]
[11,"TUS","Yes","Yes","Backing",81408,8]
[2,"SEN","Yes","No","Pedalcycles",412128,8]
[4,"ATB","Yes","Yes","Sideswipe - Passing",475569,24]
[11,"JEF","Yes","No","Parked Vehicle",71232,7]
[6,"FRA","Yes","Yes","Angle",86973,3]
[11,"COL","Yes","No","Sideswipe - Passing",1331529,30]
[9,"PIK","Yes","No","Head On",2462718,25]
[4,"STA","Yes","No","Other Object",1169922,97]
[11,"TUS","No","No","Overturning",12674616,115]
[9,"JAC","Yes","Yes","Angle",597951,9]
[6,"FRA","Yes","Yes","Angle",18028353,369]
[6,"MAR","Yes","Yes","Sideswipe - Passing",20352,2]
[9,"BRO","Yes","No","Pedestrian",167109,4]
[7,"AUG","No","Yes","Right Turn",10176,1]
[7,"DAR","Yes","No","Overturning",210039,4]
[11,"BEL","No","No","Fixed Object",52781100,1288]
[3,"MED","No","No","Pedestrian",3439200,18]
[4,"POR","No","No","Sideswipe - Meeting",40704,4]
[5,"LIC","Yes","No","Other Non-Vehicle",460098,1]
[7,"MER","Yes","No","Rear End",50880,5]
[8,"PRE","No","No","Pedalcycles",199863,3]
[7,"LOG","Yes","No","Right Turn",798975,55]
[5,"GUE","Yes","No","Other Non-Collision",698598,21]
[8,"HAM","Yes","No","Fixed Object",406676397,10598]
[12,"CUY","Yes","No","Pedalcycles",167109,4]
[8,"CLE","Yes","No","Sideswipe - Meeting",10176,1]
[7,"MIA","Yes","No","Unknown",30528,3]
[2,"LUC","No","No","Fixed Object",15598515,316]
[3,"WAY","No","Yes","Other Object",392253,33]
[10,"WAS","Yes","No","Unknown",86973,3]
[10,"NOB","No","Yes","Angle",45156,1]
[3,"LOR","Yes","No","Fixed Object",26034222,614]
[7,"SHE","Yes","No","Left Turn",5803308,200]
[1,"ALL","Yes","No","Backing",319908,28]
[7,"AUG","Yes","No","Animal",71232,7]
[2,"LUC","No","No","Backing",1321353,29]
[2,"LUC","Yes","No","Other Non-Collision",10176,1]
[3,"LOR","Yes","No","Unknown",71232,7]
[10,"WAS","Yes","No","Angle",10726806,384]
[9,"BRO","Yes","No","Angle",687150,13]
[5,"LIC","Yes","No","Rear End",21447921,865]
[10,"WAS","Yes","No","Right Turn",10176,1]
[2,"WIL","Yes","No","Sideswipe - Passing",10176,1]
[4,"SUM","Yes","No","Rear End",2764533,153]
[6,"PIC","Yes","No","Parked Vehicle",178557,12]
[7,"CHP","Yes","No","Head On",2364456,23]
[7,"LOG","Yes","Yes","Angle",526719,2]
[2,"SAN","Yes","No","Left Turn",5893842,125]
[10,"WAS","Yes","No","Backing",523428,48]
[12,"CUY","Yes","No","Left Turn",10176,1]
[2,"WIL","No","No","Head On",4821705,63]
[4,"ATB","Yes","No","Animal",10176,1]
[3,"RIC","Yes","No","Angle",142305,5]
[4,"TRU","Yes","Yes","Right Turn",10176,1]
[3,"MED","Yes","No","Right Turn",4265604,232]
[6,"UNI","Yes","No","Pedestrian",66621,1]
[3,"MED","Yes","No","Unknown",617190,13]
[12,"LAK","No","Yes","Rear End",7066467,190]
[10,"WAS","Yes","No","Other Non-Collision",162816,16]
[2,"WOO","Yes","No","Backing",20352,2]
[7,"CHP","No","Yes","Sideswipe - Passing",65508,3]
[11,"JEF","Yes","No","Pedestrian",66621,1]
[3,"ERI","Yes","No","Other Object",423735,25]
[4,"MAH","Yes","No","Backing",749478,26]
[4,"POR","Yes","Yes","Fixed Object",107325,5]
[11,"COL","Yes","Yes","Sideswipe - Passing",514047,27]
[8,"BUT","No","No","Unknown",101760,10]
[4,"SUM","No","No","Pedalcycles",66621,1]
[4,"STA","Yes","Yes","Fixed Object",1494870,48]
[8,"CLE","Yes","No","Fixed Object",85969944,2623]
[7,"AUG","Yes","No","Unknown",10176,1]
[5,"FAI","Yes","No","Fixed Object",642837,37]
[7,"MOT","Yes","Yes","Unknown",10176,1]
[2,"FUL","Yes","No","Pedestrian",10176,1]
[7,"LOG","No","Yes","Sideswipe - Passing",745710,45]
[3,"ERI","Yes","Yes","Sideswipe - Passing",367131,16]
[3,"MED","Yes","No","Overturning",603516,4]
[7,"MOT","Yes","Yes","Overturning",86973,3]
[3,"HUR","Yes","No","Angle",3313416,110]
[10,"WAS","Yes","No","Head On",2300061,18]
[10,"WAS","Yes","No","Train",10176,1]
[10,"WAS","No","Yes","Unknown",40704,4]
[2,"OTT","Yes","Yes","Sideswipe - Passing",152481,6]
[5,"FAI","Yes","No","Pedestrian",156933,3]
[1,"PAU","No","No","Right Turn",1097640,16]
[11,"COL","Yes","No","Head On",2709963,30]
[11,"COL","Yes","No","Train",460098,1]
[4,"ATB","Yes","No","Sideswipe - Passing",66621,1]
[6,"FRA","No","No","Backing",912135,33]
[7,"CHP","Yes","No","Rear End",490626,4]
[8,"BUT","Yes","No","Pedestrian",35766270,238]
[6,"FRA","Yes","Yes","Other Non-Collision",10176,1]
[11,"HOL","No","No","Other Non-Collision",2044437,31]
[3,"LOR","Yes","Yes","Other Object",767493,63]
[8,"PRE","Yes","No","Sideswipe - Passing",1568376,101]
[9,"ROS","Yes","Yes","Left Turn",10176,1]
[3,"MED","Yes","No","Angle",10593357,318]
[4,"TRU","Yes","No","Right Turn",9451341,477]
[12,"GEA","Yes","No","Sideswipe - Passing",1231455,65]
[7,"SHE","No","Yes","Sideswipe - Passing",2542203,106]
[2,"LUC","Yes","No","Angle",10176,1]
[7,"SHE","Yes","Yes","Overturning",1466154,8]
[8,"CLE","Yes","No","Rear End",143349999,6285]
[8,"GRE","No","Yes","Angle",10176,1]
[7,"AUG","Yes","No","Sideswipe - Meeting",10176,1]
[3,"ASD","No","Yes","Other Non-Collision",331197,27]
[6,"MAD","Yes","No","Pedestrian",1153926,7]
[7,"SHE","Yes","No","Angle",219102,7]
[4,"STA","Yes","No","Other Non-Collision",942504,27]
[5,"GUE","Yes","Yes","Left Turn",20352,2]
[2,"OTT","Yes","No","Angle",1217892,25]
[6,"FAY","No","Yes","Parked Vehicle",480450,3]
[2,"SEN","Yes","No","Backing",1647240,155]
[4,"SUM","Yes","No","Right Turn",298284,19]
[2,"HEN","Yes","Yes","Angle",76797,2]
[12,"CUY","Yes","Yes","Other Non-Collision",10176,1]
[9,"HIG","Yes","No","Unknown",20352,2]
[7,"CLA","No","Yes","Right Turn",40704,4]
[8,"HAM","Yes","Yes","Pedalcycles",613692,5]
[5,"KNO","No","No","Unknown",136740,10]
[3,"WAY","No","No","Fixed Object",76980321,1740]
[2,"SAN","Yes","No","Fixed Object",10438713,300]
[8,"WAR","Yes","Yes","Sideswipe - Passing",1552905,78]
[4,"SUM","Yes","Yes","Right Turn",45156,1]
[7,"MOT","Yes","Yes","Backing",10176,1]
[10,"MOE","Yes","No","Unknown",10176,1]
[2,"FUL","Yes","No","Head On",842970,13]
[5,"LIC","Yes","No","Pedalcycles",7956834,74]
[3,"LOR","Yes","No","Overturning",45156,1]
[2,"HEN","Yes","No","Other Object",20352,2]
[3,"CRA","Yes","No","Pedestrian",736758,6]
[7,"CLA","Yes","Yes","Backing",10176,1]
[4,"STA","Yes","Yes","Rear End",4237461,169]
[4,"MAH","No","Yes","Fixed Object",10264005,405]
[4,"MAH","Yes","No","Left Turn",54249816,1302]
[1,"HAR","No","No","Overturning",3626820,33]
[5,"FAI","No","Yes","Sideswipe - Passing",2223996,72]
[9,"LAW","Yes","No","Animal",752865,65]
[3,"LOR","Yes","No","Sideswipe - Passing",32279841,1457]
[6,"UNI","Yes","No","Pedestrian",1177617,8]
[8,"CLI","Yes","No","Rear End",20352,2]
[11,"TUS","Yes","No","Other Non-Collision",1672743,49]
[8,"GRE","Yes","Yes","Angle",10176,1]
[10,"ATH","Yes","Yes","Unknown",10176,1]
[3,"LOR","No","No","Head On",11388528,88]
[3,"LOR","No","No","Train",55332,2]
[8,"HAM","Yes","No","Animal",280317,22]
[11,"HAS","No","No","Parked Vehicle",1761783,39]
[10,"ATH","Yes","No","Right Turn",10176,1]
[7,"MOT","Yes","Yes","Backing",20352,2]
[7,"DAR","No","No","Fixed Object",47759928,1163]
[3,"WAY","Yes","Yes","Other Object",85860,5]
[6,"FAY","No","Yes","Head On",153594,4]
[1,"HAN","Yes","Yes","Fixed Object",10176,1]
[10,"WAS","Yes","Yes","Other Non-Collision",85860,5]
[10,"HOC","Yes","No","Parked Vehicle",132129,4]
[12,"CUY","Yes","No","Sideswipe - Passing",116388,8]
[10,"VIN","No","No","Right Turn",50880,5]
[4,"POR","Yes","Yes","Head On",76797,2]
[4,"SUM","Yes","No","Angle",292351161,9232]
[5,"FAI","Yes","No","Rear End",1457664,57]
[12,"LAK","Yes","Yes","Sideswipe - Passing",19978872,849]
[4,"MAH","Yes","No","Angle",1133733,14]
[3,"WAY","Yes","Yes","Rear End",10176,1]
[10,"HOC","Yes","Yes","Animal",1708884,87]
[3,"HUR","Yes","No","Rear End",9890085,442]
[7,"AUG","No","No","Pedalcycles",199863,3]
[11,"TUS","Yes","No","Pedestrian",76797,2]
[10,"MEG","No","No","Sideswipe - Passing",2996004,56]
[5,"GUE","Yes","No","Fixed Object",20352,2]
[4,"POR","Yes","Yes","Unknown",10176,1]
[11,"COL","Yes","No","Rear End",6224865,274]
[7,"MIA","No","Yes","Other Non-Collision",71232,7]
[5,"LIC","Yes","No","Left Turn",9657228,220]
[4,"STA","No","No","Animal",13752369,820]
[3,"RIC","No","No","Unknown",132288,13]
[8,"WAR","Yes","No","Other Non-Collision",1757061,69]
[3,"MED","Yes","No","Pedestrian",2074122,9]
[10,"NOB","No","Yes","Other Object",101760,10]
[8,"CLI","Yes","Yes","Left Turn",66621,1]
[9,"BRO","Yes","No","Other Non-Collision",30528,3]
[7,"DAR","Yes","Yes","Other Object",20352,2]
[4,"POR","Yes","No","Backing",10176,1]
[6,"FRA","Yes","No","Left Turn",5100894,148]
[3,"LOR","Yes","Yes","Pedestrian",526719,2]
[8,"WAR","Yes","Yes","Parked Vehicle",173946,6]
[8,"BUT","Yes","Yes","Rear End",1008696,46]
[3,"ERI","Yes","Yes","Other Non-Collision",20352,2]
[3,"LOR","Yes","No","Pedestrian",24590292,152]
[8,"BUT","Yes","Yes","Fixed Object",137853,8]
[7,"DAR","Yes","No","Angle",207813,8]
[5,"MUS","Yes","No","Backing",4319664,352]
[2,"SAN","Yes","No","Angle",97149,4]
[5,"GUE","No","Yes","Pedestrian",986817,3]
[9,"ROS","Yes","Yes","Overturning",509277,12]
[11,"COL","No","No","Other Object",209085,15]
[8,"BUT","Yes","No","Animal",7619232,560]
[4,"MAH","No","Yes","Parked Vehicle",218148,18]
[4,"MAH","Yes","No","Parked Vehicle",158205,10]
[10,"WAS","Yes","No","Left Turn",20352,2]
[10,"GAL","No","Yes","Overturning",593340,3]
[3,"ERI","Yes","No","Other Object",30528,3]
[10,"WAS","No","No","Angle",10797495,157]
[2,"WIL","Yes","Yes","Backing",40704,4]
[3,"LOR","Yes","Yes","Animal",10176,1]
[7,"MIA","Yes","No","Sideswipe - Meeting",10176,1]
[3,"ERI","Yes","No","Head On",6721977,91]
[3,"ERI","Yes","No","Train",505254,2]
[2,"WOO","Yes","Yes","Rear End",148029,9]
[8,"WAR","No","No","Parked Vehicle",544734,39]
[3,"MED","Yes","Yes","Other Non-Collision",148029,9]
[3,"CRA","No","No","Angle",7717587,119]
[3,"RIC","Yes","Yes","Rear End",525606,4]
[5,"GUE","Yes","No","Rear End",96036,6]
[7,"MOT","Yes","No","Right Turn",20352,2]
[2,"LUC","Yes","No","Animal",12336444,972]
[4,"SUM","No","No","Backing",259965,20]
[1,"ALL","Yes","Yes","Overturning",45156,1]
[7,"AUG","Yes","Yes","Left Turn",66621,1]
[10,"VIN","Yes","No","Animal",161544,9]
[12,"GEA","Yes","No","Other Non-Collision",10176,1]
[4,"MAH","No","Yes","Rear End",7720656,145]
[3,"WAY","Yes","No","Head On",2359845,17]
[4,"SUM","Yes","Yes","Sideswipe - Passing",30528,3]
[1,"HAN","Yes","Yes","Rear End",10176,1]
[6,"MAD","Yes","Yes","Backing",10176,1]

{"sheet":"Import","index":8,"n_rows":63,"n_cols":75,"rows_kept":63,"cut":false,"hidden":true,"merged":[[0,0,0,1]]}
["Application ID:",null,{"$f":"IF('Safety Application'!A115=\"\",\"Not Assigned\",'Safety Application'!A115)","v":"202303D08-05"}]
[]
[]
["General Application Data"]
["https://extranet.dot.state.oh.us/divisions/Planning/plan/HSIP_applications/Lists/AppData/ImportView.aspx"]
["Title","Cycle","AppID","District","CountyCd","Sponsor","Project Name","PID","ProjectManager","PM_Phone","PM_Email","Applicant_Name","Applicant_Title","Applicant_Phone","ApplicationDt","RouteNbr","RouteName","Blog","Elog","FolderPath"]
[{"$f":"C7","v":"202303D08-05"},{"$f":"LEFT(C7,6)","v":"202303"},{"$f":"C1","v":"202303D08-05"},{"$f":"'Safety Application'!C10","v":8},{"$f":"LEFT('Safety Application'!H10,3)","v":"BUT"},{"$f":"IF('Safety Application'!D2=\"\",\"\",'Safety Application'!D2)","v":"ODOT D8"},{"$f":"IF('Safety Application'!D3=\"\",\"\",'Safety Application'!D3)","v":"SR-747 at SR-129 Interchanges and Grandin Ridge Drive/Logsdons Meadow Drive"},{"$f":"IF('Safety Application'!D4=\"\",\"\",'Safety Application'!D4)","v":"TBD"},{"$f":"IF('Safety Application'!D5=\"\",\"\",'Safety Application'!D5)","v":"Brianne Hetzel"},{"$f":"IF('Safety Application'!D6=\"\",\"\",'Safety Application'!D6)","v":"513-933-6624"},{"$f":"IF('Safety Application'!D7=\"\",\"\",'Safety Application'!D7)","v":"brianne.hetzel@dot.ohio.gov"},{"$f":"IF('Safety Application'!A106=\"\",\"\",'Safety Application'!A106)","v":"Brianne Hetzel"},{"$f":"IF('Safety Application'!F106=\"\",\"\",'Safety Application'!F106)","v":"D8 Traffic Studies Engineer"},{"$f":"'Safety Application'!I106","v":"513-933-6624"},{"$f":"IF('Safety Application'!I108=\"\",\"\",MONTH('Safety Application'!I108)&\"/\"&DAY('Safety Application'!I108)&\"/\"&YEAR('Safety Application'!I108))","v":"3/31/2023"},{"$f":"'Safety Application'!C11","v":"SR-747R"},{"$f":"'Safety Application'!H11","v":"SR-747"},{"$f":"'Safety Application'!C12","v":5.43},{"$f":"'Safety Application'!H12","v":5.65},{"$f":"IF(LEFT('Safety Application'!A117,1)=\"\\\",'Safety Application'!A117,\"\\\\itcfs007.dot.state.oh.us\\odrive\"&MID('Safety Application'!A117,FIND(\"\\\",'Safety Application'!A117,1),100))","v":"\\\\itcfs007.dot.state.oh.us\\odrive\\SAFETY\\D08\\SAFETY APPLICATIONS\\202303 Applications\\202303D08-05 BUT SR-747 @ SR-129 interchange"}]
[]
[]
["Project Priority"]
["https://extranet.dot.state.oh.us/divisions/Planning/plan/HSIP_applications/Lists/PriorityInfo/ImportView.aspx"]
["AppID","PriorityText"]
[{"$f":"C1","v":"202303D08-05"},{"$f":"IF('Safety Application'!A22=\"\",\"\",'Safety Application'!A22)","v":"SuburbanNonFwy #36 (2020 SA List)\nSuburbanNonFwy #160 (2021 SA List)"}]
[]
[]
["Application Summary of Crash Patterns and Recommended Countermeasures"]
["https://extranet.dot.state.oh.us/divisions/Planning/plan/HSIP_applications/Lists/CrashPatterns/ImportView.aspx"]
["AppID","SummaryText","RecCountermeasure"]
[{"$f":"A13","v":"202303D08-05"},{"$f":"'Safety Application'!A18","v":"Crash data between 2018 and 2020 was obtained using ODOT’s TIMS website. A total of 100 crashes occurred within the study area with three involving serious injuries, thirteen involving minor injuries, and ten involving possible injuries. The data shows that rear end and left turn crashes happen more frequently in the study area than is typical. Crashes were higher on weekdays, especially on Monday (19%) and Tuesday (18%)\nand were most common between 2 PM and 7 PM. Following Too Closely/ACDA (Assured Clear Distance Ahead) was the highest contributing factor (54%) of crashes. Failure to Yield was the next most common contributing factor (23%), with six from angle crashes and 17 from left turn crashes indicating drivers were unable to properly select an appropriate gap in traffic. Pavement friction is likely not a significant contributing factor\nsince 68% of the crashes occurred on dry pavement.\n\nThe 2021-2022 updated crash data shows 25 crashes occurring in 2021 and 35 crashes occurring in 2022, with a nearly 32% injury rate. The highest concentration of crashes was still rear end and left turn crashes. There were 8 left turn crashes at the WB ramp and 10 left turn crashes at the EB ramp. Rear ends are primarily in the SB direction at both ramps due to queing of the left turns. "},{"$f":"'Safety Application'!A20","v":"The SR-129 EB ramp signal operates poorly during the AM peak, with several movements underperforming (LOS E/F). Additionally, the southbound left-turn movement shows LOS D, however, the 95% queue exceeds the existing storage. During the PM peak, this trend occurs again for the southbound left, while the rest of the intersection operates functionally (except the WB right-turn, with LOS E). The SR-129 WB ramp signal operates well during the AM peak and in the PM peak hours, except the WB approach during the AM Peak (LOS E), and the 95% queue exceeds the existing storage in the PM peak. The signalized ramp intersections operate poorly over all time periods, with several movements underperforming (LOS E/F) and 95% queues exceeding existing storage.\n\nConvert the interchange to a Diverging Diamond Interchange (DDI). All movements for both the AM and PM peak hours show acceptable levels of service (LOS D or better) in the design year. Furthermore, all V/C ratios are under 1.0, and all 95th Percentile Queues are within the existing/proposed storage lengths."}]
[]
[]
["Application Crash Data"]
["https://extranet.dot.state.oh.us/divisions/Planning/plan/HSIP_applications/Lists/CrashData/ImportView.aspx"]
["AppID","Pred_Ex_KA","Pred_Ex_B","Pred_Ex_C","Pred_Ex_O","Exp_Ex_KA","Exp_Ex_B","Exp_Ex_C","Exp_Ex_O","PSI_KA","PSI_B","PSI_C","PSI_O","Prop_Type","Prop_KA","Prop_B","Prop_C","Prop_O","Obs_KA","Obs_B","Obs_C","Obs_O","Obs_People_K","Obs_People_A","Obs_People_B","Obs_People_C"]
[{"$f":"A19","v":"202303D08-05"},{"$f":"'Safety Application'!F26","v":0.48489999999999994},{"$f":"'Safety Application'!G26","v":1.9638999999999998},{"$f":"'Safety Application'!H26","v":2.9813000000000001},{"$f":"'Safety Application'!I26","v":14.086300000000001},{"$f":"'Safety Application'!F27","v":0.5222},{"$f":"'Safety Application'!G27","v":2.1368},{"$f":"'Safety Application'!H27","v":3.2578},{"$f":"'Safety Application'!I27","v":18.366799999999998},{"$f":"'Safety Application'!F28","v":3.7300000000000055E-2},{"$f":"'Safety Application'!G28","v":0.17290000000000028},{"$f":"'Safety Application'!H28","v":0.27649999999999997},{"$f":"'Safety Application'!I28","v":4.2804999999999964},{"$f":"IF(ScoringCalculations!$AB$1=\"ECAT - Change in base SPF\",\"Predicted\",\"Expected\")","v":"Predicted"},{"$f":"'Safety Application'!F29","v":0.34639999999999999},{"$f":"'Safety Application'!G29","v":1.4200999999999999},{"$f":"'Safety Application'!H29","v":2.2084000000000001},{"$f":"'Safety Application'!I29","v":12.4259},{"$f":"'Safety Application'!F30","v":1},{"$f":"'Safety Application'!G30","v":4.3333000000000004},{"$f":"'Safety Application'!H30","v":3.3332999999999999},{"$f":"'Safety Application'!I30","v":24.666699999999999},{"$f":"'Safety Application'!F33","v":0},{"$f":"'Safety Application'!G33","v":1.6667000000000001},{"$f":"'Safety Application'!H33","v":5.3333000000000004},{"$f":"'Safety Application'!I33","v":9}]
[]
[]
["Application Scoring"]
["https://extranet.dot.state.oh.us/divisions/Planning/plan/HSIP_applications/Lists/AppScoring/ImportView.aspx"]
["AppID","Expected_Value","Expected_Points","ObservedFSI_Value","ObservedFSI_Points","PercPSI_Value","PercPSI_Points","RSI_Value","RSI_Points","EPDO_Value","EPDO_Points","VCRatio_Value","VCRatio_Points","BCRatio_Value","BCRatio_Points","FundRequest_Value","FundRequest_Points","LocEquity_Value","LocEquity_Points","BCRatio_Safety_Value","NetBenefit","NetPV_Project","NetPV_Safety"]
[{"$f":"A25","v":"202303D08-05"},null,null,{"$f":"'Safety Application'!H37","v":0.05},{"$f":"'Safety Application'!I37","v":10},{"$f":"'Safety Application'!H38","v":0.19650000000000001},{"$f":"'Safety Application'!I38","v":14},{"$f":"'Safety Application'!H39","v":28889.8},{"$f":"'Safety Application'!I39","v":8},{"$f":"'Safety Application'!H40","v":2.9},{"$f":"'Safety Application'!I40","v":8},null,null,{"$f":"'Safety Application'!I93","v":0.28000000000000003},null,null,null,{"$f":"'Safety Application'!H41","v":0},{"$f":"'Safety Application'!I41","v":""},{"$f":"'Safety Application'!I94","v":6.02},{"$f":"'Safety Application'!I92","v":-4623370.78},{"$f":"'Safety Application'!E92","v":6430000},{"$f":"'Safety Application'!E93","v":1806629.23}]
[]
[]
["Strategic Highway Safety Plan"]
["https://extranet.dot.state.oh.us/divisions/Planning/plan/HSIP_applications/Lists/SHSP/ImportView.aspx"]
["AppID","Functional Class","MajAADT","OhioEmpArea","OhioEmpSub","FHWAEmpArea","FHWA_ImprovCat","FHWA_ImprovSubCat"]
[{"$f":"A31","v":"202303D08-05"},{"$f":"'Safety Application'!D48","v":"3 - Other Principal Arterial Roadway"},{"$f":"'Safety Application'!D49","v":26368},{"$f":"'Safety Application'!E54","v":"Serious Crash Types"},{"$f":"'Safety Application'!E55","v":"Intersection"},{"$f":"'Safety Application'!E56","v":"Improving the design and operation of highway intersections"},{"$f":"'Safety Application'!E57","v":"Interchange design"},{"$f":"'Safety Application'!E58","v":"Interchange design - other"}]
[]
[]
["Application Work Locations"]
["https://extranet.dot.state.oh.us/divisions/Planning/plan/HSIP_applications/Lists/WorkLocations/ImportView.aspx"]
["RouteID","AppID","Location ID","NLFID","Begin Logpoint","End Logpoint","startLatitude","startLongitude","endLatitude","endLongitude","Termini"]
[{"$f":"IF(D43=\"\",\"\",MID(D43,5,2)&\"-\"&IFERROR(MID(D43,7,5)*1,MID(D43,7,5))&IF(LEFT(D43,1)=\"S\",IF(RIGHT(D43,2)=\"*C\",\"\",MID(D43,13,1)),IF(RIGHT(D43,3)=\"**C\",\"\",MID(D43,12,1))))","v":"SR-747"},{"$f":"IF(C43=\"\",\"\",$A$37)","v":"202303D08-05"},{"$f":"IF(D43=\"\",\"\",1)","v":1},{"$f":"IF('Safety Application'!A62=0,\"\",'Safety Application'!A62)","v":"SBUTSR00747**C"},{"$f":"IF(D43=\"\",\"\",'Safety Application'!C62)","v":5.43},{"$f":"IF(D43=\"\",\"\",'Safety Application'!D62)","v":5.65},{"$f":"IF(D43=\"\",\"\",'Safety Application'!E62)","v":0},{"$f":"IF(D43=\"\",\"\",'Safety Application'!F62)","v":0},{"$f":"IF(D43=\"\",\"\",'Safety Application'!AA62)","v":0},{"$f":"IF(D43=\"\",\"\",'Safety Application'!AB62)","v":0},{"$f":"IF(D43=\"\",\"\",'Safety Application'!G62)","v":0}]
[{"$f":"IF(D44=\"\",\"\",MID(D44,5,2)&\"-\"&IFERROR(MID(D44,7,5)*1,MID(D44,7,5))&IF(LEFT(D44,1)=\"S\",IF(RIGHT(D44,2)=\"*C\",\"\",MID(D44,13,1)),IF(RIGHT(D44,3)=\"**C\",\"\",MID(D44,12,1))))","v":""},{"$f":"IF(C44=\"\",\"\",$A$37)","v":""},{"$f":"IF(D44=\"\",\"\",C43+1)","v":""},{"$f":"IF('Safety Application'!A63=0,\"\",'Safety Application'!A63)","v":""},{"$f":"IF(D44=\"\",\"\",'Safety Application'!C63)","v":""},{"$f":"IF(D44=\"\",\"\",'Safety Application'!D63)","v":""},{"$f":"IF(D44=\"\",\"\",'Safety Application'!E63)","v":""},{"$f":"IF(D44=\"\",\"\",'Safety Application'!F63)","v":""},null,null,{"$f":"IF(D44=\"\",\"\",'Safety Application'!G63)","v":""}]
["","",{"$f":"IF(D45=\"\",\"\",C44+1)","v":""},{"$f":"IF('Safety Application'!A64=0,\"\",'Safety Application'!A64)","v":""},{"$f":"IF(D45=\"\",\"\",'Safety Application'!C64)","v":""},{"$f":"IF(D45=\"\",\"\",'Safety Application'!D64)","v":""},{"$f":"IF(D45=\"\",\"\",'Safety Application'!E64)","v":""},{"$f":"IF(D45=\"\",\"\",'Safety Application'!F64)","v":""},null,null,{"$f":"IF(D45=\"\",\"\",'Safety Application'!G64)","v":""}]
["","","",{"$f":"IF('Safety Application'!A65=0,\"\",'Safety Application'!A65)","v":""},{"$f":"IF(D46=\"\",\"\",'Safety Application'!C65)","v":""},{"$f":"IF(D46=\"\",\"\",'Safety Application'!D65)","v":""},{"$f":"IF(D46=\"\",\"\",'Safety Application'!E65)","v":""},{"$f":"IF(D46=\"\",\"\",'Safety Application'!F65)","v":""},null,null,{"$f":"IF(D46=\"\",\"\",'Safety Application'!G65)","v":""}]
["","","",{"$f":"IF('Safety Application'!A66=0,\"\",'Safety Application'!A66)","v":""},{"$f":"IF(D47=\"\",\"\",'Safety Application'!C66)","v":""},{"$f":"IF(D47=\"\",\"\",'Safety Application'!D66)","v":""},{"$f":"IF(D47=\"\",\"\",'Safety Application'!E66)","v":""},{"$f":"IF(D47=\"\",\"\",'Safety Application'!F66)","v":""},null,null,{"$f":"IF(D47=\"\",\"\",'Safety Application'!G66)","v":""}]
["","","",{"$f":"IF('Safety Application'!A67=0,\"\",'Safety Application'!A67)","v":""},{"$f":"IF(D48=\"\",\"\",'Safety Application'!C67)","v":""},{"$f":"IF(D48=\"\",\"\",'Safety Application'!D67)","v":""},{"$f":"IF(D48=\"\",\"\",'Safety Application'!E67)","v":""},{"$f":"IF(D48=\"\",\"\",'Safety Application'!F67)","v":""},null,null,{"$f":"IF(D48=\"\",\"\",'Safety Application'!G67)","v":""}]
["","","",{"$f":"IF('Safety Application'!A68=0,\"\",'Safety Application'!A68)","v":""},{"$f":"IF(D49=\"\",\"\",'Safety Application'!C68)","v":""},{"$f":"IF(D49=\"\",\"\",'Safety Application'!D68)","v":""},{"$f":"IF(D49=\"\",\"\",'Safety Application'!E68)","v":""},{"$f":"IF(D49=\"\",\"\",'Safety Application'!F68)","v":""},null,null,{"$f":"IF(D49=\"\",\"\",'Safety Application'!G68)","v":""}]
["","","",{"$f":"IF('Safety Application'!A69=0,\"\",'Safety Application'!A69)","v":""},{"$f":"IF(D50=\"\",\"\",'Safety Application'!C69)","v":""},{"$f":"IF(D50=\"\",\"\",'Safety Application'!D69)","v":""},{"$f":"IF(D50=\"\",\"\",'Safety Application'!E69)","v":""},{"$f":"IF(D50=\"\",\"\",'Safety Application'!F69)","v":""},null,null,{"$f":"IF(D50=\"\",\"\",'Safety Application'!G69)","v":""}]
["","","",{"$f":"IF('Safety Application'!A70=0,\"\",'Safety Application'!A70)","v":""},{"$f":"IF(D51=\"\",\"\",'Safety Application'!C70)","v":""},{"$f":"IF(D51=\"\",\"\",'Safety Application'!D70)","v":""},{"$f":"IF(D51=\"\",\"\",'Safety Application'!E70)","v":""},{"$f":"IF(D51=\"\",\"\",'Safety Application'!F70)","v":""},null,null,{"$f":"IF(D51=\"\",\"\",'Safety Application'!G70)","v":""}]
["","","",{"$f":"IF('Safety Application'!A71=0,\"\",'Safety Application'!A71)","v":""},{"$f":"IF(D52=\"\",\"\",'Safety Application'!C71)","v":""},{"$f":"IF(D52=\"\",\"\",'Safety Application'!D71)","v":""},{"$f":"IF(D52=\"\",\"\",'Safety Application'!E71)","v":""},{"$f":"IF(D52=\"\",\"\",'Safety Application'!F71)","v":""},null,null,{"$f":"IF(D52=\"\",\"\",'Safety Application'!G71)","v":""}]
[]
["Project Funding"]
["https://extranet.dot.state.oh.us/divisions/Planning/plan/HSIP_applications/Lists/Funding/ImportView.aspx"]
["AppID","FY_SafetyStudy","FY_IMS","FY_PE_Enviro","FY_PE_Design","FY_ROW","FY_Const","NewSafety_AMT_SafetyStudy","NewSafety_AMT_IMS","NewSafety_AMT_PE_Enviro","NewSafety_AMT_PE_Design","NewSafety_AMT_ROW","NewSafety_AMT_Const","PrevSafety_AMT_SafetyStudy","PrevSafety_AMT_IMS","PrevSafety_AMT_PE_Enviro","PrevSafety_AMT_PE_Design","PrevSafety_AMT_ROW","PrevSafety_AMT_Const","Sponsor_AMT_SafetyStudy","Sponsor_AMT_IMS","Sponsor_AMT_PE_Enviro","Sponsor_AMT_PE_Design","Sponsor_AMT_ROW","Sponsor_AMT_Const","Alt1_Source","Alt1_AMT_SafetyStudy","Alt1_AMT_IMS","Alt1_AMT_PE_Enviro","Alt1_AMT_PE_Design","Alt1_AMT_ROW","Alt1_AMT_Const","Alt2_Source","Alt2_AMT_SafetyStudy","Alt2_AMT_IMS","Alt2_AMT_PE_Enviro","Alt2_AMT_PE_Design","Alt2_AMT_ROW","Alt2_AMT_Const","Alt3_Source","Alt3_AMT_SafetyStudy","Alt3_AMT_IMS","Alt3_AMT_PE_Enviro","Alt3_AMT_PE_Design","Alt3_AMT_ROW","Alt3_AMT_Const","Alt4_Source","Alt4_AMT_SafetyStudy","Alt4_AMT_IMS","Alt4_AMT_PE_Enviro","Alt4_AMT_PE_Design","Alt4_AMT_ROW","Alt4_AMT_Const","Alt5_Source","Alt5_AMT_SafetyStudy","Alt5_AMT_IMS","Alt5_AMT_PE_Enviro","Alt5_AMT_PE_Design","Alt5_AMT_ROW","Alt5_AMT_Const","Alt6_Source","Alt6_AMT_SafetyStudy","Alt6_AMT_IMS","Alt6_AMT_PE_Enviro","Alt6_AMT_PE_Design","Alt6_AMT_ROW","Alt6_AMT_Const","Alt7_Source","Alt7_AMT_SafetyStudy","Alt7_AMT_IMS","Alt7_AMT_PE_Enviro","Alt7_AMT_PE_Design","Alt7_AMT_ROW","Alt7_AMT_Const","AddtlDetails"]
[{"$f":"A37","v":"202303D08-05"},{"$f":"IF('Safety Application'!D75=0,\"\",'Safety Application'!D75)","v":""},{"$f":"IF('Safety Application'!E75=0,\"\",'Safety Application'!E75)","v":""},{"$f":"IF('Safety Application'!F75=0,\"\",'Safety Application'!F75)","v":2024},{"$f":"IF('Safety Application'!G75=0,\"\",'Safety Application'!G75)","v":""},{"$f":"IF('Safety Application'!H75=0,\"\",'Safety Application'!H75)","v":""},{"$f":"IF('Safety Application'!I75=0,\"\",'Safety Application'!I75)","v":""},{"$f":"IF('Safety Application'!D78=0,\"\",'Safety Application'!D78)","v":""},{"$f":"IF('Safety Application'!E78=0,\"\",'Safety Application'!E78)","v":""},{"$f":"IF('Safety Application'!F78=0,\"\",'Safety Application'!F78)","v":300000},{"$f":"IF('Safety Application'!G78=0,\"\",'Safety Application'!G78)","v":""},{"$f":"IF('Safety Application'!H78=0,\"\",'Safety Application'!H78)","v":""},{"$f":"IF('Safety Application'!I78=0,\"\",'Safety Application'!I78)","v":""},{"$f":"IF('Safety Application'!D77=0,\"\",'Safety Application'!D77)","v":""},{"$f":"IF('Safety Application'!E77=0,\"\",'Safety Application'!E77)","v":""},{"$f":"IF('Safety Application'!F77=0,\"\",'Safety Application'!F77)","v":""},{"$f":"IF('Safety Application'!G77=0,\"\",'Safety Application'!G77)","v":""},{"$f":"IF('Safety Application'!H77=0,\"\",'Safety Application'!H77)","v":""},{"$f":"IF('Safety Application'!I77=0,\"\",'Safety Application'!I77)","v":""},{"$f":"IF('Safety Application'!D79=0,\"\",'Safety Application'!D79)","v":""},{"$f":"IF('Safety Application'!E79=0,\"\",'Safety Application'!E79)","v":""},{"$f":"IF('Safety Application'!F79=0,\"\",'Safety Application'!F79)","v":""},{"$f":"IF('Safety Application'!G79=0,\"\",'Safety Application'!G79)","v":""},{"$f":"IF('Safety Application'!H79=0,\"\",'Safety Application'!H79)","v":""},{"$f":"IF('Safety Application'!I79=0,\"\",'Safety Application'!I79)","v":""},{"$f":"IF('Safety Application'!A80=0,\"\",'Safety Application'!A80)","v":""},{"$f":"IF('Safety Application'!D80=0,\"\",'Safety Application'!D80)","v":""},{"$f":"IF('Safety Application'!E80=0,\"\",'Safety Application'!E80)","v":""},{"$f":"IF('Safety Application'!F80=0,\"\",'Safety Application'!F80)","v":""},{"$f":"IF('Safety Application'!G80=0,\"\",'Safety Application'!G80)","v":""},{"$f":"IF('Safety Application'!H80=0,\"\",'Safety Application'!H80)","v":""},{"$f":"IF('Safety Application'!I80=0,\"\",'Safety Application'!I80)","v":""},{"$f":"IF('Safety Application'!A81=0,\"\",'Safety Application'!A81)","v":""},{"$f":"IF('Safety Application'!D81=0,\"\",'Safety Application'!D81)","v":""},{"$f":"IF('Safety Application'!E81=0,\"\",'Safety Application'!E81)","v":""},{"$f":"IF('Safety Application'!F81=0,\"\",'Safety Application'!F81)","v":""},{"$f":"IF('Safety Application'!G81=0,\"\",'Safety Application'!G81)","v":""},{"$f":"IF('Safety Application'!H81=0,\"\",'Safety Application'!H81)","v":""},{"$f":"IF('Safety Application'!I81=0,\"\",'Safety Application'!I81)","v":""},{"$f":"IF('Safety Application'!A82=0,\"\",'Safety Application'!A82)","v":""},{"$f":"IF('Safety Application'!D82=0,\"\",'Safety Application'!D82)","v":""},{"$f":"IF('Safety Application'!E82=0,\"\",'Safety Application'!E82)","v":""},{"$f":"IF('Safety Application'!F82=0,\"\",'Safety Application'!F82)","v":""},{"$f":"IF('Safety Application'!G82=0,\"\",'Safety Application'!G82)","v":""},{"$f":"IF('Safety Application'!H82=0,\"\",'Safety Application'!H82)","v":""},{"$f":"IF('Safety Application'!I82=0,\"\",'Safety Application'!I82)","v":""},{"$f":"IF('Safety Application'!A83=0,\"\",'Safety Application'!A83)","v":""},{"$f":"IF('Safety Application'!D83=0,\"\",'Safety Application'!D83)","v":""},{"$f":"IF('Safety Application'!E83=0,\"\",'Safety Application'!E83)","v":""},{"$f":"IF('Safety Application'!F83=0,\"\",'Safety Application'!F83)","v":""},{"$f":"IF('Safety Application'!G83=0,\"\",'Safety Application'!G83)","v":""},{"$f":"IF('Safety Application'!H83=0,\"\",'Safety Application'!H83)","v":""},{"$f":"IF('Safety Application'!I83=0,\"\",'Safety Application'!I83)","v":""},{"$f":"IF('Safety Application'!A84=0,\"\",'Safety Application'!A84)","v":""},{"$f":"IF('Safety Application'!D84=0,\"\",'Safety Application'!D84)","v":""},{"$f":"IF('Safety Application'!E84=0,\"\",'Safety Application'!E84)","v":""},{"$f":"IF('Safety Application'!F84=0,\"\",'Safety Application'!F84)","v":""},{"$f":"IF('Safety Application'!G84=0,\"\",'Safety Application'!G84)","v":""},{"$f":"IF('Safety Application'!H84=0,\"\",'Safety Application'!H84)","v":""},{"$f":"IF('Safety Application'!I84=0,\"\",'Safety Application'!I84)","v":""},{"$f":"IF('Safety Application'!A85=0,\"\",'Safety Application'!A85)","v":""},{"$f":"IF('Safety Application'!D85=0,\"\",'Safety Application'!D85)","v":""},{"$f":"IF('Safety Application'!E85=0,\"\",'Safety Application'!E85)","v":""},{"$f":"IF('Safety Application'!F85=0,\"\",'Safety Application'!F85)","v":""},{"$f":"IF('Safety Application'!G85=0,\"\",'Safety Application'!G85)","v":""},{"$f":"IF('Safety Application'!H85=0,\"\",'Safety Application'!H85)","v":""},{"$f":"IF('Safety Application'!I85=0,\"\",'Safety Application'!I85)","v":""},{"$f":"IF('Safety Application'!A86=0,\"\",'Safety Application'!A86)","v":""},{"$f":"IF('Safety Application'!D86=0,\"\",'Safety Application'!D86)","v":""},{"$f":"IF('Safety Application'!E86=0,\"\",'Safety Application'!E86)","v":""},{"$f":"IF('Safety Application'!F86=0,\"\",'Safety Application'!F86)","v":""},{"$f":"IF('Safety Application'!G86=0,\"\",'Safety Application'!G86)","v":""},{"$f":"IF('Safety Application'!H86=0,\"\",'Safety Application'!H86)","v":""},{"$f":"IF('Safety Application'!I86=0,\"\",'Safety Application'!I86)","v":""},{"$f":"IF('Safety Application'!A89=0,\"\",'Safety Application'!A89)","v":"Funding for feasibility study only to get better cost estimate and right of way impacts/utility impacts for the DDI. Also consider alternative for loop ramps for the existing left turn movements from SR-747 NB and SB to SR-129 EB/WB. "}]
[]
[]
["Project Development"]
["https://extranet.dot.state.oh.us/divisions/Planning/plan/HSIP_applications/Lists/ProjectDevelopment/ImportView.aspx"]
["AppID","SafetyStudy_CompBy","SafetyStudy_CompDt","IMS_CompBy","IMS__CompDt","PE_Enviro_CompBy","PE_Enviro_CompDt","PE_Design_CompBy","PE_Design_CompDt","ROW_CompBy","ROW_CompDt"]
[{"$f":"A57","v":"202303D08-05"},{"$f":"IF('Safety Application'!E98=0,\"\",'Safety Application'!E98)","v":""},{"$f":"IF('Safety Application'!H98=\"\",\"\",MONTH('Safety Application'!H98)&\"/\"&DAY('Safety Application'!H98)&\"/\"&YEAR('Safety Application'!H98))","v":""},{"$f":"IF('Safety Application'!E99=0,\"\",'Safety Application'!E99)","v":""},{"$f":"IF('Safety Application'!H99=\"\",\"\",MONTH('Safety Application'!H99)&\"/\"&DAY('Safety Application'!H99)&\"/\"&YEAR('Safety Application'!H99))","v":""},{"$f":"IF('Safety Application'!E100=0,\"\",'Safety Application'!E100)","v":""},{"$f":"IF('Safety Application'!H100=\"\",\"\",MONTH('Safety Application'!H100)&\"/\"&DAY('Safety Application'!H100)&\"/\"&YEAR('Safety Application'!H100))","v":""},{"$f":"IF('Safety Application'!E101=0,\"\",'Safety Application'!E101)","v":""},{"$f":"IF('Safety Application'!H101=\"\",\"\",MONTH('Safety Application'!H101)&\"/\"&DAY('Safety Application'!H101)&\"/\"&YEAR('Safety Application'!H101))","v":""},{"$f":"IF('Safety Application'!E102=0,\"\",'Safety Application'!E102)","v":""},{"$f":"IF('Safety Application'!H102=\"\",\"\",MONTH('Safety Application'!H102)&\"/\"&DAY('Safety Application'!H102)&\"/\"&YEAR('Safety Application'!H102))","v":""}]