{"text_format":"1","workbook":"xlsx","n_sheets":14,"sheets":["REPORT","CSF","GRID<->GRND","OWNERS","OSIP","MON TABLE","GPS_IMPORT","PointTemplate","LEVEL RUN","TIN","DATABASE","FINAL GRID COORDINATES PNEZC","FINAL GROUND COORDINATES PNEZC","Lists"],"not_rendered":{"charts":1,"images":1,"macros":1,"external_links":0,"defined_names":14,"comments":0,"pivot_tables":0},"unopened":[],"bounds":{"document_bytes":16777216,"sheet_cells":100000,"rows_first":2000,"rows_last":500,"rows_between":2000,"halvings":0,"cell_chars":16384,"cell_head_chars":4096},"cells_cut":0,"cells_raw":0,"read":"whole","date_system":"1900"}

{"sheet":"REPORT","index":0,"n_rows":56,"n_cols":7,"rows_kept":56,"cut":false,"hidden":false,"merged":[[25,0,25,3],[20,1,20,3],[23,0,23,3],[17,2,17,4],[19,2,19,4],[21,0,21,3],[24,0,24,3],[22,0,22,3],[18,2,18,4],[26,2,26,3],[30,0,30,4],[47,2,47,4],[31,0,31,1],[32,0,32,4],[46,0,46,4],[37,0,37,4],[35,0,35,4],[27,0,27,1],[27,2,27,3],[28,2,28,3],[28,0,28,1],[47,0,47,1],[38,0,38,4],[43,1,43,2],[42,0,42,4],[0,0,0,4],[3,1,3,4],[7,0,7,4],[8,0,8,4],[9,0,9,1],[9,2,9,4],[5,0,5,4],[6,0,6,2],[1,1,1,2],[4,1,4,4],[54,0,54,4],[53,2,53,4],[52,2,52,4],[51,2,51,4],[50,2,50,4],[51,0,51,1],[50,0,50,1],[53,0,53,1],[29,8,29,9],[27,8,27,9],[29,0,29,1],[29,2,29,3],[48,2,48,4],[36,0,36,4],[31,2,31,4],[48,0,48,1],[39,0,39,4],[49,2,49,4],[41,0,41,4],[40,0,40,4],[44,0,44,4],[45,0,45,1],[45,3,45,4],[55,0,55,4],[52,0,52,1],[10,0,10,1],[10,2,10,4],[11,0,11,1],[11,2,11,4],[12,0,12,1],[13,0,13,1],[13,2,13,4],[14,0,14,1],[14,2,14,4],[15,0,15,1],[15,2,15,4],[16,0,16,1],[16,2,16,4],[49,0,49,1]]}
["Surveyor’s Report"]
["Project: ",null,null,"PID:"]
[]
["Scope: "]
["Type:"]
[]
["Gray boxes denote INPUT",null,null,null,"Tan boxes denote OUTPUT (check)"]
[]
{"$rows_left_out":49}
{"sheet":"CSF","index":1,"n_rows":311,"n_cols":17,"rows_kept":311,"cut":false,"hidden":false,"merged":[[3,0,3,1],[3,2,3,6],[0,0,0,6],[0,10,0,11],[1,1,1,2],[1,4,1,6],[2,0,2,6],[4,0,4,5],[5,0,5,2],[5,3,5,6],[6,0,6,5],[7,0,7,1],[7,5,7,6],[8,0,8,1],[8,5,8,6],[10,0,10,1],[10,2,10,4],[10,5,10,6],[17,0,17,1],[11,0,11,1],[11,2,11,4],[11,5,11,6],[12,0,12,6],[13,0,13,1],[14,0,14,1],[14,2,14,6],[15,0,15,6],[16,0,16,1],[25,0,25,1],[25,2,25,6],[18,0,18,1],[19,0,19,1],[19,2,19,6],[20,0,20,6],[21,0,21,1],[22,0,22,1],[22,2,22,6],[23,0,23,6],[24,0,24,1],[24,2,24,6],[26,0,26,6],[27,0,27,1],[27,2,27,6],[28,0,28,1],[28,2,28,6],[31,0,31,6],[32,0,32,1],[33,0,33,1],[33,2,33,6],[29,0,29,6],[30,0,30,6],[41,3,41,4],[34,0,34,6],[35,0,35,1],[35,3,35,4],[35,5,35,6],[36,3,36,4],[37,3,37,4],[37,5,37,6],[38,3,38,4],[39,0,39,6],[40,0,40,1],[40,3,40,4],[40,5,40,6],[47,0,47,6],[48,0,49,4],[48,5,48,6],[42,3,42,4],[42,5,42,6],[43,3,43,4],[44,0,44,6],[45,0,46,4],[45,5,45,6]]}
["Combined Scale Factor Calculations",null,null,null,null,null,null,null,"Zone","Index Value","Project Latitude",null,"Radius of the Earth (meters)","Tabular Difference","Scale Factor (k)","Differences","Coordinate System List"]
["Project: ",{"$f":"REPORT!B2","v":0},null,"PID:",{"$f":"REPORT!E2","v":0},null,null,null,"NZ",3940,39,40,7485451.5980000002,30.84836,1.0002349100000001]
[null,null,null,null,null,null,null,null,"NZ",3941,39,41,7483600.6969999997,30.848230000000001,1.0002279300000001,{"$f":"O2-O3","v":6.9799999999897722E-6},"State Plane Coordinate System: Ohio North (3401)"]
["Horizontal Datum: NAD83",null,"State Plane Coordinate System: Ohio North (3401)",null,null,null,null,null,"NZ",3942,39,42,7481749.8030000003,30.848109999999998,1.00022104,6.8900000000926553E-6,"State Plane Coordinate System: Ohio South (3402)"]
[null,null,null,null,null,null,null,null,"NZ",3943,39,43,7479898.9160000002,30.847989999999999,1.00021424,6.7999999999734939E-6]
["Gray boxes denote INPUT",null,null,"Tan boxes denote OUTPUT (check)",null,null,null,null,"NZ",3944,39,44,7478048.0369999995,30.84787,1.0002075100000001,6.7299999999548277E-6]
[null,null,null,null,null,null,null,null,"NZ",3945,39,45,7476197.165,30.847760000000001,1.00020087,6.6400000000577108E-6]
[null,null,"Input Deg.","Min.","Sec.","Zone Parameters:",null,null,"NZ",3946,39,46,7474346.2989999996,30.847650000000002,1.0001943099999999,6.5600000000998193E-6]
{"$rows_left_out":304}
{"sheet":"GRID<->GRND","index":2,"n_rows":52,"n_cols":11,"rows_kept":52,"cut":false,"hidden":false,"merged":[[0,1,0,2],[1,1,1,2],[5,0,5,4],[5,6,5,10],[4,0,4,4],[4,6,4,10],[0,4,1,5],[2,4,2,5],[2,8,2,9],[1,8,1,9],[0,8,0,9]]}
["Project:",{"$f":"REPORT!B2","v":0},null,null,"Import Units (please select):",null,"Ground Coord?",true,{"$f":"IF(H1=TRUE,\"Unitless Ground to Grid Factor:\",\"Unitless Grid to Ground Factor:\")","v":"Unitless Ground to Grid Factor:"},null,{"$f":"IF(H1=TRUE,1/REPORT!C13,REPORT!C13)","v":1}]
["Pid:",{"$f":"REPORT!E2","v":0},null,null,null,null,"U.S. Survey FT",{"$f":"INDEX(ShortUnits,MATCH(G2,Units,0),1)","v":"sft"},{"$f":"\"Unit Conversion Factor (\"&H2&\"->\"&H3&\"):\"","v":"Unit Conversion Factor (sft->m):"},null,{"$f":"INDEX(FactorValues,MATCH(H2&\"->\"&H3,FactorNames,0))","v":0.30480060960121919}]
[null,null,null,null,"Output Units (please select):",null,"Meters",{"$f":"INDEX(ShortUnits,MATCH(G3,Units,0),1)","v":"m"},"Project Adjustment Factor:",null,{"$f":"K1*K2","v":0.30480060960121919}]
[]
["INPUT",null,null,null,null,null,"OUTPUT"]
[{"$f":"IF(H1=TRUE,\"Ground\",\"Grid\")&\" - \"&G2","v":"Ground - U.S. Survey FT"},null,null,null,null,null,{"$f":"IF(H1=TRUE,\"Grid\",\"Ground\")&\" - \"&G3","v":"Grid - Meters"}]
["NAME","NORTH","EAST","ORTHO HT","FEATURE",null,"NAME","NORTH","EAST","ORTHO HT","FEATURE"]
[null,null,null,null,null,null,{"$f":"A8","v":0},{"$f":"B8*$K$3","v":0},{"$f":"C8*$K$3","v":0},{"$f":"D8*$K$2","v":0},{"$f":"E8","v":0}]
{"$rows_left_out":45}
{"sheet":"OWNERS","index":3,"n_rows":1,"n_cols":12,"rows_kept":1,"cut":false,"hidden":false,"merged":[]}
["First","Last","Address","City","State","Zip Code","Deed Book/Page","Auditor Parcel Number","Area","Section","Lot","Tax Map Parcel"]

{"sheet":"OSIP","index":4,"n_rows":96,"n_cols":18,"rows_kept":96,"cut":false,"hidden":false,"merged":[[0,2,0,4],[1,2,1,4],[6,14,6,15],[6,16,6,17],[23,0,23,8],[15,0,15,8],[7,0,7,8]]}
[null,"Project:",{"$f":"REPORT!B2","v":0}]
[null,"Pid:",{"$f":"REPORT!E2","v":0}]
[]
["Calculate the Project Coordinates for the corners of the Aerial Mapping Raster File"]
["To scale the Geo-referenced file to the Project Datum  ",null,null,null,null,null,null,null,null,null,null,null,null,"Project County:",null,{"$f":"REPORT!B2","v":0},{"$f":"MID(P5,1,3)","v":"0"}]
[]
[null,null,null,null,null,null,null,null,null,null,null,null,null,null,"Photo Corners",null,"Pixel Range"]
["INPUT: SP GRID - US SURVEY FEET",null,null,null,null,null,null,null,null,null,null,null,null,"COUNTY","EASTING","NORTHING","EASTING","NORTHING"]
{"$rows_left_out":89}
{"sheet":"MON TABLE","index":5,"n_rows":95,"n_cols":20,"rows_kept":95,"cut":false,"hidden":false,"merged":[[3,9,3,19],[5,0,6,10],[8,11,8,16],[0,14,0,15],[0,5,0,10],[0,0,0,4],[5,18,5,19],[6,18,7,19],[1,0,2,1],[3,0,3,1],[2,4,2,6],[1,4,1,6],[1,8,2,8],[4,0,4,1],[5,11,6,17],[7,0,8,10],[4,4,4,6],[3,4,3,6],[3,8,4,8]]}
["PROJECT: ",null,null,null,null,{"$f":"REPORT!B2","v":0},null,null,null,null,null,null,null,"PID:",{"$f":"REPORT!$E$2","v":0}]
["Import Units:",null,"Ground Coord?",true,{"$f":"\"Unit Conversion Factor1 (\"&D3&\"->\"&D4&\"):\"","v":"Unit Conversion Factor1 (sft->m):"},null,null,{"$f":"INDEX(FactorValues,MATCH(D3&\"->\"&D4,FactorNames,0))","v":0.30480060960121919},"Unitless Ground to Grid Factor:","Unitless Factor:"]
[null,null,"U.S. Survey FT",{"$f":"INDEX(ShortUnits,MATCH($C$3,Units,0),1)","v":"sft"},{"$f":"\"Unit Conversion Factor2 (\"&D3&\"->\"&D5&\"):\"","v":"Unit Conversion Factor2 (sft->sft):"},null,null,{"$f":"INDEX(FactorValues,MATCH(D3&\"->\"&D5,FactorNames,0))","v":1},null,{"$f":"REPORT!A46&REPORT!C46","v":""}]
["Output Unit1:",null,"Meters",{"$f":"INDEX(ShortUnits,MATCH($C$4,Units,0),1)","v":"m"},"Adjustment Factor1:",null,null,{"$f":"IF(D2=TRUE,I4*H2,H2)","v":0.30480060960121919},{"$f":"IF(D2=TRUE,1/REPORT!C13,\"n/a\")","v":1},"Primary Project Control:"]
["Output Unit2:",null,"U.S. Survey FT",{"$f":"INDEX(ShortUnits,MATCH($C$5,Units,0),1)","v":"sft"},"Adjustment Factor2:",null,null,{"$f":"IF(D2=TRUE,I4*H3,H3)","v":1},null,{"$f":"REPORT!A41&REPORT!A42&REPORT!A43","v":""}]
[{"$f":"IF(D2=TRUE,\"GROUND\",\"GRID\")&\" COORDINATES - \"&C3","v":"GROUND COORDINATES - U.S. Survey FT"},null,null,null,null,null,null,null,null,null,null,"STATE PLANE GRID COORDINATES",null,null,null,null,null,null,"  MONUMENTS TO BE SET"]
[null,null,null,null,null,null,null,null,null,null,null,null,null,null,null,null,null,null," DURING CONSTRUCTION"]
[{"$f":"IF(ISNUMBER(SEARCH(\"NORTH\",REPORT!C10))=TRUE,\"PROJECT coordinates are scaled from GRID coordinates about the Ohio North Zone grid point \"&Lists!$G$1,\"PROJECT coordinates are scaled from GRID coordinates about the Ohio South Zone grid point \"&Lists!$G$2)","v":"PROJECT coordinates are scaled from GRID coordinates about the Ohio South Zone grid point N=0, E=0 (N 37⁰ 47' 45.30621\", W 89⁰ 19' 00.02517\")"},null,null,null,null,null,null,null,null,null,null,"Horiz. Datum:",{"$f":"REPORT!C11","v":"NAD83 (2011)"},{"$f":"REPORT!C10","v":"Ohio State Plane, South Zone"},null,"Vert. Datum:",{"$f":"REPORT!C15","v":"NAVD88"}]
{"$rows_left_out":88}
{"sheet":"GPS_IMPORT","index":6,"n_rows":6,"n_cols":12,"rows_kept":6,"cut":false,"hidden":false,"merged":[[5,11,6,11],[5,10,6,10],[5,9,6,9],[5,8,6,8],[0,8,0,11],[3,9,4,9],[2,11,4,11],[1,8,4,8],[3,10,4,10]]}
["NAME","Date","Time","Northing","Easting","Elevation","Code",null,"GPS Import Settings"]
[null,null,null,null,null,null,null,null,"Import","Ground Coord?",false,"Factor"]
[null,null,null,null,null,null,null,null,null,"Units","Short Unit",{"$f":"K4&\"->\"&K6","v":"sft->sft"}]
[null,null,null,null,null,null,null,null,null,"U.S. Survey FT",{"$f":"INDEX(ShortUnits,MATCH(GPS_IMPORT!$J$4,Units,0),1)","v":"sft"}]
[]
[null,null,null,null,null,null,null,null,"Output","U.S. Survey FT",{"$f":"INDEX(ShortUnits,MATCH(GPS_IMPORT!$J$6,Units,0),1)","v":"sft"},{"$f":"INDEX(FactorValues,MATCH(L3,FactorNames,0))","v":1}]

{"sheet":"PointTemplate","index":7,"n_rows":388,"n_cols":17,"rows_kept":388,"cut":false,"hidden":false,"merged":[[3,4,3,7],[2,1,2,2],[3,1,3,2],[0,0,0,10],[26,0,26,6],[4,4,4,5],[4,9,4,10],[3,9,3,10],[2,9,2,10],[23,7,23,8],[2,4,2,7],[27,1,27,2],[27,8,38,10],[28,1,28,2],[30,0,30,6],[35,0,35,6],[36,1,36,2],[37,1,37,2],[38,1,38,2]]}
["VRS GNSS Project Control Monument Coordinate Analysis"]
[]
["Project:",{"$f":"REPORT!B2","v":0},null,"GPS Antenna:",{"$f":"REPORT!A41","v":0},null,null,null,"Report Date:",{"$f":"REPORT!C49","v":"00:00:00"}]
["PID:",{"$f":"REPORT!E2","v":0},null,"VRS Network:","ODOT VRS",null,null,null,"Prepared By:",{"$f":"REPORT!C48","v":0}]
["Point ID:"," ","No. of Sessions:",{"$f":"SUM(IF(GPS_IMPORT!A2:A1000=$B$5,1,0))","v":0},{"$f":"IF(GPS_IMPORT!K2,\"(GROUND)\",\"(GRID)\")","v":"(GRID)"},null,null,null,"Checked By:",{"$f":"REPORT!C52","v":"00:00:00"}]
["SESSION #","Point","Observation Date","Start Time",{"$f":"\"Northing(\"&GPS_IMPORT!K4&\")\"","v":"Northing(sft)"},{"$f":"\"Easting(\"&GPS_IMPORT!K4&\")\"","v":"Easting(sft)"},{"$f":"\"Height(\"&GPS_IMPORT!K4&\")\"","v":"Height(sft)"},{"$f":"\"∆ Northing(\"&GPS_IMPORT!K4&\")\"","v":"∆ Northing(sft)"},{"$f":"\"∆ Easting(\"&GPS_IMPORT!K4&\")\"","v":"∆ Easting(sft)"},{"$f":"\"∆ Height(\"&GPS_IMPORT!K4&\")\"","v":"∆ Height(sft)"},"Include in Solution?"]
[1,{"$f":"IF(ROWS(GPS_IMPORT!$1:1)<=SUM(IF(GPS_IMPORT!$A$2:$A$10000=$B$5,1,0)),INDEX(GPS_IMPORT!$2:$10000,MATCH($B$5,(GPS_IMPORT!$A$2:$A$10000),0)+ROWS($1:1)-1,COLUMN()-1),0)","v":0},{"$f":"IF(ROWS(GPS_IMPORT!$1:1)<=SUM(IF(GPS_IMPORT!$A$2:$A$10000=$B$5,1,0)),INDEX(GPS_IMPORT!$2:$10000,MATCH($B$5,(GPS_IMPORT!$A$2:$A$10000),0)+ROWS($1:1)-1,COLUMN()-1),0)","v":"00:00:00"},{"$f":"IF(ROWS(GPS_IMPORT!$1:1)<=SUM(IF(GPS_IMPORT!$A$2:$A$10000=$B$5,1,0)),INDEX(GPS_IMPORT!$2:$10000,MATCH($B$5,(GPS_IMPORT!$A$2:$A$10000),0)+ROWS($1:1)-1,COLUMN()-1),0)","v":"00:00:00"},{"$f":"IF(ROWS(GPS_IMPORT!$1:1)<=SUM(IF(GPS_IMPORT!$A$2:$A$10000=$B$5,1,0)),INDEX(GPS_IMPORT!$2:$10000,MATCH($B$5,(GPS_IMPORT!$A$2:$A$10000),0)+ROWS($1:1)-1,COLUMN()-1),0)","v":0},{"$f":"IF(ROWS(GPS_IMPORT!$1:1)<=SUM(IF(GPS_IMPORT!$A$2:$A$10000=$B$5,1,0)),INDEX(GPS_IMPORT!$2:$10000,MATCH($B$5,(GPS_IMPORT!$A$2:$A$10000),0)+ROWS($1:1)-1,COLUMN()-1),0)","v":0},{"$f":"IF(ROWS(GPS_IMPORT!$1:1)<=SUM(IF(GPS_IMPORT!$A$2:$A$10000=$B$5,1,0)),INDEX(GPS_IMPORT!$2:$10000,MATCH($B$5,(GPS_IMPORT!$A$2:$A$10000),0)+ROWS($1:1)-1,COLUMN()-1),0)","v":0},{"$f":"IF(K7=TRUE,IF(E7>0,E$22-E7,0),0)","v":0},{"$f":"IF(K7=TRUE,IF(F7>0,F$22-F7,0),0)","v":0},{"$f":"IF(K7=TRUE,IF(G7>0,G$22-G7,0),0)","v":0},true,{"$f":"IF(OR(ABS(H7)>$H$24,ABS(I7)>$H$24,ABS(SQRT((H7^2)+(I7^2)))>$H$24),IF(K7=TRUE,IF(E7>0,E$22-E7,0),0),0)","v":0},{"$f":"IF(OR(ABS(H7)>$H$24,ABS(I7)>$H$24,ABS(SQRT((H7^2)+(I7^2)))>$H$24),IF(K7=TRUE,IF(E7>0,F$22-F7,0),0),0)","v":0}]
[2,{"$f":"IF(ROWS(GPS_IMPORT!$1:2)<=SUM(IF(GPS_IMPORT!$A$2:$A$10000=$B$5,1,0)),INDEX(GPS_IMPORT!$2:$10000,MATCH($B$5,(GPS_IMPORT!$A$2:$A$10000),0)+ROWS($1:2)-1,COLUMN()-1),0)","v":0},{"$f":"IF(ROWS(GPS_IMPORT!$1:2)<=SUM(IF(GPS_IMPORT!$A$2:$A$10000=$B$5,1,0)),INDEX(GPS_IMPORT!$2:$10000,MATCH($B$5,(GPS_IMPORT!$A$2:$A$10000),0)+ROWS($1:2)-1,COLUMN()-1),0)","v":"00:00:00"},{"$f":"IF(ROWS(GPS_IMPORT!$1:2)<=SUM(IF(GPS_IMPORT!$A$2:$A$10000=$B$5,1,0)),INDEX(GPS_IMPORT!$2:$10000,MATCH($B$5,(GPS_IMPORT!$A$2:$A$10000),0)+ROWS($1:2)-1,COLUMN()-1),0)","v":"00:00:00"},{"$f":"IF(ROWS(GPS_IMPORT!$1:2)<=SUM(IF(GPS_IMPORT!$A$2:$A$10000=$B$5,1,0)),INDEX(GPS_IMPORT!$2:$10000,MATCH($B$5,(GPS_IMPORT!$A$2:$A$10000),0)+ROWS($1:2)-1,COLUMN()-1),0)","v":0},{"$f":"IF(ROWS(GPS_IMPORT!$1:2)<=SUM(IF(GPS_IMPORT!$A$2:$A$10000=$B$5,1,0)),INDEX(GPS_IMPORT!$2:$10000,MATCH($B$5,(GPS_IMPORT!$A$2:$A$10000),0)+ROWS($1:2)-1,COLUMN()-1),0)","v":0},{"$f":"IF(ROWS(GPS_IMPORT!$1:2)<=SUM(IF(GPS_IMPORT!$A$2:$A$10000=$B$5,1,0)),INDEX(GPS_IMPORT!$2:$10000,MATCH($B$5,(GPS_IMPORT!$A$2:$A$10000),0)+ROWS($1:2)-1,COLUMN()-1),0)","v":0},{"$f":"IF(K8=TRUE,IF(E8>0,E$22-E8,0),0)","v":0},{"$f":"IF(K8=TRUE,IF(F8>0,F$22-F8,0),0)","v":0},{"$f":"IF(K8=TRUE,IF(G8>0,G$22-G8,0),0)","v":0},true,0,0]
{"$rows_left_out":381}
{"sheet":"LEVEL RUN","index":8,"n_rows":21,"n_cols":13,"rows_kept":21,"cut":false,"hidden":false,"merged":[[13,9,13,12],[14,9,14,12],[15,9,15,12],[6,9,6,12],[7,9,7,12],[8,9,8,12],[9,9,9,12],[10,9,10,12],[0,0,0,10],[5,9,5,12],[1,4,1,5],[2,4,2,5],[1,6,1,7],[2,6,2,7],[3,6,3,7],[11,9,11,12],[12,9,12,12],[4,1,4,2],[22,9,22,12],[23,9,23,12],[24,9,24,12],[25,9,25,12],[16,9,16,12],[17,9,17,12],[18,9,18,12],[19,9,19,12],[20,9,20,12],[21,9,21,12],[31,9,31,12],[32,9,32,12],[33,9,33,12],[34,9,34,12],[35,9,35,12],[26,9,26,12],[27,9,27,12],[28,9,28,12],[29,9,29,12],[30,9,30,12],[41,9,41,12],[42,9,42,12],[43,9,43,12],[44,9,44,12],[45,9,45,12],[36,9,36,12],[37,9,37,12],[38,9,38,12],[39,9,39,12],[40,9,40,12],[51,9,51,12],[52,9,52,12],[53,9,53,12],[54,9,54,12],[55,9,55,12],[46,9,46,12],[47,9,47,12],[48,9,48,12],[49,9,49,12],[50,9,50,12],[61,9,61,12],[62,9,62,12],[63,9,63,12],[64,9,64,12],[65,9,65,12],[56,9,56,12],[57,9,57,12],[58,9,58,12],[59,9,59,12],[60,9,60,12],[71,9,71,12],[72,9,72,12],[73,9,73,12],[74,9,74,12],[75,9,75,12],[66,9,66,12],[67,9,67,12],[68,9,68,12],[69,9,69,12],[70,9,70,12],[81,9,81,12],[82,9,82,12],[83,9,83,12],[84,9,84,12],[85,9,85,12],[76,9,76,12],[77,9,77,12],[78,9,78,12],[79,9,79,12],[80,9,80,12],[91,9,91,12],[92,9,92,12],[93,9,93,12],[94,9,94,12],[95,9,95,12],[86,9,86,12],[87,9,87,12],[88,9,88,12],[89,9,89,12],[90,9,90,12],[101,9,101,12],[102,9,102,12],[103,9,103,12],[104,9,104,12],[105,9,105,12],[96,9,96,12],[97,9,97,12],[98,9,98,12],[99,9,99,12],[100,9,100,12],[111,9,111,12],[112,9,112,12],[113,9,113,12],[114,9,114,12],[115,9,115,12],[106,9,106,12],[107,9,107,12],[108,9,108,12],[109,9,109,12],[110,9,110,12],[121,9,121,12],[122,9,122,12],[123,9,123,12],[124,9,124,12],[125,9,125,12],[116,9,116,12],[117,9,117,12],[118,9,118,12],[119,9,119,12],[120,9,120,12],[131,9,131,12],[132,9,132,12],[133,9,133,12],[134,9,134,12],[135,9,135,12],[126,9,126,12],[127,9,127,12],[128,9,128,12],[129,9,129,12],[130,9,130,12],[141,9,141,12],[142,9,142,12],[143,9,143,12],[144,9,144,12],[145,9,145,12],[136,9,136,12],[137,9,137,12],[138,9,138,12],[139,9,139,12],[140,9,140,12],[151,9,151,12],[152,9,152,12],[153,9,153,12],[154,9,154,12],[155,9,155,12],[146,9,146,12],[147,9,147,12],[148,9,148,12],[149,9,149,12],[150,9,150,12],[161,9,161,12],[162,9,162,12],[163,9,163,12],[164,9,164,12],[165,9,165,12],[156,9,156,12],[157,9,157,12],[158,9,158,12],[159,9,159,12],[160,9,160,12],[171,9,171,12],[172,9,172,12],[173,9,173,12],[174,9,174,12],[175,9,175,12],[166,9,166,12],[167,9,167,12],[168,9,168,12],[169,9,169,12],[170,9,170,12],[196,9,196,12],[197,9,197,12],[198,9,198,12],[191,9,191,12],[192,9,192,12],[193,9,193,12],[194,9,194,12],[195,9,195,12],[186,9,186,12],[187,9,187,12],[188,9,188,12],[189,9,189,12],[190,9,190,12],[181,9,181,12],[182,9,182,12],[183,9,183,12],[184,9,184,12],[185,9,185,12],[176,9,176,12],[177,9,177,12],[178,9,178,12],[179,9,179,12],[180,9,180,12]]}
[{"$f":"REPORT!B2","v":0},null,null,null,null,null,null,null,null,null,null,"PID:",{"$f":"REPORT!E2","v":0}]
["Adjustment factor only works for closed level loops.",null,null,null,"Instrument Used:",null,"Length in Miles:",null,0,"Instrument:",null,"Date:"]
["SUM BS:",{"$f":"SUM(B7:B200)","v":0},"SUM FS:",{"$f":"SUM(E8:E200)","v":0},"Topcon DL-503",null,"Misclosure:",null,{"$f":"B3-D3","v":0},"Notes:",null,"Weather:"]
["Misclosure must not exceed 0.04 ft x √E where E=Length of loop (miles)",null,null,null,null,null,"Adj Factor:",null,{"$f":"(I3/(COUNTA(B7:B200)))*-1","v":{"$error":"#DIV/0!"}},"Rod:",null,"Temperature:"]
["Unit:","U.S. Survey FT",null,{"$f":"INDEX(ShortUnits,MATCH(B5,Units,0),1)","v":"sft"},{"$f":"GPS_IMPORT!K4&\"->\"&D5","v":"sft->sft"},{"$f":"INDEX(FactorValues,MATCH(E5,FactorNames,0))","v":1},{"$f":"D5&\"->\"&GPS_IMPORT!K6","v":"sft->sft"},{"$f":"INDEX(FactorValues,MATCH(G5,FactorNames,0))","v":1}]
["POINT","BS","HI","FS","SUMFS","ELEV","REC ELEV","ADJ","ADJ ELEV","DESCRIPTION"]
[null,null,{"$f":"F7+B7","v":{"$error":"#VALUE!"}},null,{"$f":"IF(D7>0,IF(B7>0,D7,0),\" \")","v":" "},"Input start elevation",null,null,{"$f":"F7","v":"Input start elevation"}]
[null,null,{"$f":"IF(D8<>\"\",IF(OR(B8<>\"\",INDIRECT(\"D9\")=0),IF(B7<>\"\",F7+B7,VLOOKUP(INDEX($B$7:B7,MATCH(9.99999999999999E+307,$B$7:B7)),$B$7:F7,5,FALSE)+INDEX($B$7:B7,MATCH(9.99999999999999E+307,$B$7:B7))),(VLOOKUP(INDEX($B$7:B7,MATCH(9.99999999999999E+307,$B$7:B7)),$B$7:F7,5,FALSE))+(INDEX($B$7:B7,MATCH(9.99999999999999E+307,$B$7:B7)))),\"\")","v":""},null,{"$f":"IF(D8<>\"\",IF(OR(B8<>\"\",INDIRECT(\"D9\")=0),D8,0),\"\")","v":""},{"$f":"IF(D8<>\"\",C8-D8,\"\")","v":""},null,{"$f":"IF(D8<>\"\",IF(AND(B8<>\"\",B7<>\"\"),$I$4+H7,VLOOKUP(INDEX($B$7:B7,MATCH(9.99999999999999E+307,$B$7:B7)),$B$7:H7,7,FALSE)+$I$4),\"\")","v":""},{"$f":"IF(D8<>\"\",(F8+H8),\"\")","v":""}]
{"$rows_left_out":14}
{"sheet":"TIN","index":9,"n_rows":106,"n_cols":7,"rows_kept":106,"cut":false,"hidden":false,"merged":[[0,0,0,6],[1,0,1,6],[2,0,2,6],[104,0,105,3]]}
["Vertical TIN Accuracy Test"]
["Example Survey Check Shot Data Compared to TIN for Accuracy Class A"]
["(Units in U.S. Survey Feet)"]
["Point ID","Northing","Easting","Check Z","TIN Z","Dz","Dz^2"]
[null,null,null,null,null,{"$f":"E5-D5","v":0},{"$f":"F5^2","v":0}]
[null,null,null,null,null,{"$f":"E6-D6","v":0},{"$f":"F6^2","v":0}]
[null,null,null,null,null,0,0]
[null,null,null,null,null,{"$f":"E8-D8","v":0},{"$f":"F8^2","v":0}]
{"$rows_left_out":99}
{"sheet":"DATABASE","index":10,"n_rows":1,"n_cols":18,"rows_kept":1,"cut":false,"hidden":false,"merged":[]}
["Name","Point ID","Northing","Easting","Elevation","Feature","Condition","Latitude","Longitude","Ellips Ht","Datum_Adj","Geoid","Method","Date","County","Route","District","PID"]

{"sheet":"FINAL GRID COORDINATES PNEZC","index":11,"n_rows":8,"n_cols":5,"rows_kept":8,"cut":false,"hidden":false,"merged":[]}
["Point ID","Northing","Easting","Elevation","Code"]
["CP7"]
["CP6"]
["CP5"]
["CP3"]
["CP2"]
["CP1"]
[null,{"$f":"INDIRECT($A8&\"!D38\")","v":{"$error":"#REF!"}},{"$f":"INDIRECT($A8&\"!E38\")","v":{"$error":"#REF!"}},{"$f":"INDIRECT($A8&\"!F38\")","v":{"$error":"#REF!"}},{"$f":"INDIRECT($A8&\"!G38\")","v":{"$error":"#REF!"}}]
{"$rows_left_out":1}
{"sheet":"FINAL GROUND COORDINATES PNEZC","index":12,"n_rows":8,"n_cols":5,"rows_kept":8,"cut":false,"hidden":false,"merged":[]}
["Point ID","Northing","Easting","Elevation","Code"]
["CP7"]
["CP6"]
["CP5"]
["CP3"]
["CP2"]
["CP1"]
[null,{"$f":"INDIRECT($A8&\"!D39\")","v":{"$error":"#REF!"}},{"$f":"INDIRECT($A8&\"!E39\")","v":{"$error":"#REF!"}},{"$f":"INDIRECT($A8&\"!F39\")","v":{"$error":"#REF!"}},{"$f":"INDIRECT($A8&\"!G39\")","v":{"$error":"#REF!"}}]
{"$rows_left_out":1}
{"sheet":"Lists","index":13,"n_rows":10,"n_cols":10,"rows_kept":10,"cut":false,"hidden":true,"merged":[]}
["Units","Short Unit","Display Units","Factor Names","Factor Values","Point Types","N=0, E=0 (N 39⁰ 27' 01.76097\", W 89⁰ 28' 32.98476\")","Unit","Tolerance N,E","Tolerance Height"]
["U.S. Survey FT","sft",{"$f":"A2&\" (\"&B2&\")\"","v":"U.S. Survey FT (sft)"},"ft->sft",0.99999800000399997,"Project Control Points","N=0, E=0 (N 37⁰ 47' 45.30621\", W 89⁰ 19' 00.02517\")","sft",2.9000000000000001E-2,3.9E-2]
["International FT","ft",{"$f":"A3&\" (\"&B3&\")\"","v":"International FT (ft)"},"sft->ft",1.0000020000000001,"Existing Centerline Control Point",null,"sft",{"$f":"I2*VLOOKUP($H$2&\"->\"&H3,D2:E10,2,FALSE)","v":2.9000000000000001E-2},{"$f":"J2*VLOOKUP($H$2&\"->\"&H3,D2:E10,2,FALSE)","v":3.9E-2}]
["Meters","m","Meters (m)","m->ft",{"$f":"1/0.3048","v":3.280839895013123},"Centerline Alignment",null,"ft",{"$f":"I3*VLOOKUP($H$2&\"->\"&H4,D3:E11,2,FALSE)","v":2.9000058000000002E-2},{"$f":"J3*VLOOKUP($H$2&\"->\"&H4,D3:E11,2,FALSE)","v":3.9000078000000001E-2}]
[null,null,null,"ft->m",0.30480000000000002,"Proposed R/W Monuments",null,"m",{"$f":"I4*VLOOKUP($H$2&\"->\"&H5,D4:E12,2,FALSE)","v":8.8392353568707144E-3},{"$f":"J4*VLOOKUP($H$2&\"->\"&H5,D4:E12,2,FALSE)","v":1.1887247548895098E-2}]
[null,null,null,"m->sft",{"$f":"3937/1200","v":3.2808333333333333},"Existing R/W Points"]
[null,null,null,"sft->m",{"$f":"1200/3937","v":0.30480060960121919},"Existing Boundary Monuments"]
[null,null,null,"ft->ft",1]
{"$rows_left_out":2}