{"text_format":"1","workbook":"xlsx","n_sheets":14,"sheets":["REPORT","CSF","GRID<->GRND","OWNERS","OSIP","MON TABLE","GPS_IMPORT","PointTemplate","LEVEL RUN","TIN","DATABASE","FINAL GRID COORDINATES PNEZC","FINAL GROUND COORDINATES PNEZC","Lists"],"not_rendered":{"charts":1,"images":1,"macros":1,"external_links":0,"defined_names":14,"comments":0,"pivot_tables":0},"unopened":[],"bounds":{"document_bytes":16777216,"sheet_cells":100000,"rows_first":2000,"rows_last":500,"rows_between":2000,"halvings":0,"cell_chars":16384,"cell_head_chars":4096},"cells_cut":0,"cells_raw":0,"read":"whole","date_system":"1900"}

{"sheet":"REPORT","index":0,"n_rows":56,"n_cols":7,"rows_kept":56,"cut":false,"hidden":false,"merged":[[25,0,25,3],[20,1,20,3],[23,0,23,3],[17,2,17,4],[19,2,19,4],[21,0,21,3],[24,0,24,3],[22,0,22,3],[18,2,18,4],[26,2,26,3],[30,0,30,4],[47,2,47,4],[31,0,31,1],[32,0,32,4],[46,0,46,4],[37,0,37,4],[35,0,35,4],[27,0,27,1],[27,2,27,3],[28,2,28,3],[28,0,28,1],[47,0,47,1],[38,0,38,4],[43,1,43,2],[42,0,42,4],[0,0,0,4],[3,1,3,4],[7,0,7,4],[8,0,8,4],[9,0,9,1],[9,2,9,4],[5,0,5,4],[6,0,6,2],[1,1,1,2],[4,1,4,4],[54,0,54,4],[53,2,53,4],[52,2,52,4],[51,2,51,4],[50,2,50,4],[51,0,51,1],[50,0,50,1],[53,0,53,1],[29,8,29,9],[27,8,27,9],[29,0,29,1],[29,2,29,3],[48,2,48,4],[36,0,36,4],[31,2,31,4],[48,0,48,1],[39,0,39,4],[49,2,49,4],[41,0,41,4],[40,0,40,4],[44,0,44,4],[45,0,45,1],[45,3,45,4],[55,0,55,4],[52,0,52,1],[10,0,10,1],[10,2,10,4],[11,0,11,1],[11,2,11,4],[12,0,12,1],[13,0,13,1],[13,2,13,4],[14,0,14,1],[14,2,14,4],[15,0,15,1],[15,2,15,4],[16,0,16,1],[16,2,16,4],[49,0,49,1]]}
["Surveyor’s Report"]
["Project: ",null,null,"PID:"]
[]
["Scope: "]
["Type:"]
[]
["Gray boxes denote INPUT",null,null,null,"Tan boxes denote OUTPUT (check)"]
[]
["Datum and Coordinate System",null,null,null,null,null,"Type:"]
["Coordinate System: ",null,"Ohio State Plane, South Zone",null,null,null,"(Select from List)"]
["Horizontal Reference Datum: ",null,"NAD83 (2011)",null,null,null,"Bridge Monitoring"]
["Ellipsoid: ",null,"GRS80",null,null,null,"Bridge Rehab"]
["Grid to Ground Multiplier (1/CSF):",null,1,"Factor is 8 decimal places per Survey & Mapping Specifications.",null,null,"Bridge Replacement"]
["Origin of Combined Scale Factor: ",null,"(0,0)",null,null,null,"Culvert Rehab"]
["Vertical Reference Datum: ",null,"NAVD88",null,null,null,"Highway Widening"]
["Geoid Model: ",null,"Geoid 12B",null,null,null,"Slope Repair"]
["Units: ",null,"US Survey Feet (sft)",null,null,null,"Stream Maintenance"]
["Original Survey Subdivision:"]
["Township:"]
["Quarter Section/Section/Lot:"]
["Files",null,null,null,"Description"]
[]
[]
[]
[]
[]
[]
[]
[]
[]
["References"]
["Alignment based on the following plan:"]
["Other references used:"]
[]
[]
["Equipment Maintenance"]
["Equipment maintenance logs are on file at the Ohio Department of Transportation, Central Office"]
["Methodology and Equipment Used"]
[]
["GPS Antenna Used"]
[]
[]
[]
[]
[]
[]
[]
["Report Submitted/Prepared by: "]
["Date Submitted:"]
["Surveying Performed by: "]
["Surveying Performed by: "]
["Checked By:"]
[]
[]
["DGN Overview Map"]
["Insert close-up screen shot of combined DGN here"]

{"sheet":"CSF","index":1,"n_rows":311,"n_cols":17,"rows_kept":311,"cut":false,"hidden":false,"merged":[[3,0,3,1],[3,2,3,6],[0,0,0,6],[0,10,0,11],[1,1,1,2],[1,4,1,6],[2,0,2,6],[4,0,4,5],[5,0,5,2],[5,3,5,6],[6,0,6,5],[7,0,7,1],[7,5,7,6],[8,0,8,1],[8,5,8,6],[10,0,10,1],[10,2,10,4],[10,5,10,6],[17,0,17,1],[11,0,11,1],[11,2,11,4],[11,5,11,6],[12,0,12,6],[13,0,13,1],[14,0,14,1],[14,2,14,6],[15,0,15,6],[16,0,16,1],[25,0,25,1],[25,2,25,6],[18,0,18,1],[19,0,19,1],[19,2,19,6],[20,0,20,6],[21,0,21,1],[22,0,22,1],[22,2,22,6],[23,0,23,6],[24,0,24,1],[24,2,24,6],[26,0,26,6],[27,0,27,1],[27,2,27,6],[28,0,28,1],[28,2,28,6],[31,0,31,6],[32,0,32,1],[33,0,33,1],[33,2,33,6],[29,0,29,6],[30,0,30,6],[41,3,41,4],[34,0,34,6],[35,0,35,1],[35,3,35,4],[35,5,35,6],[36,3,36,4],[37,3,37,4],[37,5,37,6],[38,3,38,4],[39,0,39,6],[40,0,40,1],[40,3,40,4],[40,5,40,6],[47,0,47,6],[48,0,49,4],[48,5,48,6],[42,3,42,4],[42,5,42,6],[43,3,43,4],[44,0,44,6],[45,0,46,4],[45,5,45,6]]}
["Combined Scale Factor Calculations",null,null,null,null,null,null,null,"Zone","Index Value","Project Latitude",null,"Radius of the Earth (meters)","Tabular Difference","Scale Factor (k)","Differences","Coordinate System List"]
["Project: ",{"$f":"REPORT!B2","v":0},null,"PID:",{"$f":"REPORT!E2","v":0},null,null,null,"NZ",3940,39,40,7485451.5980000002,30.84836,1.0002349100000001]
[null,null,null,null,null,null,null,null,"NZ",3941,39,41,7483600.6969999997,30.848230000000001,1.0002279300000001,{"$f":"O2-O3","v":6.9799999999897722E-6},"State Plane Coordinate System: Ohio North (3401)"]
["Horizontal Datum: NAD83",null,"State Plane Coordinate System: Ohio North (3401)",null,null,null,null,null,"NZ",3942,39,42,7481749.8030000003,30.848109999999998,1.00022104,6.8900000000926553E-6,"State Plane Coordinate System: Ohio South (3402)"]
[null,null,null,null,null,null,null,null,"NZ",3943,39,43,7479898.9160000002,30.847989999999999,1.00021424,6.7999999999734939E-6]
["Gray boxes denote INPUT",null,null,"Tan boxes denote OUTPUT (check)",null,null,null,null,"NZ",3944,39,44,7478048.0369999995,30.84787,1.0002075100000001,6.7299999999548277E-6]
[null,null,null,null,null,null,null,null,"NZ",3945,39,45,7476197.165,30.847760000000001,1.00020087,6.6400000000577108E-6]
[null,null,"Input Deg.","Min.","Sec.","Zone Parameters:",null,null,"NZ",3946,39,46,7474346.2989999996,30.847650000000002,1.0001943099999999,6.5600000000998193E-6]
["Project Mean Latitude (DMS):",null,null,null,null,{"$f":"IF(C4=\"State Plane Coordinate System: Ohio North (3401)\",\n\"k = 1 at lats. 40⁰ 26' and 41⁰ 42'\",\n\"k = 1 at lats. 38⁰ 44' and 40⁰ 20'\")","v":"k = 1 at lats. 40⁰ 26' and 41⁰ 42'"},null,null,"NZ",3947,39,47,7472495.4400000004,30.847539999999999,1.00018783,6.4799999999198832E-6]
[{"$f":"ISBLANK(D9)","v":true},{"$f":"ISBLANK(E9)","v":true},null,{"$f":"IF(OR(A10,B10)=TRUE,\"Minute and second fields must be populated\",\"\")","v":"Minute and second fields must be populated"},null,null,null,null,"NZ",3948,39,48,7470644.5880000005,30.847429999999999,1.00018144,6.3900000000227664E-6]
[null,null,"Input Ellipsoid Height:",null,null,{"$f":"IF(C4=\"State Plane Coordinate System: Ohio North (3401)\",\n\"Origin at 82⁰ 30' long., 39⁰ 40' lat.\",\n\"Origin at 82⁰ 30' long., 38⁰ 00' lat.\")","v":"Origin at 82⁰ 30' long., 39⁰ 40' lat."},null,null,"NZ",3949,39,49,7468793.7419999996,30.84732,1.0001751299999999,6.3100000000648748E-6]
["Project Mean Height (ft):",null,null,null,null,"Origin coords: x=600,000m, y=0m",null,null,"NZ",3950,39,50,7466942.9029999999,30.84722,1.0001689,6.2299999998849387E-6]
[null,null,null,null,null,null,null,null,"NZ",3951,39,51,7465092.0690000001,30.84712,1.00016276,6.1399999999878219E-6]
[null,null,"Radius of the Earth * (Radius of the Earth + Proj. Mean Elev.) =",null,null,null,null,null,"NZ",3952,39,52,7463241.2419999996,30.84703,1.0001567,6.0600000000299303E-6]
["Sea Level Factor:",null,{"$f":"TRUNC(20906000/(20906000+C12),9)","v":1},null,null,null,null,null,"NZ",3953,39,53,7461390.4199999999,30.84693,1.0001507199999999,5.9800000000720388E-6]
[null,null,null,null,null,null,null,null,"NZ",3954,39,54,7459539.6040000003,30.84684,1.00014482,5.8999999998921027E-6]
[null,null,"Tabular data proportioned according to the number of seconds:",null,null,null,null,null,"NZ",3955,39,55,7457688.7939999998,30.84675,1.0001390100000001,5.8099999999949858E-6]
[null,null,{"$f":"IF($C$4=\"State Plane Coordinate System: Ohio North (3401)\",VLOOKUP(D18,J1:O150,6),VLOOKUP(D18,J151:O310,6))","v":{"$error":"#N/A"}},{"$f":"VALUE(IF(D9>9,CONCATENATE(C9,D9),CONCATENATE(C9*10,D9)))","v":0},{"$f":"IF(C18>C19,1-E9/60,E9/60)","v":{"$error":"#N/A"}},{"$f":"\"Scale factor at \"&LEFT($D18,2)&\"⁰ \"&RIGHT($D18,2)&\"' latitude\"","v":"Scale factor at 0⁰ 0' latitude"},null,null,"NZ",3956,39,56,7455837.9890000001,30.84667,1.00013328,5.7300000000370943E-6]
[null,null,{"$f":"IF($C$4=\"State Plane Coordinate System: Ohio North (3401)\",VLOOKUP(D19,J2:O151,6),VLOOKUP(D19,J152:O311,6))","v":{"$error":"#N/A"}},{"$f":"IF(D9=59,(VALUE(IF(D9>9,CONCATENATE(C9,D9),CONCATENATE(C9*10,D9)))+41),(VALUE(IF(D9>9,CONCATENATE(C9,D9),CONCATENATE(C9*10,D9)))+1))","v":1},{"$f":"IF(C18<C19,1-E9/60,E9/60)","v":{"$error":"#N/A"}},{"$f":"\"Scale factor at \"&LEFT($D19,2)&\"⁰ \"&RIGHT($D19,2)&\"' latitude\"","v":"Scale factor at 1⁰ 1' latitude"},null,null,"NZ",3957,39,57,7453987.1890000002,30.846579999999999,1.0001276299999999,5.6500000000792028E-6]
["Scale Factor (k):",null,{"$f":"C18*E18+C19*E19","v":{"$error":"#N/A"}},null,null,null,null,null,"NZ",3958,39,58,7452136.3940000003,30.846499999999999,1.00012206,5.5699999998992666E-6]
[null,null,null,null,null,null,null,null,"NZ",3959,39,59,7450285.6040000003,30.846419999999998,1.00011658,5.4800000000021498E-6]
[null,null,{"$f":"LEFT(A15,16)&\" * \"&LEFT(A20,12)&\" =\"","v":"Sea Level Factor * Scale Factor ="},null,null,null,null,null,"NZ",4000,40,0,7448434.8190000001,30.846340000000001,1.00011118,5.4000000000442583E-6]
["Combined Scale Factor (CSF):",null,{"$f":"C15*C20","v":{"$error":"#N/A"}},null,null,null,null,null,"NZ",4001,40,1,7446584.0379999997,30.846270000000001,1.0001058700000001,5.3099999999250969E-6]
[null,null,null,null,null,null,null,null,"NZ",4002,40,2,7444733.2620000001,30.8462,1.0001006299999999,5.2400000001284752E-6]
[null,null,"Unitless Grid to Ground Multiplier:",null,null,null,null,null,"NZ",4003,40,3,7442882.4900000002,30.846129999999999,1.0000954799999999,5.1500000000093138E-6]
["Grid to Ground Multiplier (1/CSF):",null,{"$f":"1/C23","v":{"$error":"#N/A"}},null,null,null,null,null,"NZ",4004,40,4,7441031.7220000001,30.846070000000001,1.00009042,5.0599999998901524E-6]
[null,null,null,null,null,null,null,null,"NZ",4005,40,5,7439180.9579999996,30.846,1.0000854299999999,4.9900000000935307E-6]
[null,null,"Converts Grid Meters to Ground Feet:",null,null,null,null,null,"NZ",4006,40,6,7437330.1979999999,30.845939999999999,1.00008053,4.8999999999743693E-6]
["Project Adjustment Factor (PAF):",null,{"$f":"C26*3.28083333","v":{"$error":"#N/A"}},null,null,null,null,null,"NZ",4007,40,7,7435479.4409999996,30.845880000000001,1.00007571,4.8200000000164778E-6]
[null,null,null,null,null,null,null,null,"NZ",4011,40,11,7428076.449,30.845680000000002,1.00005728,{"$f":"O34-O30","v":4.4799999998623719E-6}]
["Check spreadsheet-generated (XLS) CSF against Trimble Business Center-generated (TBC) CSF below.",null,null,null,null,null,null,null,"NZ",4012,40,12,7426225.7079999996,30.84563,1.00005287,{"$f":"O30-O31","v":4.4100000000657502E-6}]
[null,null,null,null,null,null,null,null,"NZ",4008,40,8,7433628.6880000001,30.845829999999999,1.0000709800000001,{"$f":"O29-O32","v":4.7299999998973163E-6}]
[null,null,"Compare to Unitless Grid to Ground Multiplier:",null,null,null,null,null,"NZ",4009,40,9,7431777.9390000002,30.845770000000002,1.0000663299999999,{"$f":"O32-O33","v":4.6500000001614694E-6}]
["Input TBC-generated 1/CSF:",null,null,null,null,null,null,null,"NZ",4010,40,10,7429927.1919999998,30.84572,1.0000617599999999,{"$f":"O33-O34","v":4.5699999999815333E-6}]
[null,null,null,null,null,null,null,null,"NZ",4013,40,13,7424374.9699999997,30.845590000000001,1.00004856,{"$f":"O31-O35","v":4.3100000000073635E-6}]
["Test point at one end of project:",null,"Northing (ft)","Easting (ft)",null,"Grid - Ground (XLS)",null,null,"NZ",4014,40,14,7422524.2350000003,30.845549999999999,1.00004432,{"$f":"O35-O36","v":4.2399999999886973E-6}]
[null,"Input Grid Coordinates:",null,null,null,{"$f":"IF(C37-C38>0,ABS(ROUND(C37-C38,3))&\"' shift N\",ABS(ROUND(C37-C38,3))&\"' shift S\")","v":{"$error":"#N/A"}},{"$f":"IF(D37-D38>0,ABS(ROUND(D37-D38,3))&\"' shift E\",ABS(ROUND(D37-D38,3))&\"' shift W\")","v":{"$error":"#N/A"}},null,"NZ",4015,40,15,7420673.5020000003,30.845510000000001,1.0000401699999999,4.1500000000915804E-6]
[{"$f":"$A37","v":0},"Ground (XLS):",{"$f":"$C37*$C$26","v":{"$error":"#N/A"}},{"$f":"$D37*$C$26","v":{"$error":"#N/A"}},null,"Ground (XLS) - Ground (TBC)",null,null,"NZ",4016,40,16,7418822.7719999999,30.845469999999999,1.0000361,4.0699999999116443E-6]
[{"$f":"$A37","v":0},"Ground (TBC):",{"$f":"$C37*$C$34","v":0},{"$f":"$D37*$C$34","v":0},null,{"$f":"IF(C38-C39>0,ABS(ROUND(C38-C39,3))&\"' shift N\",ABS(ROUND(C38-C39,3))&\"' shift S\")","v":{"$error":"#N/A"}},{"$f":"IF(D38-D39>0,ABS(ROUND(D38-D39,3))&\"' shift E\",ABS(ROUND(D38-D39,3))&\"' shift W\")","v":{"$error":"#N/A"}},null,"NZ",4017,40,17,7416972.0429999996,30.84544,1.00003212,3.9800000000145275E-6]
[null,null,null,null,null,null,null,null,"NZ",4018,40,18,7415121.3169999998,30.845410000000001,1.00002821,3.9099999999958612E-6]
["Test point at other end of project:",null,"Northing (ft)","Easting (ft)",null,"Grid - Ground (XLS)",null,null,"NZ",4019,40,19,7413270.5920000002,30.845379999999999,1.0000244,3.8099999999374745E-6]
[null,"Input Grid Coordinates:",null,null,null,{"$f":"IF(C42-C43>0,ABS(ROUND(C42-C43,3))&\"' shift N\",ABS(ROUND(C42-C43,3))&\"' shift S\")","v":{"$error":"#N/A"}},{"$f":"IF(D42-D43>0,ABS(ROUND(D42-D43,3))&\"' shift E\",ABS(ROUND(D42-D43,3))&\"' shift W\")","v":{"$error":"#N/A"}},null,"NZ",4020,40,20,7411419.8689999999,30.845359999999999,1.0000206599999999,3.7400000001408529E-6]
[{"$f":"$A42","v":0},"Ground (XLS):",{"$f":"$C42*$C$26","v":{"$error":"#N/A"}},{"$f":"$D42*$C$26","v":{"$error":"#N/A"}},null,"Ground XLS - Ground TBC",null,null,"NZ",4021,40,21,7409569.1469999999,30.84534,1.0000170100000001,3.6499999997996468E-6]
[{"$f":"$A42","v":0},"Ground (TBC):",{"$f":"$C42*$C$34","v":0},{"$f":"$D42*$C$34","v":0},null,{"$f":"IF(C43-C44>0,ABS(ROUND(C43-C44,3))&\"' shift N\",ABS(ROUND(C43-C44,3))&\"' shift S\")","v":{"$error":"#N/A"}},{"$f":"IF(D43-D44>0,ABS(ROUND(D43-D44,3))&\"' shift E\",ABS(ROUND(D43-D44,3))&\"' shift W\")","v":{"$error":"#N/A"}},null,"NZ",4022,40,22,7407718.4270000001,30.845320000000001,1.00001344,3.5700000000637999E-6]
[null,null,null,null,null,null,null,null,"NZ",4023,40,23,7405867.7079999996,30.845300000000002,1.0000099499999999,3.4900000001059084E-6]
[{"$f":"\"Change in computed horizontal distance between \"&A$37&\" and \"&A$42&\" due to CSF used (an approximate \"&ROUND(SQRT((C38-C43)^2+(D38-D43)^2),0)&\" foot distance):\"","v":{"$error":"#N/A"}},null,null,null,null,"Ground (XLS) vs. Ground (TBC)",null,null,"NZ",4024,40,24,7404016.9900000002,30.845289999999999,1.0000065499999999,3.399999999986747E-6]
[null,null,null,null,null,{"$f":"IF(ABS(C38-C43)>ABS(C39-C44),ABS(ROUND((C38-C39)-(C43-C44),3))&\"' further N-S\",ABS(ROUND((C38-C39)-(C43-C44),3))&\"' nearer N-S\")","v":{"$error":"#N/A"}},{"$f":"IF(ABS(D38-D43)>ABS(D39-D44),ABS(ROUND((D38-D39)-(D43-D44),3))&\"' further E-W\",ABS(ROUND((D38-D39)-(D43-D44),3))&\"' nearer E-W\")","v":{"$error":"#N/A"}},null,"NZ",4025,40,25,7402166.273,30.845269999999999,1.0000032299999999,3.3200000000288554E-6]
[null,null,null,null,null,null,null,null,"NZ",4027,40,27,7398464.8399999999,30.84526,0.99999685000000005,6.3799999998614965E-6]
[{"$f":"\"Change in computed horizontal distance between \"&A$37&\" and \"&A$42&\" by adjusting from grid to ground (approx. \"&ROUND(SQRT((C38-C43)^2+(D38-D43)^2),0)&\" ft dist.):\"","v":{"$error":"#N/A"}},null,null,null,null,"Grid vs. Ground (XLS)",null,null,"NZ",4028,40,28,7396614.125,30.84525,0.99999378000000005,3.0699999999939109E-6]
[null,null,null,null,null,{"$f":"IF(ABS(C38-C43)>ABS(C37-C42),ABS(ROUND((C37-C38)-(C42-C43),3))&\"' further N-S\",ABS(ROUND((C37-C38)-(C42-C43),3))&\"' nearer N-S\")","v":{"$error":"#N/A"}},{"$f":"IF(ABS(D38-D43)>ABS(D37-D42),ABS(ROUND((D37-D38)-(D42-D43),3))&\"' further E-W\",ABS(ROUND((D37-D38)-(D42-D43),3))&\"' nearer E-W\")","v":{"$error":"#N/A"}},null,"NZ",4029,40,29,7394763.409,30.84525,0.99999079999999996,2.9800000000967941E-6]
[null,null,null,null,null,null,null,null,"NZ",4030,40,30,7392912.6940000001,30.84525,0.99998790000000004,2.899999999916858E-6]
[null,null,null,null,null,null,null,null,"NZ",4031,40,31,7391061.9790000003,30.84526,0.99998507999999997,2.8200000000699887E-6]
[null,null,null,null,null,null,null,null,"NZ",4032,40,32,7389211.2630000003,30.84526,0.99998235000000002,2.7299999999508273E-6]
[null,null,null,null,null,null,null,null,"NZ",4033,40,33,7387360.5480000004,30.845269999999999,0.99997970000000003,2.6499999999929358E-6]
[null,null,null,null,null,null,null,null,"NZ",4034,40,34,7385509.8310000002,30.845279999999999,0.99997712999999999,2.5700000000350443E-6]
[null,null,null,null,null,null,null,null,"NZ",4035,40,35,7383659.1140000001,30.845300000000002,0.99997464999999996,2.4800000000269051E-6]
[null,null,null,null,null,null,null,null,"NZ",4036,40,36,7381808.3959999997,30.845320000000001,0.99997225000000001,2.3999999999579913E-6]
[null,null,null,null,null,null,null,null,"NZ",4037,40,37,7379957.6770000001,30.845330000000001,0.99996993000000001,2.3200000000000998E-6]
[null,null,null,null,null,null,null,null,"NZ",4038,40,38,7378106.9570000004,30.845359999999999,0.99996770000000001,2.2299999999919606E-6]
[null,null,null,null,null,null,null,null,"NZ",4039,40,39,7376256.2359999996,30.845379999999999,0.99996556000000003,2.1399999999838215E-6]
[null,null,null,null,null,null,null,null,"NZ",4040,40,40,7374405.5130000003,30.845410000000001,0.99996348999999995,2.0700000000761776E-6]
[null,null,null,null,null,null,null,null,"NZ",4041,40,41,7372554.7889999999,30.84544,0.99996151,1.9799999999570161E-6]
[null,null,null,null,null,null,null,null,"NZ",4042,40,42,7370704.0619999999,30.845469999999999,0.99995961,1.8999999999991246E-6]
[null,null,null,null,null,null,null,null,"NZ",4043,40,43,7368853.3339999998,30.845500000000001,0.99995780000000001,1.8099999999909855E-6]
[null,null,null,null,null,null,null,null,"NZ",4044,40,44,7367002.6040000003,30.84554,0.99995606999999997,1.730000000033094E-6]
[null,null,null,null,null,null,null,null,"NZ",4045,40,45,7365151.8720000004,30.845580000000002,0.99995442999999995,1.6400000000249548E-6]
[null,null,null,null,null,null,null,null,"NZ",4046,40,46,7363301.1370000001,30.84562,0.99995286999999999,1.559999999956041E-6]
[null,null,null,null,null,null,null,null,"NZ",4047,40,47,7361450.3990000002,30.845669999999998,0.99995139,{"$f":"O67-O68","v":1.4799999999981495E-6}]
[null,null,null,null,null,null,null,null,"NZ",4048,40,48,7359599.659,30.84572,0.99995000000000001,1.3899999999900103E-6]
[null,null,null,null,null,null,null,null,"NZ",4049,40,49,7357748.9160000002,30.845770000000002,0.99994868999999997,1.3100000000321188E-6]
[null,null,null,null,null,null,null,null,"NZ",4050,40,50,7355898.1699999999,30.84582,0.99994746000000001,1.229999999963205E-6]
[null,null,null,null,null,null,null,null,"NZ",4051,40,51,7354047.4210000001,30.845880000000001,0.99994632000000006,1.1399999999550658E-6]
[null,null,null,null,null,null,null,null,"NZ",4052,40,52,7352196.6689999998,30.845929999999999,0.99994527,1.050000000057949E-6]
[null,null,null,null,null,null,null,null,"NZ",4053,40,53,7350345.9129999997,30.84599,0.99994428999999996,9.8000000003928278E-7]
[null,null,null,null,null,null,null,null,"NZ",4054,40,54,7348495.1529999999,30.846060000000001,0.99994340000000004,8.8999999992012135E-7]
[null,null,null,null,null,null,null,null,"NZ",4055,40,55,7346644.3899999997,30.846119999999999,0.99994260000000001,8.0000000002300453E-7]
[null,null,null,null,null,null,null,null,"NZ",4056,40,56,7344793.6220000004,30.84619,0.99994187999999995,7.20000000065113E-7]
[null,null,null,null,null,null,null,null,"NZ",4057,40,57,7342942.8509999998,30.846260000000001,0.99994123999999995,6.3999999999619916E-7]
[null,null,null,null,null,null,null,null,"NZ",4058,40,58,7341092.0750000002,30.846340000000001,0.99994068999999997,5.4999999998806004E-7]
[null,null,null,null,null,null,null,null,"NZ",4059,40,59,7339241.2949999999,30.846409999999999,0.99994022000000005,4.6999999991914621E-7]
[null,null,null,null,null,null,null,null,"NZ",4100,41,0,7337390.5099999998,30.846489999999999,0.99993984000000002,3.8000000002202938E-7]
[null,null,null,null,null,null,null,null,"NZ",4101,41,1,7335539.7199999997,30.84657,0.99993953999999996,3.0000000006413785E-7]
[null,null,null,null,null,null,null,null,"NZ",4102,41,2,7333688.926,30.84666,0.99993931999999996,2.1999999999522402E-7]
[null,null,null,null,null,null,null,null,"NZ",4103,41,3,7331838.1270000003,30.84674,0.99993918999999998,1.2999999998708489E-7]
[null,null,null,null,null,null,null,null,"NZ",4104,41,4,7329987.3219999997,30.846830000000001,0.99993913999999995,5.0000000029193359E-8]
[null,null,null,null,null,null,null,null,"NZ",4105,41,5,7328136.5120000001,30.84693,0.99993918000000004,-4.0000000089968069E-8]
[null,null,null,null,null,null,null,null,"NZ",4106,41,6,7326285.6960000005,30.847020000000001,0.99993929999999998,-1.199999999368373E-7]
[null,null,null,null,null,null,null,null,"NZ",4107,41,7,7324434.875,30.84712,0.99993949999999998,-2.0000000000575113E-7]
[null,null,null,null,null,null,null,null,"NZ",4108,41,8,7322584.0480000004,30.84722,0.99993979,-2.9000000001389026E-7]
[null,null,null,null,null,null,null,null,"NZ",4109,41,9,7320733.2149999999,30.84732,0.99994017000000002,-3.8000000002202938E-7]
[null,null,null,null,null,null,null,null,"NZ",4110,41,10,7318882.3760000002,30.84742,0.99994063,-4.5999999997992091E-7]
[null,null,null,null,null,null,null,null,"NZ",4111,41,11,7317031.5310000004,30.847529999999999,0.99994117000000005,-5.4000000004883475E-7]
[null,null,null,null,null,null,null,null,"NZ",4112,41,12,7315180.6789999995,30.847639999999998,0.99994179999999999,-6.2999999994595157E-7]
[null,null,null,null,null,null,null,null,"NZ",4113,41,13,7313329.8200000003,30.847760000000001,0.99994251000000001,-7.1000000001486541E-7]
[null,null,null,null,null,null,null,null,"NZ",4114,41,14,7311478.9550000001,30.84787,0.99994331000000003,-8.0000000002300453E-7]
[null,null,null,null,null,null,null,null,"NZ",4115,41,15,7309628.0829999996,30.847989999999999,0.99994419000000001,-8.7999999998089606E-7]
[null,null,null,null,null,null,null,null,"NZ",4116,41,16,7307777.2029999997,30.848109999999998,0.99994514999999995,-9.599999999387876E-7]
[null,null,null,null,null,null,null,null,"NZ",4117,41,17,7305926.3169999998,30.848230000000001,0.99994620000000001,-1.050000000057949E-6]
[null,null,null,null,null,null,null,null,"NZ",4118,41,18,7304075.4230000004,30.84836,0.99994733999999996,-1.1399999999550658E-6]
[null,null,null,null,null,null,null,null,"NZ",4119,41,19,7302224.5209999997,30.848490000000002,0.99994855999999999,{"$f":"O99-O100","v":-1.2200000000239797E-6}]
[null,null,null,null,null,null,null,null,"NZ",4120,41,20,7300373.6119999997,30.84862,0.99994985999999997,-1.2999999999818712E-6]
[null,null,null,null,null,null,null,null,"NZ",4121,41,21,7298522.6950000003,30.848749999999999,0.99995124999999996,-1.3899999999900103E-6]
[null,null,null,null,null,null,null,null,"NZ",4122,41,22,7296671.7699999996,30.848890000000001,0.99995272000000002,-1.4700000000589242E-6]
[null,null,null,null,null,null,null,null,"NZ",4123,41,23,7294820.8370000003,30.849029999999999,0.99995427999999997,-1.559999999956041E-6]
[null,null,null,null,null,null,null,null,"NZ",4124,41,24,7292969.8949999996,30.849170000000001,0.99995592,-1.6400000000249548E-6]
[null,null,null,null,null,null,null,null,"NZ",4125,41,25,7291118.9450000003,30.849309999999999,0.99995765000000003,-1.730000000033094E-6]
[null,null,null,null,null,null,null,null,"NZ",4126,41,26,7289267.9859999996,30.849460000000001,0.99995946000000002,-1.8099999999909855E-6]
[null,null,null,null,null,null,null,null,"NZ",4127,41,27,7287417.0180000002,30.849609999999998,0.99996136000000002,-1.8999999999991246E-6]
[null,null,null,null,null,null,null,null,"NZ",4128,41,28,7285566.0420000004,30.84976,0.99996333999999998,-1.9799999999570161E-6]
[null,null,null,null,null,null,null,null,"NZ",4129,41,29,7283715.0559999999,30.849920000000001,0.99996541000000005,-2.0700000000761776E-6]
[null,null,null,null,null,null,null,null,"NZ",4130,41,30,7281864.0609999998,30.850069999999999,0.99996755999999998,-2.1499999999230468E-6]
[null,null,null,null,null,null,null,null,"NZ",4131,41,31,7280013.057,30.85023,0.99996978999999997,-2.2299999999919606E-6]
[null,null,null,null,null,null,null,null,"NZ",4132,41,32,7278162.0429999996,30.8504,0.99997212000000002,-2.3300000000503474E-6]
[null,null,null,null,null,null,null,null,"NZ",4133,41,33,7276311.0190000003,30.850560000000002,0.99997451999999998,-2.3999999999579913E-6]
[null,null,null,null,null,null,null,null,"NZ",4134,41,34,7274459.9850000003,30.850729999999999,0.99997701000000006,-2.4900000000771527E-6]
[null,null,null,null,null,null,null,null,"NZ",4135,41,35,7272608.9409999996,30.850899999999999,0.99997959000000003,-2.5799999999742695E-6]
[null,null,null,null,null,null,null,null,"NZ",4136,41,36,7270757.8870000001,30.85107,0.99998224999999996,-2.6599999999321611E-6]
[null,null,null,null,null,null,null,null,"NZ",4137,41,37,7268906.8229999999,30.85125,0.99998498999999996,-2.7400000000010749E-6]
[null,null,null,null,null,null,null,null,"NZ",4138,41,38,7267055.7479999997,30.851430000000001,0.99998783000000002,-2.8400000000594616E-6]
[null,null,null,null,null,null,null,null,"NZ",4139,41,39,7265204.6619999995,30.851610000000001,0.99999073999999999,-2.9099999999671056E-6]
[null,null,null,null,null,null,null,null,"NZ",4140,41,40,7263353.5659999996,30.851790000000001,0.99999373999999996,-2.9999999999752447E-6]
[null,null,null,null,null,null,null,null,"NZ",4141,41,41,7261502.4579999996,30.851980000000001,0.99999682999999995,-3.0899999999833838E-6]
[null,null,null,null,null,null,null,null,"NZ",4142,41,42,7259651.3389999997,30.852170000000001,1,-3.1700000000522977E-6]
[null,null,null,null,null,null,null,null,"NZ",4143,41,43,7257800.2089999998,30.852360000000001,1.0000032599999999,-3.2599999999494145E-6]
[null,null,null,null,null,null,null,null,"NZ",4144,41,44,7255949.068,30.852550000000001,1.0000066000000001,-3.3400000001293506E-6]
[null,null,null,null,null,null,null,null,"NZ",4145,41,45,7254097.915,30.85275,1.0000100199999999,-3.4199999998651975E-6]
[null,null,null,null,null,null,null,null,"NZ",4146,41,46,7252246.75,30.85295,1.0000135400000001,-3.5200000001456289E-6]
[null,null,null,null,null,null,null,null,"NZ",4147,41,47,7250395.5729999999,30.853149999999999,1.00001713,-3.5899999999422505E-6]
[null,null,null,null,null,null,null,null,"NZ",4148,41,48,7248544.3839999996,30.853359999999999,1.00002082,-3.6900000000006372E-6]
[null,null,null,null,null,null,null,null,"NZ",4149,41,49,7246693.182,30.853560000000002,1.0000245800000001,-3.7600000000193035E-6]
[null,null,null,null,null,null,null,null,"NZ",4150,41,50,7244841.9680000003,30.853770000000001,1.0000284399999999,-3.8599999998556456E-6]
[null,null,null,null,null,null,null,null,"NZ",4151,41,51,7242990.7419999996,30.85399,1.0000323799999999,{"$f":"O131-O132","v":-3.9400000000355817E-6}]
[null,null,null,null,null,null,null,null,"NZ",4152,41,52,7241139.5029999996,30.854199999999999,1.0000363999999999,-4.0199999999934732E-6]
[null,null,null,null,null,null,null,null,"NZ",4153,41,53,7239288.2510000002,30.854420000000001,1.00004051,-4.1100000001126347E-6]
[null,null,null,null,null,null,null,null,"NZ",4154,41,54,7237436.9850000003,30.85464,1.0000446999999999,-4.1899999998484816E-6]
[null,null,null,null,null,null,null,null,"NZ",4155,41,55,7235585.7070000004,30.854859999999999,1.0000489800000001,-4.2800000001896876E-6]
[null,null,null,null,null,null,null,null,"NZ",4156,41,56,7233734.415,30.855090000000001,1.00005335,-4.3699999998647598E-6]
[null,null,null,null,null,null,null,null,"NZ",4157,41,57,7231883.1100000003,30.855319999999999,1.0000578,-4.450000000044696E-6]
[null,null,null,null,null,null,null,null,"NZ",4158,41,58,7230031.7910000002,30.855550000000001,1.0000623399999999,-4.5399999999418128E-6]
[null,null,null,null,null,null,null,null,"NZ",4159,41,59,7228180.4579999996,30.855779999999999,1.0000669600000001,-4.6200000001217489E-6]
[null,null,null,null,null,null,null,null,"NZ",4200,42,0,7226329.1109999996,30.856020000000001,1.0000716700000001,-4.7100000000188658E-6]
[null,null,null,null,null,null,null,null,"NZ",4201,42,1,7224477.7489999998,30.856259999999999,1.0000764600000001,-4.7899999999767573E-6]
[null,null,null,null,null,null,null,null,"NZ",4202,42,2,7222626.3739999998,30.8565,1.0000813399999999,-4.8799999998738741E-6]
[null,null,null,null,null,null,null,null,"NZ",4203,42,3,7220774.9840000002,30.856750000000002,1.0000863,-4.9600000000538103E-6]
[null,null,null,null,null,null,null,null,"NZ",4204,42,4,7218923.5789999999,30.85699,1.0000913499999999,-5.0499999999509271E-6]
[null,null,null,null,null,null,null,null,"NZ",4205,42,5,7217072.1600000001,30.857240000000001,1.00009649,-5.1400000000700885E-6]
[null,null,null,null,null,null,null,null,"NZ",4206,42,6,7215220.7249999996,30.857489999999999,1.00010171,-5.22000000002798E-6]
[null,null,null,null,null,null,null,null,"NZ",4207,42,7,7213369.2750000004,30.857749999999999,1.00010702,-5.3099999999250969E-6]
[null,null,null,null,null,null,null,null,"NZ",4208,42,8,7211517.8109999998,30.85801,1.0001124100000001,-5.390000000105033E-6]
[null,null,null,null,null,null,null,null,"NZ",4209,42,9,7209666.3300000001,30.858270000000001,1.0001178900000001,-5.4800000000021498E-6]
[null,null,null,null,null,null,null,null,"NZ",4210,42,10,7207814.8339999998,30.858529999999998,1.00012345,-5.5599999999600414E-6]
[null,null,null,null,null,null,null,null,"SZ",3800,38,0,7932869.0369999995,30.839220000000001,1.00022476]
[null,null,null,null,null,null,null,null,"SZ",3801,38,1,7931018.6840000004,30.839099999999998,1.00021786,{"$f":"O152-O153","v":6.9000000000318806E-6}]
[null,null,null,null,null,null,null,null,"SZ",3802,38,2,7929168.3380000005,30.838979999999999,1.0002110500000001,6.8099999999127192E-6]
[null,null,null,null,null,null,null,null,"SZ",3803,38,3,7927318,30.83886,1.0002043300000001,6.7200000000156024E-6]
[null,null,null,null,null,null,null,null,"SZ",3804,38,4,7925467.6679999996,30.838740000000001,1.0001976800000001,6.6499999999969361E-6]
[null,null,null,null,null,null,null,null,"SZ",3805,38,5,7923617.3430000003,30.838629999999998,1.00019112,6.5600000000998193E-6]
[null,null,null,null,null,null,null,null,"SZ",3806,38,6,7921767.0259999996,30.838519999999999,1.0001846400000001,6.4799999999198832E-6]
[null,null,null,null,null,null,null,null,"SZ",3807,38,7,7919916.7149999999,30.83841,1.00017825,6.3900000000227664E-6]
[null,null,null,null,null,null,null,null,"SZ",3808,38,8,7918066.4100000001,30.8383,1.00017193,6.3200000000041001E-6]
[null,null,null,null,null,null,null,null,"SZ",3809,38,9,7916216.1119999997,30.838200000000001,1.0001656999999999,6.2300000001069833E-6]
[null,null,null,null,null,null,null,null,"SZ",3810,38,10,7914365.8200000003,30.838100000000001,1.0001595599999999,6.1399999999878219E-6]
[null,null,null,null,null,null,null,null,"SZ",3811,38,11,7912515.534,30.838100000000001,1.00015349,6.0699999999691556E-6]
[null,null,null,null,null,null,null,null,"SZ",3812,38,12,7910665.2529999996,30.837910000000001,1.0001475099999999,5.9800000000720388E-6]
[null,null,null,null,null,null,null,null,"SZ",3813,38,13,7908814.9790000003,30.837820000000001,1.00014161,5.8999999998921027E-6]
[null,null,null,null,null,null,null,null,"SZ",3814,38,14,7906964.71,30.837720000000001,1.0001358,5.8099999999949858E-6]
[null,null,null,null,null,null,null,null,"SZ",3815,38,15,7905114.4460000005,30.83764,1.00013007,5.7300000000370943E-6]
[null,null,null,null,null,null,null,null,"SZ",3816,38,16,7903264.1880000001,30.83755,1.0001244199999999,5.6500000000792028E-6]
[null,null,null,null,null,null,null,null,"SZ",3817,38,17,7901413.9349999996,30.83747,1.00011885,5.5699999998992666E-6]
[null,null,null,null,null,null,null,null,"SZ",3818,38,18,7899563.6869999999,30.837389999999999,1.00011337,5.4800000000021498E-6]
[null,null,null,null,null,null,null,null,"SZ",3819,38,19,7897713.4440000001,30.837309999999999,1.00010797,5.4000000000442583E-6]
[null,null,null,null,null,null,null,null,"SZ",3820,38,20,7895863.2050000001,30.837240000000001,1.0001026500000001,5.3199999998643221E-6]
[null,null,null,null,null,null,null,null,"SZ",3821,38,21,7894012.9709999999,30.83717,1.00009741,5.2400000001284752E-6]
[null,null,null,null,null,null,null,null,"SZ",3822,38,22,7892162.7410000004,30.8371,1.00009226,5.1500000000093138E-6]
[null,null,null,null,null,null,null,null,"SZ",3823,38,23,7890312.5149999997,30.837029999999999,1.0000872000000001,5.0599999998901524E-6]
[null,null,null,null,null,null,null,null,"SZ",3824,38,24,7888462.2929999996,30.836960000000001,1.00008221,4.9900000000935307E-6]
[null,null,null,null,null,null,null,null,"SZ",3825,38,25,7886612.0750000002,30.8369,1.00007731,4.8999999999743693E-6]
[null,null,null,null,null,null,null,null,"SZ",3826,38,26,7884761.8609999996,30.836839999999999,1.00007249,4.8200000000164778E-6]
[null,null,null,null,null,null,null,null,"SZ",3827,38,27,7882911.6509999996,30.836790000000001,1.0000677600000001,4.7299999998973163E-6]
[null,null,null,null,null,null,null,null,"SZ",3828,38,28,7881061.4440000001,30.836729999999999,1.0000631,4.6600000001006947E-6]
[null,null,null,null,null,null,null,null,"SZ",3829,38,29,7879211.2400000002,30.836680000000001,1.00005853,4.5699999999815333E-6]
[null,null,null,null,null,null,null,null,"SZ",3830,38,30,7877361.0389999999,30.83663,1.0000540499999999,4.4800000000844165E-6]
[null,null,null,null,null,null,null,null,"SZ",3831,38,31,7875510.841,30.836580000000001,1.00004965,4.3999999999044803E-6]
[null,null,null,null,null,null,null,null,"SZ",3832,38,32,7873660.6459999997,30.836539999999999,1.0000453300000001,4.3199999999465888E-6]
[null,null,null,null,null,null,null,null,"SZ",3833,38,33,7871810.4529999997,30.836500000000001,1.0000410900000001,{"$f":"O184-O185","v":4.2399999999886973E-6}]
[null,null,null,null,null,null,null,null,"SZ",3834,38,34,7869960.2630000003,30.836459999999999,1.00003694,4.1500000000915804E-6]
[null,null,null,null,null,null,null,null,"SZ",3835,38,35,7868110.0760000004,30.83642,1.0000328700000001,4.0699999999116443E-6]
[null,null,null,null,null,null,null,null,"SZ",3836,38,36,7866259.8899999997,30.836390000000002,1.0000288799999999,3.9900000001757974E-6]
[null,null,null,null,null,null,null,null,"SZ",3837,38,37,7864409.7070000004,30.836359999999999,1.0000249800000001,3.8999999998345913E-6]
[null,null,null,null,null,null,null,null,"SZ",3838,38,38,7862559.5250000004,30.83633,1.00002116,3.8200000000987444E-6]
[null,null,null,null,null,null,null,null,"SZ",3839,38,39,7860709.3449999997,30.836310000000001,1.00001743,3.729999999979583E-6]
[null,null,null,null,null,null,null,null,"SZ",3840,38,40,7858859.1670000004,30.836279999999999,1.00001377,3.6599999999609167E-6]
[null,null,null,null,null,null,null,null,"SZ",3841,38,41,7857008.9900000002,30.836259999999999,1.0000102099999999,3.5600000001245746E-6]
[null,null,null,null,null,null,null,null,"SZ",3842,38,42,7855158.8140000002,30.83624,1.00000672,3.4899999998838638E-6]
[null,null,null,null,null,null,null,null,"SZ",3843,38,43,7853308.6399999997,30.83623,1.00000332,3.399999999986747E-6]
[null,null,null,null,null,null,null,null,"SZ",3844,38,44,7851458.466,30.836220000000001,1,3.3200000000288554E-6]
[null,null,null,null,null,null,null,null,"SZ",3845,38,45,7849608.2929999996,30.836210000000001,0.99999676999999998,3.2300000000207163E-6]
[null,null,null,null,null,null,null,null,"SZ",3846,38,46,7847758.1210000003,30.836200000000002,0.99999360999999998,3.1600000000020501E-6]
[null,null,null,null,null,null,null,null,"SZ",3847,38,47,7845907.949,30.836189999999998,0.99999055000000003,3.0599999999436633E-6]
[null,null,null,null,null,null,null,null,"SZ",3848,38,48,7844057.7769999998,30.836189999999998,0.99998756,2.9900000000360194E-6]
[null,null,null,null,null,null,null,null,"SZ",3849,38,49,7842207.6059999997,30.836189999999998,0.99998465999999997,2.9000000000278803E-6]
[null,null,null,null,null,null,null,null,"SZ",3850,38,50,7840357.4340000004,30.836189999999998,0.99998184000000001,2.8199999999589664E-6]
[null,null,null,null,null,null,null,null,"SZ",3851,38,51,7838507.2630000003,30.836200000000002,0.99997910999999995,2.7300000000618496E-6]
[null,null,null,null,null,null,null,null,"SZ",3852,38,52,7836657.091,30.836210000000001,0.99997645999999996,2.6499999999929358E-6]
[null,null,null,null,null,null,null,null,"SZ",3853,38,53,7834806.9189999998,30.836220000000001,0.99997389000000003,2.5699999999240219E-6]
[null,null,null,null,null,null,null,null,"SZ",3854,38,54,7832956.7460000003,30.83623,0.99997141,2.4800000000269051E-6]
[null,null,null,null,null,null,null,null,"SZ",3855,38,55,7831106.5719999997,30.83624,0.99996901000000005,2.3999999999579913E-6]
[null,null,null,null,null,null,null,null,"SZ",3856,38,56,7829256.3969999999,30.836259999999999,0.99996669999999999,2.3100000000608745E-6]
[null,null,null,null,null,null,null,null,"SZ",3857,38,57,7827406.2220000001,30.836279999999999,0.99996446999999999,2.2299999999919606E-6]
[null,null,null,null,null,null,null,null,"SZ",3858,38,58,7825556.0449999999,30.836310000000001,0.99996231999999996,2.1500000000340691E-6]
[null,null,null,null,null,null,null,null,"SZ",3859,38,59,7823705.8660000004,30.83633,0.99996026000000005,2.0599999999149077E-6]
[null,null,null,null,null,null,null,null,"SZ",3900,39,0,7821855.6859999998,30.836359999999999,0.99995827999999998,1.9800000000680384E-6]
[null,null,null,null,null,null,null,null,"SZ",3901,39,1,7820005.5039999997,30.836390000000002,0.99995637999999998,1.8999999999991246E-6]
[null,null,null,null,null,null,null,null,"SZ",3902,39,2,7818155.3210000005,30.83643,0.99995456999999999,1.8099999999909855E-6]
[null,null,null,null,null,null,null,null,"SZ",3903,39,3,7816305.1349999998,30.836459999999999,0.99995283999999995,1.730000000033094E-6]
[null,null,null,null,null,null,null,null,"SZ",3904,39,4,7814454.9469999997,30.836500000000001,0.99995118999999999,1.6499999999641801E-6]
[null,null,null,null,null,null,null,null,"SZ",3905,39,5,7812604.7570000002,30.836539999999999,0.99994963000000003,{"$f":"O216-O217","v":1.559999999956041E-6}]
[null,null,null,null,null,null,null,null,"SZ",3906,39,6,7810754.5650000004,30.836590000000001,0.99994815999999997,1.4700000000589242E-6]
[null,null,null,null,null,null,null,null,"SZ",3907,39,7,7808904.3689999999,30.83663,0.99994676000000005,1.3999999999292356E-6]
[null,null,null,null,null,null,null,null,"SZ",3908,39,8,7807054.1710000001,30.836680000000001,0.99994545000000001,1.3100000000321188E-6]
[null,null,null,null,null,null,null,null,"SZ",3909,39,9,7805203.9699999997,30.836739999999999,0.99994422999999999,1.2200000000239797E-6]
[null,null,null,null,null,null,null,null,"SZ",3910,39,10,7803353.7659999998,30.836790000000001,0.99994309000000003,1.1399999999550658E-6]
[null,null,null,null,null,null,null,null,"SZ",3911,39,11,7801503.5590000004,30.836849999999998,0.99994203000000004,1.0599999999971743E-6]
[null,null,null,null,null,null,null,null,"SZ",3912,39,12,7799653.3480000002,30.83691,0.99994106000000005,9.6999999998903519E-7]
[null,null,null,null,null,null,null,null,"SZ",3913,39,13,7797803.1339999996,30.836970000000001,0.99994017000000002,8.9000000003114366E-7]
[null,null,null,null,null,null,null,null,"SZ",3914,39,14,7795952.915,30.837029999999999,0.99993936000000005,8.0999999996222982E-7]
[null,null,null,null,null,null,null,null,"SZ",3915,39,15,7794102.693,30.8371,0.99993863999999999,7.20000000065113E-7]
[null,null,null,null,null,null,null,null,"SZ",3916,39,16,7792252.4670000002,30.83717,0.99993801000000004,6.2999999994595157E-7]
[null,null,null,null,null,null,null,null,"SZ",3917,39,17,7790402.2369999997,30.837250000000001,0.99993745999999994,5.5000000009908234E-7]
[null,null,null,null,null,null,null,null,"SZ",3918,39,18,7788552.0020000003,30.837319999999998,0.99993699000000003,4.6999999991914621E-7]
[null,null,null,null,null,null,null,null,"SZ",3919,39,19,7786701.7630000003,30.837399999999999,0.99993659999999995,3.9000000007227698E-7]
[null,null,null,null,null,null,null,null,"SZ",3920,39,20,7784851.5190000003,30.837479999999999,0.9999363,2.9999999995311555E-7]
[null,null,null,null,null,null,null,null,"SZ",3921,39,21,7783001.2699999996,30.83756,0.99993609000000006,2.0999999994497642E-7]
[null,null,null,null,null,null,null,null,"SZ",3922,39,22,7781151.017,30.83765,0.99993595999999996,1.3000000009810719E-7]
[null,null,null,null,null,null,null,null,"SZ",3923,39,23,7779300.7580000004,30.83774,0.99993591000000004,4.9999999918171056E-8]
[null,null,null,null,null,null,null,null,"SZ",3924,39,24,7777450.4929999998,30.83783,0.99993593999999997,-2.9999999928698173E-8]
[null,null,null,null,null,null,null,null,"SZ",3925,39,25,7775600.2240000004,30.83792,0.99993606999999995,-1.2999999998708489E-7]
[null,null,null,null,null,null,null,null,"SZ",3926,39,26,7773749.949,30.83802,0.99993626999999996,-2.0000000000575113E-7]
[null,null,null,null,null,null,null,null,"SZ",3927,39,27,7771899.6670000004,30.83812,0.99993655999999997,-2.9000000001389026E-7]
[null,null,null,null,null,null,null,null,"SZ",3928,39,28,7770049.3799999999,30.83822,0.99993694,-3.8000000002202938E-7]
[null,null,null,null,null,null,null,null,"SZ",3929,39,29,7768199.0870000003,30.83832,0.99993739000000004,-4.5000000004069562E-7]
[null,null,null,null,null,null,null,null,"SZ",3930,39,30,7766348.7879999997,30.838429999999999,0.99993794000000003,-5.4999999998806004E-7]
[null,null,null,null,null,null,null,null,"SZ",3931,39,31,7764498.4819999998,30.838539999999998,0.99993856000000003,-6.2000000000672628E-7]
[null,null,null,null,null,null,null,null,"SZ",3932,39,32,7762648.1699999999,30.838650000000001,0.99993927999999999,-7.199999999540907E-7]
[null,null,null,null,null,null,null,null,"SZ",3933,39,33,7760797.8509999998,30.838760000000001,0.99994006999999996,-7.8999999997275694E-7]
[null,null,null,null,null,null,null,null,"SZ",3934,39,34,7758947.5250000004,30.83888,0.99994095000000005,-8.8000000009191837E-7]
[null,null,null,null,null,null,null,null,"SZ",3935,39,35,7757097.1919999998,30.838999999999999,0.99994192000000004,-9.6999999998903519E-7]
[null,null,null,null,null,null,null,null,"SZ",3936,39,36,7755246.852,30.839120000000001,0.99994296999999999,-1.0499999999469267E-6]
[null,null,null,null,null,null,null,null,"SZ",3937,39,37,7753396.5049999999,30.83925,0.9999441,{"$f":"O248-O249","v":-1.1300000000158406E-6}]
[null,null,null,null,null,null,null,null,"SZ",3938,39,38,7751546.1500000004,30.839379999999998,0.99994532000000003,-1.2200000000239797E-6]
[null,null,null,null,null,null,null,null,"SZ",3939,39,39,7749695.7869999995,30.839510000000001,0.99994662999999995,-1.3099999999210965E-6]
[null,null,null,null,null,null,null,null,"SZ",3940,39,40,7747845.4170000004,30.839639999999999,0.99994801,-1.380000000050785E-6]
[null,null,null,null,null,null,null,null,"SZ",3941,39,41,7745995.0389999999,30.839780000000001,0.99994949,-1.4799999999981495E-6]
[null,null,null,null,null,null,null,null,"SZ",3942,39,42,7744144.6519999998,30.83991,0.99995104000000001,-1.5500000000168157E-6]
[null,null,null,null,null,null,null,null,"SZ",3943,39,43,7742294.2570000002,30.840050000000002,0.99995268999999998,-1.6499999999641801E-6]
[null,null,null,null,null,null,null,null,"SZ",3944,39,44,7740443.8540000003,30.840199999999999,0.99995440999999996,-1.7199999999828464E-6]
[null,null,null,null,null,null,null,null,"SZ",3945,39,45,7738593.4419999998,30.840340000000001,0.99995621999999995,-1.8099999999909855E-6]
[null,null,null,null,null,null,null,null,"SZ",3946,39,46,7736743.0219999999,30.840489999999999,0.99995811999999995,-1.8999999999991246E-6]
[null,null,null,null,null,null,null,null,"SZ",3947,39,47,7734892.5920000002,30.84064,0.99996010000000002,-1.9800000000680384E-6]
[null,null,null,null,null,null,null,null,"SZ",3948,39,48,7733042.1529999999,30.840800000000002,0.99996216999999998,-2.0699999999651553E-6]
[null,null,null,null,null,null,null,null,"SZ",3949,39,49,7731191.7060000002,30.840949999999999,0.99996432000000002,-2.1500000000340691E-6]
[null,null,null,null,null,null,null,null,"SZ",3950,39,50,7729341.2479999997,30.84111,0.99996655000000001,-2.2299999999919606E-6]
[null,null,null,null,null,null,null,null,"SZ",3951,39,51,7727490.7819999997,30.841270000000002,0.99996887000000001,-2.3200000000000998E-6]
[null,null,null,null,null,null,null,null,"SZ",3952,39,52,7725640.3049999997,30.841439999999999,0.99997128000000002,-2.4100000000082389E-6]
[null,null,null,null,null,null,null,null,"SZ",3953,39,53,7723789.8190000001,30.841609999999999,0.99997376999999998,-2.4899999999661304E-6]
[null,null,null,null,null,null,null,null,"SZ",3954,39,54,7721939.3229999999,30.84178,0.99997634000000002,-2.5700000000350443E-6]
[null,null,null,null,null,null,null,null,"SZ",3955,39,55,7720088.8159999996,30.841950000000001,0.99997899999999995,-2.6599999999321611E-6]
[null,null,null,null,null,null,null,null,"SZ",3956,39,56,7718238.2989999996,30.842120000000001,0.99998175,-2.7500000000513225E-6]
[null,null,null,null,null,null,null,null,"SZ",3957,39,57,7716387.7719999999,30.842300000000002,0.99998458000000001,-2.830000000009214E-6]
[null,null,null,null,null,null,null,null,"SZ",3958,39,58,7714537.2340000002,30.842479999999998,0.99998748999999998,-2.9099999999671056E-6]
[null,null,null,null,null,null,null,null,"SZ",3959,39,59,7712686.6849999996,30.842659999999999,0.99999048999999995,-2.9999999999752447E-6]
[null,null,null,null,null,null,null,null,"SZ",4000,40,0,7710836.125,30.842849999999999,0.99999358000000005,-3.0900000000944061E-6]
[null,null,null,null,null,null,null,null,"SZ",4001,40,1,7708985.5539999995,30.843039999999998,0.99999674999999999,-3.1699999999412753E-6]
[null,null,null,null,null,null,null,null,"SZ",4002,40,2,7707134.9720000001,30.843229999999998,1,-3.2500000000101892E-6]
[null,null,null,null,null,null,null,null,"SZ",4003,40,3,7705284.3779999996,30.843419999999998,1.0000033399999999,-3.339999999907306E-6]
[null,null,null,null,null,null,null,null,"SZ",4004,40,4,7703433.773,30.843620000000001,1.0000067699999999,-3.4300000000264674E-6]
[null,null,null,null,null,null,null,null,"SZ",4005,40,5,7701583.1560000004,30.843820000000001,1.0000102799999999,-3.509999999984359E-6]
[null,null,null,null,null,null,null,null,"SZ",4006,40,6,7699732.5269999998,30.84402,1.0000138700000001,-3.5900000001642951E-6]
[null,null,null,null,null,null,null,null,"SZ",4007,40,7,7697881.8859999999,30.84422,1.0000175499999999,-3.6799999998393673E-6]
[null,null,null,null,null,null,null,null,"SZ",4008,40,8,7696031.233,30.844429999999999,1.0000213200000001,-3.7700000001805734E-6]
[null,null,null,null,null,null,null,null,"SZ",4009,40,9,7694180.5669999998,30.844639999999998,1.00002517,{"$f":"O280-O281","v":-3.8499999999164203E-6}]
[null,null,null,null,null,null,null,null,"SZ",4010,40,10,7692329.8890000004,30.844850000000001,1.0000290999999999,-3.9299999998743118E-6]
[null,null,null,null,null,null,null,null,"SZ",4011,40,11,7690479.1979999999,30.84506,1.00003313,-4.0300000001547431E-6]
[null,null,null,null,null,null,null,null,"SZ",4012,40,12,7688628.4950000001,30.845279999999999,1.00003723,-4.0999999999513648E-6]
[null,null,null,null,null,null,null,null,"SZ",4013,40,13,7686777.7779999999,30.845500000000001,1.00004143,-4.2000000000097515E-6]
[null,null,null,null,null,null,null,null,"SZ",4014,40,14,7684927.0480000004,30.84572,1.0000457,-4.2700000000284177E-6]
[null,null,null,null,null,null,null,null,"SZ",4015,40,15,7683076.3049999997,30.845949999999998,1.0000500699999999,-4.3699999998647598E-6]
[null,null,null,null,null,null,null,null,"SZ",4016,40,16,7681225.5480000004,30.846170000000001,1.00005451,-4.4400000001054707E-6]
[null,null,null,null,null,null,null,null,"SZ",4017,40,17,7679374.7779999999,30.846399999999999,1.0000590499999999,-4.5399999999418128E-6]
[null,null,null,null,null,null,null,null,"SZ",4018,40,18,7677523.9929999998,30.846640000000001,1.0000636700000001,-4.6200000001217489E-6]
[null,null,null,null,null,null,null,null,"SZ",4019,40,19,7675673.1950000003,30.846869999999999,1.0000683699999999,-4.6999999998575959E-6]
[null,null,null,null,null,null,null,null,"SZ",4020,40,20,7673822.3830000004,30.847110000000001,1.0000731599999999,-4.7899999999767573E-6]
[null,null,null,null,null,null,null,null,"SZ",4021,40,21,7671971.5559999999,30.847349999999999,1.00007804,-4.8800000000959187E-6]
[null,null,null,null,null,null,null,null,"SZ",4022,40,22,7670120.7149999999,30.8476,1.000073,5.0400000000117018E-6]
[null,null,null,null,null,null,null,null,"SZ",4023,40,23,7668269.8590000002,30.847840000000001,1.00008805,-1.5050000000016439E-5]
[null,null,null,null,null,null,null,null,"SZ",4024,40,24,7666418.9890000001,30.848089999999999,1.0000931799999999,-5.1299999999088186E-6]
[null,null,null,null,null,null,null,null,"SZ",4025,40,25,7664568.1030000001,30.84834,1.0000983999999999,-5.22000000002798E-6]
[null,null,null,null,null,null,null,null,"SZ",4026,40,26,7662717.2029999997,30.848600000000001,1.0001036999999999,-5.2999999999858716E-6]
[null,null,null,null,null,null,null,null,"SZ",4027,40,27,7660866.2869999995,30.848849999999999,1.00010909,-5.390000000105033E-6]
[null,null,null,null,null,null,null,null,"SZ",4028,40,28,7659015.3559999997,30.84911,1.0001145600000001,-5.4700000000629245E-6]
[null,null,null,null,null,null,null,null,"SZ",4029,40,29,7657164.409,30.84937,1.00012013,-5.5699999998992666E-6]
[null,null,null,null,null,null,null,null,"SZ",4030,40,30,7655313.4469999997,30.849640000000001,1.0001257699999999,-5.6399999999179329E-6]
[null,null,null,null,null,null,null,null,"SZ",4031,40,31,7653462.4680000003,30.849910000000001,1.0001315,-5.7300000000370943E-6]
[null,null,null,null,null,null,null,null,"SZ",4032,40,32,7651611.4740000004,30.850180000000002,1.0001373200000001,-5.8200000001562557E-6]
[null,null,null,null,null,null,null,null,"SZ",4033,40,33,7649760.4630000005,30.850449999999999,1.0001432299999999,-5.909999999831328E-6]
[null,null,null,null,null,null,null,null,"SZ",4034,40,34,7647909.4359999998,30.850719999999999,1.0001492199999999,-5.9900000000112641E-6]
[null,null,null,null,null,null,null,null,"SZ",4035,40,35,7646058.3930000002,30.850999999999999,1.0001552899999999,-6.0699999999691556E-6]
[null,null,null,null,null,null,null,null,"SZ",4036,40,36,7644207.3329999996,30.851279999999999,1.0001644999999999,-9.2099999999817328E-6]
[null,null,null,null,null,null,null,null,"SZ",4037,40,37,7642356.2560000001,30.851569999999999,1.0001677,-3.2000000000920181E-6]
[null,null,null,null,null,null,null,null,"SZ",4038,40,38,7640505.1619999995,30.851849999999999,1.0001740299999999,-6.3299999999433254E-6]
[null,null,null,null,null,null,null,null,"SZ",4039,40,39,7638654.051,30.852139999999999,1.00018045,-6.4200000000624868E-6]

{"sheet":"GRID<->GRND","index":2,"n_rows":52,"n_cols":11,"rows_kept":52,"cut":false,"hidden":false,"merged":[[0,1,0,2],[1,1,1,2],[5,0,5,4],[5,6,5,10],[4,0,4,4],[4,6,4,10],[0,4,1,5],[2,4,2,5],[2,8,2,9],[1,8,1,9],[0,8,0,9]]}
["Project:",{"$f":"REPORT!B2","v":0},null,null,"Import Units (please select):",null,"Ground Coord?",true,{"$f":"IF(H1=TRUE,\"Unitless Ground to Grid Factor:\",\"Unitless Grid to Ground Factor:\")","v":"Unitless Ground to Grid Factor:"},null,{"$f":"IF(H1=TRUE,1/REPORT!C13,REPORT!C13)","v":1}]
["Pid:",{"$f":"REPORT!E2","v":0},null,null,null,null,"U.S. Survey FT",{"$f":"INDEX(ShortUnits,MATCH(G2,Units,0),1)","v":"sft"},{"$f":"\"Unit Conversion Factor (\"&H2&\"->\"&H3&\"):\"","v":"Unit Conversion Factor (sft->m):"},null,{"$f":"INDEX(FactorValues,MATCH(H2&\"->\"&H3,FactorNames,0))","v":0.30480060960121919}]
[null,null,null,null,"Output Units (please select):",null,"Meters",{"$f":"INDEX(ShortUnits,MATCH(G3,Units,0),1)","v":"m"},"Project Adjustment Factor:",null,{"$f":"K1*K2","v":0.30480060960121919}]
[]
["INPUT",null,null,null,null,null,"OUTPUT"]
[{"$f":"IF(H1=TRUE,\"Ground\",\"Grid\")&\" - \"&G2","v":"Ground - U.S. Survey FT"},null,null,null,null,null,{"$f":"IF(H1=TRUE,\"Grid\",\"Ground\")&\" - \"&G3","v":"Grid - Meters"}]
["NAME","NORTH","EAST","ORTHO HT","FEATURE",null,"NAME","NORTH","EAST","ORTHO HT","FEATURE"]
[null,null,null,null,null,null,{"$f":"A8","v":0},{"$f":"B8*$K$3","v":0},{"$f":"C8*$K$3","v":0},{"$f":"D8*$K$2","v":0},{"$f":"E8","v":0}]
[null,null,null,null,null,null,0,0,0,0,0]
[null,null,null,null,null,null,0,0,0,0,0]
[null,null,null,null,null,null,0,0,0,0,0]
[null,null,null,null,null,null,0,0,0,0,0]
[null,null,null,null,null,null,0,0,0,0,0]
[null,null,null,null,null,null,0,0,0,0,0]
[null,null,null,null,null,null,0,0,0,0,0]
[null,null,null,null,null,null,0,0,0,0,0]
[null,null,null,null,null,null,0,0,0,0,0]
[null,null,null,null,null,null,0,0,0,0,0]
[null,null,null,null,null,null,0,0,0,0,0]
[null,null,null,null,null,null,0,0,0,0,0]
[null,null,null,null,null,null,0,0,0,0,0]
[null,null,null,null,null,null,0,0,0,0,0]
[null,null,null,null,null,null,0,0,0,0,0]
[null,null,null,null,null,null,0,0,0,0,0]
[null,null,null,null,null,null,0,0,0,0,0]
[null,null,null,null,null,null,0,0,0,0,0]
[null,null,null,null,null,null,0,0,0,0,0]
[null,null,null,null,null,null,0,0,0,0,0]
[null,null,null,null,null,null,0,0,0,0,0]
[null,null,null,null,null,null,0,0,0,0,0]
[null,null,null,null,null,null,0,0,0,0,0]
[null,null,null,null,null,null,0,0,0,0,0]
[null,null,null,null,null,null,0,0,0,0,0]
[null,null,null,null,null,null,0,0,0,0,0]
[null,null,null,null,null,null,0,0,0,0,0]
[null,null,null,null,null,null,0,0,0,0,0]
[null,null,null,null,null,null,0,0,0,0,0]
[null,null,null,null,null,null,0,0,0,0,0]
[null,null,null,null,null,null,0,0,0,0,0]
[null,null,null,null,null,null,0,{"$f":"B40*$K$3","v":0},{"$f":"C40*$K$3","v":0},{"$f":"D40*$K$2","v":0},0]
[null,null,null,null,null,null,0,0,0,0,0]
[null,null,null,null,null,null,0,0,0,0,0]
[null,null,null,null,null,null,0,0,0,0,0]
[null,null,null,null,null,null,0,0,0,0,0]
[null,null,null,null,null,null,0,0,0,0,0]
[null,null,null,null,null,null,0,0,0,0,0]
[null,null,null,null,null,null,0,0,0,0,0]
[null,null,null,null,null,null,0,0,0,0,0]
[null,null,null,null,null,null,0,0,0,0,0]
[null,null,null,null,null,null,0,0,0,0,0]
[null,null,null,null,null,null,0,0,0,0,0]
[null,null,null,null,null,null,0,0,0,0,0]

{"sheet":"OWNERS","index":3,"n_rows":1,"n_cols":12,"rows_kept":1,"cut":false,"hidden":false,"merged":[]}
["First","Last","Address","City","State","Zip Code","Deed Book/Page","Auditor Parcel Number","Area","Section","Lot","Tax Map Parcel"]

{"sheet":"OSIP","index":4,"n_rows":96,"n_cols":18,"rows_kept":96,"cut":false,"hidden":false,"merged":[[0,2,0,4],[1,2,1,4],[6,14,6,15],[6,16,6,17],[23,0,23,8],[15,0,15,8],[7,0,7,8]]}
[null,"Project:",{"$f":"REPORT!B2","v":0}]
[null,"Pid:",{"$f":"REPORT!E2","v":0}]
[]
["Calculate the Project Coordinates for the corners of the Aerial Mapping Raster File"]
["To scale the Geo-referenced file to the Project Datum  ",null,null,null,null,null,null,null,null,null,null,null,null,"Project County:",null,{"$f":"REPORT!B2","v":0},{"$f":"MID(P5,1,3)","v":"0"}]
[]
[null,null,null,null,null,null,null,null,null,null,null,null,null,null,"Photo Corners",null,"Pixel Range"]
["INPUT: SP GRID - US SURVEY FEET",null,null,null,null,null,null,null,null,null,null,null,null,"COUNTY","EASTING","NORTHING","EASTING","NORTHING"]
[null,"X (East)","Y (North) ",null,null,null,null,null,null,null,null,null,null,"ADA",1620000,215000,130000,175000]
["Lower left (SW) origin:",{"$f":"VLOOKUP(MID(REPORT!B2,1,3),OSIP!N9:R96,2,FALSE)","v":{"$error":"#N/A"}},{"$f":"VLOOKUP(MID(REPORT!B2,1,3),OSIP!N9:R96,3,FALSE)","v":{"$error":"#N/A"}},"Enter X,Y from Georeferenced Raster File Header",null,null,null,null,null,null,null,null,null,"ALL",1440000,355000,150000,110000]
["Pixel Range:",{"$f":"VLOOKUP(MID(REPORT!B2,1,3),OSIP!N9:R96,4,FALSE)","v":{"$error":"#N/A"}},{"$f":"VLOOKUP(MID(REPORT!B2,1,3),OSIP!N9:R96,5,FALSE)","v":{"$error":"#N/A"}},"Enter X,Y from Georeferenced Raster File Header",null,null,null,null,null,null,null,null,null,"ASD",1985000,320000,90000,195000]
["Upper right (NE) origin:",{"$f":"B10+B11","v":{"$error":"#N/A"}},{"$f":"C10+C11","v":{"$error":"#N/A"}},"Calculated NE ORIGIN using Delta X & Delta Y",null,null,null,null,null,null,null,null,null,"ASH",2375000,670000,140000,185000]
[null,null,null,null,null,null,null,null,null,null,null,null,null,"ATH",2025000,430000,165000,140000]
["PAF (scale multiplier):",{"$f":"REPORT!C13","v":1},null,"Enter Unitless Project Adjustment Factor for Project",null,null,null,null,null,null,null,null,null,"AUG",1420000,255000,170000,125000]
[null,null,null,null,null,null,null,null,null,null,null,null,null,"BEL",2320000,675000,155000,120000]
["OUTPUT: PROJECT GROUND - US SURVEY FEET",null,null,null,null,null,null,null,null,null,null,null,null,"BRO",1525000,230000,115000,235000]
[null,"X (East)","Y (North) ",null,null,null,null,null,null,null,null,null,null,"BUT",1310000,475000,145000,115000]
["Lower left (SW) origin (MAP01):",{"$f":"PRODUCT(B10,B14)","v":{"$error":"#N/A"}},{"$f":"PRODUCT(C10,B14)","v":{"$error":"#N/A"}},"Calculated Scaled ORIGIN Coordinates",null,null,null,null,null,null,null,null,null,"CAR",2295000,275000,130000,120000]
["Upper right (NE) origin (MAP02):",{"$f":"PRODUCT(B12,B14)","v":{"$error":"#N/A"}},{"$f":"PRODUCT(C12,B14)","v":{"$error":"#N/A"}},"Calculated Scaled ORIGIN Coordinates",null,null,null,null,null,null,null,null,null,"CHP",1535000,730000,160000,105000]
[null,null,null,null,null,null,null,null,null,null,null,null,null,"CLA",1530000,645000,160000,105000]
[null,null,null,"(Edit Header & Footer for Printing File report copy)",null,null,null,null,null,null,null,null,null,"CLE",1450000,280000,100000,190000]
[null,null,null,null,null,null,null,null,null,null,null,null,null,"CLI",1540000,445000,125000,130000]
["1) Place a Shape (BOX) in the MicroStation file at the Project Origin Coordinates and use KEY-IN COMMAND  XY= (X value),(Y value) for both corners",null,null,null,null,null,null,null,null,null,null,null,null,"COL",2355000,335000,165000,130000]
["2) Attach the Raster File using the \"INTERACTIVE\" Toggle & PLACE at the Corners of the BOX",null,null,null,null,null,null,null,null,null,null,null,null,"COS",2050000,175000,165000,115000]
[null,null,null,null,null,null,null,null,null,null,null,null,null,"CRA",1795000,375000,115000,115000]
["This will scale the Aerial Mapping Ortho Photo to fit the PROJECT COORDINATES",null,null,null,null,null,null,null,null,null,null,null,null,"CUY",2110000,585000,170000,145000]
[null,null,null,null,null,null,null,null,null,null,null,null,null,"DAR",1315000,700000,115000,170000]
[null,null,null,null,null,null,null,null,null,null,null,null,null,"DEF",1330000,550000,165000,100000]
[null,null,null,null,null,null,null,null,null,null,null,null,null,"DEL",1755000,165000,150000,120000]
[null,null,null,null,null,null,null,null,null,null,null,null,null,"ERI",1855000,585000,160000,135000]
[null,null,null,null,null,null,null,null,null,null,null,null,null,"FAI",1870000,565000,140000,145000]
[null,null,null,null,null,null,null,null,null,null,null,null,null,"FAY",1635000,500000,125000,130000]
[null,null,null,null,null,null,null,null,null,null,null,null,null,"FRA",1755000,650000,145000,135000]
[null,null,null,null,null,null,null,null,null,null,null,null,null,"FUL",1445000,665000,150000,90000]
[null,null,null,null,null,null,null,null,null,null,null,null,null,"GAL",1940000,210000,145000,170000]
[null,null,null,null,null,null,null,null,null,null,null,null,null,"GEA",2270000,610000,110000,145000]
[null,null,null,null,null,null,null,null,null,null,null,null,null,"GRE",1510000,565000,140000,115000]
[null,null,null,null,null,null,null,null,null,null,null,null,null,"GUE",2180000,670000,145000,145000]
[null,null,null,null,null,null,null,null,null,null,null,null,null,"HAM",1305000,375000,170000,110000]
[null,null,null,null,null,null,null,null,null,null,null,null,null,"HAN",1585000,420000,135000,135000]
[null,null,null,null,null,null,null,null,null,null,null,null,null,"HAR",1580000,305000,135000,120000]
[null,null,null,null,null,null,null,null,null,null,null,null,null,"HAS",2290000,180000,135000,105000]
[null,null,null,null,null,null,null,null,null,null,null,null,null,"HEN",1460000,545000,130000,125000]
[null,null,null,null,null,null,null,null,null,null,null,null,null,"HIG",1575000,370000,155000,135000]
[null,null,null,null,null,null,null,null,null,null,null,null,null,"HOC",1895000,495000,170000,115000]
[null,null,null,null,null,null,null,null,null,null,null,null,null,"HOL",2045000,280000,160000,90000]
[null,null,null,null,null,null,null,null,null,null,null,null,null,"HUR",1870000,480000,145000,115000]
[null,null,null,null,null,null,null,null,null,null,null,null,null,"JAC",1880000,305000,110000,140000]
[null,null,null,null,null,null,null,null,null,null,null,null,null,"JEF",2400000,180000,100000,165000]
[null,null,null,null,null,null,null,null,null,null,null,null,null,"KNO",1895000,205000,165000,130000]
[null,null,null,null,null,null,null,null,null,null,null,null,null,"LAK",2240000,690000,140000,115000]
[null,null,null,null,null,null,null,null,null,null,null,null,null,"LAW",1875000,145000,155000,165000]
[null,null,null,null,null,null,null,null,null,null,null,null,null,"LIC",1885000,695000,175000,135000]
[null,null,null,null,null,null,null,null,null,null,null,null,null,"LOG",1545000,205000,145000,120000]
[null,null,null,null,null,null,null,null,null,null,null,null,null,"LOR",2005000,505000,135000,175000]
[null,null,null,null,null,null,null,null,null,null,null,null,null,"LUC",1585000,635000,225000,125000]
[null,null,null,null,null,null,null,null,null,null,null,null,null,"MAD",1640000,615000,135000,160000]
[null,null,null,null,null,null,null,null,null,null,null,null,null,"MAH",2355000,450000,165000,95000]
[null,null,null,null,null,null,null,null,null,null,null,null,null,"MAR",1710000,275000,160000,105000]
[null,null,null,null,null,null,null,null,null,null,null,null,null,"MED",2055000,480000,140000,110000]
[null,null,null,null,null,null,null,null,null,null,null,null,null,"MEG",2015000,315000,175000,125000]
[null,null,null,null,null,null,null,null,null,null,null,null,null,"MER",1325000,255000,110000,145000]
[null,null,null,null,null,null,null,null,null,null,null,null,null,"MIA",1425000,685000,120000,125000]
[null,null,null,null,null,null,null,null,null,null,null,null,null,"MOE",2300000,560000,145000,125000]
[null,null,null,null,null,null,null,null,null,null,null,null,null,"MOT",1410000,575000,125000,130000]
[null,null,null,null,null,null,null,null,null,null,null,null,null,"MRG",2085000,525000,145000,125000]
[null,null,null,null,null,null,null,null,null,null,null,null,null,"MRW",1820000,245000,115000,140000]
[null,null,null,null,null,null,null,null,null,null,null,null,null,"MUS",2040000,640000,160000,150000]
[null,null,null,null,null,null,null,null,null,null,null,null,null,"NOB",2190000,575000,135000,140000]
[null,null,null,null,null,null,null,null,null,null,null,null,null,"OTT",1715000,650000,20000,105000]
[null,null,null,null,null,null,null,null,null,null,null,null,null,"PAU",1330000,485000,135000,105000]
[null,null,null,null,null,null,null,null,null,null,null,null,null,"PER",1975000,560000,130000,145000]
[null,null,null,null,null,null,null,null,null,null,null,null,null,"PIC",1750000,530000,155000,135000]
[null,null,null,null,null,null,null,null,null,null,null,null,null,"PIK",1715000,345000,175000,95000]
[null,null,null,null,null,null,null,null,null,null,null,null,null,"POR",2270000,480000,115000,140000]
[null,null,null,null,null,null,null,null,null,null,null,null,null,"PRE",1310000,575000,105000,135000]
[null,null,null,null,null,null,null,null,null,null,null,null,null,"PUT",1440000,435000,150000,120000]
[null,null,null,null,null,null,null,null,null,null,null,null,null,"RIC",1900000,320000,115000,165000]
[null,null,null,null,null,null,null,null,null,null,null,null,null,"ROS",1715000,425000,190000,130000]
[null,null,null,null,null,null,null,null,null,null,null,null,null,"SAN",1715000,575000,165000,100000]
[null,null,null,null,null,null,null,null,null,null,null,null,null,"SCI",1745000,205000,185000,170000]
[null,null,null,null,null,null,null,null,null,null,null,null,null,"SEN",1710000,480000,170000,105000]
[null,null,null,null,null,null,null,null,null,null,null,null,null,"SHE",1425000,190000,130000,115000]
[null,null,null,null,null,null,null,null,null,null,null,null,null,"STA",2200000,350000,165000,135000]
[null,null,null,null,null,null,null,null,null,null,null,null,null,"SUM",2190000,450000,85000,175000]
[null,null,null,null,null,null,null,null,null,null,null,null,null,"TRU",2375000,535000,145000,140000]
[null,null,null,null,null,null,null,null,null,null,null,null,null,"TUS",2185000,200000,130000,170000]
[null,null,null,null,null,null,null,null,null,null,null,null,null,"UNI",1650000,160000,265000,295000]
[null,null,null,null,null,null,null,null,null,null,null,null,null,"VAN",1325000,375000,135000,120000]
[null,null,null,null,null,null,null,null,null,null,null,null,null,"VIN",1890000,370000,150000,140000]
[null,null,null,null,null,null,null,null,null,null,null,null,null,"WAR",1440000,460000,115000,125000]
[null,null,null,null,null,null,null,null,null,null,null,null,null,"WAS",2150000,440000,235000,165000]
[null,null,null,null,null,null,null,null,null,null,null,null,null,"WAY",2070000,360000,135000,125000]
[null,null,null,null,null,null,null,null,null,null,null,null,null,"WIL",1335000,645000,130000,105000]
[null,null,null,null,null,null,null,null,null,null,null,null,null,"WOO",1585000,545000,135000,170000]
[null,null,null,null,null,null,null,null,null,null,null,null,null,"WYA",1685000,370000,115000,115000]

{"sheet":"MON TABLE","index":5,"n_rows":95,"n_cols":20,"rows_kept":95,"cut":false,"hidden":false,"merged":[[3,9,3,19],[5,0,6,10],[8,11,8,16],[0,14,0,15],[0,5,0,10],[0,0,0,4],[5,18,5,19],[6,18,7,19],[1,0,2,1],[3,0,3,1],[2,4,2,6],[1,4,1,6],[1,8,2,8],[4,0,4,1],[5,11,6,17],[7,0,8,10],[4,4,4,6],[3,4,3,6],[3,8,4,8]]}
["PROJECT: ",null,null,null,null,{"$f":"REPORT!B2","v":0},null,null,null,null,null,null,null,"PID:",{"$f":"REPORT!$E$2","v":0}]
["Import Units:",null,"Ground Coord?",true,{"$f":"\"Unit Conversion Factor1 (\"&D3&\"->\"&D4&\"):\"","v":"Unit Conversion Factor1 (sft->m):"},null,null,{"$f":"INDEX(FactorValues,MATCH(D3&\"->\"&D4,FactorNames,0))","v":0.30480060960121919},"Unitless Ground to Grid Factor:","Unitless Factor:"]
[null,null,"U.S. Survey FT",{"$f":"INDEX(ShortUnits,MATCH($C$3,Units,0),1)","v":"sft"},{"$f":"\"Unit Conversion Factor2 (\"&D3&\"->\"&D5&\"):\"","v":"Unit Conversion Factor2 (sft->sft):"},null,null,{"$f":"INDEX(FactorValues,MATCH(D3&\"->\"&D5,FactorNames,0))","v":1},null,{"$f":"REPORT!A46&REPORT!C46","v":""}]
["Output Unit1:",null,"Meters",{"$f":"INDEX(ShortUnits,MATCH($C$4,Units,0),1)","v":"m"},"Adjustment Factor1:",null,null,{"$f":"IF(D2=TRUE,I4*H2,H2)","v":0.30480060960121919},{"$f":"IF(D2=TRUE,1/REPORT!C13,\"n/a\")","v":1},"Primary Project Control:"]
["Output Unit2:",null,"U.S. Survey FT",{"$f":"INDEX(ShortUnits,MATCH($C$5,Units,0),1)","v":"sft"},"Adjustment Factor2:",null,null,{"$f":"IF(D2=TRUE,I4*H3,H3)","v":1},null,{"$f":"REPORT!A41&REPORT!A42&REPORT!A43","v":""}]
[{"$f":"IF(D2=TRUE,\"GROUND\",\"GRID\")&\" COORDINATES - \"&C3","v":"GROUND COORDINATES - U.S. Survey FT"},null,null,null,null,null,null,null,null,null,null,"STATE PLANE GRID COORDINATES",null,null,null,null,null,null,"  MONUMENTS TO BE SET"]
[null,null,null,null,null,null,null,null,null,null,null,null,null,null,null,null,null,null," DURING CONSTRUCTION"]
[{"$f":"IF(ISNUMBER(SEARCH(\"NORTH\",REPORT!C10))=TRUE,\"PROJECT coordinates are scaled from GRID coordinates about the Ohio North Zone grid point \"&Lists!$G$1,\"PROJECT coordinates are scaled from GRID coordinates about the Ohio South Zone grid point \"&Lists!$G$2)","v":"PROJECT coordinates are scaled from GRID coordinates about the Ohio South Zone grid point N=0, E=0 (N 37⁰ 47' 45.30621\", W 89⁰ 19' 00.02517\")"},null,null,null,null,null,null,null,null,null,null,"Horiz. Datum:",{"$f":"REPORT!C11","v":"NAD83 (2011)"},{"$f":"REPORT!C10","v":"Ohio State Plane, South Zone"},null,"Vert. Datum:",{"$f":"REPORT!C15","v":"NAVD88"}]
[null,null,null,null,null,null,null,null,null,null,null,{"$f":"REPORT!A43&\" defined by GPS from CORS using \"&REPORT!C15&\". All other elevations are established by leveling from \"&REPORT!A43&\".\"","v":" defined by GPS from CORS using NAVD88. All other elevations are established by leveling from ."},null,null,null,null,null,null,"ITEM 623.05","ITEM 623.05"]
["NAME","Alignment Name","STATION",{"$f":"\"OFFSET (\"&D3&\")\"","v":"OFFSET (sft)"},"RT/LT",{"$f":"\"NORTH (\"&D3&\")\"","v":"NORTH (sft)"},{"$f":"\"EAST (\"&D3&\")\"","v":"EAST (sft)"},{"$f":"\"ELEVATION (\"&D3&\")\"","v":"ELEVATION (sft)"},"FEATURE","POINT TYPE","DESCRIPTION","NAME",{"$f":"\"NORTH (\"&D4&\")\"","v":"NORTH (m)"},{"$f":"\"EAST (\"&D4&\")\"","v":"EAST (m)"},{"$f":"\"ORTHO HT (\"&D4&\")\"","v":"ORTHO HT (m)"},{"$f":"\"NORTH (\"&D5&\")\"","v":"NORTH (sft)"},{"$f":"\"EAST (\"&D5&\")\"","v":"EAST (sft)"},{"$f":"\"ORTHO HT (\"&D5&\")\"","v":"ORTHO HT (sft)"},"MONUMENT ASSEMBLY","REFERENCE MONUMENT"]
[null,null,null,null,null,null,null,null,null,null,null,{"$f":"A11","v":0},{"$f":"F11*$H$4","v":0},{"$f":"G11*$H$4","v":0},{"$f":"H11*$H$4","v":0},{"$f":"$F11*$H$5","v":0},{"$f":"$G11*$H$5","v":0},{"$f":"H11*$H$5","v":0}]
[null,null,null,null,null,null,null,null,null,null,null,{"$f":"A12","v":0},0,0,0,0,0,0]
[null,null,null,null,null,null,null,null,null,null,null,0,0,0,0,0,0,0]
[null,null,null,null,null,null,null,null,null,null,null,0,0,0,0,0,0,0]
[null,null,null,null,null,null,null,null,null,null,null,0,0,0,0,0,0,0]
[null,null,null,null,null,null,null,null,null,null,null,0,0,0,0,0,0,0]
[null,null,null,null,null,null,null,null,null,null,null,0,0,0,0,0,0,0]
[null,null,null,null,null,null,null,null,null,null,null,0,0,0,0,0,0,0]
[null,null,null,null,null,null,null,null,null,null,null,0,0,0,0,0,0,0]
[null,null,null,null,null,null,null,null,null,null,null,0,0,0,0,0,0,0]
[null,null,null,null,null,null,null,null,null,null,null,0,0,0,0,0,0,0]
[null,null,null,null,null,null,null,null,null,null,null,0,0,0,0,0,0,0]
[null,null,null,null,null,null,null,null,null,null,null,0,0,0,0,0,0,0]
[null,null,null,null,null,null,null,null,null,null,null,0,0,0,0,0,0,0]
[null,null,null,null,null,null,null,null,null,null,null,0,0,0,0,0,0,0]
[null,null,null,null,null,null,null,null,null,null,null,0,0,0,0,0,0,0]
[null,null,null,null,null,null,null,null,null,null,null,0,0,0,0,0,0,0]
[null,null,null,null,null,null,null,null,null,null,null,0,0,0,0,0,0,0]
[null,null,null,null,null,null,null,null,null,null,null,0,0,0,0,0,0,0]
[null,null,null,null,null,null,null,null,null,null,null,0,0,0,0,0,0,0]
[null,null,null,null,null,null,null,null,null,null,null,0,0,0,0,0,0,0]
[null,null,null,null,null,null,null,null,null,null,null,0,0,0,0,0,0,0]
[null,null,null,null,null,null,null,null,null,null,null,0,0,0,0,0,0,0]
[null,null,null,null,null,null,null,null,null,null,null,0,0,0,0,0,0,0]
[null,null,null,null,null,null,null,null,null,null,null,0,0,0,0,0,0,0]
[null,null,null,null,null,null,null,null,null,null,null,0,0,0,0,0,0,0]
[null,null,null,null,null,null,null,null,null,null,null,0,0,0,0,0,0,0]
[null,null,null,null,null,null,null,null,null,null,null,0,0,0,0,0,0,0]
[null,null,null,null,null,null,null,null,null,null,null,0,0,0,0,0,0,0]
[null,null,null,null,null,null,null,null,null,null,null,0,0,0,0,0,0,0]
[null,null,null,null,null,null,null,null,null,null,null,0,0,0,0,0,0,0]
[null,null,null,null,null,null,null,null,null,null,null,0,0,0,0,0,0,0]
[null,null,null,null,null,null,null,null,null,null,null,0,{"$f":"F43*$H$4","v":0},{"$f":"G43*$H$4","v":0},{"$f":"H43*$H$4","v":0},{"$f":"$F43*$H$5","v":0},{"$f":"$G43*$H$5","v":0},{"$f":"H43*$H$5","v":0}]
[null,null,null,null,null,null,null,null,null,null,null,0,0,0,0,0,0,0]
[null,null,null,null,null,null,null,null,null,null,null,0,0,0,0,0,0,0]
[null,null,null,null,null,null,null,null,null,null,null,0,0,0,0,0,0,0]
[null,null,null,null,null,null,null,null,null,null,null,0,0,0,0,0,0,0]
[null,null,null,null,null,null,null,null,null,null,null,0,0,0,0,0,0,0]
[null,null,null,null,null,null,null,null,null,null,null,0,0,0,0,0,0,0]
[null,null,null,null,null,null,null,null,null,null,null,0,0,0,0,0,0,0]
[null,null,null,null,null,null,null,null,null,null,null,0,0,0,0,0,0,0]
[null,null,null,null,null,null,null,null,null,null,null,0,0,0,0,0,0,0]
[null,null,null,null,null,null,null,null,null,null,null,0,0,0,0,0,0,0]
[null,null,null,null,null,null,null,null,null,null,null,0,0,0,0,0,0,0]
[null,null,null,null,null,null,null,null,null,null,null,0,0,0,0,0,0,0]
[null,null,null,null,null,null,null,null,null,null,null,0,0,0,0,0,0,0]
[null,null,null,null,null,null,null,null,null,null,null,0,0,0,0,0,0,0]
[null,null,null,null,null,null,null,null,null,null,null,0,0,0,0,0,0,0]
[null,null,null,null,null,null,null,null,null,null,null,0,0,0,0,0,0,0]
[null,null,null,null,null,null,null,null,null,null,null,0,0,0,0,0,0,0]
[null,null,null,null,null,null,null,null,null,null,null,0,0,0,0,0,0,0]
[null,null,null,null,null,null,null,null,null,null,null,0,0,0,0,0,0,0]
[null,null,null,null,null,null,null,null,null,null,null,0,0,0,0,0,0,0]
[null,null,null,null,null,null,null,null,null,null,null,0,0,0,0,0,0,0]
[null,null,null,null,null,null,null,null,null,null,null,0,0,0,0,0,0,0]
[null,null,null,null,null,null,null,null,null,null,null,0,0,0,0,0,0,0]
[null,null,null,null,null,null,null,null,null,null,null,0,0,0,0,0,0,0]
[null,null,null,null,null,null,null,null,null,null,null,0,0,0,0,0,0,0]
[null,null,null,null,null,null,null,null,null,null,null,0,0,0,0,0,0,0]
[null,null,null,null,null,null,null,null,null,null,null,0,0,0,0,0,0,0]
[null,null,null,null,null,null,null,null,null,null,null,0,0,0,0,0,0,0]
[null,null,null,null,null,null,null,null,null,null,null,0,0,0,0,0,0,0]
[null,null,null,null,null,null,null,null,null,null,null,0,0,0,0,0,0,0]
[null,null,null,null,null,null,null,null,null,null,null,0,0,0,0,0,0,0]
[null,null,null,null,null,null,null,null,null,null,null,0,{"$f":"F75*$H$4","v":0},{"$f":"G75*$H$4","v":0},{"$f":"H75*$H$4","v":0},{"$f":"$F75*$H$5","v":0},{"$f":"$G75*$H$5","v":0},{"$f":"H75*$H$5","v":0}]
[null,null,null,null,null,null,null,null,null,null,null,{"$f":"A76","v":0},0,0,0,0,0,0]
[null,null,null,null,null,null,null,null,null,null,null,0,0,0,0,0,0,0]
[null,null,null,null,null,null,null,null,null,null,null,0,0,0,0,0,0,0]
[null,null,null,null,null,null,null,null,null,null,null,0,0,0,0,0,0,0]
[null,null,null,null,null,null,null,null,null,null,null,0,0,0,0,0,0,0]
[null,null,null,null,null,null,null,null,null,null,null,0,0,0,0,0,0,0]
[null,null,null,null,null,null,null,null,null,null,null,0,0,0,0,0,0,0]
[null,null,null,null,null,null,null,null,null,null,null,0,0,0,0,0,0,0]
[null,null,null,null,null,null,null,null,null,null,null,0,0,0,0,0,0,0]
[null,null,null,null,null,null,null,null,null,null,null,0,0,0,0,0,0,0]
[null,null,null,null,null,null,null,null,null,null,null,0,0,0,0,0,0,0]
[null,null,null,null,null,null,null,null,null,null,null,0,0,0,0,0,0,0]
[null,null,null,null,null,null,null,null,null,null,null,0,0,0,0,0,0,0]
[null,null,null,null,null,null,null,null,null,null,null,0,0,0,0,0,0,0]
[null,null,null,null,null,null,null,null,null,null,null,0,0,0,0,0,0,0]
[null,null,null,null,null,null,null,null,null,null,null,0,0,0,0,0,0,0]
[null,null,null,null,null,null,null,null,null,null,null,0,0,0,0,0,0,0]
[null,null,null,null,null,null,null,null,null,null,null,0,0,0,0,0,0,0]
[null,null,null,null,null,null,null,null,null,null,null,0,0,0,0,0,0,0]
[null,null,null,null,null,null,null,null,null,null,null,0,0,0,0,0,0,0]

{"sheet":"GPS_IMPORT","index":6,"n_rows":6,"n_cols":12,"rows_kept":6,"cut":false,"hidden":false,"merged":[[5,11,6,11],[5,10,6,10],[5,9,6,9],[5,8,6,8],[0,8,0,11],[3,9,4,9],[2,11,4,11],[1,8,4,8],[3,10,4,10]]}
["NAME","Date","Time","Northing","Easting","Elevation","Code",null,"GPS Import Settings"]
[null,null,null,null,null,null,null,null,"Import","Ground Coord?",false,"Factor"]
[null,null,null,null,null,null,null,null,null,"Units","Short Unit",{"$f":"K4&\"->\"&K6","v":"sft->sft"}]
[null,null,null,null,null,null,null,null,null,"U.S. Survey FT",{"$f":"INDEX(ShortUnits,MATCH(GPS_IMPORT!$J$4,Units,0),1)","v":"sft"}]
[]
[null,null,null,null,null,null,null,null,"Output","U.S. Survey FT",{"$f":"INDEX(ShortUnits,MATCH(GPS_IMPORT!$J$6,Units,0),1)","v":"sft"},{"$f":"INDEX(FactorValues,MATCH(L3,FactorNames,0))","v":1}]

{"sheet":"PointTemplate","index":7,"n_rows":388,"n_cols":17,"rows_kept":388,"cut":false,"hidden":false,"merged":[[3,4,3,7],[2,1,2,2],[3,1,3,2],[0,0,0,10],[26,0,26,6],[4,4,4,5],[4,9,4,10],[3,9,3,10],[2,9,2,10],[23,7,23,8],[2,4,2,7],[27,1,27,2],[27,8,38,10],[28,1,28,2],[30,0,30,6],[35,0,35,6],[36,1,36,2],[37,1,37,2],[38,1,38,2]]}
["VRS GNSS Project Control Monument Coordinate Analysis"]
[]
["Project:",{"$f":"REPORT!B2","v":0},null,"GPS Antenna:",{"$f":"REPORT!A41","v":0},null,null,null,"Report Date:",{"$f":"REPORT!C49","v":"00:00:00"}]
["PID:",{"$f":"REPORT!E2","v":0},null,"VRS Network:","ODOT VRS",null,null,null,"Prepared By:",{"$f":"REPORT!C48","v":0}]
["Point ID:"," ","No. of Sessions:",{"$f":"SUM(IF(GPS_IMPORT!A2:A1000=$B$5,1,0))","v":0},{"$f":"IF(GPS_IMPORT!K2,\"(GROUND)\",\"(GRID)\")","v":"(GRID)"},null,null,null,"Checked By:",{"$f":"REPORT!C52","v":"00:00:00"}]
["SESSION #","Point","Observation Date","Start Time",{"$f":"\"Northing(\"&GPS_IMPORT!K4&\")\"","v":"Northing(sft)"},{"$f":"\"Easting(\"&GPS_IMPORT!K4&\")\"","v":"Easting(sft)"},{"$f":"\"Height(\"&GPS_IMPORT!K4&\")\"","v":"Height(sft)"},{"$f":"\"∆ Northing(\"&GPS_IMPORT!K4&\")\"","v":"∆ Northing(sft)"},{"$f":"\"∆ Easting(\"&GPS_IMPORT!K4&\")\"","v":"∆ Easting(sft)"},{"$f":"\"∆ Height(\"&GPS_IMPORT!K4&\")\"","v":"∆ Height(sft)"},"Include in Solution?"]
[1,{"$f":"IF(ROWS(GPS_IMPORT!$1:1)<=SUM(IF(GPS_IMPORT!$A$2:$A$10000=$B$5,1,0)),INDEX(GPS_IMPORT!$2:$10000,MATCH($B$5,(GPS_IMPORT!$A$2:$A$10000),0)+ROWS($1:1)-1,COLUMN()-1),0)","v":0},{"$f":"IF(ROWS(GPS_IMPORT!$1:1)<=SUM(IF(GPS_IMPORT!$A$2:$A$10000=$B$5,1,0)),INDEX(GPS_IMPORT!$2:$10000,MATCH($B$5,(GPS_IMPORT!$A$2:$A$10000),0)+ROWS($1:1)-1,COLUMN()-1),0)","v":"00:00:00"},{"$f":"IF(ROWS(GPS_IMPORT!$1:1)<=SUM(IF(GPS_IMPORT!$A$2:$A$10000=$B$5,1,0)),INDEX(GPS_IMPORT!$2:$10000,MATCH($B$5,(GPS_IMPORT!$A$2:$A$10000),0)+ROWS($1:1)-1,COLUMN()-1),0)","v":"00:00:00"},{"$f":"IF(ROWS(GPS_IMPORT!$1:1)<=SUM(IF(GPS_IMPORT!$A$2:$A$10000=$B$5,1,0)),INDEX(GPS_IMPORT!$2:$10000,MATCH($B$5,(GPS_IMPORT!$A$2:$A$10000),0)+ROWS($1:1)-1,COLUMN()-1),0)","v":0},{"$f":"IF(ROWS(GPS_IMPORT!$1:1)<=SUM(IF(GPS_IMPORT!$A$2:$A$10000=$B$5,1,0)),INDEX(GPS_IMPORT!$2:$10000,MATCH($B$5,(GPS_IMPORT!$A$2:$A$10000),0)+ROWS($1:1)-1,COLUMN()-1),0)","v":0},{"$f":"IF(ROWS(GPS_IMPORT!$1:1)<=SUM(IF(GPS_IMPORT!$A$2:$A$10000=$B$5,1,0)),INDEX(GPS_IMPORT!$2:$10000,MATCH($B$5,(GPS_IMPORT!$A$2:$A$10000),0)+ROWS($1:1)-1,COLUMN()-1),0)","v":0},{"$f":"IF(K7=TRUE,IF(E7>0,E$22-E7,0),0)","v":0},{"$f":"IF(K7=TRUE,IF(F7>0,F$22-F7,0),0)","v":0},{"$f":"IF(K7=TRUE,IF(G7>0,G$22-G7,0),0)","v":0},true,{"$f":"IF(OR(ABS(H7)>$H$24,ABS(I7)>$H$24,ABS(SQRT((H7^2)+(I7^2)))>$H$24),IF(K7=TRUE,IF(E7>0,E$22-E7,0),0),0)","v":0},{"$f":"IF(OR(ABS(H7)>$H$24,ABS(I7)>$H$24,ABS(SQRT((H7^2)+(I7^2)))>$H$24),IF(K7=TRUE,IF(E7>0,F$22-F7,0),0),0)","v":0}]
[2,{"$f":"IF(ROWS(GPS_IMPORT!$1:2)<=SUM(IF(GPS_IMPORT!$A$2:$A$10000=$B$5,1,0)),INDEX(GPS_IMPORT!$2:$10000,MATCH($B$5,(GPS_IMPORT!$A$2:$A$10000),0)+ROWS($1:2)-1,COLUMN()-1),0)","v":0},{"$f":"IF(ROWS(GPS_IMPORT!$1:2)<=SUM(IF(GPS_IMPORT!$A$2:$A$10000=$B$5,1,0)),INDEX(GPS_IMPORT!$2:$10000,MATCH($B$5,(GPS_IMPORT!$A$2:$A$10000),0)+ROWS($1:2)-1,COLUMN()-1),0)","v":"00:00:00"},{"$f":"IF(ROWS(GPS_IMPORT!$1:2)<=SUM(IF(GPS_IMPORT!$A$2:$A$10000=$B$5,1,0)),INDEX(GPS_IMPORT!$2:$10000,MATCH($B$5,(GPS_IMPORT!$A$2:$A$10000),0)+ROWS($1:2)-1,COLUMN()-1),0)","v":"00:00:00"},{"$f":"IF(ROWS(GPS_IMPORT!$1:2)<=SUM(IF(GPS_IMPORT!$A$2:$A$10000=$B$5,1,0)),INDEX(GPS_IMPORT!$2:$10000,MATCH($B$5,(GPS_IMPORT!$A$2:$A$10000),0)+ROWS($1:2)-1,COLUMN()-1),0)","v":0},{"$f":"IF(ROWS(GPS_IMPORT!$1:2)<=SUM(IF(GPS_IMPORT!$A$2:$A$10000=$B$5,1,0)),INDEX(GPS_IMPORT!$2:$10000,MATCH($B$5,(GPS_IMPORT!$A$2:$A$10000),0)+ROWS($1:2)-1,COLUMN()-1),0)","v":0},{"$f":"IF(ROWS(GPS_IMPORT!$1:2)<=SUM(IF(GPS_IMPORT!$A$2:$A$10000=$B$5,1,0)),INDEX(GPS_IMPORT!$2:$10000,MATCH($B$5,(GPS_IMPORT!$A$2:$A$10000),0)+ROWS($1:2)-1,COLUMN()-1),0)","v":0},{"$f":"IF(K8=TRUE,IF(E8>0,E$22-E8,0),0)","v":0},{"$f":"IF(K8=TRUE,IF(F8>0,F$22-F8,0),0)","v":0},{"$f":"IF(K8=TRUE,IF(G8>0,G$22-G8,0),0)","v":0},true,0,0]
[3,{"$f":"IF(ROWS(GPS_IMPORT!$1:3)<=SUM(IF(GPS_IMPORT!$A$2:$A$10000=$B$5,1,0)),INDEX(GPS_IMPORT!$2:$10000,MATCH($B$5,(GPS_IMPORT!$A$2:$A$10000),0)+ROWS($1:3)-1,COLUMN()-1),0)","v":0},{"$f":"IF(ROWS(GPS_IMPORT!$1:3)<=SUM(IF(GPS_IMPORT!$A$2:$A$10000=$B$5,1,0)),INDEX(GPS_IMPORT!$2:$10000,MATCH($B$5,(GPS_IMPORT!$A$2:$A$10000),0)+ROWS($1:3)-1,COLUMN()-1),0)","v":"00:00:00"},{"$f":"IF(ROWS(GPS_IMPORT!$1:3)<=SUM(IF(GPS_IMPORT!$A$2:$A$10000=$B$5,1,0)),INDEX(GPS_IMPORT!$2:$10000,MATCH($B$5,(GPS_IMPORT!$A$2:$A$10000),0)+ROWS($1:3)-1,COLUMN()-1),0)","v":"00:00:00"},{"$f":"IF(ROWS(GPS_IMPORT!$1:3)<=SUM(IF(GPS_IMPORT!$A$2:$A$10000=$B$5,1,0)),INDEX(GPS_IMPORT!$2:$10000,MATCH($B$5,(GPS_IMPORT!$A$2:$A$10000),0)+ROWS($1:3)-1,COLUMN()-1),0)","v":0},{"$f":"IF(ROWS(GPS_IMPORT!$1:3)<=SUM(IF(GPS_IMPORT!$A$2:$A$10000=$B$5,1,0)),INDEX(GPS_IMPORT!$2:$10000,MATCH($B$5,(GPS_IMPORT!$A$2:$A$10000),0)+ROWS($1:3)-1,COLUMN()-1),0)","v":0},{"$f":"IF(ROWS(GPS_IMPORT!$1:3)<=SUM(IF(GPS_IMPORT!$A$2:$A$10000=$B$5,1,0)),INDEX(GPS_IMPORT!$2:$10000,MATCH($B$5,(GPS_IMPORT!$A$2:$A$10000),0)+ROWS($1:3)-1,COLUMN()-1),0)","v":0},0,0,0,true,0,0]
[4,{"$f":"IF(ROWS(GPS_IMPORT!$1:4)<=SUM(IF(GPS_IMPORT!$A$2:$A$10000=$B$5,1,0)),INDEX(GPS_IMPORT!$2:$10000,MATCH($B$5,(GPS_IMPORT!$A$2:$A$10000),0)+ROWS($1:4)-1,COLUMN()-1),0)","v":0},{"$f":"IF(ROWS(GPS_IMPORT!$1:4)<=SUM(IF(GPS_IMPORT!$A$2:$A$10000=$B$5,1,0)),INDEX(GPS_IMPORT!$2:$10000,MATCH($B$5,(GPS_IMPORT!$A$2:$A$10000),0)+ROWS($1:4)-1,COLUMN()-1),0)","v":"00:00:00"},{"$f":"IF(ROWS(GPS_IMPORT!$1:4)<=SUM(IF(GPS_IMPORT!$A$2:$A$10000=$B$5,1,0)),INDEX(GPS_IMPORT!$2:$10000,MATCH($B$5,(GPS_IMPORT!$A$2:$A$10000),0)+ROWS($1:4)-1,COLUMN()-1),0)","v":"00:00:00"},{"$f":"IF(ROWS(GPS_IMPORT!$1:4)<=SUM(IF(GPS_IMPORT!$A$2:$A$10000=$B$5,1,0)),INDEX(GPS_IMPORT!$2:$10000,MATCH($B$5,(GPS_IMPORT!$A$2:$A$10000),0)+ROWS($1:4)-1,COLUMN()-1),0)","v":0},{"$f":"IF(ROWS(GPS_IMPORT!$1:4)<=SUM(IF(GPS_IMPORT!$A$2:$A$10000=$B$5,1,0)),INDEX(GPS_IMPORT!$2:$10000,MATCH($B$5,(GPS_IMPORT!$A$2:$A$10000),0)+ROWS($1:4)-1,COLUMN()-1),0)","v":0},{"$f":"IF(ROWS(GPS_IMPORT!$1:4)<=SUM(IF(GPS_IMPORT!$A$2:$A$10000=$B$5,1,0)),INDEX(GPS_IMPORT!$2:$10000,MATCH($B$5,(GPS_IMPORT!$A$2:$A$10000),0)+ROWS($1:4)-1,COLUMN()-1),0)","v":0},0,0,0,true,0,0]
[5,{"$f":"IF(ROWS(GPS_IMPORT!$1:5)<=SUM(IF(GPS_IMPORT!$A$2:$A$10000=$B$5,1,0)),INDEX(GPS_IMPORT!$2:$10000,MATCH($B$5,(GPS_IMPORT!$A$2:$A$10000),0)+ROWS($1:5)-1,COLUMN()-1),0)","v":0},{"$f":"IF(ROWS(GPS_IMPORT!$1:5)<=SUM(IF(GPS_IMPORT!$A$2:$A$10000=$B$5,1,0)),INDEX(GPS_IMPORT!$2:$10000,MATCH($B$5,(GPS_IMPORT!$A$2:$A$10000),0)+ROWS($1:5)-1,COLUMN()-1),0)","v":"00:00:00"},{"$f":"IF(ROWS(GPS_IMPORT!$1:5)<=SUM(IF(GPS_IMPORT!$A$2:$A$10000=$B$5,1,0)),INDEX(GPS_IMPORT!$2:$10000,MATCH($B$5,(GPS_IMPORT!$A$2:$A$10000),0)+ROWS($1:5)-1,COLUMN()-1),0)","v":"00:00:00"},{"$f":"IF(ROWS(GPS_IMPORT!$1:5)<=SUM(IF(GPS_IMPORT!$A$2:$A$10000=$B$5,1,0)),INDEX(GPS_IMPORT!$2:$10000,MATCH($B$5,(GPS_IMPORT!$A$2:$A$10000),0)+ROWS($1:5)-1,COLUMN()-1),0)","v":0},{"$f":"IF(ROWS(GPS_IMPORT!$1:5)<=SUM(IF(GPS_IMPORT!$A$2:$A$10000=$B$5,1,0)),INDEX(GPS_IMPORT!$2:$10000,MATCH($B$5,(GPS_IMPORT!$A$2:$A$10000),0)+ROWS($1:5)-1,COLUMN()-1),0)","v":0},{"$f":"IF(ROWS(GPS_IMPORT!$1:5)<=SUM(IF(GPS_IMPORT!$A$2:$A$10000=$B$5,1,0)),INDEX(GPS_IMPORT!$2:$10000,MATCH($B$5,(GPS_IMPORT!$A$2:$A$10000),0)+ROWS($1:5)-1,COLUMN()-1),0)","v":0},0,0,0,true,0,0]
[6,{"$f":"IF(ROWS(GPS_IMPORT!$1:6)<=SUM(IF(GPS_IMPORT!$A$2:$A$10000=$B$5,1,0)),INDEX(GPS_IMPORT!$2:$10000,MATCH($B$5,(GPS_IMPORT!$A$2:$A$10000),0)+ROWS($1:6)-1,COLUMN()-1),0)","v":0},{"$f":"IF(ROWS(GPS_IMPORT!$1:6)<=SUM(IF(GPS_IMPORT!$A$2:$A$10000=$B$5,1,0)),INDEX(GPS_IMPORT!$2:$10000,MATCH($B$5,(GPS_IMPORT!$A$2:$A$10000),0)+ROWS($1:6)-1,COLUMN()-1),0)","v":"00:00:00"},{"$f":"IF(ROWS(GPS_IMPORT!$1:6)<=SUM(IF(GPS_IMPORT!$A$2:$A$10000=$B$5,1,0)),INDEX(GPS_IMPORT!$2:$10000,MATCH($B$5,(GPS_IMPORT!$A$2:$A$10000),0)+ROWS($1:6)-1,COLUMN()-1),0)","v":"00:00:00"},{"$f":"IF(ROWS(GPS_IMPORT!$1:6)<=SUM(IF(GPS_IMPORT!$A$2:$A$10000=$B$5,1,0)),INDEX(GPS_IMPORT!$2:$10000,MATCH($B$5,(GPS_IMPORT!$A$2:$A$10000),0)+ROWS($1:6)-1,COLUMN()-1),0)","v":0},{"$f":"IF(ROWS(GPS_IMPORT!$1:6)<=SUM(IF(GPS_IMPORT!$A$2:$A$10000=$B$5,1,0)),INDEX(GPS_IMPORT!$2:$10000,MATCH($B$5,(GPS_IMPORT!$A$2:$A$10000),0)+ROWS($1:6)-1,COLUMN()-1),0)","v":0},{"$f":"IF(ROWS(GPS_IMPORT!$1:6)<=SUM(IF(GPS_IMPORT!$A$2:$A$10000=$B$5,1,0)),INDEX(GPS_IMPORT!$2:$10000,MATCH($B$5,(GPS_IMPORT!$A$2:$A$10000),0)+ROWS($1:6)-1,COLUMN()-1),0)","v":0},0,0,0,true,0,0]
[7,{"$f":"IF(ROWS(GPS_IMPORT!$1:7)<=SUM(IF(GPS_IMPORT!$A$2:$A$10000=$B$5,1,0)),INDEX(GPS_IMPORT!$2:$10000,MATCH($B$5,(GPS_IMPORT!$A$2:$A$10000),0)+ROWS($1:7)-1,COLUMN()-1),0)","v":0},{"$f":"IF(ROWS(GPS_IMPORT!$1:7)<=SUM(IF(GPS_IMPORT!$A$2:$A$10000=$B$5,1,0)),INDEX(GPS_IMPORT!$2:$10000,MATCH($B$5,(GPS_IMPORT!$A$2:$A$10000),0)+ROWS($1:7)-1,COLUMN()-1),0)","v":"00:00:00"},{"$f":"IF(ROWS(GPS_IMPORT!$1:7)<=SUM(IF(GPS_IMPORT!$A$2:$A$10000=$B$5,1,0)),INDEX(GPS_IMPORT!$2:$10000,MATCH($B$5,(GPS_IMPORT!$A$2:$A$10000),0)+ROWS($1:7)-1,COLUMN()-1),0)","v":"00:00:00"},{"$f":"IF(ROWS(GPS_IMPORT!$1:7)<=SUM(IF(GPS_IMPORT!$A$2:$A$10000=$B$5,1,0)),INDEX(GPS_IMPORT!$2:$10000,MATCH($B$5,(GPS_IMPORT!$A$2:$A$10000),0)+ROWS($1:7)-1,COLUMN()-1),0)","v":0},{"$f":"IF(ROWS(GPS_IMPORT!$1:7)<=SUM(IF(GPS_IMPORT!$A$2:$A$10000=$B$5,1,0)),INDEX(GPS_IMPORT!$2:$10000,MATCH($B$5,(GPS_IMPORT!$A$2:$A$10000),0)+ROWS($1:7)-1,COLUMN()-1),0)","v":0},{"$f":"IF(ROWS(GPS_IMPORT!$1:7)<=SUM(IF(GPS_IMPORT!$A$2:$A$10000=$B$5,1,0)),INDEX(GPS_IMPORT!$2:$10000,MATCH($B$5,(GPS_IMPORT!$A$2:$A$10000),0)+ROWS($1:7)-1,COLUMN()-1),0)","v":0},0,0,0,true,0,0]
[8,{"$f":"IF(ROWS(GPS_IMPORT!$1:8)<=SUM(IF(GPS_IMPORT!$A$2:$A$10000=$B$5,1,0)),INDEX(GPS_IMPORT!$2:$10000,MATCH($B$5,(GPS_IMPORT!$A$2:$A$10000),0)+ROWS($1:8)-1,COLUMN()-1),0)","v":0},{"$f":"IF(ROWS(GPS_IMPORT!$1:8)<=SUM(IF(GPS_IMPORT!$A$2:$A$10000=$B$5,1,0)),INDEX(GPS_IMPORT!$2:$10000,MATCH($B$5,(GPS_IMPORT!$A$2:$A$10000),0)+ROWS($1:8)-1,COLUMN()-1),0)","v":"00:00:00"},{"$f":"IF(ROWS(GPS_IMPORT!$1:8)<=SUM(IF(GPS_IMPORT!$A$2:$A$10000=$B$5,1,0)),INDEX(GPS_IMPORT!$2:$10000,MATCH($B$5,(GPS_IMPORT!$A$2:$A$10000),0)+ROWS($1:8)-1,COLUMN()-1),0)","v":"00:00:00"},{"$f":"IF(ROWS(GPS_IMPORT!$1:8)<=SUM(IF(GPS_IMPORT!$A$2:$A$10000=$B$5,1,0)),INDEX(GPS_IMPORT!$2:$10000,MATCH($B$5,(GPS_IMPORT!$A$2:$A$10000),0)+ROWS($1:8)-1,COLUMN()-1),0)","v":0},{"$f":"IF(ROWS(GPS_IMPORT!$1:8)<=SUM(IF(GPS_IMPORT!$A$2:$A$10000=$B$5,1,0)),INDEX(GPS_IMPORT!$2:$10000,MATCH($B$5,(GPS_IMPORT!$A$2:$A$10000),0)+ROWS($1:8)-1,COLUMN()-1),0)","v":0},{"$f":"IF(ROWS(GPS_IMPORT!$1:8)<=SUM(IF(GPS_IMPORT!$A$2:$A$10000=$B$5,1,0)),INDEX(GPS_IMPORT!$2:$10000,MATCH($B$5,(GPS_IMPORT!$A$2:$A$10000),0)+ROWS($1:8)-1,COLUMN()-1),0)","v":0},0,0,0,true,0,0]
[9,{"$f":"IF(ROWS(GPS_IMPORT!$1:9)<=SUM(IF(GPS_IMPORT!$A$2:$A$10000=$B$5,1,0)),INDEX(GPS_IMPORT!$2:$10000,MATCH($B$5,(GPS_IMPORT!$A$2:$A$10000),0)+ROWS($1:9)-1,COLUMN()-1),0)","v":0},{"$f":"IF(ROWS(GPS_IMPORT!$1:9)<=SUM(IF(GPS_IMPORT!$A$2:$A$10000=$B$5,1,0)),INDEX(GPS_IMPORT!$2:$10000,MATCH($B$5,(GPS_IMPORT!$A$2:$A$10000),0)+ROWS($1:9)-1,COLUMN()-1),0)","v":"00:00:00"},{"$f":"IF(ROWS(GPS_IMPORT!$1:9)<=SUM(IF(GPS_IMPORT!$A$2:$A$10000=$B$5,1,0)),INDEX(GPS_IMPORT!$2:$10000,MATCH($B$5,(GPS_IMPORT!$A$2:$A$10000),0)+ROWS($1:9)-1,COLUMN()-1),0)","v":"00:00:00"},{"$f":"IF(ROWS(GPS_IMPORT!$1:9)<=SUM(IF(GPS_IMPORT!$A$2:$A$10000=$B$5,1,0)),INDEX(GPS_IMPORT!$2:$10000,MATCH($B$5,(GPS_IMPORT!$A$2:$A$10000),0)+ROWS($1:9)-1,COLUMN()-1),0)","v":0},{"$f":"IF(ROWS(GPS_IMPORT!$1:9)<=SUM(IF(GPS_IMPORT!$A$2:$A$10000=$B$5,1,0)),INDEX(GPS_IMPORT!$2:$10000,MATCH($B$5,(GPS_IMPORT!$A$2:$A$10000),0)+ROWS($1:9)-1,COLUMN()-1),0)","v":0},{"$f":"IF(ROWS(GPS_IMPORT!$1:9)<=SUM(IF(GPS_IMPORT!$A$2:$A$10000=$B$5,1,0)),INDEX(GPS_IMPORT!$2:$10000,MATCH($B$5,(GPS_IMPORT!$A$2:$A$10000),0)+ROWS($1:9)-1,COLUMN()-1),0)","v":0},0,0,0,true,0,0]
[10,{"$f":"IF(ROWS(GPS_IMPORT!$1:10)<=SUM(IF(GPS_IMPORT!$A$2:$A$10000=$B$5,1,0)),INDEX(GPS_IMPORT!$2:$10000,MATCH($B$5,(GPS_IMPORT!$A$2:$A$10000),0)+ROWS($1:10)-1,COLUMN()-1),0)","v":0},{"$f":"IF(ROWS(GPS_IMPORT!$1:10)<=SUM(IF(GPS_IMPORT!$A$2:$A$10000=$B$5,1,0)),INDEX(GPS_IMPORT!$2:$10000,MATCH($B$5,(GPS_IMPORT!$A$2:$A$10000),0)+ROWS($1:10)-1,COLUMN()-1),0)","v":"00:00:00"},{"$f":"IF(ROWS(GPS_IMPORT!$1:10)<=SUM(IF(GPS_IMPORT!$A$2:$A$10000=$B$5,1,0)),INDEX(GPS_IMPORT!$2:$10000,MATCH($B$5,(GPS_IMPORT!$A$2:$A$10000),0)+ROWS($1:10)-1,COLUMN()-1),0)","v":"00:00:00"},{"$f":"IF(ROWS(GPS_IMPORT!$1:10)<=SUM(IF(GPS_IMPORT!$A$2:$A$10000=$B$5,1,0)),INDEX(GPS_IMPORT!$2:$10000,MATCH($B$5,(GPS_IMPORT!$A$2:$A$10000),0)+ROWS($1:10)-1,COLUMN()-1),0)","v":0},{"$f":"IF(ROWS(GPS_IMPORT!$1:10)<=SUM(IF(GPS_IMPORT!$A$2:$A$10000=$B$5,1,0)),INDEX(GPS_IMPORT!$2:$10000,MATCH($B$5,(GPS_IMPORT!$A$2:$A$10000),0)+ROWS($1:10)-1,COLUMN()-1),0)","v":0},{"$f":"IF(ROWS(GPS_IMPORT!$1:10)<=SUM(IF(GPS_IMPORT!$A$2:$A$10000=$B$5,1,0)),INDEX(GPS_IMPORT!$2:$10000,MATCH($B$5,(GPS_IMPORT!$A$2:$A$10000),0)+ROWS($1:10)-1,COLUMN()-1),0)","v":0},0,0,0,true,0,0]
[11,{"$f":"IF(ROWS(GPS_IMPORT!$1:11)<=SUM(IF(GPS_IMPORT!$A$2:$A$10000=$B$5,1,0)),INDEX(GPS_IMPORT!$2:$10000,MATCH($B$5,(GPS_IMPORT!$A$2:$A$10000),0)+ROWS($1:11)-1,COLUMN()-1),0)","v":0},{"$f":"IF(ROWS(GPS_IMPORT!$1:11)<=SUM(IF(GPS_IMPORT!$A$2:$A$10000=$B$5,1,0)),INDEX(GPS_IMPORT!$2:$10000,MATCH($B$5,(GPS_IMPORT!$A$2:$A$10000),0)+ROWS($1:11)-1,COLUMN()-1),0)","v":"00:00:00"},{"$f":"IF(ROWS(GPS_IMPORT!$1:11)<=SUM(IF(GPS_IMPORT!$A$2:$A$10000=$B$5,1,0)),INDEX(GPS_IMPORT!$2:$10000,MATCH($B$5,(GPS_IMPORT!$A$2:$A$10000),0)+ROWS($1:11)-1,COLUMN()-1),0)","v":"00:00:00"},{"$f":"IF(ROWS(GPS_IMPORT!$1:11)<=SUM(IF(GPS_IMPORT!$A$2:$A$10000=$B$5,1,0)),INDEX(GPS_IMPORT!$2:$10000,MATCH($B$5,(GPS_IMPORT!$A$2:$A$10000),0)+ROWS($1:11)-1,COLUMN()-1),0)","v":0},{"$f":"IF(ROWS(GPS_IMPORT!$1:11)<=SUM(IF(GPS_IMPORT!$A$2:$A$10000=$B$5,1,0)),INDEX(GPS_IMPORT!$2:$10000,MATCH($B$5,(GPS_IMPORT!$A$2:$A$10000),0)+ROWS($1:11)-1,COLUMN()-1),0)","v":0},{"$f":"IF(ROWS(GPS_IMPORT!$1:11)<=SUM(IF(GPS_IMPORT!$A$2:$A$10000=$B$5,1,0)),INDEX(GPS_IMPORT!$2:$10000,MATCH($B$5,(GPS_IMPORT!$A$2:$A$10000),0)+ROWS($1:11)-1,COLUMN()-1),0)","v":0},0,0,0,true,0,0]
[12,{"$f":"IF(ROWS(GPS_IMPORT!$1:12)<=SUM(IF(GPS_IMPORT!$A$2:$A$10000=$B$5,1,0)),INDEX(GPS_IMPORT!$2:$10000,MATCH($B$5,(GPS_IMPORT!$A$2:$A$10000),0)+ROWS($1:12)-1,COLUMN()-1),0)","v":0},{"$f":"IF(ROWS(GPS_IMPORT!$1:12)<=SUM(IF(GPS_IMPORT!$A$2:$A$10000=$B$5,1,0)),INDEX(GPS_IMPORT!$2:$10000,MATCH($B$5,(GPS_IMPORT!$A$2:$A$10000),0)+ROWS($1:12)-1,COLUMN()-1),0)","v":"00:00:00"},{"$f":"IF(ROWS(GPS_IMPORT!$1:12)<=SUM(IF(GPS_IMPORT!$A$2:$A$10000=$B$5,1,0)),INDEX(GPS_IMPORT!$2:$10000,MATCH($B$5,(GPS_IMPORT!$A$2:$A$10000),0)+ROWS($1:12)-1,COLUMN()-1),0)","v":"00:00:00"},{"$f":"IF(ROWS(GPS_IMPORT!$1:12)<=SUM(IF(GPS_IMPORT!$A$2:$A$10000=$B$5,1,0)),INDEX(GPS_IMPORT!$2:$10000,MATCH($B$5,(GPS_IMPORT!$A$2:$A$10000),0)+ROWS($1:12)-1,COLUMN()-1),0)","v":0},{"$f":"IF(ROWS(GPS_IMPORT!$1:12)<=SUM(IF(GPS_IMPORT!$A$2:$A$10000=$B$5,1,0)),INDEX(GPS_IMPORT!$2:$10000,MATCH($B$5,(GPS_IMPORT!$A$2:$A$10000),0)+ROWS($1:12)-1,COLUMN()-1),0)","v":0},{"$f":"IF(ROWS(GPS_IMPORT!$1:12)<=SUM(IF(GPS_IMPORT!$A$2:$A$10000=$B$5,1,0)),INDEX(GPS_IMPORT!$2:$10000,MATCH($B$5,(GPS_IMPORT!$A$2:$A$10000),0)+ROWS($1:12)-1,COLUMN()-1),0)","v":0},0,0,0,true,0,0]
[13,{"$f":"IF(ROWS(GPS_IMPORT!$1:13)<=SUM(IF(GPS_IMPORT!$A$2:$A$10000=$B$5,1,0)),INDEX(GPS_IMPORT!$2:$10000,MATCH($B$5,(GPS_IMPORT!$A$2:$A$10000),0)+ROWS($1:13)-1,COLUMN()-1),0)","v":0},{"$f":"IF(ROWS(GPS_IMPORT!$1:13)<=SUM(IF(GPS_IMPORT!$A$2:$A$10000=$B$5,1,0)),INDEX(GPS_IMPORT!$2:$10000,MATCH($B$5,(GPS_IMPORT!$A$2:$A$10000),0)+ROWS($1:13)-1,COLUMN()-1),0)","v":"00:00:00"},{"$f":"IF(ROWS(GPS_IMPORT!$1:13)<=SUM(IF(GPS_IMPORT!$A$2:$A$10000=$B$5,1,0)),INDEX(GPS_IMPORT!$2:$10000,MATCH($B$5,(GPS_IMPORT!$A$2:$A$10000),0)+ROWS($1:13)-1,COLUMN()-1),0)","v":"00:00:00"},{"$f":"IF(ROWS(GPS_IMPORT!$1:13)<=SUM(IF(GPS_IMPORT!$A$2:$A$10000=$B$5,1,0)),INDEX(GPS_IMPORT!$2:$10000,MATCH($B$5,(GPS_IMPORT!$A$2:$A$10000),0)+ROWS($1:13)-1,COLUMN()-1),0)","v":0},{"$f":"IF(ROWS(GPS_IMPORT!$1:13)<=SUM(IF(GPS_IMPORT!$A$2:$A$10000=$B$5,1,0)),INDEX(GPS_IMPORT!$2:$10000,MATCH($B$5,(GPS_IMPORT!$A$2:$A$10000),0)+ROWS($1:13)-1,COLUMN()-1),0)","v":0},{"$f":"IF(ROWS(GPS_IMPORT!$1:13)<=SUM(IF(GPS_IMPORT!$A$2:$A$10000=$B$5,1,0)),INDEX(GPS_IMPORT!$2:$10000,MATCH($B$5,(GPS_IMPORT!$A$2:$A$10000),0)+ROWS($1:13)-1,COLUMN()-1),0)","v":0},0,0,0,false,0,0]
[14,{"$f":"IF(ROWS(GPS_IMPORT!$1:14)<=SUM(IF(GPS_IMPORT!$A$2:$A$10000=$B$5,1,0)),INDEX(GPS_IMPORT!$2:$10000,MATCH($B$5,(GPS_IMPORT!$A$2:$A$10000),0)+ROWS($1:14)-1,COLUMN()-1),0)","v":0},{"$f":"IF(ROWS(GPS_IMPORT!$1:14)<=SUM(IF(GPS_IMPORT!$A$2:$A$10000=$B$5,1,0)),INDEX(GPS_IMPORT!$2:$10000,MATCH($B$5,(GPS_IMPORT!$A$2:$A$10000),0)+ROWS($1:14)-1,COLUMN()-1),0)","v":"00:00:00"},{"$f":"IF(ROWS(GPS_IMPORT!$1:14)<=SUM(IF(GPS_IMPORT!$A$2:$A$10000=$B$5,1,0)),INDEX(GPS_IMPORT!$2:$10000,MATCH($B$5,(GPS_IMPORT!$A$2:$A$10000),0)+ROWS($1:14)-1,COLUMN()-1),0)","v":"00:00:00"},{"$f":"IF(ROWS(GPS_IMPORT!$1:14)<=SUM(IF(GPS_IMPORT!$A$2:$A$10000=$B$5,1,0)),INDEX(GPS_IMPORT!$2:$10000,MATCH($B$5,(GPS_IMPORT!$A$2:$A$10000),0)+ROWS($1:14)-1,COLUMN()-1),0)","v":0},{"$f":"IF(ROWS(GPS_IMPORT!$1:14)<=SUM(IF(GPS_IMPORT!$A$2:$A$10000=$B$5,1,0)),INDEX(GPS_IMPORT!$2:$10000,MATCH($B$5,(GPS_IMPORT!$A$2:$A$10000),0)+ROWS($1:14)-1,COLUMN()-1),0)","v":0},{"$f":"IF(ROWS(GPS_IMPORT!$1:14)<=SUM(IF(GPS_IMPORT!$A$2:$A$10000=$B$5,1,0)),INDEX(GPS_IMPORT!$2:$10000,MATCH($B$5,(GPS_IMPORT!$A$2:$A$10000),0)+ROWS($1:14)-1,COLUMN()-1),0)","v":0},0,0,0,false,0,0]
[15,{"$f":"IF(ROWS(GPS_IMPORT!$1:15)<=SUM(IF(GPS_IMPORT!$A$2:$A$10000=$B$5,1,0)),INDEX(GPS_IMPORT!$2:$10000,MATCH($B$5,(GPS_IMPORT!$A$2:$A$10000),0)+ROWS($1:15)-1,COLUMN()-1),0)","v":0},{"$f":"IF(ROWS(GPS_IMPORT!$1:15)<=SUM(IF(GPS_IMPORT!$A$2:$A$10000=$B$5,1,0)),INDEX(GPS_IMPORT!$2:$10000,MATCH($B$5,(GPS_IMPORT!$A$2:$A$10000),0)+ROWS($1:15)-1,COLUMN()-1),0)","v":"00:00:00"},{"$f":"IF(ROWS(GPS_IMPORT!$1:15)<=SUM(IF(GPS_IMPORT!$A$2:$A$10000=$B$5,1,0)),INDEX(GPS_IMPORT!$2:$10000,MATCH($B$5,(GPS_IMPORT!$A$2:$A$10000),0)+ROWS($1:15)-1,COLUMN()-1),0)","v":"00:00:00"},{"$f":"IF(ROWS(GPS_IMPORT!$1:15)<=SUM(IF(GPS_IMPORT!$A$2:$A$10000=$B$5,1,0)),INDEX(GPS_IMPORT!$2:$10000,MATCH($B$5,(GPS_IMPORT!$A$2:$A$10000),0)+ROWS($1:15)-1,COLUMN()-1),0)","v":0},{"$f":"IF(ROWS(GPS_IMPORT!$1:15)<=SUM(IF(GPS_IMPORT!$A$2:$A$10000=$B$5,1,0)),INDEX(GPS_IMPORT!$2:$10000,MATCH($B$5,(GPS_IMPORT!$A$2:$A$10000),0)+ROWS($1:15)-1,COLUMN()-1),0)","v":0},{"$f":"IF(ROWS(GPS_IMPORT!$1:15)<=SUM(IF(GPS_IMPORT!$A$2:$A$10000=$B$5,1,0)),INDEX(GPS_IMPORT!$2:$10000,MATCH($B$5,(GPS_IMPORT!$A$2:$A$10000),0)+ROWS($1:15)-1,COLUMN()-1),0)","v":0},{"$f":"IF(K21=TRUE,IF(E21>0,E$22-E21,0),0)","v":0},0,0,false,0,0]
[null,null,null,"AVERAGE",{"$f":"(IF($K$7=TRUE,E7,0)+IF($K$8=TRUE,E8,0)+IF($K$9=TRUE,E9,0)+IF($K$10=TRUE,E10,0)+IF($K$11=TRUE,E11,0)+IF($K$12=TRUE,E12,0)+IF($K$13=TRUE,E13,0)+IF($K$14=TRUE,E14,0)+IF($K$15=TRUE,E15,0)+IF($K$16=TRUE,E16,0)+IF($K$17=TRUE,E17,0)+IF($K$18=TRUE,E18,0)+IF($K$19=TRUE,E19,0)+IF($K$20=TRUE,E20,0)+IF($K$21=TRUE,E21,0))/(IF($K$7=TRUE,1,0)+IF($K$8=TRUE,1,0)+IF($K$9=TRUE,1,0)+IF($K$10=TRUE,1,0)+IF($K$11=TRUE,1,0)+IF($K$12=TRUE,1,0)+IF($K$13=TRUE,1,0)+IF($K$14=TRUE,1,0)+IF($K$15=TRUE,1,0)+IF($K$16=TRUE,1,0)+IF($K$17=TRUE,1,0)+IF($K$18=TRUE,1,0)+IF($K$19=TRUE,1,0)+IF($K$20=TRUE,1,0)+IF($K$21=TRUE,1,0))","v":0},{"$f":"(IF($K$7=TRUE,F7,0)+IF($K$8=TRUE,F8,0)+IF($K$9=TRUE,F9,0)+IF($K$10=TRUE,F10,0)+IF($K$11=TRUE,F11,0)+IF($K$12=TRUE,F12,0)+IF($K$13=TRUE,F13,0)+IF($K$14=TRUE,F14,0)+IF($K$15=TRUE,F15,0)+IF($K$16=TRUE,F16,0)+IF($K$17=TRUE,F17,0)+IF($K$18=TRUE,F18,0)+IF($K$19=TRUE,F19,0)+IF($K$20=TRUE,F20,0)+IF($K$21=TRUE,F21,0))/(IF($K$7=TRUE,1,0)+IF($K$8=TRUE,1,0)+IF($K$9=TRUE,1,0)+IF($K$10=TRUE,1,0)+IF($K$11=TRUE,1,0)+IF($K$12=TRUE,1,0)+IF($K$13=TRUE,1,0)+IF($K$14=TRUE,1,0)+IF($K$15=TRUE,1,0)+IF($K$16=TRUE,1,0)+IF($K$17=TRUE,1,0)+IF($K$18=TRUE,1,0)+IF($K$19=TRUE,1,0)+IF($K$20=TRUE,1,0)+IF($K$21=TRUE,1,0))","v":0},{"$f":"(IF($K$7=TRUE,G7,0)+IF($K$8=TRUE,G8,0)+IF($K$9=TRUE,G9,0)+IF($K$10=TRUE,G10,0)+IF($K$11=TRUE,G11,0)+IF($K$12=TRUE,G12,0)+IF($K$13=TRUE,G13,0)+IF($K$14=TRUE,G14,0)+IF($K$15=TRUE,G15,0)+IF($K$16=TRUE,G16,0)+IF($K$17=TRUE,G17,0)+IF($K$18=TRUE,G18,0)+IF($K$19=TRUE,G19,0)+IF($K$20=TRUE,G20,0)+IF($K$21=TRUE,G21,0))/\n(IF($K$7=TRUE,1,0)+IF($K$8=TRUE,1,0)+IF($K$9=TRUE,1,0)+IF($K$10=TRUE,1,0)+IF($K$11=TRUE,1,0)+IF($K$12=TRUE,1,0)+IF($K$13=TRUE,1,0)+IF($K$14=TRUE,1,0)+IF($K$15=TRUE,1,0)+IF($K$16=TRUE,1,0)+IF($K$17=TRUE,1,0)+IF($K$18=TRUE,1,0)+IF($K$19=TRUE,1,0)+IF($K$20=TRUE,1,0)+IF($K$21=TRUE,1,0))","v":0},"RMSE:","RMSE:","RMSE:"]
[null,null,null,null,null,null,{"$f":"\"RMSE IN \"&GPS_IMPORT!J4&\":\"","v":"RMSE IN U.S. Survey FT:"},{"$f":"SQRT(SUMSQ((IF(K7:K21=TRUE,H7:H21)))/SUM(IF(K7:K21=TRUE,1,0)))","v":0},{"$f":"SQRT(SUMSQ((IF(K7:K21=TRUE,I7:I21)))/SUM(IF(K7:K21=TRUE,1,0)))","v":0},{"$f":"SQRT(SUMSQ((IF(K7:K21=TRUE,J7:J21)))/SUM(IF(K7:K21=TRUE,1,0)))","v":0}]
[null,null,null,null,null,null,"Tolerance:",{"$f":"VLOOKUP(GPS_IMPORT!$K$4,Lists!H3:I5,2,FALSE)","v":2.9000000000000001E-2},null,{"$f":"VLOOKUP(GPS_IMPORT!$K$4,Lists!H3:J5,3,FALSE)","v":3.9E-2}]
[null,null,null,null,null,null,null,{"$f":"IF(H23<=H24,\"PASS\",\"FAIL\")","v":"PASS"},{"$f":"IF(I23<=H24,\"PASS\",\"FAIL\")","v":"PASS"},{"$f":"IF(J23<=J24,\"PASS\",\"FAIL\")","v":"PASS"}]
[]
["AVERAGED GPS-DERIVED POSITION",null,null,null,null,null,null,null,"Notes:"]
[null,"MONUMENT COORDINATES",null,"NORTHING","EASTING","ORTHO HEIGHT",null,null,null,null,null,null,null,"Degrees","Radians","SIN","COS"]
[null,{"$f":"GPS_IMPORT!J4&\" (\"&IF(GPS_IMPORT!K2,\"GROUND\",\"GRID\")&\")\"","v":"U.S. Survey FT (GRID)"},null,{"$f":"$E$22","v":0},{"$f":"$F$22","v":0},{"$f":"$G$22","v":0},null,null,null,null,null,null,null,1,{"$f":"N29*(PI()/180)","v":1.7453292519943295E-2},{"$f":"SIN(O29)*H$24","v":5.0611978668122187E-4},{"$f":"COS(O29)*H$24","v":2.8995583159535349E-2}]
[null,null,null,null,null,null,null,null,null,null,null,null,null,{"$f":"N29+1","v":2},{"$f":"N30*(PI()/180)","v":3.4906585039886591E-2},1.0120854043725281E-3,2.8982333983553779E-2]
["LEVELED ELEVATION",null,null,null,null,null,null,null,null,null,null,null,null,{"$f":"N30+1","v":3},5.235987755982989E-2,1.5177427310453712E-3,2.8960256507882642E-2]
[{"$f":"'LEVEL RUN'!B5","v":"U.S. Survey FT"},null,{"$f":"IFERROR(VLOOKUP(B5,'LEVEL RUN'!A7:I59,9,FALSE),\"N/A\")","v":"N/A"},"(Fill out Level Run Sheet or N/A if no leveled elevation is available)",null,null,null,null,null,null,null,null,null,4,6.9813170079773182E-2,2.0229377385796339E-3,2.8929357457534902E-2]
["MONUMENT HELD",null,{"$f":"IF('LEVEL RUN'!A7=\"\",\"\",'LEVEL RUN'!A7)","v":""},"(Type the monument name from which leveling originated)",null,null,null,null,null,null,null,null,null,5,8.7266462599716474E-2,2.5275165396820868E-3,2.8889646244660623E-2]
["LEVELED ELEVATION - GPS DERIVED ELEVATION   = ",null,null,null,{"$f":"IF(C32=\"N/A\",\"N/A\",C32-(F29*'LEVEL RUN'!F5))","v":"N/A"},{"$f":"'LEVEL RUN'!D5","v":"sft"},null,null,null,null,null,null,null,6,0.10471975511965978,3.0313254347619509E-3,2.8841134965679926E-2]
[null,null,null,null,null,null,null,null,null,null,null,null,null,7,0.12217304763960307,3.5342109587492769E-3,2.8783838397598339E-2]
["FINAL MONUMENT COORDINATES",null,null,null,null,null,null,null,null,null,null,null,null,8,0.13962634015954636,4.036019927841898E-3,2.871777399350554E-2]
[null,"MONUMENT COORDINATES",null,"NORTHING","EASTING","ELEVATION","FEATURE CODE",null,null,null,null,null,null,9,0.15707963267948966,4.5365994861666951E-3,2.8642961877258996E-2]
[null,{"$f":"GPS_IMPORT!J6&\" (GRID)\"","v":"U.S. Survey FT (GRID)"},null,{"$f":"IF(GPS_IMPORT!K2,($E$22*GPS_IMPORT!$L$6)*(1/REPORT!C13),$E$22*GPS_IMPORT!$L$6)","v":0},{"$f":"IF(GPS_IMPORT!K2,($F$22*GPS_IMPORT!$L$6)*(1/REPORT!C13),$F$22*GPS_IMPORT!$L$6)","v":0},{"$f":"IF($C$32=\"N/A\",($G$22*GPS_IMPORT!$L$6),$C$32*'LEVEL RUN'!H5)","v":0},{"$f":"VLOOKUP($B$5,GPS_IMPORT!$A$2:$G$2000,7,FALSE)","v":{"$error":"#N/A"}},null,null,null,null,null,null,10,0.17453292519943295,5.03579715234098E-3,2.8559424837354033E-2]
[null,{"$f":"GPS_IMPORT!J6&\" (GROUND)\"","v":"U.S. Survey FT (GROUND)"},null,{"$f":"IF(GPS_IMPORT!K2,$E$22*GPS_IMPORT!$L$6,$E$22*GPS_IMPORT!$L$6*REPORT!C13)","v":0},{"$f":"IF(GPS_IMPORT!K2,$F$22*GPS_IMPORT!$L$6,$F$22*GPS_IMPORT!$L$6*REPORT!C13)","v":0},{"$f":"IF($C$32=\"N/A\",($G$22*GPS_IMPORT!$L$6),$C$32*'LEVEL RUN'!H5)","v":0},{"$f":"$G$38","v":{"$error":"#N/A"}},null,null,null,null,null,null,11,0.19198621771937624,5.5334608659197999E-3,2.8467188319982257E-2]
[null,null,null,null,null,null,null,null,null,null,null,null,null,12,0.20943951023931956,6.0294390337150214E-3,2.8366280421280365E-2]
["∆ North,  ∆ East, and ∆ Ht. are the difference between the average northing, easting, and height for each observation.",null,null,null,null,null,null,null,"Mask Angle:","10°",null,null,null,13,0.22689280275926285,6.5235805759720853E-3,2.8256731878771823E-2]
[null,null,null,null,null,null,null,null,null,null,null,null,null,14,0.24434609527920614,7.0157349723903644E-3,2.81385760620039E-2]
[null,null,null,null,null,null,null,null,null,null,null,null,null,15,0.26179938779914941,7.505752307973102E-3,2.8011848962382981E-2]
[null,null,null,null,null,null,null,null,null,null,null,null,null,16,0.27925268031909273,7.9934833186929757E-3,2.787658918221125E-2]
[null,null,null,null,null,null,null,null,null,null,null,null,null,17,0.29670597283903605,8.4787794369593668E-3,2.7732837922928029E-2]
[null,null,null,null,null,null,null,null,null,null,null,null,null,18,0.31415926535897931,8.9614928368734748E-3,2.7580638972559454E-2]
[null,null,null,null,null,null,null,null,null,null,null,null,null,19,0.33161255787892263,9.4414764792575441E-3,2.7420038692380189E-2]
[null,null,null,null,null,null,null,null,null,null,null,null,null,20,0.3490658503988659,9.9185841564443933E-3,2.7251086002791344E-2]
[null,null,null,null,null,null,null,null,null,null,null,null,null,21,0.36651914291880922,1.0392670536813708E-2,2.7073832368418854E-2]
[null,null,null,null,null,null,null,null,null,null,null,null,null,22,0.38397243543875248,1.0863591209061449E-2,2.6888331782436835E-2]
[null,null,null,null,null,null,null,null,null,null,null,null,null,23,0.4014257279586958,1.1331202726188939E-2,2.6694640750120773E-2]
[null,null,null,null,null,null,null,null,null,null,null,null,null,24,0.41887902047863912,1.1795362649198206E-2,2.6492818271635427E-2]
[null,null,null,null,null,null,null,null,null,null,null,null,null,25,0.43633231299858238,1.2255929590480285E-2,2.6282925824062848E-2]
[null,null,null,null,null,null,null,null,null,null,null,null,null,26,0.4537856055185257,1.2712763256883246E-2,2.6065027342675847E-2]
[null,null,null,null,null,null,null,null,null,null,null,null,null,27,0.47123889803846897,1.3165724492446856E-2,2.5839189201462671E-2]
[null,null,null,null,null,null,null,null,null,null,null,null,null,28,0.48869219055841229,1.3614675320790835E-2,2.5605480192908883E-2]
[null,null,null,null,null,null,null,null,null,null,null,null,null,29,0.50614548307835561,1.4059478987143775E-2,2.5363971507042476E-2]
[null,null,null,null,null,null,null,null,null,null,null,null,null,30,0.52359877559829882,1.4499999999999999E-2,2.5114736709748724E-2]
[null,null,null,null,null,null,null,null,null,null,null,null,null,31,0.54105206811824214,1.4936104172391572E-2,2.485785172036126E-2]
[null,null,null,null,null,null,null,null,null,null,null,null,null,32,0.55850536063818546,1.5367658662762943E-2,2.4593394788536355E-2]
[null,null,null,null,null,null,null,null,null,null,null,null,null,33,0.57595865315812877,1.5794532015435785E-2,2.4321446470417299E-2]
[null,null,null,null,null,null,null,null,null,null,null,null,null,34,0.59341194567807209,1.6216594200651663E-2,2.404208960409621E-2]
[null,null,null,null,null,null,null,null,null,null,null,null,null,35,0.6108652381980153,1.6633716654180335E-2,2.3755409284380764E-2]
[null,null,null,null,null,null,null,null,null,null,null,null,null,36,0.62831853071795862,1.7045772316481723E-2,2.3461492836873477E-2]
[null,null,null,null,null,null,null,null,null,null,null,null,null,37,0.64577182323790194,1.7452635671409401E-2,2.3160429791371492E-2]
[null,null,null,null,null,null,null,null,null,null,null,null,null,38,0.66322511575784526,1.7854182784444093E-2,2.2852311854594937E-2]
[null,null,null,null,null,null,null,null,null,null,null,null,null,39,0.68067840827778847,1.8250291340445285E-2,2.2537232882252158E-2]
[null,null,null,null,null,null,null,null,null,null,null,null,null,40,0.69813170079773179,1.864084068090964E-2,2.2215288850450363E-2]
[null,null,null,null,null,null,null,null,null,null,null,null,null,41,0.71558499331767511,1.9025711840724713E-2,2.1886577826460391E-2]
[null,null,null,null,null,null,null,null,null,null,null,null,null,42,0.73303828583761843,1.9404787584406891E-2,2.1551199938844433E-2]
[null,null,null,null,null,null,null,null,null,null,null,null,null,43,0.75049157835756175,1.9777952441812456E-2,2.1209257346955945E-2]
[null,null,null,null,null,null,null,null,null,null,null,null,null,44,0.76794487087750496,2.0145092743310923E-2,2.0860854209820884E-2]
[null,null,null,null,null,null,null,null,null,null,null,null,null,45,0.78539816339744828,2.0506096654409878E-2,2.0506096654409882E-2]
[null,null,null,null,null,null,null,null,null,null,null,null,null,46,0.8028514559173916,2.0860854209820881E-2,2.0145092743310923E-2]
[null,null,null,null,null,null,null,null,null,null,null,null,null,47,0.82030474843733492,2.1209257346955945E-2,1.9777952441812456E-2]
[null,null,null,null,null,null,null,null,null,null,null,null,null,48,0.83775804095727824,2.1551199938844433E-2,1.9404787584406891E-2]
[null,null,null,null,null,null,null,null,null,null,null,null,null,49,0.85521133347722145,2.1886577826460391E-2,1.9025711840724713E-2]
[null,null,null,null,null,null,null,null,null,null,null,null,null,50,0.87266462599716477,2.2215288850450363E-2,1.8640840680909643E-2]
[null,null,null,null,null,null,null,null,null,null,null,null,null,51,0.89011791851710809,2.2537232882252158E-2,1.8250291340445288E-2]
[null,null,null,null,null,null,null,null,null,null,null,null,null,52,0.90757121103705141,2.285231185459494E-2,1.7854182784444093E-2]
[null,null,null,null,null,null,null,null,null,null,null,null,null,53,0.92502450355699462,2.3160429791371492E-2,1.7452635671409405E-2]
[null,null,null,null,null,null,null,null,null,null,null,null,null,54,0.94247779607693793,2.3461492836873477E-2,1.7045772316481723E-2]
[null,null,null,null,null,null,null,null,null,null,null,null,null,55,0.95993108859688125,2.3755409284380764E-2,1.6633716654180338E-2]
[null,null,null,null,null,null,null,null,null,null,null,null,null,56,0.97738438111682457,2.4042089604096213E-2,1.6216594200651659E-2]
[null,null,null,null,null,null,null,null,null,null,null,null,null,57,0.99483767363676789,2.4321446470417299E-2,1.5794532015435785E-2]
[null,null,null,null,null,null,null,null,null,null,null,null,null,58,1.0122909661567112,2.4593394788536355E-2,1.5367658662762943E-2]
[null,null,null,null,null,null,null,null,null,null,null,null,null,59,1.0297442586766545,2.485785172036126E-2,1.4936104172391572E-2]
[null,null,null,null,null,null,null,null,null,null,null,null,null,60,1.0471975511965976,2.511473670974872E-2,1.4500000000000004E-2]
[null,null,null,null,null,null,null,null,null,null,null,null,null,61,1.064650843716541,2.5363971507042476E-2,1.4059478987143777E-2]
[null,null,null,null,null,null,null,null,null,null,null,null,null,62,1.0821041362364843,2.560548019290888E-2,1.3614675320790836E-2]
[null,null,null,null,null,null,null,null,null,null,null,null,null,63,1.0995574287564276,2.5839189201462668E-2,1.3165724492446858E-2]
[null,null,null,null,null,null,null,null,null,null,null,null,null,64,1.1170107212763709,2.6065027342675847E-2,1.2712763256883248E-2]
[null,null,null,null,null,null,null,null,null,null,null,null,null,65,1.1344640137963142,{"$f":"SIN(O93)*H$24","v":2.6282925824062848E-2},{"$f":"COS(O93)*H$24","v":1.2255929590480285E-2}]
[null,null,null,null,null,null,null,null,null,null,null,null,null,66,{"$f":"N94*(PI()/180)","v":1.1519173063162575},2.6492818271635427E-2,1.1795362649198206E-2]
[null,null,null,null,null,null,null,null,null,null,null,null,null,{"$f":"N94+1","v":67},1.1693705988362009,2.6694640750120773E-2,1.1331202726188939E-2]
[null,null,null,null,null,null,null,null,null,null,null,null,null,68,1.1868238913561442,2.6888331782436835E-2,1.0863591209061448E-2]
[null,null,null,null,null,null,null,null,null,null,null,null,null,69,1.2042771838760873,2.7073832368418854E-2,1.0392670536813711E-2]
[null,null,null,null,null,null,null,null,null,null,null,null,null,70,1.2217304763960306,2.7251086002791344E-2,9.9185841564443968E-3]
[null,null,null,null,null,null,null,null,null,null,null,null,null,71,1.2391837689159739,2.7420038692380185E-2,9.4414764792575458E-3]
[null,null,null,null,null,null,null,null,null,null,null,null,null,72,1.2566370614359172,2.7580638972559454E-2,8.9614928368734765E-3]
[null,null,null,null,null,null,null,null,null,null,null,null,null,73,1.2740903539558606,2.7732837922928029E-2,8.4787794369593668E-3]
[null,null,null,null,null,null,null,null,null,null,null,null,null,74,1.2915436464758039,2.787658918221125E-2,7.9934833186929757E-3]
[null,null,null,null,null,null,null,null,null,null,null,null,null,75,1.3089969389957472,2.8011848962382981E-2,7.505752307973102E-3]
[null,null,null,null,null,null,null,null,null,null,null,null,null,76,1.3264502315156905,2.81385760620039E-2,7.0157349723903627E-3]
[null,null,null,null,null,null,null,null,null,null,null,null,null,77,1.3439035240356338,2.8256731878771823E-2,6.5235805759720827E-3]
[null,null,null,null,null,null,null,null,null,null,null,null,null,78,1.3613568165555769,2.8366280421280362E-2,6.0294390337150248E-3]
[null,null,null,null,null,null,null,null,null,null,null,null,null,79,1.3788101090755203,2.8467188319982257E-2,5.5334608659198025E-3]
[null,null,null,null,null,null,null,null,null,null,null,null,null,80,1.3962634015954636,2.8559424837354033E-2,5.0357971523409826E-3]
[null,null,null,null,null,null,null,null,null,null,null,null,null,81,1.4137166941154069,2.8642961877258996E-2,4.5365994861666968E-3]
[null,null,null,null,null,null,null,null,null,null,null,null,null,82,1.4311699866353502,2.871777399350554E-2,4.0360199278418989E-3]
[null,null,null,null,null,null,null,null,null,null,null,null,null,83,1.4486232791552935,2.8783838397598339E-2,3.5342109587492773E-3]
[null,null,null,null,null,null,null,null,null,null,null,null,null,84,1.4660765716752369,2.8841134965679926E-2,3.0313254347619505E-3]
[null,null,null,null,null,null,null,null,null,null,null,null,null,85,1.4835298641951802,2.8889646244660623E-2,2.527516539682086E-3]
[null,null,null,null,null,null,null,null,null,null,null,null,null,86,1.5009831567151235,2.8929357457534902E-2,2.0229377385796317E-3]
[null,null,null,null,null,null,null,null,null,null,null,null,null,87,1.5184364492350666,2.8960256507882642E-2,1.5177427310453752E-3]
[null,null,null,null,null,null,null,null,null,null,null,null,null,88,1.5358897417550099,2.8982333983553779E-2,1.0120854043725314E-3]
[null,null,null,null,null,null,null,null,null,null,null,null,null,89,1.5533430342749532,2.8995583159535349E-2,5.0611978668122436E-4]
[null,null,null,null,null,null,null,null,null,null,null,null,null,90,1.5707963267948966,2.9000000000000001E-2,1.7764652596174992E-18]
[null,null,null,null,null,null,null,null,null,null,null,null,null,91,1.5882496193148399,2.8995583159535349E-2,-5.061197866812209E-4]
[null,null,null,null,null,null,null,null,null,null,null,null,null,92,1.6057029118347832,2.8982333983553779E-2,-1.0120854043725277E-3]
[null,null,null,null,null,null,null,null,null,null,null,null,null,93,1.6231562043547265,2.8960256507882642E-2,-1.5177427310453715E-3]
[null,null,null,null,null,null,null,null,null,null,null,null,null,94,1.6406094968746698,2.8929357457534902E-2,-2.0229377385796348E-3]
[null,null,null,null,null,null,null,null,null,null,null,null,null,95,1.6580627893946132,2.8889646244660623E-2,-2.527516539682089E-3]
[null,null,null,null,null,null,null,null,null,null,null,null,null,96,1.6755160819145565,2.8841134965679926E-2,-3.0313254347619531E-3]
[null,null,null,null,null,null,null,null,null,null,null,null,null,97,1.6929693744344996,2.8783838397598342E-2,-3.5342109587492739E-3]
[null,null,null,null,null,null,null,null,null,null,null,null,null,98,1.7104226669544429,2.871777399350554E-2,-4.0360199278418954E-3]
[null,null,null,null,null,null,null,null,null,null,null,null,null,99,1.7278759594743862,2.8642961877258996E-2,-4.5365994861666942E-3]
[null,null,null,null,null,null,null,null,null,null,null,null,null,100,1.7453292519943295,2.8559424837354033E-2,-5.0357971523409791E-3]
[null,null,null,null,null,null,null,null,null,null,null,null,null,101,1.7627825445142729,2.8467188319982257E-2,-5.5334608659197999E-3]
[null,null,null,null,null,null,null,null,null,null,null,null,null,102,1.7802358370342162,2.8366280421280365E-2,-6.0294390337150214E-3]
[null,null,null,null,null,null,null,null,null,null,null,null,null,103,1.7976891295541595,2.8256731878771823E-2,-6.5235805759720862E-3]
[null,null,null,null,null,null,null,null,null,null,null,null,null,104,1.8151424220741028,2.81385760620039E-2,-7.0157349723903662E-3]
[null,null,null,null,null,null,null,null,null,null,null,null,null,105,1.8325957145940461,2.8011848962382981E-2,-7.5057523079731054E-3]
[null,null,null,null,null,null,null,null,null,null,null,null,null,106,1.8500490071139892,2.787658918221125E-2,-7.9934833186929722E-3]
[null,null,null,null,null,null,null,null,null,null,null,null,null,107,1.8675022996339325,2.7732837922928032E-2,-8.4787794369593633E-3]
[null,null,null,null,null,null,null,null,null,null,null,null,null,108,1.8849555921538759,2.7580638972559458E-2,-8.961492836873473E-3]
[null,null,null,null,null,null,null,null,null,null,null,null,null,109,1.9024088846738192,2.7420038692380189E-2,-9.4414764792575424E-3]
[null,null,null,null,null,null,null,null,null,null,null,null,null,110,1.9198621771937625,2.7251086002791344E-2,-9.9185841564443933E-3]
[null,null,null,null,null,null,null,null,null,null,null,null,null,111,1.9373154697137058,2.7073832368418854E-2,-1.0392670536813708E-2]
[null,null,null,null,null,null,null,null,null,null,null,null,null,112,1.9547687622336491,2.6888331782436835E-2,-1.0863591209061451E-2]
[null,null,null,null,null,null,null,null,null,null,null,null,null,113,1.9722220547535925,2.669464075012077E-2,-1.1331202726188939E-2]
[null,null,null,null,null,null,null,null,null,null,null,null,null,114,1.9896753472735358,2.6492818271635427E-2,-1.1795362649198208E-2]
[null,null,null,null,null,null,null,null,null,null,null,null,null,115,2.0071286397934789,2.6282925824062851E-2,-1.2255929590480281E-2]
[null,null,null,null,null,null,null,null,null,null,null,null,null,116,2.0245819323134224,2.6065027342675844E-2,-1.2712763256883249E-2]
[null,null,null,null,null,null,null,null,null,null,null,null,null,117,2.0420352248333655,2.5839189201462671E-2,-1.3165724492446854E-2]
[null,null,null,null,null,null,null,null,null,null,null,null,null,118,2.0594885173533091,2.560548019290888E-2,-1.3614675320790838E-2]
[null,null,null,null,null,null,null,null,null,null,null,null,null,119,2.0769418098732522,2.536397150704248E-2,-1.4059478987143773E-2]
[null,null,null,null,null,null,null,null,null,null,null,null,null,120,2.0943951023931953,2.5114736709748724E-2,-1.4499999999999994E-2]
[null,null,null,null,null,null,null,null,null,null,null,null,null,121,2.1118483949131388,2.485785172036126E-2,-1.4936104172391574E-2]
[null,null,null,null,null,null,null,null,null,null,null,null,null,122,2.1293016874330819,2.4593394788536359E-2,-1.5367658662762939E-2]
[null,null,null,null,null,null,null,null,null,null,null,null,null,123,2.1467549799530254,2.4321446470417295E-2,-1.5794532015435785E-2]
[null,null,null,null,null,null,null,null,null,null,null,null,null,124,2.1642082724729685,2.4042089604096213E-2,-1.6216594200651656E-2]
[null,null,null,null,null,null,null,null,null,null,null,null,null,125,2.1816615649929121,2.375540928438076E-2,-1.6633716654180338E-2]
[null,null,null,null,null,null,null,null,null,null,null,null,null,126,2.1991148575128552,2.3461492836873477E-2,-1.704577231648172E-2]
[null,null,null,null,null,null,null,null,null,null,null,null,null,127,2.2165681500327987,2.3160429791371489E-2,-1.7452635671409405E-2]
[null,null,null,null,null,null,null,null,null,null,null,null,null,128,2.2340214425527418,2.285231185459494E-2,-1.7854182784444093E-2]
[null,null,null,null,null,null,null,null,null,null,null,null,null,129,2.2514747350726849,{"$f":"SIN(O157)*H$24","v":2.2537232882252161E-2},{"$f":"COS(O157)*H$24","v":-1.8250291340445281E-2}]
[null,null,null,null,null,null,null,null,null,null,null,null,null,130,{"$f":"N158*(PI()/180)","v":2.2689280275926285},2.2215288850450363E-2,-1.8640840680909643E-2]
[null,null,null,null,null,null,null,null,null,null,null,null,null,{"$f":"N158+1","v":131},2.2863813201125716,2.1886577826460394E-2,-1.9025711840724709E-2]
[null,null,null,null,null,null,null,null,null,null,null,null,null,132,2.3038346126325151,2.1551199938844433E-2,-1.9404787584406891E-2]
[null,null,null,null,null,null,null,null,null,null,null,null,null,133,2.3212879051524582,2.1209257346955949E-2,-1.9777952441812453E-2]
[null,null,null,null,null,null,null,null,null,null,null,null,null,134,2.3387411976724017,2.0860854209820881E-2,-2.0145092743310923E-2]
[null,null,null,null,null,null,null,null,null,null,null,null,null,135,2.3561944901923448,2.0506096654409882E-2,-2.0506096654409878E-2]
[null,null,null,null,null,null,null,null,null,null,null,null,null,136,2.3736477827122884,2.014509274331092E-2,-2.0860854209820884E-2]
[null,null,null,null,null,null,null,null,null,null,null,null,null,137,2.3911010752322315,1.977795244181246E-2,-2.1209257346955945E-2]
[null,null,null,null,null,null,null,null,null,null,null,null,null,138,2.4085543677521746,1.9404787584406894E-2,-2.1551199938844429E-2]
[null,null,null,null,null,null,null,null,null,null,null,null,null,139,2.4260076602721181,1.9025711840724713E-2,-2.1886577826460391E-2]
[null,null,null,null,null,null,null,null,null,null,null,null,null,140,2.4434609527920612,1.8640840680909647E-2,-2.2215288850450359E-2]
[null,null,null,null,null,null,null,null,null,null,null,null,null,141,2.4609142453120048,1.8250291340445285E-2,-2.2537232882252158E-2]
[null,null,null,null,null,null,null,null,null,null,null,null,null,142,2.4783675378319479,1.7854182784444096E-2,-2.2852311854594937E-2]
[null,null,null,null,null,null,null,null,null,null,null,null,null,143,2.4958208303518914,1.7452635671409398E-2,-2.3160429791371496E-2]
[null,null,null,null,null,null,null,null,null,null,null,null,null,144,2.5132741228718345,1.7045772316481723E-2,-2.3461492836873474E-2]
[null,null,null,null,null,null,null,null,null,null,null,null,null,145,2.530727415391778,1.6633716654180335E-2,-2.3755409284380767E-2]
[null,null,null,null,null,null,null,null,null,null,null,null,null,146,2.5481807079117211,1.6216594200651663E-2,-2.404208960409621E-2]
[null,null,null,null,null,null,null,null,null,null,null,null,null,147,2.5656340004316642,1.5794532015435792E-2,-2.4321446470417295E-2]
[null,null,null,null,null,null,null,null,null,null,null,null,null,148,2.5830872929516078,1.5367658662762943E-2,-2.4593394788536355E-2]
[null,null,null,null,null,null,null,null,null,null,null,null,null,149,2.6005405854715509,1.4936104172391577E-2,-2.4857851720361257E-2]
[null,null,null,null,null,null,null,null,null,null,null,null,null,150,2.6179938779914944,1.4499999999999999E-2,-2.5114736709748724E-2]
[null,null,null,null,null,null,null,null,null,null,null,null,null,151,2.6354471705114375,1.4059478987143778E-2,-2.5363971507042476E-2]
[null,null,null,null,null,null,null,null,null,null,null,null,null,152,2.6529004630313811,1.3614675320790831E-2,-2.5605480192908883E-2]
[null,null,null,null,null,null,null,null,null,null,null,null,null,153,2.6703537555513241,1.316572449244686E-2,-2.5839189201462668E-2]
[null,null,null,null,null,null,null,null,null,null,null,null,null,154,2.6878070480712677,1.2712763256883242E-2,-2.6065027342675847E-2]
[null,null,null,null,null,null,null,null,null,null,null,null,null,155,2.7052603405912108,1.2255929590480287E-2,-2.6282925824062848E-2]
[null,null,null,null,null,null,null,null,null,null,null,null,null,156,2.7227136331111539,1.1795362649198213E-2,-2.6492818271635424E-2]
[null,null,null,null,null,null,null,null,null,null,null,null,null,157,2.7401669256310974,1.1331202726188939E-2,-2.6694640750120773E-2]
[null,null,null,null,null,null,null,null,null,null,null,null,null,158,2.7576202181510405,1.0863591209061456E-2,-2.6888331782436832E-2]
[null,null,null,null,null,null,null,null,null,null,null,null,null,159,2.7750735106709841,1.0392670536813706E-2,-2.7073832368418854E-2]
[null,null,null,null,null,null,null,null,null,null,null,null,null,160,2.7925268031909272,9.9185841564443985E-3,-2.7251086002791344E-2]
[null,null,null,null,null,null,null,null,null,null,null,null,null,161,2.8099800957108707,9.4414764792575424E-3,-2.7420038692380189E-2]
[null,null,null,null,null,null,null,null,null,null,null,null,null,162,2.8274333882308138,8.9614928368734782E-3,-2.7580638972559454E-2]
[null,null,null,null,null,null,null,null,null,null,null,null,null,163,2.8448866807507573,8.4787794369593616E-3,-2.7732837922928032E-2]
[null,null,null,null,null,null,null,null,null,null,null,null,null,164,2.8623399732707004,7.9934833186929774E-3,-2.787658918221125E-2]
[null,null,null,null,null,null,null,null,null,null,null,null,null,165,2.8797932657906435,7.5057523079731098E-3,-2.8011848962382978E-2]
[null,null,null,null,null,null,null,null,null,null,null,null,null,166,2.8972465583105871,7.0157349723903644E-3,-2.81385760620039E-2]
[null,null,null,null,null,null,null,null,null,null,null,null,null,167,2.9146998508305302,6.5235805759720914E-3,-2.8256731878771819E-2]
[null,null,null,null,null,null,null,null,null,null,null,null,null,168,2.9321531433504737,6.0294390337150205E-3,-2.8366280421280365E-2]
[null,null,null,null,null,null,null,null,null,null,null,null,null,169,2.9496064358704168,5.5334608659198042E-3,-2.8467188319982257E-2]
[null,null,null,null,null,null,null,null,null,null,null,null,null,170,2.9670597283903604,5.0357971523409782E-3,-2.8559424837354033E-2]
[null,null,null,null,null,null,null,null,null,null,null,null,null,171,2.9845130209103035,4.5365994861666986E-3,-2.8642961877258993E-2]
[null,null,null,null,null,null,null,null,null,null,null,null,null,172,3.001966313430247,4.0360199278418945E-3,-2.871777399350554E-2]
[null,null,null,null,null,null,null,null,null,null,null,null,null,173,3.0194196059501901,3.5342109587492791E-3,-2.8783838397598339E-2]
[null,null,null,null,null,null,null,null,null,null,null,null,null,174,3.0368728984701332,3.0313254347619583E-3,-2.8841134965679926E-2]
[null,null,null,null,null,null,null,null,null,null,null,null,null,175,3.0543261909900767,2.5275165396820877E-3,-2.8889646244660623E-2]
[null,null,null,null,null,null,null,null,null,null,null,null,null,176,3.0717794835100198,2.0229377385796404E-3,-2.8929357457534902E-2]
[null,null,null,null,null,null,null,null,null,null,null,null,null,177,3.0892327760299634,1.5177427310453704E-3,-2.8960256507882642E-2]
[null,null,null,null,null,null,null,null,null,null,null,null,null,178,3.1066860685499065,1.0120854043725331E-3,-2.8982333983553779E-2]
[null,null,null,null,null,null,null,null,null,null,null,null,null,179,3.12413936106985,5.061197866812197E-4,-2.8995583159535349E-2]
[null,null,null,null,null,null,null,null,null,null,null,null,null,180,3.1415926535897931,3.5529305192349984E-18,-2.9000000000000001E-2]
[null,null,null,null,null,null,null,null,null,null,null,null,null,181,3.1590459461097367,-5.0611978668122545E-4,-2.8995583159535349E-2]
[null,null,null,null,null,null,null,null,null,null,null,null,null,182,3.1764992386296798,-1.0120854043725262E-3,-2.8982333983553779E-2]
[null,null,null,null,null,null,null,null,null,null,null,null,null,183,3.1939525311496229,-1.5177427310453632E-3,-2.8960256507882642E-2]
[null,null,null,null,null,null,null,null,null,null,null,null,null,184,3.2114058236695664,-2.022937738579633E-3,-2.8929357457534902E-2]
[null,null,null,null,null,null,null,null,null,null,null,null,null,185,3.2288591161895095,-2.5275165396820803E-3,-2.8889646244660623E-2]
[null,null,null,null,null,null,null,null,null,null,null,null,null,186,3.246312408709453,-3.0313254347619518E-3,-2.8841134965679926E-2]
[null,null,null,null,null,null,null,null,null,null,null,null,null,187,3.2637657012293961,-3.5342109587492721E-3,-2.8783838397598342E-2]
[null,null,null,null,null,null,null,null,null,null,null,null,null,188,3.2812189937493397,-4.0360199278419006E-3,-2.871777399350554E-2]
[null,null,null,null,null,null,null,null,null,null,null,null,null,189,3.2986722862692828,-4.5365994861666916E-3,-2.8642961877258996E-2]
[null,null,null,null,null,null,null,null,null,null,null,null,null,190,3.3161255787892263,-5.0357971523409843E-3,-2.8559424837354033E-2]
[null,null,null,null,null,null,null,null,null,null,null,null,null,191,3.3335788713091694,-5.5334608659197973E-3,-2.8467188319982257E-2]
[null,null,null,null,null,null,null,null,null,null,null,null,null,192,3.351032163829113,-6.0294390337150257E-3,-2.8366280421280362E-2]
[null,null,null,null,null,null,null,null,null,null,null,null,null,193,3.3684854563490561,{"$f":"SIN(O221)*H$24","v":-6.5235805759720844E-3},{"$f":"COS(O221)*H$24","v":-2.8256731878771823E-2}]
[null,null,null,null,null,null,null,null,null,null,null,null,null,194,{"$f":"N222*(PI()/180)","v":3.3859387488689991},-7.0157349723903584E-3,-2.81385760620039E-2]
[null,null,null,null,null,null,null,null,null,null,null,null,null,{"$f":"N222+1","v":195},3.4033920413889427,-7.5057523079731037E-3,-2.8011848962382981E-2]
[null,null,null,null,null,null,null,null,null,null,null,null,null,196,3.4208453339088858,-7.9934833186929705E-3,-2.787658918221125E-2]
[null,null,null,null,null,null,null,null,null,null,null,null,null,197,3.4382986264288293,-8.4787794369593668E-3,-2.7732837922928029E-2]
[null,null,null,null,null,null,null,null,null,null,null,null,null,198,3.4557519189487724,-8.9614928368734713E-3,-2.7580638972559458E-2]
[null,null,null,null,null,null,null,null,null,null,null,null,null,199,3.473205211468716,-9.4414764792575458E-3,-2.7420038692380185E-2]
[null,null,null,null,null,null,null,null,null,null,null,null,null,200,3.4906585039886591,-9.9185841564443916E-3,-2.7251086002791344E-2]
[null,null,null,null,null,null,null,null,null,null,null,null,null,201,3.5081117965086026,-1.0392670536813713E-2,-2.7073832368418854E-2]
[null,null,null,null,null,null,null,null,null,null,null,null,null,202,3.5255650890285457,-1.0863591209061449E-2,-2.6888331782436835E-2]
[null,null,null,null,null,null,null,null,null,null,null,null,null,203,3.5430183815484888,-1.1331202726188934E-2,-2.6694640750120773E-2]
[null,null,null,null,null,null,null,null,null,null,null,null,null,204,3.5604716740684323,-1.1795362649198206E-2,-2.6492818271635427E-2]
[null,null,null,null,null,null,null,null,null,null,null,null,null,205,3.5779249665883754,-1.225592959048028E-2,-2.6282925824062851E-2]
[null,null,null,null,null,null,null,null,null,null,null,null,null,206,3.595378259108319,-1.2712763256883248E-2,-2.6065027342675844E-2]
[null,null,null,null,null,null,null,null,null,null,null,null,null,207,3.6128315516282621,-1.3165724492446854E-2,-2.5839189201462671E-2]
[null,null,null,null,null,null,null,null,null,null,null,null,null,208,3.6302848441482056,-1.3614675320790836E-2,-2.560548019290888E-2]
[null,null,null,null,null,null,null,null,null,null,null,null,null,209,3.6477381366681487,-1.4059478987143771E-2,-2.536397150704248E-2]
[null,null,null,null,null,null,null,null,null,null,null,null,null,210,3.6651914291880923,-1.4500000000000004E-2,-2.511473670974872E-2]
[null,null,null,null,null,null,null,null,null,null,null,null,null,211,3.6826447217080354,-1.4936104172391572E-2,-2.485785172036126E-2]
[null,null,null,null,null,null,null,null,null,null,null,null,null,212,3.7000980142279785,-1.5367658662762939E-2,-2.4593394788536359E-2]
[null,null,null,null,null,null,null,null,null,null,null,null,null,213,3.717551306747922,-1.5794532015435785E-2,-2.4321446470417299E-2]
[null,null,null,null,null,null,null,null,null,null,null,null,null,214,3.7350045992678651,-1.6216594200651656E-2,-2.4042089604096213E-2]
[null,null,null,null,null,null,null,null,null,null,null,null,null,215,3.7524578917878086,-1.6633716654180338E-2,-2.3755409284380764E-2]
[null,null,null,null,null,null,null,null,null,null,null,null,null,216,3.7699111843077517,-1.704577231648172E-2,-2.3461492836873481E-2]
[null,null,null,null,null,null,null,null,null,null,null,null,null,217,3.7873644768276953,-1.7452635671409405E-2,-2.3160429791371492E-2]
[null,null,null,null,null,null,null,null,null,null,null,null,null,218,3.8048177693476384,-1.7854182784444089E-2,-2.285231185459494E-2]
[null,null,null,null,null,null,null,null,null,null,null,null,null,219,3.8222710618675819,-1.8250291340445292E-2,-2.2537232882252154E-2]
[null,null,null,null,null,null,null,null,null,null,null,null,null,220,3.839724354387525,-1.864084068090964E-2,-2.2215288850450363E-2]
[null,null,null,null,null,null,null,null,null,null,null,null,null,221,3.8571776469074681,-1.9025711840724706E-2,-2.1886577826460394E-2]
[null,null,null,null,null,null,null,null,null,null,null,null,null,222,3.8746309394274117,-1.9404787584406891E-2,-2.1551199938844433E-2]
[null,null,null,null,null,null,null,null,null,null,null,null,null,223,3.8920842319473548,-1.9777952441812453E-2,-2.1209257346955949E-2]
[null,null,null,null,null,null,null,null,null,null,null,null,null,224,3.9095375244672983,-2.0145092743310923E-2,-2.0860854209820881E-2]
[null,null,null,null,null,null,null,null,null,null,null,null,null,225,3.9269908169872414,-2.0506096654409878E-2,-2.0506096654409885E-2]
[null,null,null,null,null,null,null,null,null,null,null,null,null,226,3.9444441095071849,-2.0860854209820884E-2,-2.0145092743310923E-2]
[null,null,null,null,null,null,null,null,null,null,null,null,null,227,3.961897402027128,-2.1209257346955945E-2,-1.977795244181246E-2]
[null,null,null,null,null,null,null,null,null,null,null,null,null,228,3.9793506945470716,-2.1551199938844436E-2,-1.9404787584406887E-2]
[null,null,null,null,null,null,null,null,null,null,null,null,null,229,3.9968039870670147,-2.1886577826460391E-2,-1.9025711840724713E-2]
[null,null,null,null,null,null,null,null,null,null,null,null,null,230,4.0142572795869578,-2.2215288850450359E-2,-1.8640840680909647E-2]
[null,null,null,null,null,null,null,null,null,null,null,null,null,231,4.0317105721069009,-2.2537232882252147E-2,-1.8250291340445299E-2]
[null,null,null,null,null,null,null,null,null,null,null,null,null,232,4.0491638646268449,-2.2852311854594944E-2,-1.7854182784444086E-2]
[null,null,null,null,null,null,null,null,null,null,null,null,null,233,4.066617157146788,-2.3160429791371492E-2,-1.7452635671409401E-2]
[null,null,null,null,null,null,null,null,null,null,null,null,null,234,4.0840704496667311,-2.3461492836873474E-2,-1.7045772316481723E-2]
[null,null,null,null,null,null,null,null,null,null,null,null,null,235,4.1015237421866741,-2.3755409284380757E-2,-1.6633716654180345E-2]
[null,null,null,null,null,null,null,null,null,null,null,null,null,236,4.1189770347066181,-2.4042089604096213E-2,-1.6216594200651652E-2]
[null,null,null,null,null,null,null,null,null,null,null,null,null,237,4.1364303272265612,-2.4321446470417299E-2,-1.5794532015435785E-2]
[null,null,null,null,null,null,null,null,null,null,null,null,null,238,4.1538836197465043,-2.4593394788536355E-2,-1.5367658662762946E-2]
[null,null,null,null,null,null,null,null,null,null,null,null,null,239,4.1713369122664474,-2.4857851720361254E-2,-1.4936104172391581E-2]
[null,null,null,null,null,null,null,null,null,null,null,null,null,240,4.1887902047863905,-2.5114736709748713E-2,-1.4500000000000013E-2]
[null,null,null,null,null,null,null,null,null,null,null,null,null,241,4.2062434973063345,-2.5363971507042483E-2,-1.405947898714377E-2]
[null,null,null,null,null,null,null,null,null,null,null,null,null,242,4.2236967898262776,-2.5605480192908883E-2,-1.3614675320790833E-2]
[null,null,null,null,null,null,null,null,null,null,null,null,null,243,4.2411500823462207,-2.5839189201462668E-2,-1.3165724492446861E-2]
[null,null,null,null,null,null,null,null,null,null,null,null,null,244,4.2586033748661638,-2.606502734267584E-2,-1.2712763256883254E-2]
[null,null,null,null,null,null,null,null,null,null,null,null,null,245,4.2760566673861078,-2.6282925824062851E-2,-1.2255929590480276E-2]
[null,null,null,null,null,null,null,null,null,null,null,null,null,246,4.2935099599060509,-2.6492818271635431E-2,-1.1795362649198204E-2]
[null,null,null,null,null,null,null,null,null,null,null,null,null,247,4.310963252425994,-2.669464075012077E-2,-1.1331202726188941E-2]
[null,null,null,null,null,null,null,null,null,null,null,null,null,248,4.3284165449459371,-2.6888331782436832E-2,-1.0863591209061456E-2]
[null,null,null,null,null,null,null,null,null,null,null,null,null,249,4.3458698374658802,-2.707383236841885E-2,-1.0392670536813722E-2]
[null,null,null,null,null,null,null,null,null,null,null,null,null,250,4.3633231299858242,-2.7251086002791344E-2,-9.9185841564443881E-3]
[null,null,null,null,null,null,null,null,null,null,null,null,null,251,4.3807764225057673,-2.7420038692380189E-2,-9.4414764792575424E-3]
[null,null,null,null,null,null,null,null,null,null,null,null,null,252,4.3982297150257104,-2.7580638972559454E-2,-8.96149283687348E-3]
[null,null,null,null,null,null,null,null,null,null,null,null,null,253,4.4156830075456535,-2.7732837922928025E-2,-8.4787794369593772E-3]
[null,null,null,null,null,null,null,null,null,null,null,null,null,254,4.4331363000655974,-2.7876589182211253E-2,-7.9934833186929687E-3]
[null,null,null,null,null,null,null,null,null,null,null,null,null,255,4.4505895925855405,-2.8011848962382981E-2,-7.5057523079730985E-3]
[null,null,null,null,null,null,null,null,null,null,null,null,null,256,4.4680428851054836,-2.81385760620039E-2,-7.0157349723903662E-3]
[null,null,null,null,null,null,null,null,null,null,null,null,null,257,4.4854961776254267,{"$f":"SIN(O285)*H$24","v":-2.8256731878771819E-2},{"$f":"COS(O285)*H$24","v":-6.5235805759720922E-3}]
[null,null,null,null,null,null,null,null,null,null,null,null,null,258,{"$f":"N286*(PI()/180)","v":4.5029494701453698},-2.8366280421280362E-2,-6.0294390337150344E-3]
[null,null,null,null,null,null,null,null,null,null,null,null,null,{"$f":"N286+1","v":259},4.5204027626653138,-2.8467188319982257E-2,-5.5334608659197938E-3]
[null,null,null,null,null,null,null,null,null,null,null,null,null,260,4.5378560551852569,-2.8559424837354033E-2,-5.03579715234098E-3]
[null,null,null,null,null,null,null,null,null,null,null,null,null,261,4.5553093477052,-2.8642961877258993E-2,-4.5365994861667003E-3]
[null,null,null,null,null,null,null,null,null,null,null,null,null,262,4.5727626402251431,-2.871777399350554E-2,-4.0360199278419093E-3]
[null,null,null,null,null,null,null,null,null,null,null,null,null,263,4.5902159327450871,-2.8783838397598342E-2,-3.5342109587492682E-3]
[null,null,null,null,null,null,null,null,null,null,null,null,null,264,4.6076692252650302,-2.8841134965679929E-2,-3.0313254347619474E-3]
[null,null,null,null,null,null,null,null,null,null,null,null,null,265,4.6251225177849733,-2.8889646244660623E-2,-2.5275165396820894E-3]
[null,null,null,null,null,null,null,null,null,null,null,null,null,266,4.6425758103049164,-2.8929357457534902E-2,-2.0229377385796417E-3]
[null,null,null,null,null,null,null,null,null,null,null,null,null,267,4.6600291028248595,-2.8960256507882642E-2,-1.5177427310453849E-3]
[null,null,null,null,null,null,null,null,null,null,null,null,null,268,4.6774823953448035,-2.8982333983553779E-2,-1.012085404372522E-3]
[null,null,null,null,null,null,null,null,null,null,null,null,null,269,4.6949356878647466,-2.8995583159535349E-2,-5.0611978668122144E-4]
[null,null,null,null,null,null,null,null,null,null,null,null,null,270,4.7123889803846897,-2.9000000000000001E-2,-5.3293957788524972E-18]
[null,null,null,null,null,null,null,null,null,null,null,null,null,271,4.7298422729046328,-2.8995583159535349E-2,5.0611978668121081E-4]
[null,null,null,null,null,null,null,null,null,null,null,null,null,272,4.7472955654245768,-2.8982333983553779E-2,1.0120854043725372E-3]
[null,null,null,null,null,null,null,null,null,null,null,null,null,273,4.7647488579445199,-2.8960256507882642E-2,1.5177427310453745E-3]
[null,null,null,null,null,null,null,null,null,null,null,null,null,274,4.782202150464463,-2.8929357457534905E-2,2.0229377385796313E-3]
[null,null,null,null,null,null,null,null,null,null,null,null,null,275,4.7996554429844061,-2.8889646244660623E-2,2.527516539682079E-3]
[null,null,null,null,null,null,null,null,null,null,null,null,null,276,4.8171087355043491,-2.8841134965679929E-2,3.0313254347619366E-3]
[null,null,null,null,null,null,null,null,null,null,null,null,null,277,4.8345620280242931,-2.8783838397598339E-2,3.534210958749283E-3]
[null,null,null,null,null,null,null,null,null,null,null,null,null,278,4.8520153205442362,-2.871777399350554E-2,4.0360199278418989E-3]
[null,null,null,null,null,null,null,null,null,null,null,null,null,279,4.8694686130641793,-2.8642961877258996E-2,4.5365994861666899E-3]
[null,null,null,null,null,null,null,null,null,null,null,null,null,280,4.8869219055841224,-2.8559424837354037E-2,5.0357971523409695E-3]
[null,null,null,null,null,null,null,null,null,null,null,null,null,281,4.9043751981040664,-2.8467188319982253E-2,5.5334608659198085E-3]
[null,null,null,null,null,null,null,null,null,null,null,null,null,282,4.9218284906240095,-2.8366280421280362E-2,6.029439033715024E-3]
[null,null,null,null,null,null,null,null,null,null,null,null,null,283,4.9392817831439526,-2.8256731878771823E-2,6.5235805759720827E-3]
[null,null,null,null,null,null,null,null,null,null,null,null,null,284,4.9567350756638957,-2.8138576062003904E-2,7.0157349723903566E-3]
[null,null,null,null,null,null,null,null,null,null,null,null,null,285,4.9741883681838388,-2.8011848962382985E-2,7.505752307973089E-3]
[null,null,null,null,null,null,null,null,null,null,null,null,null,286,4.9916416607037828,-2.7876589182211246E-2,7.9934833186929826E-3]
[null,null,null,null,null,null,null,null,null,null,null,null,null,287,5.0090949532237259,-2.7732837922928029E-2,8.478779436959365E-3]
[null,null,null,null,null,null,null,null,null,null,null,null,null,288,5.026548245743669,-2.7580638972559458E-2,8.9614928368734696E-3]
[null,null,null,null,null,null,null,null,null,null,null,null,null,289,5.0440015382636121,-2.7420038692380192E-2,9.4414764792575337E-3]
[null,null,null,null,null,null,null,null,null,null,null,null,null,290,5.0614548307835561,-2.7251086002791344E-2,9.918584156444402E-3]
[null,null,null,null,null,null,null,null,null,null,null,null,null,291,5.0789081233034992,-2.7073832368418854E-2,1.0392670536813711E-2]
[null,null,null,null,null,null,null,null,null,null,null,null,null,292,5.0963614158234423,-2.6888331782436835E-2,1.0863591209061448E-2]
[null,null,null,null,null,null,null,null,null,null,null,null,null,293,5.1138147083433854,-2.6694640750120777E-2,1.1331202726188932E-2]
[null,null,null,null,null,null,null,null,null,null,null,null,null,294,5.1312680008633285,-2.6492818271635434E-2,1.1795362649198194E-2]
[null,null,null,null,null,null,null,null,null,null,null,null,null,295,5.1487212933832724,-2.6282925824062848E-2,1.2255929590480288E-2]
[null,null,null,null,null,null,null,null,null,null,null,null,null,296,5.1661745859032155,-2.6065027342675847E-2,1.2712763256883246E-2]
[null,null,null,null,null,null,null,null,null,null,null,null,null,297,5.1836278784231586,-2.5839189201462671E-2,1.3165724492446853E-2]
[null,null,null,null,null,null,null,null,null,null,null,null,null,298,5.2010811709431017,-2.5605480192908887E-2,1.3614675320790822E-2]
[null,null,null,null,null,null,null,null,null,null,null,null,null,299,5.2185344634630457,-2.5363971507042473E-2,1.4059478987143782E-2]
[null,null,null,null,null,null,null,null,null,null,null,null,null,300,5.2359877559829888,-2.511473670974872E-2,1.4500000000000004E-2]
[null,null,null,null,null,null,null,null,null,null,null,null,null,301,5.2534410485029319,-2.485785172036126E-2,1.4936104172391572E-2]
[null,null,null,null,null,null,null,null,null,null,null,null,null,302,5.270894341022875,-2.4593394788536359E-2,1.5367658662762936E-2]
[null,null,null,null,null,null,null,null,null,null,null,null,null,303,5.2883476335428181,-2.4321446470417306E-2,1.5794532015435774E-2]
[null,null,null,null,null,null,null,null,null,null,null,null,null,304,5.3058009260627621,-2.404208960409621E-2,1.6216594200651663E-2]
[null,null,null,null,null,null,null,null,null,null,null,null,null,305,5.3232542185827052,-2.3755409284380764E-2,1.6633716654180335E-2]
[null,null,null,null,null,null,null,null,null,null,null,null,null,306,5.3407075111026483,-2.3461492836873481E-2,1.7045772316481717E-2]
[null,null,null,null,null,null,null,null,null,null,null,null,null,307,5.3581608036225914,-2.3160429791371499E-2,1.7452635671409391E-2]
[null,null,null,null,null,null,null,null,null,null,null,null,null,308,5.3756140961425354,-2.2852311854594933E-2,1.7854182784444096E-2]
[null,null,null,null,null,null,null,null,null,null,null,null,null,309,5.3930673886624785,-2.2537232882252154E-2,1.8250291340445288E-2]
[null,null,null,null,null,null,null,null,null,null,null,null,null,310,5.4105206811824216,-2.2215288850450366E-2,1.864084068090964E-2]
[null,null,null,null,null,null,null,null,null,null,null,null,null,311,5.4279739737023647,-2.1886577826460397E-2,1.9025711840724706E-2]
[null,null,null,null,null,null,null,null,null,null,null,null,null,312,5.4454272662223078,-2.1551199938844443E-2,1.9404787584406877E-2]
[null,null,null,null,null,null,null,null,null,null,null,null,null,313,5.4628805587422518,-2.1209257346955942E-2,1.977795244181246E-2]
[null,null,null,null,null,null,null,null,null,null,null,null,null,314,5.4803338512621949,-2.0860854209820884E-2,2.0145092743310923E-2]
[null,null,null,null,null,null,null,null,null,null,null,null,null,315,5.497787143782138,-2.0506096654409885E-2,2.0506096654409875E-2]
[null,null,null,null,null,null,null,null,null,null,null,null,null,316,5.5152404363020811,-2.014509274331093E-2,2.0860854209820878E-2]
[null,null,null,null,null,null,null,null,null,null,null,null,null,317,5.532693728822025,-1.9777952441812449E-2,2.1209257346955952E-2]
[null,null,null,null,null,null,null,null,null,null,null,null,null,318,5.5501470213419681,-1.9404787584406887E-2,2.1551199938844433E-2]
[null,null,null,null,null,null,null,null,null,null,null,null,null,319,5.5676003138619112,-1.9025711840724716E-2,2.1886577826460387E-2]
[null,null,null,null,null,null,null,null,null,null,null,null,null,320,5.5850536063818543,-1.864084068090965E-2,2.2215288850450356E-2]
[null,null,null,null,null,null,null,null,null,null,null,null,null,321,5.6025068989017974,{"$f":"SIN(O349)*H$24","v":-1.8250291340445299E-2},{"$f":"COS(O349)*H$24","v":2.2537232882252147E-2}]
[null,null,null,null,null,null,null,null,null,null,null,null,null,322,{"$f":"N350*(PI()/180)","v":5.6199601914217414},-1.7854182784444089E-2,2.285231185459494E-2]
[null,null,null,null,null,null,null,null,null,null,null,null,null,{"$f":"N350+1","v":323},5.6374134839416845,-1.7452635671409401E-2,2.3160429791371492E-2]
[null,null,null,null,null,null,null,null,null,null,null,null,null,324,5.6548667764616276,-1.7045772316481727E-2,2.3461492836873474E-2]
[null,null,null,null,null,null,null,null,null,null,null,null,null,325,5.6723200689815707,-1.6633716654180349E-2,2.3755409284380757E-2]
[null,null,null,null,null,null,null,null,null,null,null,null,null,326,5.6897733615015147,-1.6216594200651652E-2,2.4042089604096213E-2]
[null,null,null,null,null,null,null,null,null,null,null,null,null,327,5.7072266540214578,-1.5794532015435785E-2,2.4321446470417299E-2]
[null,null,null,null,null,null,null,null,null,null,null,null,null,328,5.7246799465414009,-1.5367658662762946E-2,2.4593394788536355E-2]
[null,null,null,null,null,null,null,null,null,null,null,null,null,329,5.742133239061344,-1.4936104172391581E-2,2.4857851720361254E-2]
[null,null,null,null,null,null,null,null,null,null,null,null,null,330,5.7595865315812871,-1.4500000000000013E-2,2.5114736709748713E-2]
[null,null,null,null,null,null,null,null,null,null,null,null,null,331,5.7770398241012311,-1.405947898714377E-2,2.536397150704248E-2]
[null,null,null,null,null,null,null,null,null,null,null,null,null,332,5.7944931166211742,-1.3614675320790835E-2,2.560548019290888E-2]
[null,null,null,null,null,null,null,null,null,null,null,null,null,333,5.8119464091411173,-1.3165724492446863E-2,2.5839189201462668E-2]
[null,null,null,null,null,null,null,null,null,null,null,null,null,334,5.8293997016610604,-1.2712763256883256E-2,2.606502734267584E-2]
[null,null,null,null,null,null,null,null,null,null,null,null,null,335,5.8468529941810043,-1.2255929590480278E-2,2.6282925824062851E-2]
[null,null,null,null,null,null,null,null,null,null,null,null,null,336,5.8643062867009474,-1.1795362649198206E-2,2.6492818271635431E-2]
[null,null,null,null,null,null,null,null,null,null,null,null,null,337,5.8817595792208905,-1.1331202726188943E-2,2.669464075012077E-2]
[null,null,null,null,null,null,null,null,null,null,null,null,null,338,5.8992128717408336,-1.0863591209061458E-2,2.6888331782436832E-2]
[null,null,null,null,null,null,null,null,null,null,null,null,null,339,5.9166661642607767,-1.0392670536813723E-2,2.7073832368418847E-2]
[null,null,null,null,null,null,null,null,null,null,null,null,null,340,5.9341194567807207,-9.9185841564443898E-3,2.7251086002791344E-2]
[null,null,null,null,null,null,null,null,null,null,null,null,null,341,5.9515727493006638,-9.4414764792575441E-3,2.7420038692380189E-2]
[null,null,null,null,null,null,null,null,null,null,null,null,null,342,5.9690260418206069,-8.9614928368734817E-3,2.7580638972559454E-2]
[null,null,null,null,null,null,null,null,null,null,null,null,null,343,5.98647933434055,-8.4787794369593772E-3,2.7732837922928025E-2]
[null,null,null,null,null,null,null,null,null,null,null,null,null,344,6.003932626860494,-7.9934833186929705E-3,2.787658918221125E-2]
[null,null,null,null,null,null,null,null,null,null,null,null,null,345,6.0213859193804371,-7.5057523079731002E-3,2.8011848962382981E-2]
[null,null,null,null,null,null,null,null,null,null,null,null,null,346,6.0388392119003802,-7.0157349723903688E-3,2.81385760620039E-2]
[null,null,null,null,null,null,null,null,null,null,null,null,null,347,6.0562925044203233,-6.5235805759720948E-3,2.8256731878771819E-2]
[null,null,null,null,null,null,null,null,null,null,null,null,null,348,6.0737457969402664,-6.0294390337150361E-3,2.8366280421280362E-2]
[null,null,null,null,null,null,null,null,null,null,null,null,null,349,6.0911990894602104,-5.5334608659197955E-3,2.8467188319982257E-2]
[null,null,null,null,null,null,null,null,null,null,null,null,null,350,6.1086523819801535,-5.0357971523409817E-3,2.8559424837354033E-2]
[null,null,null,null,null,null,null,null,null,null,null,null,null,351,6.1261056745000966,-4.5365994861667029E-3,2.8642961877258993E-2]
[null,null,null,null,null,null,null,null,null,null,null,null,null,352,6.1435589670200397,-4.036019927841911E-3,2.871777399350554E-2]
[null,null,null,null,null,null,null,null,null,null,null,null,null,353,6.1610122595399837,-3.5342109587492699E-3,2.8783838397598342E-2]
[null,null,null,null,null,null,null,null,null,null,null,null,null,354,6.1784655520599268,-3.0313254347619492E-3,2.8841134965679926E-2]
[null,null,null,null,null,null,null,null,null,null,null,null,null,355,6.1959188445798699,-2.5275165396820912E-3,2.8889646244660623E-2]
[null,null,null,null,null,null,null,null,null,null,null,null,null,356,6.213372137099813,-2.0229377385796435E-3,2.8929357457534902E-2]
[null,null,null,null,null,null,null,null,null,null,null,null,null,357,6.2308254296197561,-1.5177427310453869E-3,2.8960256507882642E-2]
[null,null,null,null,null,null,null,null,null,null,null,null,null,358,6.2482787221397,-1.012085404372524E-3,2.8982333983553779E-2]
[null,null,null,null,null,null,null,null,null,null,null,null,null,359,6.2657320146596431,-5.0611978668122328E-4,2.8995583159535349E-2]
[null,null,null,null,null,null,null,null,null,null,null,null,null,360,6.2831853071795862,-7.1058610384699967E-18,2.9000000000000001E-2]

{"sheet":"LEVEL RUN","index":8,"n_rows":21,"n_cols":13,"rows_kept":21,"cut":false,"hidden":false,"merged":[[13,9,13,12],[14,9,14,12],[15,9,15,12],[6,9,6,12],[7,9,7,12],[8,9,8,12],[9,9,9,12],[10,9,10,12],[0,0,0,10],[5,9,5,12],[1,4,1,5],[2,4,2,5],[1,6,1,7],[2,6,2,7],[3,6,3,7],[11,9,11,12],[12,9,12,12],[4,1,4,2],[22,9,22,12],[23,9,23,12],[24,9,24,12],[25,9,25,12],[16,9,16,12],[17,9,17,12],[18,9,18,12],[19,9,19,12],[20,9,20,12],[21,9,21,12],[31,9,31,12],[32,9,32,12],[33,9,33,12],[34,9,34,12],[35,9,35,12],[26,9,26,12],[27,9,27,12],[28,9,28,12],[29,9,29,12],[30,9,30,12],[41,9,41,12],[42,9,42,12],[43,9,43,12],[44,9,44,12],[45,9,45,12],[36,9,36,12],[37,9,37,12],[38,9,38,12],[39,9,39,12],[40,9,40,12],[51,9,51,12],[52,9,52,12],[53,9,53,12],[54,9,54,12],[55,9,55,12],[46,9,46,12],[47,9,47,12],[48,9,48,12],[49,9,49,12],[50,9,50,12],[61,9,61,12],[62,9,62,12],[63,9,63,12],[64,9,64,12],[65,9,65,12],[56,9,56,12],[57,9,57,12],[58,9,58,12],[59,9,59,12],[60,9,60,12],[71,9,71,12],[72,9,72,12],[73,9,73,12],[74,9,74,12],[75,9,75,12],[66,9,66,12],[67,9,67,12],[68,9,68,12],[69,9,69,12],[70,9,70,12],[81,9,81,12],[82,9,82,12],[83,9,83,12],[84,9,84,12],[85,9,85,12],[76,9,76,12],[77,9,77,12],[78,9,78,12],[79,9,79,12],[80,9,80,12],[91,9,91,12],[92,9,92,12],[93,9,93,12],[94,9,94,12],[95,9,95,12],[86,9,86,12],[87,9,87,12],[88,9,88,12],[89,9,89,12],[90,9,90,12],[101,9,101,12],[102,9,102,12],[103,9,103,12],[104,9,104,12],[105,9,105,12],[96,9,96,12],[97,9,97,12],[98,9,98,12],[99,9,99,12],[100,9,100,12],[111,9,111,12],[112,9,112,12],[113,9,113,12],[114,9,114,12],[115,9,115,12],[106,9,106,12],[107,9,107,12],[108,9,108,12],[109,9,109,12],[110,9,110,12],[121,9,121,12],[122,9,122,12],[123,9,123,12],[124,9,124,12],[125,9,125,12],[116,9,116,12],[117,9,117,12],[118,9,118,12],[119,9,119,12],[120,9,120,12],[131,9,131,12],[132,9,132,12],[133,9,133,12],[134,9,134,12],[135,9,135,12],[126,9,126,12],[127,9,127,12],[128,9,128,12],[129,9,129,12],[130,9,130,12],[141,9,141,12],[142,9,142,12],[143,9,143,12],[144,9,144,12],[145,9,145,12],[136,9,136,12],[137,9,137,12],[138,9,138,12],[139,9,139,12],[140,9,140,12],[151,9,151,12],[152,9,152,12],[153,9,153,12],[154,9,154,12],[155,9,155,12],[146,9,146,12],[147,9,147,12],[148,9,148,12],[149,9,149,12],[150,9,150,12],[161,9,161,12],[162,9,162,12],[163,9,163,12],[164,9,164,12],[165,9,165,12],[156,9,156,12],[157,9,157,12],[158,9,158,12],[159,9,159,12],[160,9,160,12],[171,9,171,12],[172,9,172,12],[173,9,173,12],[174,9,174,12],[175,9,175,12],[166,9,166,12],[167,9,167,12],[168,9,168,12],[169,9,169,12],[170,9,170,12],[196,9,196,12],[197,9,197,12],[198,9,198,12],[191,9,191,12],[192,9,192,12],[193,9,193,12],[194,9,194,12],[195,9,195,12],[186,9,186,12],[187,9,187,12],[188,9,188,12],[189,9,189,12],[190,9,190,12],[181,9,181,12],[182,9,182,12],[183,9,183,12],[184,9,184,12],[185,9,185,12],[176,9,176,12],[177,9,177,12],[178,9,178,12],[179,9,179,12],[180,9,180,12]]}
[{"$f":"REPORT!B2","v":0},null,null,null,null,null,null,null,null,null,null,"PID:",{"$f":"REPORT!E2","v":0}]
["Adjustment factor only works for closed level loops.",null,null,null,"Instrument Used:",null,"Length in Miles:",null,0,"Instrument:",null,"Date:"]
["SUM BS:",{"$f":"SUM(B7:B200)","v":0},"SUM FS:",{"$f":"SUM(E8:E200)","v":0},"Topcon DL-503",null,"Misclosure:",null,{"$f":"B3-D3","v":0},"Notes:",null,"Weather:"]
["Misclosure must not exceed 0.04 ft x √E where E=Length of loop (miles)",null,null,null,null,null,"Adj Factor:",null,{"$f":"(I3/(COUNTA(B7:B200)))*-1","v":{"$error":"#DIV/0!"}},"Rod:",null,"Temperature:"]
["Unit:","U.S. Survey FT",null,{"$f":"INDEX(ShortUnits,MATCH(B5,Units,0),1)","v":"sft"},{"$f":"GPS_IMPORT!K4&\"->\"&D5","v":"sft->sft"},{"$f":"INDEX(FactorValues,MATCH(E5,FactorNames,0))","v":1},{"$f":"D5&\"->\"&GPS_IMPORT!K6","v":"sft->sft"},{"$f":"INDEX(FactorValues,MATCH(G5,FactorNames,0))","v":1}]
["POINT","BS","HI","FS","SUMFS","ELEV","REC ELEV","ADJ","ADJ ELEV","DESCRIPTION"]
[null,null,{"$f":"F7+B7","v":{"$error":"#VALUE!"}},null,{"$f":"IF(D7>0,IF(B7>0,D7,0),\" \")","v":" "},"Input start elevation",null,null,{"$f":"F7","v":"Input start elevation"}]
[null,null,{"$f":"IF(D8<>\"\",IF(OR(B8<>\"\",INDIRECT(\"D9\")=0),IF(B7<>\"\",F7+B7,VLOOKUP(INDEX($B$7:B7,MATCH(9.99999999999999E+307,$B$7:B7)),$B$7:F7,5,FALSE)+INDEX($B$7:B7,MATCH(9.99999999999999E+307,$B$7:B7))),(VLOOKUP(INDEX($B$7:B7,MATCH(9.99999999999999E+307,$B$7:B7)),$B$7:F7,5,FALSE))+(INDEX($B$7:B7,MATCH(9.99999999999999E+307,$B$7:B7)))),\"\")","v":""},null,{"$f":"IF(D8<>\"\",IF(OR(B8<>\"\",INDIRECT(\"D9\")=0),D8,0),\"\")","v":""},{"$f":"IF(D8<>\"\",C8-D8,\"\")","v":""},null,{"$f":"IF(D8<>\"\",IF(AND(B8<>\"\",B7<>\"\"),$I$4+H7,VLOOKUP(INDEX($B$7:B7,MATCH(9.99999999999999E+307,$B$7:B7)),$B$7:H7,7,FALSE)+$I$4),\"\")","v":""},{"$f":"IF(D8<>\"\",(F8+H8),\"\")","v":""}]
[null,null,{"$f":"IF(D9<>\"\",IF(OR(B9<>\"\",INDIRECT(\"D10\")=0),IF(B8<>\"\",F8+B8,VLOOKUP(INDEX($B$7:B8,MATCH(9.99999999999999E+307,$B$7:B8)),$B$7:F8,5,FALSE)+INDEX($B$7:B8,MATCH(9.99999999999999E+307,$B$7:B8))),(VLOOKUP(INDEX($B$7:B8,MATCH(9.99999999999999E+307,$B$7:B8)),$B$7:F8,5,FALSE))+(INDEX($B$7:B8,MATCH(9.99999999999999E+307,$B$7:B8)))),\"\")","v":""},null,{"$f":"IF(D9<>\"\",IF(OR(B9<>\"\",INDIRECT(\"D10\")=0),D9,0),\"\")","v":""},{"$f":"IF(D9<>\"\",C9-D9,\"\")","v":""},null,{"$f":"IF(D9<>\"\",IF(AND(B9<>\"\",B8<>\"\"),$I$4+H8,VLOOKUP(INDEX($B$7:B8,MATCH(9.99999999999999E+307,$B$7:B8)),$B$7:H8,7,FALSE)+$I$4),\"\")","v":""},{"$f":"IF(D9<>\"\",(F9+H9),\"\")","v":""}]
[null,null,{"$f":"IF(D10<>\"\",IF(OR(B10<>\"\",INDIRECT(\"D11\")=0),IF(B9<>\"\",F9+B9,VLOOKUP(INDEX($B$7:B9,MATCH(9.99999999999999E+307,$B$7:B9)),$B$7:F9,5,FALSE)+INDEX($B$7:B9,MATCH(9.99999999999999E+307,$B$7:B9))),(VLOOKUP(INDEX($B$7:B9,MATCH(9.99999999999999E+307,$B$7:B9)),$B$7:F9,5,FALSE))+(INDEX($B$7:B9,MATCH(9.99999999999999E+307,$B$7:B9)))),\"\")","v":""},null,{"$f":"IF(D10<>\"\",IF(OR(B10<>\"\",INDIRECT(\"D11\")=0),D10,0),\"\")","v":""},"",null,{"$f":"IF(D10<>\"\",IF(AND(B10<>\"\",B9<>\"\"),$I$4+H9,VLOOKUP(INDEX($B$7:B9,MATCH(9.99999999999999E+307,$B$7:B9)),$B$7:H9,7,FALSE)+$I$4),\"\")","v":""},""]
[null,null,{"$f":"IF(D11<>\"\",IF(OR(B11<>\"\",INDIRECT(\"D12\")=0),IF(B10<>\"\",F10+B10,VLOOKUP(INDEX($B$7:B10,MATCH(9.99999999999999E+307,$B$7:B10)),$B$7:F10,5,FALSE)+INDEX($B$7:B10,MATCH(9.99999999999999E+307,$B$7:B10))),(VLOOKUP(INDEX($B$7:B10,MATCH(9.99999999999999E+307,$B$7:B10)),$B$7:F10,5,FALSE))+(INDEX($B$7:B10,MATCH(9.99999999999999E+307,$B$7:B10)))),\"\")","v":""},null,{"$f":"IF(D11<>\"\",IF(OR(B11<>\"\",INDIRECT(\"D12\")=0),D11,0),\"\")","v":""},"",null,{"$f":"IF(D11<>\"\",IF(AND(B11<>\"\",B10<>\"\"),$I$4+H10,VLOOKUP(INDEX($B$7:B10,MATCH(9.99999999999999E+307,$B$7:B10)),$B$7:H10,7,FALSE)+$I$4),\"\")","v":""},""]
[null,null,{"$f":"IF(D12<>\"\",IF(OR(B12<>\"\",INDIRECT(\"D13\")=0),IF(B11<>\"\",F11+B11,VLOOKUP(INDEX($B$7:B11,MATCH(9.99999999999999E+307,$B$7:B11)),$B$7:F11,5,FALSE)+INDEX($B$7:B11,MATCH(9.99999999999999E+307,$B$7:B11))),(VLOOKUP(INDEX($B$7:B11,MATCH(9.99999999999999E+307,$B$7:B11)),$B$7:F11,5,FALSE))+(INDEX($B$7:B11,MATCH(9.99999999999999E+307,$B$7:B11)))),\"\")","v":""},null,{"$f":"IF(D12<>\"\",IF(OR(B12<>\"\",INDIRECT(\"D13\")=0),D12,0),\"\")","v":""},"",null,{"$f":"IF(D12<>\"\",IF(AND(B12<>\"\",B11<>\"\"),$I$4+H11,VLOOKUP(INDEX($B$7:B11,MATCH(9.99999999999999E+307,$B$7:B11)),$B$7:H11,7,FALSE)+$I$4),\"\")","v":""},""]
[null,null,{"$f":"IF(D13<>\"\",IF(OR(B13<>\"\",INDIRECT(\"D14\")=0),IF(B12<>\"\",F12+B12,VLOOKUP(INDEX($B$7:B12,MATCH(9.99999999999999E+307,$B$7:B12)),$B$7:F12,5,FALSE)+INDEX($B$7:B12,MATCH(9.99999999999999E+307,$B$7:B12))),(VLOOKUP(INDEX($B$7:B12,MATCH(9.99999999999999E+307,$B$7:B12)),$B$7:F12,5,FALSE))+(INDEX($B$7:B12,MATCH(9.99999999999999E+307,$B$7:B12)))),\"\")","v":""},null,{"$f":"IF(D13<>\"\",IF(OR(B13<>\"\",INDIRECT(\"D14\")=0),D13,0),\"\")","v":""},"",null,{"$f":"IF(D13<>\"\",IF(AND(B13<>\"\",B12<>\"\"),$I$4+H12,VLOOKUP(INDEX($B$7:B12,MATCH(9.99999999999999E+307,$B$7:B12)),$B$7:H12,7,FALSE)+$I$4),\"\")","v":""},""]
[null,null,{"$f":"IF(D14<>\"\",IF(OR(B14<>\"\",INDIRECT(\"D15\")=0),IF(B13<>\"\",F13+B13,VLOOKUP(INDEX($B$7:B13,MATCH(9.99999999999999E+307,$B$7:B13)),$B$7:F13,5,FALSE)+INDEX($B$7:B13,MATCH(9.99999999999999E+307,$B$7:B13))),(VLOOKUP(INDEX($B$7:B13,MATCH(9.99999999999999E+307,$B$7:B13)),$B$7:F13,5,FALSE))+(INDEX($B$7:B13,MATCH(9.99999999999999E+307,$B$7:B13)))),\"\")","v":""},null,{"$f":"IF(D14<>\"\",IF(OR(B14<>\"\",INDIRECT(\"D15\")=0),D14,0),\"\")","v":""},"",null,{"$f":"IF(D14<>\"\",IF(AND(B14<>\"\",B13<>\"\"),$I$4+H13,VLOOKUP(INDEX($B$7:B13,MATCH(9.99999999999999E+307,$B$7:B13)),$B$7:H13,7,FALSE)+$I$4),\"\")","v":""},""]
[null,null,{"$f":"IF(D15<>\"\",IF(OR(B15<>\"\",INDIRECT(\"D16\")=0),IF(B14<>\"\",F14+B14,VLOOKUP(INDEX($B$7:B14,MATCH(9.99999999999999E+307,$B$7:B14)),$B$7:F14,5,FALSE)+INDEX($B$7:B14,MATCH(9.99999999999999E+307,$B$7:B14))),(VLOOKUP(INDEX($B$7:B14,MATCH(9.99999999999999E+307,$B$7:B14)),$B$7:F14,5,FALSE))+(INDEX($B$7:B14,MATCH(9.99999999999999E+307,$B$7:B14)))),\"\")","v":""},null,{"$f":"IF(D15<>\"\",IF(OR(B15<>\"\",INDIRECT(\"D16\")=0),D15,0),\"\")","v":""},"",null,{"$f":"IF(D15<>\"\",IF(AND(B15<>\"\",B14<>\"\"),$I$4+H14,VLOOKUP(INDEX($B$7:B14,MATCH(9.99999999999999E+307,$B$7:B14)),$B$7:H14,7,FALSE)+$I$4),\"\")","v":""},""]
[null,null,{"$f":"IF(D16<>\"\",IF(OR(B16<>\"\",INDIRECT(\"D17\")=0),IF(B15<>\"\",F15+B15,VLOOKUP(INDEX($B$7:B15,MATCH(9.99999999999999E+307,$B$7:B15)),$B$7:F15,5,FALSE)+INDEX($B$7:B15,MATCH(9.99999999999999E+307,$B$7:B15))),(VLOOKUP(INDEX($B$7:B15,MATCH(9.99999999999999E+307,$B$7:B15)),$B$7:F15,5,FALSE))+(INDEX($B$7:B15,MATCH(9.99999999999999E+307,$B$7:B15)))),\"\")","v":""},null,{"$f":"IF(D16<>\"\",IF(OR(B16<>\"\",INDIRECT(\"D17\")=0),D16,0),\"\")","v":""},"",null,{"$f":"IF(D16<>\"\",IF(AND(B16<>\"\",B15<>\"\"),$I$4+H15,VLOOKUP(INDEX($B$7:B15,MATCH(9.99999999999999E+307,$B$7:B15)),$B$7:H15,7,FALSE)+$I$4),\"\")","v":""},""]
[null,null,{"$f":"IF(D17<>\"\",IF(OR(B17<>\"\",INDIRECT(\"D18\")=0),IF(B16<>\"\",F16+B16,VLOOKUP(INDEX($B$7:B16,MATCH(9.99999999999999E+307,$B$7:B16)),$B$7:F16,5,FALSE)+INDEX($B$7:B16,MATCH(9.99999999999999E+307,$B$7:B16))),(VLOOKUP(INDEX($B$7:B16,MATCH(9.99999999999999E+307,$B$7:B16)),$B$7:F16,5,FALSE))+(INDEX($B$7:B16,MATCH(9.99999999999999E+307,$B$7:B16)))),\"\")","v":""},null,{"$f":"IF(D17<>\"\",IF(OR(B17<>\"\",INDIRECT(\"D18\")=0),D17,0),\"\")","v":""},"",null,{"$f":"IF(D17<>\"\",IF(AND(B17<>\"\",B16<>\"\"),$I$4+H16,VLOOKUP(INDEX($B$7:B16,MATCH(9.99999999999999E+307,$B$7:B16)),$B$7:H16,7,FALSE)+$I$4),\"\")","v":""},""]
[null,null,{"$f":"IF(D18<>\"\",IF(OR(B18<>\"\",INDIRECT(\"D19\")=0),IF(B17<>\"\",F17+B17,VLOOKUP(INDEX($B$7:B17,MATCH(9.99999999999999E+307,$B$7:B17)),$B$7:F17,5,FALSE)+INDEX($B$7:B17,MATCH(9.99999999999999E+307,$B$7:B17))),(VLOOKUP(INDEX($B$7:B17,MATCH(9.99999999999999E+307,$B$7:B17)),$B$7:F17,5,FALSE))+(INDEX($B$7:B17,MATCH(9.99999999999999E+307,$B$7:B17)))),\"\")","v":""},null,{"$f":"IF(D18<>\"\",IF(OR(B18<>\"\",INDIRECT(\"D19\")=0),D18,0),\"\")","v":""},"",null,{"$f":"IF(D18<>\"\",IF(AND(B18<>\"\",B17<>\"\"),$I$4+H17,VLOOKUP(INDEX($B$7:B17,MATCH(9.99999999999999E+307,$B$7:B17)),$B$7:H17,7,FALSE)+$I$4),\"\")","v":""},""]
[null,null,{"$f":"IF(D19<>\"\",IF(OR(B19<>\"\",INDIRECT(\"D20\")=0),IF(B18<>\"\",F18+B18,VLOOKUP(INDEX($B$7:B18,MATCH(9.99999999999999E+307,$B$7:B18)),$B$7:F18,5,FALSE)+INDEX($B$7:B18,MATCH(9.99999999999999E+307,$B$7:B18))),(VLOOKUP(INDEX($B$7:B18,MATCH(9.99999999999999E+307,$B$7:B18)),$B$7:F18,5,FALSE))+(INDEX($B$7:B18,MATCH(9.99999999999999E+307,$B$7:B18)))),\"\")","v":""},null,{"$f":"IF(D19<>\"\",IF(OR(B19<>\"\",INDIRECT(\"D20\")=0),D19,0),\"\")","v":""},"",null,{"$f":"IF(D19<>\"\",IF(AND(B19<>\"\",B18<>\"\"),$I$4+H18,VLOOKUP(INDEX($B$7:B18,MATCH(9.99999999999999E+307,$B$7:B18)),$B$7:H18,7,FALSE)+$I$4),\"\")","v":""},""]
[null,null,{"$f":"IF(D20<>\"\",IF(OR(B20<>\"\",INDIRECT(\"D21\")=0),IF(B19<>\"\",F19+B19,VLOOKUP(INDEX($B$7:B19,MATCH(9.99999999999999E+307,$B$7:B19)),$B$7:F19,5,FALSE)+INDEX($B$7:B19,MATCH(9.99999999999999E+307,$B$7:B19))),(VLOOKUP(INDEX($B$7:B19,MATCH(9.99999999999999E+307,$B$7:B19)),$B$7:F19,5,FALSE))+(INDEX($B$7:B19,MATCH(9.99999999999999E+307,$B$7:B19)))),\"\")","v":""},null,{"$f":"IF(D20<>\"\",IF(OR(B20<>\"\",INDIRECT(\"D21\")=0),D20,0),\"\")","v":""},"",null,{"$f":"IF(D20<>\"\",IF(AND(B20<>\"\",B19<>\"\"),$I$4+H19,VLOOKUP(INDEX($B$7:B19,MATCH(9.99999999999999E+307,$B$7:B19)),$B$7:H19,7,FALSE)+$I$4),\"\")","v":""},""]
[null,null,{"$f":"IF(D21<>\"\",IF(OR(B21<>\"\",INDIRECT(\"D22\")=0),IF(B20<>\"\",F20+B20,VLOOKUP(INDEX($B$7:B20,MATCH(9.99999999999999E+307,$B$7:B20)),$B$7:F20,5,FALSE)+INDEX($B$7:B20,MATCH(9.99999999999999E+307,$B$7:B20))),(VLOOKUP(INDEX($B$7:B20,MATCH(9.99999999999999E+307,$B$7:B20)),$B$7:F20,5,FALSE))+(INDEX($B$7:B20,MATCH(9.99999999999999E+307,$B$7:B20)))),\"\")","v":""},null,{"$f":"IF(D21<>\"\",IF(OR(B21<>\"\",INDIRECT(\"D22\")=0),D21,0),\"\")","v":""},"",null,{"$f":"IF(D21<>\"\",IF(AND(B21<>\"\",B20<>\"\"),$I$4+H20,VLOOKUP(INDEX($B$7:B20,MATCH(9.99999999999999E+307,$B$7:B20)),$B$7:H20,7,FALSE)+$I$4),\"\")","v":""},""]

{"sheet":"TIN","index":9,"n_rows":106,"n_cols":7,"rows_kept":106,"cut":false,"hidden":false,"merged":[[0,0,0,6],[1,0,1,6],[2,0,2,6],[104,0,105,3]]}
["Vertical TIN Accuracy Test"]
["Example Survey Check Shot Data Compared to TIN for Accuracy Class A"]
["(Units in U.S. Survey Feet)"]
["Point ID","Northing","Easting","Check Z","TIN Z","Dz","Dz^2"]
[null,null,null,null,null,{"$f":"E5-D5","v":0},{"$f":"F5^2","v":0}]
[null,null,null,null,null,{"$f":"E6-D6","v":0},{"$f":"F6^2","v":0}]
[null,null,null,null,null,0,0]
[null,null,null,null,null,{"$f":"E8-D8","v":0},{"$f":"F8^2","v":0}]
[null,null,null,null,null,0,0]
[null,null,null,null,null,0,0]
[null,null,null,null,null,0,0]
[null,null,null,null,null,0,0]
[null,null,null,null,null,0,0]
[null,null,null,null,null,0,0]
[null,null,null,null,null,0,0]
[null,null,null,null,null,0,0]
[null,null,null,null,null,0,0]
[null,null,null,null,null,0,0]
[null,null,null,null,null,0,0]
[null,null,null,null,null,0,0]
[null,null,null,null,null,0,0]
[null,null,null,null,null,0,0]
[null,null,null,null,null,0,0]
[null,null,null,null,null,0,0]
[null,null,null,null,null,0,0]
[null,null,null,null,null,0,0]
[null,null,null,null,null,0,0]
[null,null,null,null,null,0,0]
[null,null,null,null,null,0,0]
[null,null,null,null,null,0,0]
[null,null,null,null,null,0,0]
[null,null,null,null,null,0,0]
[null,null,null,null,null,0,0]
[null,null,null,null,null,0,0]
[null,null,null,null,null,0,0]
[null,null,null,null,null,0,0]
[null,null,null,null,null,0,0]
[null,null,null,null,null,0,0]
[null,null,null,null,null,0,0]
[null,null,null,null,null,0,0]
[null,null,null,null,null,0,0]
[null,null,null,null,null,0,0]
[null,null,null,null,null,0,0]
[null,null,null,null,null,0,0]
[null,null,null,null,null,0,0]
[null,null,null,null,null,0,0]
[null,null,null,null,null,0,0]
[null,null,null,null,null,0,0]
[null,null,null,null,null,0,0]
[null,null,null,null,null,0,0]
[null,null,null,null,null,0,0]
[null,null,null,null,null,0,0]
[null,null,null,null,null,0,0]
[null,null,null,null,null,0,0]
[null,null,null,null,null,0,0]
[null,null,null,null,null,0,0]
[null,null,null,null,null,0,0]
[null,null,null,null,null,0,0]
[null,null,null,null,null,0,0]
[null,null,null,null,null,0,0]
[null,null,null,null,null,0,0]
[null,null,null,null,null,0,0]
[null,null,null,null,null,0,0]
[null,null,null,null,null,0,0]
[null,null,null,null,null,0,0]
[null,null,null,null,null,0,0]
[null,null,null,null,null,0,0]
[null,null,null,null,null,0,0]
[null,null,null,null,null,0,0]
[null,null,null,null,null,0,0]
[null,null,null,null,null,0,0]
[null,null,null,null,null,{"$f":"E72-D72","v":0},{"$f":"F72^2","v":0}]
[null,null,null,null,null,0,0]
[null,null,null,null,null,0,0]
[null,null,null,null,null,0,0]
[null,null,null,null,null,0,0]
[null,null,null,null,null,0,0]
[null,null,null,null,null,0,0]
[null,null,null,null,null,0,0]
[null,null,null,null,null,0,0]
[null,null,null,null,null,0,0]
[null,null,null,null,null,0,0]
[null,null,null,null,null,0,0]
[null,null,null,null,null,0,0]
[null,null,null,null,null,0,0]
[null,null,null,null,null,0,0]
[null,null,null,null,null,0,0]
[null,null,null,null,null,0,0]
[null,null,null,null,null,0,0]
[null,null,null,null,null,0,0]
[null,null,null,null,null,0,0]
[null,null,null,null,null,0,0]
[null,null,null,null,null,0,0]
[null,null,null,null,null,0,0]
[null,null,null,null,null,0,0]
[null,null,null,null,null,0,0]
[null,null,null,null,null,0,0]
[null,null,null,null,null,0,0]
[null,null,null,null,null,{"$f":"E99-D99","v":0},{"$f":"F99^2","v":0}]
[null,null,null,null,null,0,0]
[null,null,null,null,null,0,0]
[null,null,null,null,null,0,0]
[null,null,null,null,null,0,0]
[null,null,null,null,"Sum Dz=",{"$f":"SUM($F$5:$F103)","v":0}]
["Spreadsheet user is responsible to verify all calculations. This spreadsheet is not guaranteed to provide accurate results.",null,null,null,"Sum Dz^2=",null,{"$f":"SUM($G$5:$G103)","v":0}]
[null,null,null,null,"N=",{"$f":"COUNT($D$5:$D103)","v":0}]

{"sheet":"DATABASE","index":10,"n_rows":1,"n_cols":18,"rows_kept":1,"cut":false,"hidden":false,"merged":[]}
["Name","Point ID","Northing","Easting","Elevation","Feature","Condition","Latitude","Longitude","Ellips Ht","Datum_Adj","Geoid","Method","Date","County","Route","District","PID"]

{"sheet":"FINAL GRID COORDINATES PNEZC","index":11,"n_rows":8,"n_cols":5,"rows_kept":8,"cut":false,"hidden":false,"merged":[]}
["Point ID","Northing","Easting","Elevation","Code"]
["CP7"]
["CP6"]
["CP5"]
["CP3"]
["CP2"]
["CP1"]
[null,{"$f":"INDIRECT($A8&\"!D38\")","v":{"$error":"#REF!"}},{"$f":"INDIRECT($A8&\"!E38\")","v":{"$error":"#REF!"}},{"$f":"INDIRECT($A8&\"!F38\")","v":{"$error":"#REF!"}},{"$f":"INDIRECT($A8&\"!G38\")","v":{"$error":"#REF!"}}]

{"sheet":"FINAL GROUND COORDINATES PNEZC","index":12,"n_rows":8,"n_cols":5,"rows_kept":8,"cut":false,"hidden":false,"merged":[]}
["Point ID","Northing","Easting","Elevation","Code"]
["CP7"]
["CP6"]
["CP5"]
["CP3"]
["CP2"]
["CP1"]
[null,{"$f":"INDIRECT($A8&\"!D39\")","v":{"$error":"#REF!"}},{"$f":"INDIRECT($A8&\"!E39\")","v":{"$error":"#REF!"}},{"$f":"INDIRECT($A8&\"!F39\")","v":{"$error":"#REF!"}},{"$f":"INDIRECT($A8&\"!G39\")","v":{"$error":"#REF!"}}]

{"sheet":"Lists","index":13,"n_rows":10,"n_cols":10,"rows_kept":10,"cut":false,"hidden":true,"merged":[]}
["Units","Short Unit","Display Units","Factor Names","Factor Values","Point Types","N=0, E=0 (N 39⁰ 27' 01.76097\", W 89⁰ 28' 32.98476\")","Unit","Tolerance N,E","Tolerance Height"]
["U.S. Survey FT","sft",{"$f":"A2&\" (\"&B2&\")\"","v":"U.S. Survey FT (sft)"},"ft->sft",0.99999800000399997,"Project Control Points","N=0, E=0 (N 37⁰ 47' 45.30621\", W 89⁰ 19' 00.02517\")","sft",2.9000000000000001E-2,3.9E-2]
["International FT","ft",{"$f":"A3&\" (\"&B3&\")\"","v":"International FT (ft)"},"sft->ft",1.0000020000000001,"Existing Centerline Control Point",null,"sft",{"$f":"I2*VLOOKUP($H$2&\"->\"&H3,D2:E10,2,FALSE)","v":2.9000000000000001E-2},{"$f":"J2*VLOOKUP($H$2&\"->\"&H3,D2:E10,2,FALSE)","v":3.9E-2}]
["Meters","m","Meters (m)","m->ft",{"$f":"1/0.3048","v":3.280839895013123},"Centerline Alignment",null,"ft",{"$f":"I3*VLOOKUP($H$2&\"->\"&H4,D3:E11,2,FALSE)","v":2.9000058000000002E-2},{"$f":"J3*VLOOKUP($H$2&\"->\"&H4,D3:E11,2,FALSE)","v":3.9000078000000001E-2}]
[null,null,null,"ft->m",0.30480000000000002,"Proposed R/W Monuments",null,"m",{"$f":"I4*VLOOKUP($H$2&\"->\"&H5,D4:E12,2,FALSE)","v":8.8392353568707144E-3},{"$f":"J4*VLOOKUP($H$2&\"->\"&H5,D4:E12,2,FALSE)","v":1.1887247548895098E-2}]
[null,null,null,"m->sft",{"$f":"3937/1200","v":3.2808333333333333},"Existing R/W Points"]
[null,null,null,"sft->m",{"$f":"1200/3937","v":0.30480060960121919},"Existing Boundary Monuments"]
[null,null,null,"ft->ft",1]
[null,null,null,"sft->sft",1]
[null,null,null,"m->m",1]