{"text_format":"1","workbook":"xlsx","n_sheets":9,"sheets":["Instructions","Safety Application","DSRTSignature","Project Scoring","ScoringCalculations","ScoringTable","RefTables","RSI_Data","Import"],"not_rendered":{"charts":0,"images":5,"macros":1,"external_links":0,"defined_names":38,"comments":1,"pivot_tables":0},"unopened":[],"bounds":{"document_bytes":16777216,"sheet_cells":100000,"rows_first":2000,"rows_last":500,"rows_between":2000,"halvings":0,"cell_chars":16384,"cell_head_chars":4096},"cells_cut":0,"cells_raw":0,"read":"whole","date_system":"1900"}

{"sheet":"Instructions","index":0,"n_rows":16,"n_cols":12,"rows_kept":16,"cut":false,"hidden":false,"merged":[[0,0,0,8],[1,0,1,8],[2,0,2,8],[5,0,5,8],[6,0,6,8],[7,0,7,8],[16,0,16,8],[3,0,3,8],[4,0,4,8],[8,0,8,8],[9,0,9,8],[11,0,11,8],[12,0,12,8],[14,0,14,8],[15,0,15,8],[13,0,13,8]]}
["Highway Safety Improvement Program",null,null,null,null,null,null,null,null,null,"Version",20230523]
["Formal Funding Application"]
["Scoring Tool Instructions"]
[]
["The instructions can be used to understand the functionality of the tool.  The tool attempts to complete as many fields as possible form information entered in the Economic Crash Analysis Tool (ECAT).  "]
[]
["The worksheets have been protected because the tool is standardized to import into the ODOT Central Office Database. Once submitted, the complete data layouts will be imported into the current database.  At this point, the district will be able to make any changes desired prior to the HSIP Program Committee Review."]
[]
[]
["I recommend starting a new application by importing data from existing ECAT Tool(s).  The import functionality will obtain information from (1) an ECAT Tool that does not have a fundamental change in Safety Performance Function (SPF) ('No' response in Cell \"K14\" on the Project Information Worksheet) or (2) an ECAT Tool that has have a fundamental change in Safety Performance Function (SPF) ('Yes' response in Cell \"K14\" on the Project Information Worksheet).  Follow the coded prompts.  Two files will be required for Item (2).  The order of import is does not matter.  Following the import process, please verify the data as assumptions have been made.  For example, it was assumed that only one route (major route) was used in the Project Element Description Table when determining project limits (All NLFIDs match in Column F).\n\nNote:  If you choose to import a new dataset, any previous information will be overridden."]
{"$rows_left_out":7}
{"sheet":"Safety Application","index":1,"n_rows":117,"n_cols":28,"rows_kept":117,"cut":false,"hidden":false,"merged":[[103,0,103,9],[91,0,91,3],[92,0,92,3],[91,6,91,7],[81,0,81,2],[96,0,96,3],[97,0,97,3],[98,0,98,3],[99,0,99,3],[90,0,90,9],[97,4,97,6],[97,7,97,9],[98,4,98,6],[98,7,98,9],[95,0,95,9],[91,4,91,5],[92,4,92,5],[91,8,91,9],[92,8,92,9],[92,6,92,7],[93,0,93,3],[93,4,93,5],[93,6,93,7],[93,8,93,9],[110,0,110,9],[105,5,105,7],[104,8,104,9],[105,8,105,9],[104,5,104,7],[85,0,85,2],[107,8,107,9],[106,0,106,7],[107,0,107,7],[106,8,106,9],[101,4,101,6],[101,7,101,9],[100,4,100,6],[100,7,100,9],[104,0,104,4],[105,0,105,4],[100,0,100,3],[101,0,101,3],[96,4,96,6],[96,7,96,9],[99,4,99,6],[99,7,99,9],[87,0,87,9],[88,0,88,9],[41,0,41,6],[42,0,42,6],[43,0,43,6],[72,0,72,9],[53,0,53,3],[54,0,54,3],[55,0,55,3],[56,0,56,3],[62,0,62,1],[63,0,63,1],[64,0,64,1],[65,0,65,1],[66,0,66,1],[46,0,46,9],[67,0,67,1],[68,0,68,1],[69,0,69,1],[70,0,70,1],[61,0,61,1],[59,0,59,9],[60,0,60,1],[44,0,44,7],[49,3,49,5],[50,3,50,5],[38,0,38,6],[39,0,39,6],[40,0,40,6],[17,0,17,9],[18,0,18,9],[19,0,19,9],[20,0,20,9],[21,0,21,9],[30,0,30,9],[23,0,23,9],[22,0,22,9],[32,0,32,3],[34,0,34,9],[35,0,35,6],[36,0,36,6],[37,0,37,6],[24,0,24,4],[25,0,25,4],[26,0,26,4],[27,0,27,4],[29,0,29,4],[28,0,28,4],[16,0,16,9],[15,0,15,9],[1,0,1,2],[9,7,9,9],[10,7,10,9],[8,0,8,9],[9,0,9,1],[10,0,10,1],[11,0,11,1],[9,5,9,6],[10,5,10,6],[11,5,11,6],[11,7,11,9],[9,2,9,4],[10,2,10,4],[11,2,11,4],[13,0,13,1],[12,2,12,4],[13,5,13,6],[12,7,12,9],[12,0,12,1],[12,5,12,6],[13,2,13,4],[13,7,13,9],[0,0,0,9],[6,0,6,2],[1,3,1,9],[2,3,2,9],[3,3,3,9],[4,3,4,9],[5,3,5,9],[6,3,6,9],[4,0,4,2],[5,0,5,2],[2,0,2,2],[3,0,3,2],[68,14,68,15],[69,14,69,15],[70,14,70,15],[62,10,62,11],[62,12,62,13],[63,10,63,11],[63,12,63,13],[64,10,64,11],[64,12,64,13],[65,10,65,11],[65,12,65,13],[66,10,66,11],[68,10,68,11],[68,12,68,13],[69,10,69,11],[69,12,69,13],[70,10,70,11],[70,12,70,13],[61,10,61,11],[61,12,61,13],[61,14,61,15],[62,14,62,15],[63,14,63,15],[64,14,64,15],[65,14,65,15],[66,14,66,15],[67,14,67,15],[66,12,66,13],[67,10,67,11],[67,12,67,13],[116,0,116,9],[114,0,114,2],[73,0,73,2],[76,0,76,2],[53,4,53,9],[54,4,54,9],[55,4,55,9],[56,4,56,9],[57,4,57,9],[69,6,69,9],[70,6,70,9],[74,0,74,2],[75,0,75,2],[73,9,75,9],[60,6,60,9],[61,6,61,9],[62,6,62,9],[63,6,63,9],[64,6,64,9],[65,6,65,9],[66,6,66,9],[67,6,67,9],[68,6,68,9],[83,0,83,2],[79,0,79,2],[84,0,84,2],[77,0,77,2],[78,0,78,2],[82,0,82,2],[80,0,80,2],[52,0,52,9],[47,0,47,2],[48,0,48,2],[50,0,50,2],[47,6,47,8],[48,6,48,8],[49,6,49,8],[49,0,49,2],[50,6,50,8],[47,3,47,5],[48,3,48,5]]}
["General Project Information",null,null,null,null,null,null,null,null,null,null,null,null,null,null,null,null,null,null,null,null,null,null,null,null,"Show Conditional Format:","Yes"]
["Project Sponsoring Agency",null,null,"ODOT D8",null,null,null,null,null,null,null,null,null,null,null,null,null,null,null,null,null,null,null,null,null,"Lat Long Format:","Yes"]
["Project Name",null,null,{"$f":"IF(ScoringCalculations!C2=\"\",\"\",ScoringCalculations!C2)","v":"US-22 & Old 3C"},null,null,null,null,null,null,null,null,null,null,null,null,null,null,null,null,null,null,null,null,null,"Priority Rank Format:","Yes"]
["PID",null,null,121423]
["Applicant Name",null,null,"Alex Genbauffe"]
["Contact Phone",null,null,5139336712]
["Contact Email",null,null,"alexander.genbauffe@dot.ohio.gov"]
[]
["Location Information"]
["ODOT District",null,{"$f":"IFERROR(VLOOKUP(H10,RefTables!A:B,2,FALSE),\"\")","v":8},null,null,"County",null,{"$f":"MID(A62,2,3)","v":"WAR"}]
{"$rows_left_out":108}
{"sheet":"DSRTSignature","index":2,"n_rows":47,"n_cols":27,"rows_kept":47,"cut":false,"hidden":false,"merged":[[31,0,31,9],[32,0,32,4],[32,5,32,7],[33,0,33,4],[33,5,33,7],[16,0,16,9],[27,0,27,4],[27,5,27,7],[28,0,28,4],[28,5,28,7],[23,5,23,7],[24,0,24,7],[19,0,19,7],[19,8,19,9],[20,0,20,7],[20,8,20,9],[18,0,18,4],[18,5,18,7],[21,0,21,9],[22,0,22,4],[22,5,22,7],[30,0,30,7],[24,8,24,9],[25,0,25,7],[29,8,29,9],[29,0,29,7],[30,8,30,9],[25,8,25,9],[26,0,26,9],[40,0,40,7],[40,8,40,9],[35,0,35,7],[36,0,36,9],[34,0,34,7],[34,8,34,9],[35,8,35,9],[39,8,39,9],[37,0,37,4],[37,5,37,7],[38,0,38,4],[38,5,38,7],[39,0,39,7],[46,0,46,9],[41,0,41,9],[42,0,42,4],[42,5,42,7],[43,0,43,4],[43,5,43,7],[44,0,44,7],[44,8,44,9],[45,0,45,7],[45,8,45,9],[23,0,23,4],[8,0,8,9],[9,0,9,9],[4,0,4,2],[4,3,4,9],[5,0,5,2],[5,3,5,9],[6,0,6,2],[6,3,6,9],[10,0,10,9],[11,0,11,9],[12,0,12,9],[17,0,17,4],[17,5,17,7],[13,0,13,9],[14,0,14,9],[3,0,3,2],[3,3,3,9],[0,0,0,9],[1,0,1,2],[1,3,1,9],[2,0,2,2],[2,3,2,9]]}
["General Project Information",null,null,null,null,null,null,null,null,null,null,null,null,null,null,null,null,null,null,null,null,null,null,null,null,"Show Conditional Format:","Yes"]
["Project Sponsoring Agency",null,null,null,null,null,null,null,null,null,null,null,null,null,null,null,null,null,null,null,null,null,null,null,null,"Lat Long Format:","Yes"]
["Project Name",null,null,"","","","","","","",null,null,null,null,null,null,null,null,null,null,null,null,null,null,null,"Priority Rank Format:","Yes"]
["PID",null,null,"","","","","","",""]
["Project Manager"]
["Contact Phone"]
["Contact Email"]
[]
["Project Description"]
["Summary of Crash Patterns"]
{"$rows_left_out":38}
{"sheet":"Project Scoring","index":3,"n_rows":16,"n_cols":9,"rows_kept":16,"cut":false,"hidden":true,"merged":[[8,1,8,6],[15,1,15,7],[12,1,12,6],[13,1,13,6],[10,1,10,6],[9,1,9,6],[11,1,11,6],[0,0,0,9],[1,0,1,9],[2,0,2,1],[2,2,2,4],[2,5,2,6],[2,7,2,9],[3,0,3,1],[3,2,3,4],[3,5,3,6],[3,7,3,9],[4,0,4,1],[4,2,4,4],[4,5,4,6],[4,7,4,9],[5,0,5,1],[5,2,5,4],[5,5,5,6],[5,7,5,9],[6,0,6,1],[6,2,6,4],[6,5,6,6],[6,7,6,9]]}
["Project Scoring Summary"]
["General Project Information"]
["Project Name",null,null,null,null,"Contact Email"]
["Project Description",null,null,null,null,"Contact Phone"]
["Reference Number",null,null,null,null,"Date Performed"]
["Analyst",null,null,null,null,"Analysis Year"]
["Agency/Company",null,null,null,null,"Analysis Type Performed"]
[]
[null,"Category",null,null,null,null,null,"Value","Points Awarded"]
[null,{"$f":"'Safety Application'!A37","v":"Ratio of Observed Fatal and Serious Injuries to Observed Total Crashes"},null,null,null,null,null,{"$f":"IF('Safety Application'!H37=\"\",\"\",'Safety Application'!H37)","v":0.05},{"$f":"IF('Safety Application'!I37=\"\",\"\",'Safety Application'!I37)","v":10}]
{"$rows_left_out":7}
{"sheet":"ScoringCalculations","index":4,"n_rows":61,"n_cols":56,"rows_kept":61,"cut":false,"hidden":false,"merged":[[4,0,4,1],[4,2,4,4],[4,5,4,6],[4,7,4,9],[5,0,5,1],[5,2,5,4],[5,5,5,6],[5,7,5,9],[2,0,2,1],[2,2,2,4],[2,5,2,6],[2,7,2,9],[3,0,3,1],[3,2,3,4],[3,5,3,6],[3,7,3,9],[0,0,0,9],[1,0,1,1],[1,2,1,4],[1,5,1,6],[1,7,1,9],[50,26,50,28],[40,26,40,33],[41,26,41,28],[42,26,42,28],[43,26,43,28],[44,26,44,28],[45,26,45,28],[47,26,47,33],[48,26,48,28],[49,26,49,28],[55,0,55,7],[57,3,57,4],[58,3,58,4],[59,3,59,4],[60,3,60,4],[50,0,50,7],[51,0,51,2],[52,0,52,2],[41,0,41,2],[42,0,42,2],[43,0,43,2],[44,0,44,2],[46,0,46,2],[45,0,45,2],[48,0,48,2],[47,0,47,2],[40,0,40,7],[35,1,35,2],[39,0,39,7],[7,0,7,3],[12,0,12,3]]}
["Project Scoring Summary",null,null,null,null,null,null,null,null,null,null,null,null,null,null,null,null,null,null,null,null,null,null,null,null,null,"HSM Analysis Type:","ECAT - No Change in base SPF"]
["Project Name",null,"US-22 & Old 3C",null,null,"Contact Email",null,"alexander.genbauffe@dot.ohio.gov"]
["Project Description",null,null,null,null,"Contact Phone",null,5139336712]
["Reference Number",null,null,null,null,"Date Performed",null,"2024-03-27"]
["Analyst",null,"ADG",null,null,"Analysis Year",null,2024]
["Agency/Company",null,"ODOT",null,null,"Analysis Type Performed",null,""]
[]
["Relative Severity Index Calculation",null,null,null,null,null,null,null,null,null,null,null,null,null,null,null,null,null,null,null,null,null,null,null,null,null,null,null,null,null,null,null,null,null,"All Sites"]
["ODOT District","STW",null,null,null,null,null,null,null,null,null,null,null,null,null,null,null,null,null,null,null,null,null,null,null,null,"NLFID:",null,null,null,"FindTruck",0,null,null,"HSM Elements Only",null,null,null,null,null,null,null,null,null,null,null,null,null,null,null,null,null,"Crash Costs (2022)"]
["Urban Area","Yes",null,null,null,null,null,null,null,null,null,null,null,null,null,null,null,null,null,null,null,null,null,null,null,null,"Blog:",null,null,null,"FindVC",0,null,null,"Observed Elements Only",null,null,null,null,null,null,null,null,null,null,null,null,null,null,null,null,null,"KA","B","C","O"]
{"$rows_left_out":52}
{"sheet":"ScoringTable","index":5,"n_rows":26,"n_cols":36,"rows_kept":26,"cut":false,"hidden":false,"merged":[[0,0,0,9],[0,26,0,35],[1,26,1,27],[1,28,1,29],[1,30,1,31],[1,32,1,33],[1,34,1,35],[1,0,1,9],[25,9,26,9],[23,9,24,9],[2,6,2,7],[2,8,2,9],[2,0,2,1],[2,2,2,3],[2,4,2,5]]}
["ODOT Highway Safety Improvement Program (HSIP)",null,null,null,null,null,null,null,null,null,null,null,null,null,null,null,null,null,null,null,null,null,null,null,null,null,"Safety Criteria"]
["Formal Funding Application Scoring Criteria",null,null,null,null,null,null,null,null,null,null,null,null,null,null,null,null,null,null,null,null,null,null,null,null,null,"Ratio of Observed Fatal and Serious Injuries to Observed Total Crashes",null,"Percentage of the Potential for Safety Improvement to Total Expected Crashes",null,"Relative Severity Index",null,"Equivalent Property Damage Only Index",null,"Location Equity Measure"]
[{"$f":"AA2","v":"Ratio of Observed Fatal and Serious Injuries to Observed Total Crashes"},null,{"$f":"AC2","v":"Percentage of the Potential for Safety Improvement to Total Expected Crashes"},null,{"$f":"AE2","v":"Relative Severity Index"},null,{"$f":"AG2","v":"Equivalent Property Damage Only Index"},null,{"$f":"AI2","v":"Location Equity Measure"},null,null,null,null,null,null,null,null,null,null,null,null,null,null,null,null,null,"Value","Points","Value","Points","Value","Points","Value","Points","Value","Points"]
["Value","Points","Value","Points","Value","Points","Value","Points","Value","Points",null,null,null,null,null,null,null,null,null,null,null,null,null,null,null,null,0,0,0,0,0,0,0,0,0,0]
[{"$f":"\"< \"&TEXT(AA5,\"#0.00\")","v":"< 0.01"},{"$f":"IF(AB4=\"\",\"\",AB4)","v":0},{"$f":"\"< \"&AC5*100&\"%\"","v":"< 2.5%"},{"$f":"IF(AD4=\"\",\"\",AD4)","v":0},{"$f":"\"< \"&TEXT(AE5,\"00,000\")","v":"< 20,000"},{"$f":"IF(AF4=\"\",\"\",AF4)","v":0},{"$f":"\"< \"&TEXT(AG5,\"#0.00\")","v":"< 1.00"},{"$f":"IF(AH4=\"\",\"\",AH4)","v":0},{"$f":"\"< \"&AI5*100&\"%\"","v":"< 10%"},{"$f":"IF(AJ4=\"\",\"\",AJ4)","v":0},null,null,null,null,null,null,null,null,null,null,null,null,null,null,null,null,0.01,2,2.5000000000000001E-2,2,20000,2,1,2,0.1,2]
[{"$f":"TEXT(AA5,\"#0.00\")&\"-\"&TEXT(AA6-0.001,\"#0.000\")","v":"0.01-0.019"},{"$f":"IF(AB5=\"\",\"\",AB5)","v":2},{"$f":"AC5*100&\"%\"&\"-\"&(AC6-0.0001)*100&\"%\"","v":"2.5%-4.99%"},2,{"$f":"TEXT(AE5,\"00,000\")&\"-\"&TEXT(AE6-0.01,\"00,000.00\")","v":"20,000-22,499.99"},2,{"$f":"TEXT(AG5,\"#0.00\")&\"-\"&TEXT(AG6-0.001,\"#0.000\")","v":"1.00-1.499"},2,{"$f":"AI5*100&\"%\"&\"-\"&(AI6-0.0001)*100&\"%\"","v":"10%-14.99%"},2,null,null,null,null,null,null,null,null,null,null,null,null,null,null,null,null,{"$f":"AA5+0.01","v":0.02},4,{"$f":"AC5+0.025","v":0.05},4,{"$f":"AE5+2500","v":22500},4,{"$f":"AG5+0.5","v":1.5},4,{"$f":"AI5+0.05","v":0.15000000000000002},4]
[{"$f":"TEXT(AA6,\"#0.00\")&\"-\"&TEXT(AA7-0.001,\"#0.000\")","v":"0.02-0.029"},4,{"$f":"AC6*100&\"%\"&\"-\"&(AC7-0.0001)*100&\"%\"","v":"5%-7.49%"},4,{"$f":"TEXT(AE6,\"00,000\")&\"-\"&TEXT(AE7-0.01,\"00,000.00\")","v":"22,500-24,999.99"},4,{"$f":"TEXT(AG6,\"#0.00\")&\"-\"&TEXT(AG7-0.001,\"#0.000\")","v":"1.50-1.999"},4,{"$f":"AI6*100&\"%\"&\"-\"&(AI7-0.0001)*100&\"%\"","v":"15%-19.99%"},4,null,null,null,null,null,null,null,null,null,null,null,null,null,null,null,null,{"$f":"AA6+0.01","v":0.03},6,{"$f":"AC6+0.025","v":7.5000000000000011E-2},6,{"$f":"AE6+2500","v":25000},6,{"$f":"AG6+0.5","v":2},6,{"$f":"AI6+0.05","v":0.2},6]
["0.03-0.039",6,"7.5%-9.99%",6,"25,000-27,499.99",6,"2.00-2.499",6,"20%-24.99%",6,null,null,null,null,null,null,null,null,null,null,null,null,null,null,null,null,0.04,8,0.1,8,27500,8,2.5,8,0.25,8]
["0.04-0.049",8,"10%-12.49%",8,"27,500-29,999.99",8,"2.50-2.999",8,"25%-29.99%",8,null,null,null,null,null,null,null,null,null,null,null,null,null,null,null,null,0.05,10,0.125,10,30000,10,3,10,0.3,10]
["0.05-0.059",10,"12.5%-14.99%",10,"30,000-32,499.99",10,"3.00-3.499",10,{"$f":"\"≥ \"&AI9*100&\"%\"","v":"≥ 30%"},10,null,null,null,null,null,null,null,null,null,null,null,null,null,null,null,null,6.0000000000000005E-2,12,0.15,12,32500,12,3.5,12]
{"$rows_left_out":17}
{"sheet":"RefTables","index":6,"n_rows":93,"n_cols":19,"rows_kept":93,"cut":false,"hidden":true,"merged":[]}
["County Code","District Number",null,"Ohio SHSP Emphasis Area",null,"FHWA SHSP Emphasis Area",null,"Improvement Type","Access management","Advanced technology and ITS","Alignment","Interchange design","Intersection geometry",null,null,null,null,null,"MPH"]
[{"$f":"LEFT(C2,3)","v":"ADA"},9,"ADA - Adams","Serious Crash Types",null,"Creating more effective processes and safety management systems",null,"Access management",null,null,"Alignment - other","Acceleration / deceleration / merge lane",null,null,null,null,null,null,5]
[{"$f":"LEFT(C3,3)","v":"ALL"},1,"ALL - Allen","High Risk Drivers and Behaviors",null,"Curbing aggressive driving",null,"Advanced technology and ITS","Access management - other","AdvancedtechnologyandITS","Horizontal curve realignment","Convert at-grade intersection to interchange","Auxiliary lanes - add acceleration lane",null,null,null,null,null,{"$f":"S2+5","v":10}]
["ASD",3,"ASD - Ashland","Special Vehicles and Roadway Users",null,"Designing safer work zones",null,"Alignment","Change in access - close or restrict existing access","Advanced technology and ITS - other","Horizontal and vertical alignment","Extend existing lane on ramp","Auxiliary lanes - add auxiliary through lane",null,null,null,null,null,{"$f":"S3+5","v":15}]
["ATB",4,"ATB - Ashtabula","Data",null,"Enhancing emergency medical capabilities to increase survivability",null,"Animal-related","Change in access - miscellaneous/unspecified","Congestion detection / traffic monitoring system","Vertical alignment or elevation change","Improve intersection radius at ramp terminus","Auxiliary lanes - add left-turn lane",null,null,null,null,null,20]
["ATH",10,"ATH - Athens",null,null,"Ensuring drivers are licensed and fully competent",null,"Interchange design","Grassed median - extend existing","Dynamic message signs",null,"Installation of new lane on ramp","Auxiliary lanes - add right-turn lane",null,null,null,null,null,25]
["AUG",7,"AUG - Auglaize",null,null,"Ensuring safer bicycle travel",null,"Intersection geometry","Median crossover - close crossover","Over height vehicle detection","Roadside","Interchange design - other","Auxiliary lanes - add right-turn lane (free-flow)",null,null,null,null,null,30]
["BEL",11,"BEL - Belmont","Data",null,"Improving information and decision support systems",null,"Intersection traffic control","Median crossover - directional crossover",null,null,"Ramp closure","Auxiliary lanes - add slip lane",null,null,null,null,null,35]
["BRO",9,"BRO - Brown","Timely Data",null,"Improving motorcycle safety and increasing motorcycle awareness",null,"Lighting","Median crossover - relocate existing",null,"Barrier end treatments (crash cushions, terminals)","Ramp metering","Auxiliary lanes - add two-way left-turn lane",null,null,null,null,null,40]
["BUT",8,"BUT - Butler","Reliable Data",null,"Improving the design and operation of highway intersections",null,"Miscellaneous","Median crossover - unspecified",null,"Barrier transitions",null,"Auxiliary lanes - extend acceleration/deceleration lane",null,null,null,null,null,45]
{"$rows_left_out":84}
{"sheet":"RSI_Data","index":7,"n_rows":8464,"n_cols":10,"rows_kept":8464,"cut":false,"hidden":true,"merged":[]}
[null,null,null,null,{"$f":"F1/G1","v":34119.623879392748},{"$f":"SUBTOTAL(9,F3:F86584)","v":46938537169},{"$f":"SUBTOTAL(9,G3:G86584)","v":1375705}]
["DISTRICT_NBR","NLF_COUNTY_CD","URBAN_AREA","FREEWAY_IND","CRASH_TYPE_CD","CRASH_COST_NBR","Crash_Count",null,null,"Select "]
[6,"FAY","Yes","Yes","Rear End",185130,3,null,null,"--CRASH_YR,"]
[4,"MAH","No","Yes","Pedestrian",622814,3,null,null,"DISTRICT_NBR,"]
[12,"LAK","No","Yes","Parked Vehicle",537344,6,null,null,"NLF_COUNTY_CD,"]
[7,"SHE","Yes","No","Sideswipe - Passing",89100,5]
[10,"ATH","Yes","Yes","Fixed Object",69135,1,null,null,"--CASE WHEN ODOT_MAINTAINED_HWY_IND = 'Y' THEN 'Yes'"]
[7,"CHP","Yes","No","Pedalcycles",782204,7,null,null,"--ELSE 'No' END AS ODOT_MAINTAINED_HWY_IND,"]
[12,"GEA","No","No","Unknown",195855,13]
[11,"COL","Yes","Yes","Rear End",1489559,65,null,null,"CASE WHEN AREA_CODE = 'CLEVE' THEN 'Yes'"]
{"$rows_left_out":8455}
{"sheet":"Import","index":8,"n_rows":63,"n_cols":75,"rows_kept":63,"cut":false,"hidden":true,"merged":[[0,0,0,1]]}
["Application ID:",null,{"$f":"IF('Safety Application'!A115=\"\",\"Not Assigned\",'Safety Application'!A115)","v":"202403D08-01"}]
[]
[]
["General Application Data"]
["https://extranet.dot.state.oh.us/divisions/Planning/plan/HSIP_applications/Lists/AppData/ImportView.aspx"]
["Title","Cycle","AppID","District","CountyCd","Sponsor","Project Name","PID","ProjectManager","PM_Phone","PM_Email","Applicant_Name","Applicant_Title","Applicant_Phone","ApplicationDt","RouteNbr","RouteName","Blog","Elog","FolderPath"]
[{"$f":"C7","v":"202403D08-01"},{"$f":"LEFT(C7,6)","v":"202403"},{"$f":"C1","v":"202403D08-01"},{"$f":"'Safety Application'!C10","v":8},{"$f":"LEFT('Safety Application'!H10,3)","v":"WAR"},{"$f":"IF('Safety Application'!D2=\"\",\"\",'Safety Application'!D2)","v":"ODOT D8"},{"$f":"IF('Safety Application'!D3=\"\",\"\",'Safety Application'!D3)","v":"US-22 & Old 3C"},{"$f":"IF('Safety Application'!D4=\"\",\"\",'Safety Application'!D4)","v":121423},{"$f":"IF('Safety Application'!D5=\"\",\"\",'Safety Application'!D5)","v":"Alex Genbauffe"},{"$f":"IF('Safety Application'!D6=\"\",\"\",'Safety Application'!D6)","v":5139336712},{"$f":"IF('Safety Application'!D7=\"\",\"\",'Safety Application'!D7)","v":"alexander.genbauffe@dot.ohio.gov"},{"$f":"IF('Safety Application'!A106=\"\",\"\",'Safety Application'!A106)","v":"Alex Genbauffe"},{"$f":"IF('Safety Application'!F106=\"\",\"\",'Safety Application'!F106)","v":"Traffic Studies Engineer"},{"$f":"'Safety Application'!I106","v":5139336712},{"$f":"IF('Safety Application'!I108=\"\",\"\",MONTH('Safety Application'!I108)&\"/\"&DAY('Safety Application'!I108)&\"/\"&YEAR('Safety Application'!I108))","v":"3/29/2024"},{"$f":"'Safety Application'!C11","v":"US-22R"},{"$f":"'Safety Application'!H11","v":"US-22"},{"$f":"'Safety Application'!C12","v":3.63},{"$f":"'Safety Application'!H12","v":3.63},{"$f":"IF(LEFT('Safety Application'!A117,1)=\"\\\",'Safety Application'!A117,\"\\\\itcfs007.dot.state.oh.us\\odrive\"&MID('Safety Application'!A117,FIND(\"\\\",'Safety Application'!A117,1),100))","v":"\\\\itcfs007.dot.state.oh.us\\odrive\\SAFETY\\D08\\SAFETY APPLICATIONS\\202403 Applications\\202403D08-01 (WAR-22-3.62 Old 3C)"}]
[]
[]
["Project Priority"]
{"$rows_left_out":53}