{"text_format":"1","workbook":"xlsx","n_sheets":12,"sheets":["Crash Data","Data Analysis","Graphical Analysis","Histograms","Collision Diagram","Resurfacing Analysis","Rate Calc Sheet","Severity Calc Sheet","ROR Analysis","Safety App","CRF Table","Help File"],"not_rendered":{"charts":32,"images":89,"macros":1,"external_links":0,"defined_names":33,"comments":2,"pivot_tables":85},"unopened":[],"bounds":{"document_bytes":16777216,"sheet_cells":100000,"rows_first":2000,"rows_last":500,"rows_between":2000,"halvings":0,"cell_chars":16384,"cell_head_chars":4096},"cells_cut":0,"cells_raw":0,"read":"whole","date_system":"1900"}

{"sheet":"Crash Data","index":0,"n_rows":39,"n_cols":126,"rows_kept":39,"cut":false,"hidden":false,"merged":[[17,61,17,66],[17,67,17,72],[17,73,17,92],[18,61,18,62],[18,63,18,64],[18,65,18,66],[18,67,18,68],[18,69,18,70],[18,71,18,72],[18,73,18,74],[18,87,18,88],[18,89,18,90],[18,91,18,92],[18,75,18,76],[18,77,18,78],[18,79,18,80],[18,81,18,82],[18,83,18,84],[18,85,18,86]]}
[null,null,null,null,null,null,"Crash Data","Graphical Analysis","Collision Diagram","Rate Calc Sheet","ROR Analysis","CRF Table"]
[null,null,null,null,null,null,"Data Analysis","Histograms","Resurfacing Analysis","Severity Calc Sheet","Safety App","Help File"]
[{"$f":"D12&\"-\"&D13&D14&\" - (\"&D15&\"-\"&D16&\")     \"&\"From \"&MID(D17,5,2)&\"/\"&MID(D17,7,2)&\"/\"&LEFT(D17,4)&\" to \"&MID(D18,5,2)&\"/\"&MID(D18,7,2)&\"/\"&LEFT(D18,4)","v":"ROS-0159R - (2.5-3.0)     From 01/01/2006 to 06/01/2009"}]
[null,null,null,null,null,null,{"$f":"+HYPERLINK(CONCATENATE(\"https://tscas001.dot.state.oh.us/OhioRVX2/Roadview.asp?nlf_id='\",+D21,\"'&offset=\",+D15),\"Launch: Video Log\")","v":"Launch: Video Log"},null,null,{"$f":"HYPERLINK(CONCATENATE(\"http://maps.google.com/maps?\"),\"Launch: Google Maps\")","v":"Launch: Google Maps"}]
[null,null,null,null,null,null,{"$f":"HYPERLINK(\"http://www.dot.state.oh.us/Divisions/TransSysDev/Innovation/Prod_Services/DESTAPE/Documents/DES\"&D12&\".htm\",\"Launch: ODOT Destape\")","v":"Launch: ODOT Destape"},null,null,{"$f":"HYPERLINK(\"http://maps.yahoo.com/beta/#maxp=search&mvt=m&trf=1&lon=-82.611694&lat=40.061257&mag=10\",\"Launch: Yahoo Maps\")","v":"Launch: Yahoo Maps"}]
[null,null,null,null,null,null,{"$f":"HYPERLINK(\"http://www2.dot.state.oh.us/techservsite/availpro/Road_%20Infor/SLD/default.htm\",\"Launch: Straight Line Diagrams\")","v":"Launch: Straight Line Diagrams"},null,null,{"$f":"HYPERLINK(\"http://local.live.com/default.aspx?v=2&cp=\"&L4&\"~\"&M4&\"&style=h&lvl=15\",\"Launch: Local Live Maps\")","v":"Launch: Local Live Maps"}]
{"$rows_left_out":34}
{"sheet":"Data Analysis","index":1,"n_rows":295,"n_cols":14,"rows_kept":295,"cut":false,"hidden":false,"merged":[]}
[{"$f":"'Crash Data'!A3","v":"ROS-0159R - (2.5-3.0)     From 01/01/2006 to 06/01/2009"},null,null,null,null,null,null,null,null,null,{"$f":"A1","v":"ROS-0159R - (2.5-3.0)     From 01/01/2006 to 06/01/2009"}]
[]
[null,null,null,null,null,null,null,null,null,null,"SEVERITY","CRASH_SEVERITY"]
[null,"Number",null,null,null,null,null,null,null,null,"TRAFFIC_CRASH_YEAR","(blank)"]
["Total",null,null,null,null,null,null,null,null,null,"(blank)",0]
[null,null,null,null,null,null,null,null,null,null,"Grand Total",0]
{"$rows_left_out":290}
{"sheet":"Graphical Analysis","index":2,"n_rows":1,"n_cols":25,"rows_kept":1,"cut":false,"hidden":false,"merged":[]}
[{"$f":"'Crash Data'!A3","v":"ROS-0159R - (2.5-3.0)     From 01/01/2006 to 06/01/2009"},null,null,null,null,null,null,null,null,null,null,null,{"$f":"A1","v":"ROS-0159R - (2.5-3.0)     From 01/01/2006 to 06/01/2009"},null,null,null,null,null,null,null,null,null,null,null,{"$f":"A1","v":"ROS-0159R - (2.5-3.0)     From 01/01/2006 to 06/01/2009"}]

{"sheet":"Histograms","index":3,"n_rows":694,"n_cols":169,"rows_kept":694,"cut":false,"hidden":false,"merged":[]}
["Default Bin Size is 0.1 Miles",null,null,{"$f":"'Crash Data'!$A$3","v":"ROS-0159R - (2.5-3.0)     From 01/01/2006 to 06/01/2009"},null,null,null,null,null,null,null,null,null,null,null,null,null,null,null,null,null,null,null,null,null,null,null,null,null,null,null,null,"Click for Histogram 1 Graph",null,null,"Click for Histogram 2 Graph",null,null,null,null,"Click for Histogram 3 Graph",null,null,null,null,null,null,null,null,null,null,null,null,null,null,null,null,null,null,"Click for Histogram 4 Graph",null,null,null,null,null,null,null,"Click for Histogram 5 Graph",null,null,null,null,null,null,null,null,null,"Click for Histogram 6 Graph",null,null,null,null,null,"Click for Histogram 7 Graph",null,null,null,null,null,null,null,null,null,null,null,null,null,null,null,null,null,null,null,null,null,null,null,null,null,null,"Click for Histogram 8 Graph",null,null,null,null,null,null,null,null,null,null,null,null,null,null,null,null,null,null,"Click for Histogram 9 Graph",null,null,null,null,null,null,null,null,null,"Click for Histogram 10 Graph",null,null,null,null,null,null,null,null,null,null,null,null,null,null,null,null,null,null,null,null,null,null,null,null,null,null,"Click for Histogram 11 Graph"]
["Click Buttons Below to Modify",null,null,"Histogram 1",null,null,null,null,null,null,null,null,null,null,null,null,null,null,null,null,null,null,null,null,null,null,null,null,null,null,null,null,"Count of ACCIDENTS_POINTS_NBR",null,null,"Count of ACCIDENTS_POINTS_NBR","CRASH_SEVERITY_TXT",null,null,null,"Count of ACCIDENTS_POINTS_NBR","TYPE_OF_CRASH_TXT",null,null,null,null,null,null,null,null,null,null,null,null,null,null,null,null,null,"Count of ACCIDENTS_POINTS_NBR","ROAD_CONDITION_TXT",null,null,null,null,null,null,"Count of ACCIDENTS_POINTS_NBR","LIGHT_CONDITION_TXT",null,null,null,null,null,null,null,null,"Count of ACCIDENTS_POINTS_NBR","ANIMAL_TYPE_TXT",null,null,null,null,"Count of ACCIDENTS_POINTS_NBR","CONTRIBUTING_FACTOR1_TXT",null,null,null,null,null,null,null,null,null,null,null,null,null,null,null,null,null,null,null,null,null,null,null,null,null,"Count of ACCIDENTS_POINTS_NBR","ACTION1_TXT",null,null,null,null,null,null,null,null,null,null,null,null,null,null,null,null,null,"Count of ACCIDENTS_POINTS_NBR","DAY_OF_WEEK_TXT",null,null,null,null,null,null,null,null,"Count of ACCIDENTS_POINTS_NBR","HOUR_OF_DAY",null,null,null,null,null,null,null,null,null,null,null,null,null,null,null,null,null,null,null,null,null,null,null,null,null,"Count of ACCIDENTS_POINTS_NBR",null,"TYPE_OF_CRASH_TXT"]
[null,null,null,null,null,null,null,null,null,null,null,null,null,null,null,null,null,null,null,null,null,null,null,null,null,null,null,null,null,null,null,null,"LOGPOINT_SLM_NBR","Total",null,"LOGPOINT_SLM_NBR","(blank)",null,null,null,"LOGPOINT_SLM_NBR","(blank)",null,null,null,null,null,null,null,null,null,null,null,null,null,null,null,null,null,"LOGPOINT_SLM_NBR","(blank)",null,null,null,null,null,null,"LOGPOINT_SLM_NBR","(blank)",null,null,null,null,null,null,null,null,"LOGPOINT_SLM_NBR","(blank)",null,null,null,null,"LOGPOINT_SLM_NBR","(blank)",null,null,null,null,null,null,null,null,null,null,null,null,null,null,null,null,null,null,null,null,null,null,null,null,null,"LOGPOINT_SLM_NBR","(blank)",null,null,null,null,null,null,null,null,null,null,null,null,null,null,null,null,null,"LOGPOINT_SLM_NBR","(blank)",null,null,null,null,null,null,null,null,"LOGPOINT_SLM_NBR","(blank)",null,null,null,null,null,null,null,null,null,null,null,null,null,null,null,null,null,null,null,null,null,null,null,null,null,"LOGPOINT_SLM_NBR","DIRECTION_TO1_TXT","(blank)"]
[null,null,null,null,null,null,null,null,null,null,null,null,null,null,null,null,null,null,null,null,null,null,null,null,null,null,null,null,null,null,null,null,"99.77-99.87",1,null,"99.77-99.87",1,null,null,null,"99.77-99.87",1,null,null,null,null,null,null,null,null,null,null,null,null,null,null,null,null,null,"99.77-99.87",1,null,null,null,null,null,null,"99.77-99.87",1,null,null,null,null,null,null,null,null,"99.77-99.87",1,null,null,null,null,"99.77-99.87",1,null,null,null,null,null,null,null,null,null,null,null,null,null,null,null,null,null,null,null,null,null,null,null,null,null,"99.77-99.87",1,null,null,null,null,null,null,null,null,null,null,null,null,null,null,null,null,null,"99.77-99.87",1,null,null,null,null,null,null,null,null,"99.77-99.87",1,null,null,null,null,null,null,null,null,null,null,null,null,null,null,null,null,null,null,null,null,null,null,null,null,null,"99.77-99.87","(blank)",1]
[null,null,null,null,null,null,null,null,null,null,null,null,null,null,null,null,null,null,null,null,null,null,null,null,null,null,null,null,null,null,null,null,"99.87-99.97",1,null,"99.87-99.97",1,null,null,null,"99.87-99.97",1,null,null,null,null,null,null,null,null,null,null,null,null,null,null,null,null,null,"99.87-99.97",1,null,null,null,null,null,null,"99.87-99.97",1,null,null,null,null,null,null,null,null,"99.87-99.97",1,null,null,null,null,"99.87-99.97",1,null,null,null,null,null,null,null,null,null,null,null,null,null,null,null,null,null,null,null,null,null,null,null,null,null,"99.87-99.97",1,null,null,null,null,null,null,null,null,null,null,null,null,null,null,null,null,null,"99.87-99.97",1,null,null,null,null,null,null,null,null,"99.87-99.97",1,null,null,null,null,null,null,null,null,null,null,null,null,null,null,null,null,null,null,null,null,null,null,null,null,null,"99.77-99.87 Total",null,1]
[null,null,null,null,null,null,null,null,null,null,null,null,null,null,null,null,null,null,null,null,null,null,null,null,null,null,null,null,null,null,null,null,"Grand Total",2,null,"Grand Total",2,null,null,null,"Grand Total",2,null,null,null,null,null,null,null,null,null,null,null,null,null,null,null,null,null,"Grand Total",2,null,null,null,null,null,null,"Grand Total",2,null,null,null,null,null,null,null,null,"Grand Total",2,null,null,null,null,"Grand Total",2,null,null,null,null,null,null,null,null,null,null,null,null,null,null,null,null,null,null,null,null,null,null,null,null,null,"Grand Total",2,null,null,null,null,null,null,null,null,null,null,null,null,null,null,null,null,null,"Grand Total",2,null,null,null,null,null,null,null,null,"Grand Total",2,null,null,null,null,null,null,null,null,null,null,null,null,null,null,null,null,null,null,null,null,null,null,null,null,null,"99.87-99.97","(blank)",1]
{"$rows_left_out":689}
{"sheet":"Collision Diagram","index":4,"n_rows":12,"n_cols":43,"rows_kept":12,"cut":false,"hidden":false,"merged":[]}
[null,null,null,null,null,null,null,null,null,null,null,null,null,null,null,null,null,null,null,null,null,null,null,null,null,null,null,null,null,null,null,null,null,null,null,null,null,null,null,null,null,{"$f":"LEFT(AO1,1)","v":""},{"$f":"RIGHT(AO1,1)","v":""}]
[null,null,null,null,null,null,null,null,null,null,null,null,null,null,null,null,null,null,null,null,null,null,null,null,null,null,null,null,null,null,null,null,null,null,null,null,null,null,null,null,null,{"$f":"LEFT(AO2,1)","v":""},{"$f":"RIGHT(AO2,1)","v":""}]
[null,null,null,null,null,null,null,null,null,null,null,null,null,null,null,null,null,null,null,null,null,null,null,null,null,null,null,null,null,null,null,null,null,null,null,null,null,null,null,null,null,{"$f":"LEFT(AO3,2)","v":""},{"$f":"RIGHT(AO3,2)","v":""}]
[null,null,null,null,null,null,null,null,null,null,null,null,null,null,null,null,null,null,null,null,null,null,null,null,null,null,null,null,null,null,null,null,null,null,null,null,null,null,null,null,null,{"$f":"LEFT(AO4,2)","v":""},{"$f":"RIGHT(AO4,2)","v":""}]
[]
[null,null,null,null,null,null,null,null,null,null,null,null,null,null,null,null,null,null,null,null,null,null,null,null,null,null,null,null,null,null,null,null,null,null,null,null,null,null,null,null,null,{"$f":"LEFT(AO6,1)","v":""},{"$f":"RIGHT(AO6,2)","v":""}]
{"$rows_left_out":7}
{"sheet":"Resurfacing Analysis","index":5,"n_rows":500,"n_cols":34,"rows_kept":500,"cut":false,"hidden":false,"merged":[]}
[null,null,{"$f":"'Crash Data'!A3","v":"ROS-0159R - (2.5-3.0)     From 01/01/2006 to 06/01/2009"},null,null,null,null,null,null,null,null,null,null,null,null,null,null,null,null,null,null,null,null,null,null,null,null,null,null,"Resurfacing Analysis Criteria"]
[null,null,null,null,null,null,null,null,null,null,null,null,null,null,null,null,null,null,null,null,null,null,null,null,null,null,null,null,null,"ADT","Total Crashes ( > )","Intersection  ( > )","Non-Intersection ( > )","Crash Rate w/o Animal  ( > )"]
[{"$f":"#REF!","v":{"$error":"#REF!"}},null,"Section Begin Log",{"$f":"IF('Crash Data'!$D$15=\"\",\"None\",'Crash Data'!$D$15+0)","v":2.5},null,null,null,null,null,null,null,null,null,{"$f":"MIN(#REF!)","v":{"$error":"#REF!"}},null,null,null,null,null,null,null,null,null,null,null,null,null,null,">=",0]
[null,null,"Section End Log",{"$f":"IF('Crash Data'!$D$16=\"\",\"None\",'Crash Data'!$D$16+0)","v":3},"    Update and Run Analysis",null,null,null,null,null,null,null,null,{"$f":"MAX(#REF!)","v":{"$error":"#REF!"}},null,null,null,null,null,null,null,null,null,null,null,null,null,null,">=",401,4]
[null,null,"Bin Lenth (Miles)",0.5,"    Default = 0.5 Miles",null,null,null,null,null,null,null,null,null,null,null,null,null,null,null,null,null,null,null,null,null,null,null,">=",2001,null,4,10,1.75]
[null,null,null,null,null,null,null,null,null,null,null,null,null,null,null,null,null,null,null,null,null,null,null,null,null,null,null,null,">=",10001,null,8,15,2.2999999999999998]
{"$rows_left_out":495}
{"sheet":"Rate Calc Sheet","index":6,"n_rows":37,"n_cols":25,"rows_kept":37,"cut":false,"hidden":false,"merged":[[8,20,8,21],[6,20,6,21],[3,16,3,17],[4,16,4,17],[5,16,5,17],[7,16,7,17],[3,2,3,4],[9,24,9,25],[7,24,7,25],[3,24,3,25],[4,24,4,25],[5,24,5,25],[6,24,6,25],[3,20,3,21],[4,20,4,21],[5,20,5,21],[26,2,26,4],[4,2,4,4],[6,2,6,4],[5,2,5,4],[7,2,7,4],[22,2,22,4],[23,2,23,4],[24,2,24,4],[25,2,25,4]]}
[]
[]
[]
[null,"County:",{"$f":"'Crash Data'!D12","v":"ROS"},null,null,null,null,null,null,null,null,null,null,null,null,"Entering Leg 1 ",null,null,null,"Entering Leg 1 ",3400,null,null,"Entering Leg 1 "]
[null,"R1:",{"$f":"'Crash Data'!G21","v":"SR0159R   "},null,null,null,null,null,null,null,null,null,null,null,null,"Entering Leg 2 ",null,null,null,"Entering Leg 2 ",5600,null,null,"Entering Leg 2 "]
[null,"R1 Log:",{"$f":"'Crash Data'!D15","v":"2.5"},null,null,null,null,null,null,null,null,null,null,null,null,"Entering Leg 3 ",null,null,null,"Entering Leg 3 ",6250,null,null,"Entering Leg 3 "]
{"$rows_left_out":32}
{"sheet":"Severity Calc Sheet","index":7,"n_rows":49,"n_cols":10,"rows_kept":49,"cut":false,"hidden":false,"merged":[[3,3,3,7]]}
["Select Location Type:",null,"Rural Non-Freeway"]
[]
[null,"RSI Value = ",{"$f":"C25/(A25+B25)","v":34367.700550656722}]
[null,null,null,"2008 Relative Severity Index"]
["User Override","Auto Fill","Crash Type Severity Calc","Crash Type #","Crash Type","Rural Non-Freeway","Urban Non-Freeway","Freeway"]
[null,{"$f":"IF(A$6:A$24=\"\",COUNTIF('Crash Data'!M$21:M$65000,\"Not Stated*\"),\"\")","v":0},{"$f":"IF(C$1=F$5,IF(A6=\"\",B6*F6,A6*F6),IF(C$1=G$5,IF(A6=\"\",B6*G6,A6*G6),IF(C$1=H$5,IF(A6=\"\",B6*H6,A6*H6))))","v":0},0,"Not stated",24068.585669781933,28922.169014084506,13469.751412429379]
{"$rows_left_out":44}
{"sheet":"ROR Analysis","index":8,"n_rows":87,"n_cols":78,"rows_kept":87,"cut":false,"hidden":false,"merged":[[49,17,49,19],[50,17,50,19],[51,17,51,19],[36,14,36,20],[37,0,37,32],[26,31,26,32],[27,31,27,32],[29,12,29,13],[30,19,30,20],[29,19,29,20],[28,19,28,20],[26,19,26,20],[27,19,27,20],[8,11,8,12],[36,31,36,32],[36,21,36,22],[8,19,8,20],[28,31,28,32],[29,31,29,32],[29,28,29,30],[8,25,8,26],[28,12,28,13],[30,12,30,13],[8,21,8,22],[8,23,8,24],[44,28,44,30],[36,23,36,30],[33,28,33,30],[30,28,30,30],[27,21,27,22],[45,28,45,30],[42,0,42,32],[39,26,39,27],[40,16,40,19],[43,14,43,19],[40,20,40,21],[40,23,40,24],[39,6,39,7],[39,23,39,24],[7,33,7,34],[38,6,38,7],[8,29,8,30],[8,9,8,10],[8,7,8,8],[8,5,8,6],[8,27,8,28],[30,31,30,32],[29,21,29,22],[30,21,30,22],[49,10,49,12],[50,10,50,12],[51,0,51,9],[51,10,51,12],[49,0,49,9],[50,0,50,9],[50,21,50,24],[43,28,43,30],[43,21,43,22],[44,21,44,22],[46,21,46,22],[46,28,46,30],[43,24,43,26],[44,24,44,26],[46,24,46,26],[48,0,48,32],[38,0,38,4],[39,0,39,4],[40,0,40,4],[39,16,39,19],[40,6,40,7],[40,26,40,27],[39,20,39,21],[22,19,22,20],[23,19,23,20],[24,19,24,20],[25,19,25,20],[22,28,22,30],[23,28,23,30],[24,28,24,30],[24,1,24,11],[8,33,8,34],[28,21,28,22],[22,21,22,22],[23,21,23,22],[25,21,25,22],[25,28,25,30],[26,28,26,30],[27,28,27,30],[26,21,26,22],[21,12,21,13],[22,12,22,13],[23,12,23,13],[21,1,21,11],[22,1,22,11],[23,1,23,11],[3,23,3,25],[20,12,20,13],[20,0,20,11],[20,14,20,22],[20,23,20,32],[8,13,8,14],[8,15,8,16],[8,17,8,18],[8,1,8,2],[8,3,8,4],[34,12,34,13],[7,1,7,6],[7,7,7,12],[3,2,3,5],[5,2,5,5],[3,10,3,15],[4,10,4,15],[5,7,5,9],[33,12,33,13],[25,1,25,11],[3,18,3,20],[35,12,35,13],[31,19,31,20],[31,21,31,22],[32,19,32,20],[32,21,32,22],[33,19,33,20],[33,21,33,22],[31,12,31,13],[32,12,32,13],[33,31,33,32],[8,31,8,32],[31,28,31,30],[31,31,31,32],[22,31,22,32],[23,31,23,32],[24,31,24,32],[25,31,25,32],[28,28,28,30],[21,28,21,30],[5,18,5,20],[5,23,5,25],[7,13,7,32],[32,28,32,30],[32,31,32,32],[24,12,24,13],[24,21,24,22],[25,12,25,13],[26,12,26,13],[27,12,27,13]]}
[null,null,null,null,null,null,null,null,null,null,null,null,null,"RATE OF RETURN - ECONOMIC ANALYSIS WORKSHEET"]
["Cells in Yellow Require User Input",null,null,null,null,null,null,null,null,null,null,null,null,null,null,null,null,null,null,null,null,null,null,null,null,null,null,"Ohio Department of Transportation"]
[null,null,null,null,null,null,null,null,null,null,null,null,null,null,null,null,null,null,null,null,null,null,null,null,null,null,null,"Office of Systems Planning and Program Management",null,null,null,null,null,null,null,null,null,null,null,null,null,null,null,null,null,null,null,null,null,null,null,null,null,null,null,null,null,null,null,null,null,null,null,null,null,null,null,null,null,null,null,null,null,null,"ESTIMATES OF COUNTERMEASURE EFFECTIVENESS REDUCTION (R) FACTORS"]
["County",null,{"$f":"'Crash Data'!D12","v":"ROS"},null,null,null,"Main Roadway",null,null,null,{"$f":"'Crash Data'!D13","v":"0159"},null,null,null,null,null,"Begin SLM",null,{"$f":"'Crash Data'!D15","v":"2.5"},null,null,"End SLM",null,{"$f":"'Crash Data'!D16","v":"3.0"},null,null,null,null,null,null,null,null,null,null,null,null,null,null,null,null,null,null,null,null,null,null,null,null,null,null,null,null,null,null,null,null,null,null,null,null,null,null,null,null,null,null,null,null,null,null,null,null,null,null,"(September 1997, Revised July 2007)"]
[null,null,null,null,null,null,"Intersecting Roadway",null,null,null,null,null,null,null,null,null,null,null,null,null,null,null,null,null,null,null,null,null,null,null,null,null,null,null,null,null,null,null,null,null,null,null,null,null,null,null,null,null,null,null,null,null,null,null,null,null,null,null,null,null,null,null,null,null,null,null,null,null,null,null,null,null,null,"Number","Description"]
["Prepared by ",null,"JH",null,null,null,"Date",{"$f":"NOW()","v":"2009-07-23T08:25:46.130"},null,null,null,null,null,null,null,null,"Crash BDate",null,{"$f":"'Crash Data'!D17","v":"20060101"},null,null,"Crash EDate",null,{"$f":"'Crash Data'!D18","v":"20090601"}]
{"$rows_left_out":82}
{"sheet":"Safety App","index":9,"n_rows":51,"n_cols":36,"rows_kept":51,"cut":false,"hidden":false,"merged":[[18,0,18,15],[20,0,20,1],[20,2,20,3],[20,4,20,5],[20,6,20,7],[20,8,20,9],[20,10,20,11],[20,12,20,13],[20,14,20,15]]}
[]
[]
[]
[]
[]
["Location","Location Type","Facility Type","Begin Log","End Log","Length","Fatal Crashes","Injury Crashes","PDO Crashes","Total Crashes","Fatalities","Incapacitating Injuries","# of Years","ADT (Or Intersection Entering Volume)","Truck ADT","V/C"]
{"$rows_left_out":46}
{"sheet":"CRF Table","index":10,"n_rows":89,"n_cols":16,"rows_kept":89,"cut":false,"hidden":false,"merged":[]}
[null,"Estimates of Countermeasure Effectiveness Reduction (CRF) Factors"]
[null,"(September 1997, Revised July 2007)"]
[]
["ID","Description","All","PDO","INJ/FAT","Night","Wet","Pedestrian","Left","Right","Angle","Rear","Head","Side","Fixed","Ran"]
[]
[1,"1 Upgrade pavement markings - general",0.1]
{"$rows_left_out":84}
{"sheet":"Help File","index":11,"n_rows":792,"n_cols":67,"rows_kept":792,"cut":false,"hidden":false,"merged":[]}
[null,null,null,"Crash Data",null,null,"Graphical Analysis",null,null,"Collision Diagram",null,null,"Rate Calc Sheet",null,null,"ROR Analysis",null,null,"CRF Table",null,null,null,null,null,null,null,null,null,null,null,null,null,null,null,null,null,null,null,null,null,null,null,null,null,null,null,null,null,null,null,null,null,null,null,null,null,null,null,null,null,null,null,null,null,null,null,"CAM Tool Created by Jonathan Hughes"]
[null,null,null,"Data Analysis",null,null,"Histograms",null,null,"Resurfacing Analysis",null,null,"Severity Calc Sheet",null,null,"Safety App",null,null,"Help File",null,null,null,null,null,null,null,null,null,null,null,null,null,null,null,null,null,null,null,null,null,null,null,null,null,null,null,null,null,null,null,null,null,null,null,null,null,null,null,null,null,null,null,null,null,null,null,"All Rights Reserved"]
[]
["For additional questions contact Jonathan Hughes 614-466-4019 or jonathan.hughes@dot.state.oh.us (Office of Systems Planning and Program Management) ",null,null,null,null,null,null,null,null,null,null,null,null,null,null,null,null,null,null,null,null,null,null,null,null,null,null,null,null,null,null,null,null,null,"Do Not Modify"]
["Click to go to Latest Updates (5-30-08 Version)",null,null,null,null,null,null,null,null,null,null,null,null,null,null,null,null,null,null,null,"Date Updated: 8-20-08",null,null,null,null,null,null,null,null,null,null,null,null,null,"REAR END                      ","NORTH               "]
[null,null,null,null,null,null,null,null,null,null,null,null,null,null,null,null,null,null,null,null,null,null,null,null,null,null,null,null,null,null,null,null,null,null,"FIXED OBJECT                  ","SOUTH               "]
{"$rows_left_out":786}