{"text_format":"1","workbook":"xlsx","n_sheets":5,"sheets":["Traffic Count","HCS+ for N-S Mainline","HCS+ for E-W Mainline","Main Line Reduction Table","Configurations"],"not_rendered":{"charts":0,"images":5,"macros":1,"external_links":0,"defined_names":0,"comments":1,"pivot_tables":0},"unopened":[],"bounds":{"document_bytes":16777216,"sheet_cells":100000,"rows_first":2000,"rows_last":500,"rows_between":2000,"halvings":0,"cell_chars":16384,"cell_head_chars":4096},"cells_cut":0,"cells_raw":0,"read":"whole","date_system":"1900"}

{"sheet":"Traffic Count","index":0,"n_rows":437,"n_cols":47,"rows_kept":437,"cut":false,"hidden":false,"merged":[[150,23,150,25],[150,31,150,33],[150,20,150,21],[150,28,150,29],[138,23,138,25],[138,31,138,33],[138,20,138,21],[138,28,138,29],[126,23,126,25],[126,31,126,33],[126,20,126,21],[126,28,126,29],[114,23,114,25],[114,31,114,33],[114,20,114,21],[114,28,114,29],[102,23,102,25],[102,31,102,33],[102,20,102,21],[102,28,102,29],[90,23,90,25],[90,31,90,33],[90,20,90,21],[90,28,90,29],[78,23,78,25],[78,31,78,33],[78,20,78,21],[78,28,78,29],[66,23,66,25],[66,31,66,33],[66,20,66,21],[66,28,66,29],[54,23,54,25],[54,31,54,33],[54,20,54,21],[54,28,54,29],[42,23,42,25],[42,31,42,33],[42,20,42,21],[42,28,42,29],[30,23,30,25],[30,31,30,33],[30,20,30,21],[30,28,30,29],[18,23,18,25],[18,31,18,33],[18,20,18,21],[18,28,18,29]]}
["Start Date","2009-06-02",null,null,null,null,null,null,null,null,null,null,null,null,null,null,null,null,null,null,null,null,null,null,null,null,null,null,null,null,null,null,null,null,null,null,"Do Not Modify",null,"Do Not Modify"]
["Start Time","06:00:00",null,null,null,null,null,null,null,null,null,null,null,null,null,null,null,null,null,null,null,null,null,false,null,null,null,null,null,null,null,true,null,null,null,null,3,null,2]
["Site Code",18271,null,null,null,null,null,null,null,null,null,null,null,null,null,null,null,null,null,"#1",null,null,null,"#2",null,null,null,"#3",null,null,null,"#4",null,null,null,null,null,null,"Number of Through Lanes",null,null,null,null,null,"Number of Through lanes"]
["Street Name","TRACTOR SUPPLY ENTRANCE--Eastbound",null,null,null,"SR 159--Southbound",null,null,null,"ALDI ENTRANCE--Westbound",null,null,null,"SR 159--Northbound",null,null,null,null,null,{"$f":"B4","v":"TRACTOR SUPPLY ENTRANCE--Eastbound"},null,null,null,{"$f":"F4","v":"SR 159--Southbound"},null,null,null,{"$f":"J4","v":"ALDI ENTRANCE--Westbound"},null,null,null,{"$f":"N4","v":"SR 159--Northbound"},null,null,null,null,null,null,2,null,null,null,null,null,2]
["Start Time","Right ","Thru ","Left ","Peds ","Right ","Thru ","Left ","Peds ","Right ","Thru ","Left ","Peds ","Right ","Thru ","Left ","Peds ",null,null,"Right ","Thru ","Left ","Peds ","Right ","Thru ","Left ","Peds ","Right ","Thru ","Left ","Peds ","Right ","Thru ","Left ","Peds ",null,"#1 Minor Leg Lane Configurations and Right Turn Reductions","-","#2 Mainline Congestion Factors for Limiting Right Turn Reductions","=","Minor Street Right Turn Reduction",null,"#3 Minor Leg Lane Configurations and Right Turn Reductions","-","#4 Mainline Congestion Factors for Limiting Right Turn Reductions","=","Minor Street Right Turn Reduction"]
["06:00:00",0,0,0,0,0,42,0,0,0,0,0,0,0,101,0,0]
["06:00:00",0,0,0,0,0,9,0,0,0,0,0,0,0,6,0,0]
["06:00:00",0,0,0,0,0,0,0,0,0,0,0,0,0,0,0,0,null,"06:00:00",{"$f":"SUM(B6:B8)","v":0},0,0,0,0,51,0,0,0,0,0,0,0,107,0,0]
["06:15:00",0,0,0,0,0,67,0,0,0,0,0,0,0,131,0,0]
["06:15:00",0,0,0,0,0,2,0,0,0,0,0,0,0,8,0,0]
["06:15:00",0,0,0,0,0,0,0,0,0,0,0,0,0,0,0,0,null,"06:15:00",{"$f":"SUM(B9:B11)","v":0},0,0,0,0,69,0,0,0,0,0,0,0,139,0,0]
["06:30:00",0,0,0,0,0,61,0,0,0,0,0,0,0,168,0,0]
["06:30:00",0,0,0,0,0,9,0,0,0,0,0,0,0,12,0,0]
["06:30:00",0,0,0,0,0,0,0,0,0,0,0,0,0,0,0,0,null,"06:30:00",{"$f":"SUM(B12:B14)","v":0},0,0,0,0,70,0,0,0,0,0,0,0,180,0,0]
["06:45:00",1,0,0,0,0,75,0,0,0,0,0,0,0,143,4,0]
["06:45:00",0,0,0,0,0,17,0,0,0,0,0,0,0,7,0,0]
["06:45:00",0,0,0,0,0,0,0,0,0,0,0,0,0,0,0,0,null,"06:45:00",{"$f":"SUM(B15:B17)","v":1},0,0,0,0,92,0,0,0,0,0,0,0,150,4,0]
["07:00:00",1,0,0,0,0,88,0,0,0,0,0,0,0,78,0,0,null,"Movement Total",{"$f":"SUM(T8,T11,T14,T17)","v":1},0,0,0,0,282,0,0,0,0,0,0,0,576,4,0,null,0.75,"-",{"$f":"IF(X$2=FALSE,LOOKUP((Y18+X18)/$AM$4,'Main Line Reduction Table'!$A$1:$B$21,'Main Line Reduction Table'!$C$1:$C$21),LOOKUP(Y18/$AM$4,'Main Line Reduction Table'!$A$1:$B$21,'Main Line Reduction Table'!$C$1:$C$21))","v":0},"=",{"$f":"AK18-AM18","v":0.75},null,0.2,"-",{"$f":"IF(AF$2=FALSE,LOOKUP((AG18+AF18)/$AS$4,'Main Line Reduction Table'!$A$1:$B$21,'Main Line Reduction Table'!$C$1:$C$21),LOOKUP(AG18/$AS$4,'Main Line Reduction Table'!$A$1:$B$21,'Main Line Reduction Table'!$C$1:$C$21))","v":0},"=",{"$f":"AQ18-AS18","v":0.2}]
["07:00:00",0,0,0,0,0,15,0,0,0,0,0,0,0,7,0,0,null,"Reduced Movement Total",{"$f":"T18*(1-AO18)","v":0.25},{"$f":"(T18*(1-$AO18))+U18+V18","v":0.25},null,null,{"$f":"X18+Y18+Z18","v":282},null,null,null,{"$f":"AB18*(1-AU18)","v":0},{"$f":"(AB18*(1-$AO18))+AC18+AD18","v":0},null,null,{"$f":"AF18+AG18+AH18","v":580}]
["07:00:00",0,0,0,0,0,0,0,0,0,0,0,0,0,0,0,0,null,"07:00:00",{"$f":"SUM(B18:B20)","v":1},0,0,0,0,103,0,0,0,0,0,0,0,85,0,0]
["07:15:00",0,0,0,0,2,107,0,0,0,0,0,0,0,96,2,0]
["07:15:00",0,0,0,0,0,7,0,0,0,0,0,0,0,9,0,0]
["07:15:00",0,0,0,0,0,0,0,0,0,0,0,0,0,0,0,0,null,"07:15:00",{"$f":"SUM(B21:B23)","v":0},0,0,0,2,114,0,0,0,0,0,0,0,105,2,0]
["07:30:00",1,0,2,0,2,163,0,0,0,0,0,0,0,129,3,0]
["07:30:00",0,0,0,0,0,10,0,0,0,0,0,0,0,12,0,0]
["07:30:00",0,0,0,0,0,0,0,0,0,0,0,0,0,0,0,0,null,"07:30:00",{"$f":"SUM(B24:B26)","v":1},0,2,0,2,173,0,0,0,0,0,0,0,141,3,0]
["07:45:00",1,1,0,0,1,131,0,0,0,0,0,0,0,142,2,0]
["07:45:00",0,0,0,0,0,22,0,0,0,0,0,0,0,14,0,0]
["07:45:00",0,0,0,0,0,0,0,0,0,0,0,0,0,0,0,0,null,"07:45:00",{"$f":"SUM(B27:B29)","v":1},1,0,0,1,153,0,0,0,0,0,0,0,156,2,0]
["08:00:00",1,0,0,0,1,141,0,0,0,0,0,0,0,104,2,0,null,"Movement Total",{"$f":"SUM(T20,T23,T26,T29)","v":3},1,2,0,5,543,0,0,0,0,0,0,0,487,7,0,null,0.75,"-",{"$f":"IF(X$2=FALSE,LOOKUP((Y30+X30)/$AM$4,'Main Line Reduction Table'!$A$1:$B$21,'Main Line Reduction Table'!$C$1:$C$21),LOOKUP(Y30/$AM$4,'Main Line Reduction Table'!$A$1:$B$21,'Main Line Reduction Table'!$C$1:$C$21))","v":0},"=",{"$f":"AK30-AM30","v":0.75},null,0.2,"-",{"$f":"IF(AF$2=FALSE,LOOKUP((AG30+AF30)/$AS$4,'Main Line Reduction Table'!$A$1:$B$21,'Main Line Reduction Table'!$C$1:$C$21),LOOKUP(AG30/$AS$4,'Main Line Reduction Table'!$A$1:$B$21,'Main Line Reduction Table'!$C$1:$C$21))","v":0},"=",{"$f":"AQ30-AS30","v":0.2}]
["08:00:00",0,0,0,0,0,20,0,0,0,0,0,0,0,12,0,0,null,"Reduced Movement Total",{"$f":"T30*(1-AO30)","v":0.75},{"$f":"(T30*(1-$AO30))+U30+V30","v":3.75},null,null,{"$f":"X30+Y30+Z30","v":548},null,null,null,{"$f":"AB30*(1-AU30)","v":0},{"$f":"(AB30*(1-$AO30))+AC30+AD30","v":0},null,null,{"$f":"AF30+AG30+AH30","v":494}]
["08:00:00",0,0,0,0,0,0,0,0,0,0,0,0,0,0,0,0,null,"08:00:00",{"$f":"SUM(B30:B32)","v":1},0,0,0,1,161,0,0,0,0,0,0,0,116,2,0]
["08:15:00",3,0,1,0,0,153,0,0,0,0,1,0,1,84,6,0]
["08:15:00",0,0,0,0,0,15,0,0,0,0,0,0,0,17,0,0]
["08:15:00",0,0,0,0,0,0,0,0,0,0,0,0,0,0,0,0,null,"08:15:00",{"$f":"SUM(B33:B35)","v":3},0,1,0,0,168,0,0,0,0,1,0,1,101,6,0]
["08:30:00",6,0,1,0,2,111,0,0,0,0,1,0,1,87,0,0]
["08:30:00",0,0,0,0,1,13,0,0,0,0,0,0,0,10,0,0]
["08:30:00",0,0,0,0,0,0,0,0,0,0,0,0,0,0,0,0,null,"08:30:00",{"$f":"SUM(B36:B38)","v":6},0,1,0,3,124,0,0,0,0,1,0,1,97,0,0]
["08:45:00",3,0,2,0,5,142,1,0,0,1,0,0,0,105,3,0]
["08:45:00",1,0,0,0,0,15,0,0,0,0,0,0,0,27,0,0]
{"$rows_left_out":398}
{"sheet":"HCS+ for N-S Mainline","index":1,"n_rows":16,"n_cols":15,"rows_kept":16,"cut":false,"hidden":false,"merged":[[0,0,0,14],[1,3,1,5],[2,3,2,5],[1,6,1,8],[2,6,2,8],[1,9,1,11],[2,9,2,11],[1,12,1,14],[2,12,2,14]]}
["Data Formatted for HCS+ Warrants for a North/South Major Street"]
[null,null,null,{"$f":"'Traffic Count'!T3","v":"#1"},null,null,{"$f":"'Traffic Count'!AB3","v":"#3"},null,null,{"$f":"'Traffic Count'!AF3","v":"#4"},null,null,{"$f":"'Traffic Count'!X3","v":"#2"}]
[null,null,null,{"$f":"'Traffic Count'!T4","v":"TRACTOR SUPPLY ENTRANCE--Eastbound"},null,null,{"$f":"'Traffic Count'!AB4","v":"ALDI ENTRANCE--Westbound"},null,null,{"$f":"'Traffic Count'!AF4","v":"SR 159--Northbound"},null,null,{"$f":"'Traffic Count'!X4","v":"SR 159--Southbound"}]
[null,null,null,"Left","Thru","Right","Left","Thru","Right","Left","Thru","Right","Left","Thru","Right"]
[{"$f":"'Traffic Count'!S8","v":"06:00:00"},"-",{"$f":"A5+TIME(1,0,0)","v":"07:00:00"},{"$f":"'Traffic Count'!V18","v":0},{"$f":"'Traffic Count'!U18","v":0},{"$f":"'Traffic Count'!T19","v":0.25},{"$f":"'Traffic Count'!AD18","v":0},{"$f":"'Traffic Count'!AC18","v":0},{"$f":"'Traffic Count'!AB19","v":0},{"$f":"'Traffic Count'!AH18","v":4},{"$f":"'Traffic Count'!AG18","v":576},{"$f":"'Traffic Count'!AF18","v":0},{"$f":"'Traffic Count'!Z18","v":0},{"$f":"'Traffic Count'!Y18","v":282},{"$f":"'Traffic Count'!X18","v":0}]
[{"$f":"'Traffic Count'!S20","v":"07:00:00"},"-",{"$f":"A6+TIME(1,0,0)","v":"08:00:00"},{"$f":"'Traffic Count'!V30","v":2},{"$f":"'Traffic Count'!U30","v":1},{"$f":"'Traffic Count'!T31","v":0.75},{"$f":"'Traffic Count'!AD30","v":0},{"$f":"'Traffic Count'!AC30","v":0},{"$f":"'Traffic Count'!AB31","v":0},{"$f":"'Traffic Count'!AH30","v":7},{"$f":"'Traffic Count'!AG30","v":487},{"$f":"'Traffic Count'!AF30","v":0},{"$f":"'Traffic Count'!Z30","v":0},{"$f":"'Traffic Count'!Y30","v":543},{"$f":"'Traffic Count'!X30","v":5}]
[{"$f":"'Traffic Count'!S32","v":"08:00:00"},"-",{"$f":"A7+TIME(1,0,0)","v":"09:00:00"},{"$f":"'Traffic Count'!V42","v":4},{"$f":"'Traffic Count'!U42","v":0},{"$f":"'Traffic Count'!T43","v":3.5},{"$f":"'Traffic Count'!AD42","v":2},{"$f":"'Traffic Count'!AC42","v":1},{"$f":"'Traffic Count'!AB43","v":0},{"$f":"'Traffic Count'!AH42","v":11},{"$f":"'Traffic Count'!AG42","v":446},{"$f":"'Traffic Count'!AF42","v":2},{"$f":"'Traffic Count'!Z42","v":1},{"$f":"'Traffic Count'!Y42","v":610},{"$f":"'Traffic Count'!X42","v":9}]
[{"$f":"'Traffic Count'!S44","v":"09:00:00"},"-","10:00:00",{"$f":"'Traffic Count'!V54","v":9},{"$f":"'Traffic Count'!U54","v":1},{"$f":"'Traffic Count'!T55","v":5},{"$f":"'Traffic Count'!AD54","v":9},{"$f":"'Traffic Count'!AC54","v":0},{"$f":"'Traffic Count'!AB55","v":0.8},{"$f":"'Traffic Count'!AH54","v":18},{"$f":"'Traffic Count'!AG54","v":458},{"$f":"'Traffic Count'!AF54","v":12},{"$f":"'Traffic Count'!Z54","v":7},{"$f":"'Traffic Count'!Y54","v":634},{"$f":"'Traffic Count'!X54","v":12}]
[{"$f":"'Traffic Count'!S56","v":"10:00:00"},"-","11:00:00",{"$f":"'Traffic Count'!V66","v":7},{"$f":"'Traffic Count'!U66","v":1},{"$f":"'Traffic Count'!T67","v":8.25},{"$f":"'Traffic Count'!AD66","v":17},{"$f":"'Traffic Count'!AC66","v":1},{"$f":"'Traffic Count'!AB67","v":3.6},{"$f":"'Traffic Count'!AH66","v":30},{"$f":"'Traffic Count'!AG66","v":544},{"$f":"'Traffic Count'!AF66","v":29},{"$f":"'Traffic Count'!Z66","v":7},{"$f":"'Traffic Count'!Y66","v":681},{"$f":"'Traffic Count'!X66","v":15}]
[{"$f":"'Traffic Count'!S68","v":"11:00:00"},"-","12:00:00",{"$f":"'Traffic Count'!V78","v":11},{"$f":"'Traffic Count'!U78","v":0},{"$f":"'Traffic Count'!T79","v":11.700000000000001},{"$f":"'Traffic Count'!AD78","v":23},{"$f":"'Traffic Count'!AC78","v":1},{"$f":"'Traffic Count'!AB79","v":1.2000000000000002},{"$f":"'Traffic Count'!AH78","v":33},{"$f":"'Traffic Count'!AG78","v":656},{"$f":"'Traffic Count'!AF78","v":32},{"$f":"'Traffic Count'!Z78","v":3},{"$f":"'Traffic Count'!Y78","v":936},{"$f":"'Traffic Count'!X78","v":17}]
[{"$f":"'Traffic Count'!S80","v":"12:00:00"},"-","13:00:00",{"$f":"'Traffic Count'!V90","v":7},{"$f":"'Traffic Count'!U90","v":1},{"$f":"'Traffic Count'!T91","v":15.600000000000001},{"$f":"'Traffic Count'!AD90","v":15},{"$f":"'Traffic Count'!AC90","v":1},{"$f":"'Traffic Count'!AB91","v":2},{"$f":"'Traffic Count'!AH90","v":38},{"$f":"'Traffic Count'!AG90","v":729},{"$f":"'Traffic Count'!AF90","v":26},{"$f":"'Traffic Count'!Z90","v":8},{"$f":"'Traffic Count'!Y90","v":789},{"$f":"'Traffic Count'!X90","v":24}]
[{"$f":"'Traffic Count'!S92","v":"13:00:00"},"-","14:00:00",{"$f":"'Traffic Count'!V102","v":12},{"$f":"'Traffic Count'!U102","v":3},{"$f":"'Traffic Count'!T103","v":12.75},{"$f":"'Traffic Count'!AD102","v":23},{"$f":"'Traffic Count'!AC102","v":1},{"$f":"'Traffic Count'!AB103","v":1.2000000000000002},{"$f":"'Traffic Count'!AH102","v":30},{"$f":"'Traffic Count'!AG102","v":647},{"$f":"'Traffic Count'!AF102","v":26},{"$f":"'Traffic Count'!Z102","v":6},{"$f":"'Traffic Count'!Y102","v":705},{"$f":"'Traffic Count'!X102","v":27}]
[{"$f":"'Traffic Count'!S104","v":"14:00:00"},"-","15:00:00",{"$f":"'Traffic Count'!V114","v":5},{"$f":"'Traffic Count'!U114","v":0},{"$f":"'Traffic Count'!T115","v":9.25},{"$f":"'Traffic Count'!AD114","v":22},{"$f":"'Traffic Count'!AC114","v":2},{"$f":"'Traffic Count'!AB115","v":3.6},{"$f":"'Traffic Count'!AH114","v":24},{"$f":"'Traffic Count'!AG114","v":696},{"$f":"'Traffic Count'!AF114","v":29},{"$f":"'Traffic Count'!Z114","v":10},{"$f":"'Traffic Count'!Y114","v":774},{"$f":"'Traffic Count'!X114","v":18}]
[{"$f":"'Traffic Count'!S116","v":"15:00:00"},"-","16:00:00",{"$f":"'Traffic Count'!V126","v":17},{"$f":"'Traffic Count'!U126","v":1},{"$f":"'Traffic Count'!T127","v":10.85},{"$f":"'Traffic Count'!AD126","v":25},{"$f":"'Traffic Count'!AC126","v":0},{"$f":"'Traffic Count'!AB127","v":1.2000000000000002},{"$f":"'Traffic Count'!AH126","v":23},{"$f":"'Traffic Count'!AG126","v":694},{"$f":"'Traffic Count'!AF126","v":24},{"$f":"'Traffic Count'!Z126","v":12},{"$f":"'Traffic Count'!Y126","v":1080},{"$f":"'Traffic Count'!X126","v":22}]
[{"$f":"'Traffic Count'!S128","v":"16:00:00"},"-","17:00:00",{"$f":"'Traffic Count'!V138","v":18},{"$f":"'Traffic Count'!U138","v":1},{"$f":"'Traffic Count'!T139","v":12.000000000000002},{"$f":"'Traffic Count'!AD138","v":17},{"$f":"'Traffic Count'!AC138","v":3},{"$f":"'Traffic Count'!AB139","v":2.4000000000000004},{"$f":"'Traffic Count'!AH138","v":31},{"$f":"'Traffic Count'!AG138","v":636},{"$f":"'Traffic Count'!AF138","v":28},{"$f":"'Traffic Count'!Z138","v":8},{"$f":"'Traffic Count'!Y138","v":977},{"$f":"'Traffic Count'!X138","v":17}]
[{"$f":"'Traffic Count'!S140","v":"17:00:00"},"-","18:00:00",{"$f":"'Traffic Count'!V150","v":15},{"$f":"'Traffic Count'!U150","v":0},{"$f":"'Traffic Count'!T151","v":6.3000000000000007},{"$f":"'Traffic Count'!AD150","v":21},{"$f":"'Traffic Count'!AC150","v":0},{"$f":"'Traffic Count'!AB151","v":2.4000000000000004},{"$f":"'Traffic Count'!AH150","v":22},{"$f":"'Traffic Count'!AG150","v":716},{"$f":"'Traffic Count'!AF150","v":22},{"$f":"'Traffic Count'!Z150","v":11},{"$f":"'Traffic Count'!Y150","v":803},{"$f":"'Traffic Count'!X150","v":14}]

{"sheet":"HCS+ for E-W Mainline","index":2,"n_rows":16,"n_cols":15,"rows_kept":16,"cut":false,"hidden":false,"merged":[[0,0,0,14],[2,3,2,5],[2,6,2,8],[2,9,2,11],[2,12,2,14],[1,3,1,5],[1,6,1,8],[1,9,1,11],[1,12,1,14]]}
["Data Formatted for HCS+ Warrants for an East/West Major Street"]
[null,null,null,{"$f":"'HCS+ for N-S Mainline'!J2","v":"#4"},null,null,{"$f":"'HCS+ for N-S Mainline'!M2","v":"#2"},null,null,{"$f":"'HCS+ for N-S Mainline'!G2","v":"#3"},null,null,{"$f":"'HCS+ for N-S Mainline'!D2","v":"#1"}]
[null,null,null,{"$f":"'Traffic Count'!AF4","v":"SR 159--Northbound"},null,null,{"$f":"'HCS+ for N-S Mainline'!M3","v":"SR 159--Southbound"},null,null,{"$f":"'HCS+ for N-S Mainline'!G3","v":"ALDI ENTRANCE--Westbound"},null,null,{"$f":"'HCS+ for N-S Mainline'!D3","v":"TRACTOR SUPPLY ENTRANCE--Eastbound"}]
[null,null,null,{"$f":"'HCS+ for N-S Mainline'!J4","v":"Left"},{"$f":"'HCS+ for N-S Mainline'!K4","v":"Thru"},{"$f":"'HCS+ for N-S Mainline'!L4","v":"Right"},{"$f":"'HCS+ for N-S Mainline'!M4","v":"Left"},{"$f":"'HCS+ for N-S Mainline'!N4","v":"Thru"},{"$f":"'HCS+ for N-S Mainline'!O4","v":"Right"},{"$f":"'HCS+ for N-S Mainline'!G4","v":"Left"},{"$f":"'HCS+ for N-S Mainline'!H4","v":"Thru"},{"$f":"'HCS+ for N-S Mainline'!I4","v":"Right"},{"$f":"'HCS+ for N-S Mainline'!D4","v":"Left"},{"$f":"'HCS+ for N-S Mainline'!E4","v":"Thru"},{"$f":"'HCS+ for N-S Mainline'!F4","v":"Right"}]
[{"$f":"'Traffic Count'!S8","v":"06:00:00"},"-",{"$f":"A5+TIME(1,0,0)","v":"07:00:00"},{"$f":"'HCS+ for N-S Mainline'!J5","v":4},{"$f":"'HCS+ for N-S Mainline'!K5","v":576},{"$f":"'HCS+ for N-S Mainline'!L5","v":0},{"$f":"'HCS+ for N-S Mainline'!M5","v":0},{"$f":"'HCS+ for N-S Mainline'!N5","v":282},{"$f":"'HCS+ for N-S Mainline'!O5","v":0},{"$f":"'HCS+ for N-S Mainline'!G5","v":0},{"$f":"'HCS+ for N-S Mainline'!H5","v":0},{"$f":"'HCS+ for N-S Mainline'!I5","v":0},{"$f":"'HCS+ for N-S Mainline'!D5","v":0},{"$f":"'HCS+ for N-S Mainline'!E5","v":0},{"$f":"'HCS+ for N-S Mainline'!F5","v":0.25}]
[{"$f":"'Traffic Count'!S20","v":"07:00:00"},"-",{"$f":"A6+TIME(1,0,0)","v":"08:00:00"},{"$f":"'HCS+ for N-S Mainline'!J6","v":7},{"$f":"'HCS+ for N-S Mainline'!K6","v":487},{"$f":"'HCS+ for N-S Mainline'!L6","v":0},{"$f":"'HCS+ for N-S Mainline'!M6","v":0},{"$f":"'HCS+ for N-S Mainline'!N6","v":543},{"$f":"'HCS+ for N-S Mainline'!O6","v":5},{"$f":"'HCS+ for N-S Mainline'!G6","v":0},{"$f":"'HCS+ for N-S Mainline'!H6","v":0},{"$f":"'HCS+ for N-S Mainline'!I6","v":0},{"$f":"'HCS+ for N-S Mainline'!D6","v":2},{"$f":"'HCS+ for N-S Mainline'!E6","v":1},{"$f":"'HCS+ for N-S Mainline'!F6","v":0.75}]
[{"$f":"'Traffic Count'!S32","v":"08:00:00"},"-",{"$f":"A7+TIME(1,0,0)","v":"09:00:00"},{"$f":"'HCS+ for N-S Mainline'!J7","v":11},{"$f":"'HCS+ for N-S Mainline'!K7","v":446},{"$f":"'HCS+ for N-S Mainline'!L7","v":2},{"$f":"'HCS+ for N-S Mainline'!M7","v":1},{"$f":"'HCS+ for N-S Mainline'!N7","v":610},{"$f":"'HCS+ for N-S Mainline'!O7","v":9},{"$f":"'HCS+ for N-S Mainline'!G7","v":2},{"$f":"'HCS+ for N-S Mainline'!H7","v":1},{"$f":"'HCS+ for N-S Mainline'!I7","v":0},{"$f":"'HCS+ for N-S Mainline'!D7","v":4},{"$f":"'HCS+ for N-S Mainline'!E7","v":0},{"$f":"'HCS+ for N-S Mainline'!F7","v":3.5}]
[{"$f":"'Traffic Count'!S44","v":"09:00:00"},"-","10:00:00",{"$f":"'HCS+ for N-S Mainline'!J8","v":18},{"$f":"'HCS+ for N-S Mainline'!K8","v":458},{"$f":"'HCS+ for N-S Mainline'!L8","v":12},{"$f":"'HCS+ for N-S Mainline'!M8","v":7},{"$f":"'HCS+ for N-S Mainline'!N8","v":634},{"$f":"'HCS+ for N-S Mainline'!O8","v":12},{"$f":"'HCS+ for N-S Mainline'!G8","v":9},{"$f":"'HCS+ for N-S Mainline'!H8","v":0},{"$f":"'HCS+ for N-S Mainline'!I8","v":0.8},{"$f":"'HCS+ for N-S Mainline'!D8","v":9},{"$f":"'HCS+ for N-S Mainline'!E8","v":1},{"$f":"'HCS+ for N-S Mainline'!F8","v":5}]
[{"$f":"'Traffic Count'!S56","v":"10:00:00"},"-","11:00:00",{"$f":"'HCS+ for N-S Mainline'!J9","v":30},{"$f":"'HCS+ for N-S Mainline'!K9","v":544},{"$f":"'HCS+ for N-S Mainline'!L9","v":29},{"$f":"'HCS+ for N-S Mainline'!M9","v":7},{"$f":"'HCS+ for N-S Mainline'!N9","v":681},{"$f":"'HCS+ for N-S Mainline'!O9","v":15},{"$f":"'HCS+ for N-S Mainline'!G9","v":17},{"$f":"'HCS+ for N-S Mainline'!H9","v":1},{"$f":"'HCS+ for N-S Mainline'!I9","v":3.6},{"$f":"'HCS+ for N-S Mainline'!D9","v":7},{"$f":"'HCS+ for N-S Mainline'!E9","v":1},{"$f":"'HCS+ for N-S Mainline'!F9","v":8.25}]
[{"$f":"'Traffic Count'!S68","v":"11:00:00"},"-","12:00:00",{"$f":"'HCS+ for N-S Mainline'!J10","v":33},{"$f":"'HCS+ for N-S Mainline'!K10","v":656},{"$f":"'HCS+ for N-S Mainline'!L10","v":32},{"$f":"'HCS+ for N-S Mainline'!M10","v":3},{"$f":"'HCS+ for N-S Mainline'!N10","v":936},{"$f":"'HCS+ for N-S Mainline'!O10","v":17},{"$f":"'HCS+ for N-S Mainline'!G10","v":23},{"$f":"'HCS+ for N-S Mainline'!H10","v":1},{"$f":"'HCS+ for N-S Mainline'!I10","v":1.2000000000000002},{"$f":"'HCS+ for N-S Mainline'!D10","v":11},{"$f":"'HCS+ for N-S Mainline'!E10","v":0},{"$f":"'HCS+ for N-S Mainline'!F10","v":11.700000000000001}]
[{"$f":"'Traffic Count'!S80","v":"12:00:00"},"-","13:00:00",{"$f":"'HCS+ for N-S Mainline'!J11","v":38},{"$f":"'HCS+ for N-S Mainline'!K11","v":729},{"$f":"'HCS+ for N-S Mainline'!L11","v":26},{"$f":"'HCS+ for N-S Mainline'!M11","v":8},{"$f":"'HCS+ for N-S Mainline'!N11","v":789},{"$f":"'HCS+ for N-S Mainline'!O11","v":24},{"$f":"'HCS+ for N-S Mainline'!G11","v":15},{"$f":"'HCS+ for N-S Mainline'!H11","v":1},{"$f":"'HCS+ for N-S Mainline'!I11","v":2},{"$f":"'HCS+ for N-S Mainline'!D11","v":7},{"$f":"'HCS+ for N-S Mainline'!E11","v":1},{"$f":"'HCS+ for N-S Mainline'!F11","v":15.600000000000001}]
[{"$f":"'Traffic Count'!S92","v":"13:00:00"},"-","14:00:00",{"$f":"'HCS+ for N-S Mainline'!J12","v":30},{"$f":"'HCS+ for N-S Mainline'!K12","v":647},{"$f":"'HCS+ for N-S Mainline'!L12","v":26},{"$f":"'HCS+ for N-S Mainline'!M12","v":6},{"$f":"'HCS+ for N-S Mainline'!N12","v":705},{"$f":"'HCS+ for N-S Mainline'!O12","v":27},{"$f":"'HCS+ for N-S Mainline'!G12","v":23},{"$f":"'HCS+ for N-S Mainline'!H12","v":1},{"$f":"'HCS+ for N-S Mainline'!I12","v":1.2000000000000002},{"$f":"'HCS+ for N-S Mainline'!D12","v":12},{"$f":"'HCS+ for N-S Mainline'!E12","v":3},{"$f":"'HCS+ for N-S Mainline'!F12","v":12.75}]
[{"$f":"'Traffic Count'!S104","v":"14:00:00"},"-","15:00:00",{"$f":"'HCS+ for N-S Mainline'!J13","v":24},{"$f":"'HCS+ for N-S Mainline'!K13","v":696},{"$f":"'HCS+ for N-S Mainline'!L13","v":29},{"$f":"'HCS+ for N-S Mainline'!M13","v":10},{"$f":"'HCS+ for N-S Mainline'!N13","v":774},{"$f":"'HCS+ for N-S Mainline'!O13","v":18},{"$f":"'HCS+ for N-S Mainline'!G13","v":22},{"$f":"'HCS+ for N-S Mainline'!H13","v":2},{"$f":"'HCS+ for N-S Mainline'!I13","v":3.6},{"$f":"'HCS+ for N-S Mainline'!D13","v":5},{"$f":"'HCS+ for N-S Mainline'!E13","v":0},{"$f":"'HCS+ for N-S Mainline'!F13","v":9.25}]
[{"$f":"'Traffic Count'!S116","v":"15:00:00"},"-","16:00:00",{"$f":"'HCS+ for N-S Mainline'!J14","v":23},{"$f":"'HCS+ for N-S Mainline'!K14","v":694},{"$f":"'HCS+ for N-S Mainline'!L14","v":24},{"$f":"'HCS+ for N-S Mainline'!M14","v":12},{"$f":"'HCS+ for N-S Mainline'!N14","v":1080},{"$f":"'HCS+ for N-S Mainline'!O14","v":22},{"$f":"'HCS+ for N-S Mainline'!G14","v":25},{"$f":"'HCS+ for N-S Mainline'!H14","v":0},{"$f":"'HCS+ for N-S Mainline'!I14","v":1.2000000000000002},{"$f":"'HCS+ for N-S Mainline'!D14","v":17},{"$f":"'HCS+ for N-S Mainline'!E14","v":1},{"$f":"'HCS+ for N-S Mainline'!F14","v":10.85}]
[{"$f":"'Traffic Count'!S128","v":"16:00:00"},"-","17:00:00",{"$f":"'HCS+ for N-S Mainline'!J15","v":31},{"$f":"'HCS+ for N-S Mainline'!K15","v":636},{"$f":"'HCS+ for N-S Mainline'!L15","v":28},{"$f":"'HCS+ for N-S Mainline'!M15","v":8},{"$f":"'HCS+ for N-S Mainline'!N15","v":977},{"$f":"'HCS+ for N-S Mainline'!O15","v":17},{"$f":"'HCS+ for N-S Mainline'!G15","v":17},{"$f":"'HCS+ for N-S Mainline'!H15","v":3},{"$f":"'HCS+ for N-S Mainline'!I15","v":2.4000000000000004},{"$f":"'HCS+ for N-S Mainline'!D15","v":18},{"$f":"'HCS+ for N-S Mainline'!E15","v":1},{"$f":"'HCS+ for N-S Mainline'!F15","v":12.000000000000002}]
[{"$f":"'Traffic Count'!S140","v":"17:00:00"},"-","18:00:00",{"$f":"'HCS+ for N-S Mainline'!J16","v":22},{"$f":"'HCS+ for N-S Mainline'!K16","v":716},{"$f":"'HCS+ for N-S Mainline'!L16","v":22},{"$f":"'HCS+ for N-S Mainline'!M16","v":11},{"$f":"'HCS+ for N-S Mainline'!N16","v":803},{"$f":"'HCS+ for N-S Mainline'!O16","v":14},{"$f":"'HCS+ for N-S Mainline'!G16","v":21},{"$f":"'HCS+ for N-S Mainline'!H16","v":0},{"$f":"'HCS+ for N-S Mainline'!I16","v":2.4000000000000004},{"$f":"'HCS+ for N-S Mainline'!D16","v":15},{"$f":"'HCS+ for N-S Mainline'!E16","v":0},{"$f":"'HCS+ for N-S Mainline'!F16","v":6.3000000000000007}]

{"sheet":"Main Line Reduction Table","index":3,"n_rows":28,"n_cols":3,"rows_kept":28,"cut":false,"hidden":false,"merged":[]}
[0,399,0]
[400,499,0.05]
[500,599,0.1]
[600,699,0.15]
[700,799,0.2]
[800,899,0.25]
[900,999,0.3]
[1000,1099,0.35]
[1100,1199,0.4]
[1200,1299,0.45]
[1300,1399,0.5]
[1400,1499,0.55000000000000004]
[1500,1599,0.6]
[1600,1699,0.65]
[1700,1799,0.7]
[1800,1899,0.75]
[1900,1999,0.8]
[2000,2099,0.85]
[2100,2199,0.9]
[2200,2299,0.95]
[2300,2399,1]
[]
[]
[]
[]
[]
["North/South"]
["East/West"]

{"sheet":"Configurations","index":4,"n_rows":0,"n_cols":0,"rows_kept":0,"cut":false,"hidden":false,"merged":[]}