{"text_format":"1","workbook":"xlsx","n_sheets":5,"sheets":["Notes-COPY ALL","Instructions","Catagory Codes","SUBSummary","Sub01"],"not_rendered":{"charts":0,"images":19,"macros":1,"external_links":1,"defined_names":2,"comments":0,"pivot_tables":0},"unopened":[],"bounds":{"document_bytes":16777216,"sheet_cells":100000,"rows_first":2000,"rows_last":500,"rows_between":2000,"halvings":0,"cell_chars":16384,"cell_head_chars":4096},"cells_cut":0,"cells_raw":0,"read":"whole","date_system":"1900"}

{"sheet":"Notes-COPY ALL","index":0,"n_rows":1,"n_cols":1,"rows_kept":1,"cut":false,"hidden":false,"merged":[[0,0,0,9]]}
["WORKBOOK NOTES"]

{"sheet":"Instructions","index":1,"n_rows":129,"n_cols":12,"rows_kept":129,"cut":false,"hidden":false,"merged":[[66,1,67,10],[68,2,70,10],[71,2,73,10],[49,2,50,10],[52,2,52,10],[109,0,109,10],[82,1,82,10],[97,2,98,10],[99,2,100,10],[108,1,108,10],[94,1,96,10],[104,2,107,10],[101,1,103,10],[83,2,84,10],[88,2,91,10],[93,0,93,10],[85,1,87,10],[77,2,79,10],[55,1,55,10],[0,0,0,10],[2,0,2,10],[11,0,11,10],[25,0,25,10],[10,1,10,10],[19,2,23,10],[3,1,3,10],[1,0,1,10],[12,1,12,10],[13,1,13,10],[74,2,76,10],[30,1,30,10],[31,1,31,10],[35,2,38,10],[42,2,44,10],[29,1,29,10],[65,0,65,10],[60,2,63,10],[51,1,51,10],[53,2,54,10],[32,1,34,10],[128,1,128,10],[9,1,9,10],[4,2,8,10],[14,2,15,10],[16,2,16,10],[17,1,18,10],[28,2,28,10],[26,1,27,10],[39,2,41,10],[45,2,47,10],[24,1,24,10],[56,1,59,10],[64,1,64,10],[92,1,92,10],[48,1,48,10],[80,1,81,10],[110,1,112,10],[113,1,113,10],[115,2,116,10],[114,2,114,10],[125,1,127,10],[117,1,117,10],[118,1,119,10],[124,1,124,10],[120,2,123,10]]}
[null,null,null,null,null,null,null,null,null,null,null,{"$f":"CELL(\"filename\",L3)","v":"https://gfnet.sharepoint.com/sites/CMH-63152/Shared Documents/63152/TO #12-10 GEA-422-14.90 Culvert Repl/F. Deliver/2021.04.06 Revised Tracings/[105821_OFFICE CALCS.xlsm]Instructions"}]
[{"$f":"CONCATENATE(\"HOW TO USE THIS WORKBOOK (\", L6, \")\")","v":"HOW TO USE THIS WORKBOOK (105821_OFFICE CALCS.xlsm)"},null,null,null,null,null,null,null,null,null,null,{"$f":"FIND(\"[\",L1)","v":145}]
["Opening the workbook",null,null,null,null,null,null,null,null,null,null,{"$f":"FIND(\"]\",L1)","v":170}]
[1,"Select \"Enable Macros\" when you open this workbook (if security is set to Medium)",null,null,null,null,null,null,null,null,null,{"$f":"LEN(L1)","v":182}]
[null,"a.","If you are not asked about enabling macros when you open the workbook, you either have your security set on the highest or lowest setting.  Set your security to \"Medium\" by the following steps:\nTools  >>  Macro  >>  Security….  For this workbook to function, you must have Medium (recommended), or Low selected.  If it was previously set on high, you must close this workbook and re-open it to ensure that the macros are enabled.",null,null,null,null,null,null,null,null,{"$f":"LEFT(CELL(\"filename\",L3),L3-1)","v":"https://gfnet.sharepoint.com/sites/CMH-63152/Shared Documents/63152/TO #12-10 GEA-422-14.90 Culvert Repl/F. Deliver/2021.04.06 Revised Tracings/[105821_OFFICE CALCS.xlsm"}]
[null,null,null,null,null,null,null,null,null,null,null,{"$f":"RIGHT(L5,L3-L2-1)","v":"105821_OFFICE CALCS.xlsm"}]
{"$rows_left_out":124}
{"sheet":"Catagory Codes","index":2,"n_rows":39,"n_cols":3,"rows_kept":39,"cut":false,"hidden":false,"merged":[[0,0,0,2]]}
["CODES FOR USE WITH EXCEL QUANTITIES\n(Used to sort items on General Summary Sheets)"]
[]
["AA","ROADWAY",{"$f":"A3","v":"AA"}]
["BB","EROSION CONTROL","BB"]
["CC","DRAINAGE","CC"]
["DD","PAVEMENT","DD"]
{"$rows_left_out":34}
{"sheet":"SUBSummary","index":3,"n_rows":75,"n_cols":30,"rows_kept":75,"cut":false,"hidden":false,"merged":[[0,24,1,24],[0,25,1,25],[0,0,0,19],[0,20,1,20],[0,21,1,21],[0,22,1,22],[0,23,1,23]]}
["SHEET NUMBER",null,null,null,null,null,null,null,null,null,null,null,null,null,null,null,null,null,null,null,"ITEM","ITEM\nEXT.","TOTAL","UNIT","DESCRIPTION","SEE SHEET NO."]
[{"$f":"IF(#REF!<>\"\",#REF!,\"\")","v":{"$error":"#REF!"}},{"$f":"IF(#REF!<>\"\",#REF!,\"\")","v":{"$error":"#REF!"}},{"$f":"IF(#REF!<>\"\",#REF!,\"\")","v":{"$error":"#REF!"}},{"$f":"IF(#REF!<>\"\",#REF!,\"\")","v":{"$error":"#REF!"}},{"$f":"IF(#REF!<>\"\",#REF!,\"\")","v":{"$error":"#REF!"}},{"$f":"IF(#REF!<>\"\",#REF!,\"\")","v":{"$error":"#REF!"}},{"$f":"IF(#REF!<>\"\",#REF!,\"\")","v":{"$error":"#REF!"}},{"$f":"IF(#REF!<>\"\",#REF!,\"\")","v":{"$error":"#REF!"}},{"$f":"IF(#REF!<>\"\",#REF!,\"\")","v":{"$error":"#REF!"}},{"$f":"IF(#REF!<>\"\",#REF!,\"\")","v":{"$error":"#REF!"}},{"$f":"IF(#REF!<>\"\",#REF!,\"\")","v":{"$error":"#REF!"}},{"$f":"IF(#REF!<>\"\",#REF!,\"\")","v":{"$error":"#REF!"}},{"$f":"IF(#REF!<>\"\",#REF!,\"\")","v":{"$error":"#REF!"}},{"$f":"IF(#REF!<>\"\",#REF!,\"\")","v":{"$error":"#REF!"}},{"$f":"IF(#REF!<>\"\",#REF!,\"\")","v":{"$error":"#REF!"}},{"$f":"IF(#REF!<>\"\",#REF!,\"\")","v":{"$error":"#REF!"}},{"$f":"IF(#REF!<>\"\",#REF!,\"\")","v":{"$error":"#REF!"}},{"$f":"IF(#REF!<>\"\",#REF!,\"\")","v":{"$error":"#REF!"}},{"$f":"IF(#REF!<>\"\",#REF!,\"\")","v":{"$error":"#REF!"}},{"$f":"IF(#REF!<>\"\",#REF!,\"\")","v":{"$error":"#REF!"}},null,null,null,null,null,null,"line","remain","offset","UNIT"]
[{"$f":"IF( $AC3 = 0, \"\", IF( OFFSET(#REF!, $AC3 - 1,0,1,1)<>0, IF(OR($AD3=\"LUMP\", $AD3=\"LS\"), \"LUMP\", OFFSET(#REF!, $AC3 - 1,0,1,1)),\"\"))","v":{"$error":"#REF!"}},{"$f":"IF( $AC3 = 0, \"\", IF( OFFSET(#REF!, $AC3 - 1,0,1,1)<>0, IF(OR($AD3=\"LUMP\", $AD3=\"LS\"), \"LUMP\", OFFSET(#REF!, $AC3 - 1,0,1,1)),\"\"))","v":{"$error":"#REF!"}},{"$f":"IF( $AC3 = 0, \"\", IF( OFFSET(#REF!, $AC3 - 1,0,1,1)<>0, IF(OR($AD3=\"LUMP\", $AD3=\"LS\"), \"LUMP\", OFFSET(#REF!, $AC3 - 1,0,1,1)),\"\"))","v":{"$error":"#REF!"}},{"$f":"IF( $AC3 = 0, \"\", IF( OFFSET(#REF!, $AC3 - 1,0,1,1)<>0, IF(OR($AD3=\"LUMP\", $AD3=\"LS\"), \"LUMP\", OFFSET(#REF!, $AC3 - 1,0,1,1)),\"\"))","v":{"$error":"#REF!"}},{"$f":"IF( $AC3 = 0, \"\", IF( OFFSET(#REF!, $AC3 - 1,0,1,1)<>0, IF(OR($AD3=\"LUMP\", $AD3=\"LS\"), \"LUMP\", OFFSET(#REF!, $AC3 - 1,0,1,1)),\"\"))","v":{"$error":"#REF!"}},{"$f":"IF( $AC3 = 0, \"\", IF( OFFSET(#REF!, $AC3 - 1,0,1,1)<>0, IF(OR($AD3=\"LUMP\", $AD3=\"LS\"), \"LUMP\", OFFSET(#REF!, $AC3 - 1,0,1,1)),\"\"))","v":{"$error":"#REF!"}},{"$f":"IF( $AC3 = 0, \"\", IF( OFFSET(#REF!, $AC3 - 1,0,1,1)<>0, IF(OR($AD3=\"LUMP\", $AD3=\"LS\"), \"LUMP\", OFFSET(#REF!, $AC3 - 1,0,1,1)),\"\"))","v":{"$error":"#REF!"}},{"$f":"IF( $AC3 = 0, \"\", IF( OFFSET(#REF!, $AC3 - 1,0,1,1)<>0, IF(OR($AD3=\"LUMP\", $AD3=\"LS\"), \"LUMP\", OFFSET(#REF!, $AC3 - 1,0,1,1)),\"\"))","v":{"$error":"#REF!"}},{"$f":"IF( $AC3 = 0, \"\", IF( OFFSET(#REF!, $AC3 - 1,0,1,1)<>0, IF(OR($AD3=\"LUMP\", $AD3=\"LS\"), \"LUMP\", OFFSET(#REF!, $AC3 - 1,0,1,1)),\"\"))","v":{"$error":"#REF!"}},{"$f":"IF( $AC3 = 0, \"\", IF( OFFSET(#REF!, $AC3 - 1,0,1,1)<>0, IF(OR($AD3=\"LUMP\", $AD3=\"LS\"), \"LUMP\", OFFSET(#REF!, $AC3 - 1,0,1,1)),\"\"))","v":{"$error":"#REF!"}},{"$f":"IF( $AC3 = 0, \"\", IF( OFFSET(#REF!, $AC3 - 1,0,1,1)<>0, IF(OR($AD3=\"LUMP\", $AD3=\"LS\"), \"LUMP\", OFFSET(#REF!, $AC3 - 1,0,1,1)),\"\"))","v":{"$error":"#REF!"}},{"$f":"IF( $AC3 = 0, \"\", IF( OFFSET(#REF!, $AC3 - 1,0,1,1)<>0, IF(OR($AD3=\"LUMP\", $AD3=\"LS\"), \"LUMP\", OFFSET(#REF!, $AC3 - 1,0,1,1)),\"\"))","v":{"$error":"#REF!"}},{"$f":"IF( $AC3 = 0, \"\", IF( OFFSET(#REF!, $AC3 - 1,0,1,1)<>0, IF(OR($AD3=\"LUMP\", $AD3=\"LS\"), \"LUMP\", OFFSET(#REF!, $AC3 - 1,0,1,1)),\"\"))","v":{"$error":"#REF!"}},{"$f":"IF( $AC3 = 0, \"\", IF( OFFSET(#REF!, $AC3 - 1,0,1,1)<>0, IF(OR($AD3=\"LUMP\", $AD3=\"LS\"), \"LUMP\", OFFSET(#REF!, $AC3 - 1,0,1,1)),\"\"))","v":{"$error":"#REF!"}},{"$f":"IF( $AC3 = 0, \"\", IF( OFFSET(#REF!, $AC3 - 1,0,1,1)<>0, IF(OR($AD3=\"LUMP\", $AD3=\"LS\"), \"LUMP\", OFFSET(#REF!, $AC3 - 1,0,1,1)),\"\"))","v":{"$error":"#REF!"}},{"$f":"IF( $AC3 = 0, \"\", IF( OFFSET(#REF!, $AC3 - 1,0,1,1)<>0, IF(OR($AD3=\"LUMP\", $AD3=\"LS\"), \"LUMP\", OFFSET(#REF!, $AC3 - 1,0,1,1)),\"\"))","v":{"$error":"#REF!"}},{"$f":"IF( $AC3 = 0, \"\", IF( OFFSET(#REF!, $AC3 - 1,0,1,1)<>0, IF(OR($AD3=\"LUMP\", $AD3=\"LS\"), \"LUMP\", OFFSET(#REF!, $AC3 - 1,0,1,1)),\"\"))","v":{"$error":"#REF!"}},{"$f":"IF( $AC3 = 0, \"\", IF( OFFSET(#REF!, $AC3 - 1,0,1,1)<>0, IF(OR($AD3=\"LUMP\", $AD3=\"LS\"), \"LUMP\", OFFSET(#REF!, $AC3 - 1,0,1,1)),\"\"))","v":{"$error":"#REF!"}},{"$f":"IF( $AC3 = 0, \"\", IF( OFFSET(#REF!, $AC3 - 1,0,1,1)<>0, IF(OR($AD3=\"LUMP\", $AD3=\"LS\"), \"LUMP\", OFFSET(#REF!, $AC3 - 1,0,1,1)),\"\"))","v":{"$error":"#REF!"}},{"$f":"IF( $AC3 = 0, \"\", IF( OFFSET(#REF!, $AC3 - 1,0,1,1)<>0, IF(OR($AD3=\"LUMP\", $AD3=\"LS\"), \"LUMP\", OFFSET(#REF!, $AC3 - 1,0,1,1)),\"\"))","v":{"$error":"#REF!"}},{"$f":"IF( $AC3 = 0, \"\", IF( OFFSET(#REF!, $AC3 - 1,0,1,1)<>0, LEFT(OFFSET(#REF!, $AC3 - 1,0,1,1),3),\"\"))","v":{"$error":"#REF!"}},{"$f":"IF( $AC3 = 0, \"\", IF( OFFSET(#REF!, $AC3 - 1,0,1,1)<>0, IF(LEN(OFFSET(#REF!, $AC3 - 1,0,1,1))=9,   RIGHT(OFFSET(#REF!, $AC3 - 1,0,1,1),5),    LEFT(RIGHT(OFFSET(#REF!, $AC3 - 1,0,1,1),6), 5)      ),\"\"))","v":{"$error":"#REF!"}},{"$f":"IF(SUM(A3:T3)<>0,SUM(A3:T3),IF(OR(AD3=\"LUMP\", AD3=\"LS\"), \"LUMP\", \"\"))","v":{"$error":"#REF!"}},{"$f":"IF( $AC3 = 0, \"\", IF( OFFSET(#REF!, $AC3 - 1,0,1,1)<>0,IF(OR(AD3=\"LUMP\", AD3=\"LS\"), \"\", AD3),\"\"))","v":{"$error":"#REF!"}},{"$f":"IF( $AC3 = 0, \"\", IF( OFFSET(#REF!, $AC3 - 1,0,1,1)<>0, VLOOKUP( OFFSET(#REF!, $AC3 - 1,0,1,1),[1]Items!$A$2:$E$10001,4,0),\"\"))","v":{"$error":"#REF!"}},null,1,{"$f":"INT(AA3/6)","v":0},{"$f":"IF(  (AA3 - 6*AB3) = 0, 0, AA3 - AB3 )","v":1},{"$f":"IF( $AC3 = 0, \"\", IF( OFFSET(#REF!, $AC3 - 1,0,1,1)<>0, VLOOKUP( OFFSET(#REF!, $AC3 - 1,0,1,1),[1]Items!$A$2:$E$10001,3,0),\"\"))","v":{"$error":"#REF!"}}]
[{"$f":"IF( $AC4 = 0, \"\", IF( OFFSET(#REF!, $AC4 - 1,0,1,1)<>0, IF(OR($AD4=\"LUMP\", $AD4=\"LS\"), \"LUMP\", OFFSET(#REF!, $AC4 - 1,0,1,1)),\"\"))","v":{"$error":"#REF!"}},{"$f":"IF( $AC4 = 0, \"\", IF( OFFSET(#REF!, $AC4 - 1,0,1,1)<>0, IF(OR($AD4=\"LUMP\", $AD4=\"LS\"), \"LUMP\", OFFSET(#REF!, $AC4 - 1,0,1,1)),\"\"))","v":{"$error":"#REF!"}},{"$f":"IF( $AC4 = 0, \"\", IF( OFFSET(#REF!, $AC4 - 1,0,1,1)<>0, IF(OR($AD4=\"LUMP\", $AD4=\"LS\"), \"LUMP\", OFFSET(#REF!, $AC4 - 1,0,1,1)),\"\"))","v":{"$error":"#REF!"}},{"$f":"IF( $AC4 = 0, \"\", IF( OFFSET(#REF!, $AC4 - 1,0,1,1)<>0, IF(OR($AD4=\"LUMP\", $AD4=\"LS\"), \"LUMP\", OFFSET(#REF!, $AC4 - 1,0,1,1)),\"\"))","v":{"$error":"#REF!"}},{"$f":"IF( $AC4 = 0, \"\", IF( OFFSET(#REF!, $AC4 - 1,0,1,1)<>0, IF(OR($AD4=\"LUMP\", $AD4=\"LS\"), \"LUMP\", OFFSET(#REF!, $AC4 - 1,0,1,1)),\"\"))","v":{"$error":"#REF!"}},{"$f":"IF( $AC4 = 0, \"\", IF( OFFSET(#REF!, $AC4 - 1,0,1,1)<>0, IF(OR($AD4=\"LUMP\", $AD4=\"LS\"), \"LUMP\", OFFSET(#REF!, $AC4 - 1,0,1,1)),\"\"))","v":{"$error":"#REF!"}},{"$f":"IF( $AC4 = 0, \"\", IF( OFFSET(#REF!, $AC4 - 1,0,1,1)<>0, IF(OR($AD4=\"LUMP\", $AD4=\"LS\"), \"LUMP\", OFFSET(#REF!, $AC4 - 1,0,1,1)),\"\"))","v":{"$error":"#REF!"}},{"$f":"IF( $AC4 = 0, \"\", IF( OFFSET(#REF!, $AC4 - 1,0,1,1)<>0, IF(OR($AD4=\"LUMP\", $AD4=\"LS\"), \"LUMP\", OFFSET(#REF!, $AC4 - 1,0,1,1)),\"\"))","v":{"$error":"#REF!"}},{"$f":"IF( $AC4 = 0, \"\", IF( OFFSET(#REF!, $AC4 - 1,0,1,1)<>0, IF(OR($AD4=\"LUMP\", $AD4=\"LS\"), \"LUMP\", OFFSET(#REF!, $AC4 - 1,0,1,1)),\"\"))","v":{"$error":"#REF!"}},{"$f":"IF( $AC4 = 0, \"\", IF( OFFSET(#REF!, $AC4 - 1,0,1,1)<>0, IF(OR($AD4=\"LUMP\", $AD4=\"LS\"), \"LUMP\", OFFSET(#REF!, $AC4 - 1,0,1,1)),\"\"))","v":{"$error":"#REF!"}},{"$f":"IF( $AC4 = 0, \"\", IF( OFFSET(#REF!, $AC4 - 1,0,1,1)<>0, IF(OR($AD4=\"LUMP\", $AD4=\"LS\"), \"LUMP\", OFFSET(#REF!, $AC4 - 1,0,1,1)),\"\"))","v":{"$error":"#REF!"}},{"$f":"IF( $AC4 = 0, \"\", IF( OFFSET(#REF!, $AC4 - 1,0,1,1)<>0, IF(OR($AD4=\"LUMP\", $AD4=\"LS\"), \"LUMP\", OFFSET(#REF!, $AC4 - 1,0,1,1)),\"\"))","v":{"$error":"#REF!"}},{"$f":"IF( $AC4 = 0, \"\", IF( OFFSET(#REF!, $AC4 - 1,0,1,1)<>0, IF(OR($AD4=\"LUMP\", $AD4=\"LS\"), \"LUMP\", OFFSET(#REF!, $AC4 - 1,0,1,1)),\"\"))","v":{"$error":"#REF!"}},{"$f":"IF( $AC4 = 0, \"\", IF( OFFSET(#REF!, $AC4 - 1,0,1,1)<>0, IF(OR($AD4=\"LUMP\", $AD4=\"LS\"), \"LUMP\", OFFSET(#REF!, $AC4 - 1,0,1,1)),\"\"))","v":{"$error":"#REF!"}},{"$f":"IF( $AC4 = 0, \"\", IF( OFFSET(#REF!, $AC4 - 1,0,1,1)<>0, IF(OR($AD4=\"LUMP\", $AD4=\"LS\"), \"LUMP\", OFFSET(#REF!, $AC4 - 1,0,1,1)),\"\"))","v":{"$error":"#REF!"}},{"$f":"IF( $AC4 = 0, \"\", IF( OFFSET(#REF!, $AC4 - 1,0,1,1)<>0, IF(OR($AD4=\"LUMP\", $AD4=\"LS\"), \"LUMP\", OFFSET(#REF!, $AC4 - 1,0,1,1)),\"\"))","v":{"$error":"#REF!"}},{"$f":"IF( $AC4 = 0, \"\", IF( OFFSET(#REF!, $AC4 - 1,0,1,1)<>0, IF(OR($AD4=\"LUMP\", $AD4=\"LS\"), \"LUMP\", OFFSET(#REF!, $AC4 - 1,0,1,1)),\"\"))","v":{"$error":"#REF!"}},{"$f":"IF( $AC4 = 0, \"\", IF( OFFSET(#REF!, $AC4 - 1,0,1,1)<>0, IF(OR($AD4=\"LUMP\", $AD4=\"LS\"), \"LUMP\", OFFSET(#REF!, $AC4 - 1,0,1,1)),\"\"))","v":{"$error":"#REF!"}},{"$f":"IF( $AC4 = 0, \"\", IF( OFFSET(#REF!, $AC4 - 1,0,1,1)<>0, IF(OR($AD4=\"LUMP\", $AD4=\"LS\"), \"LUMP\", OFFSET(#REF!, $AC4 - 1,0,1,1)),\"\"))","v":{"$error":"#REF!"}},{"$f":"IF( $AC4 = 0, \"\", IF( OFFSET(#REF!, $AC4 - 1,0,1,1)<>0, IF(OR($AD4=\"LUMP\", $AD4=\"LS\"), \"LUMP\", OFFSET(#REF!, $AC4 - 1,0,1,1)),\"\"))","v":{"$error":"#REF!"}},{"$f":"IF( $AC4 = 0, \"\", IF( OFFSET(#REF!, $AC4 - 1,0,1,1)<>0, LEFT(OFFSET(#REF!, $AC4 - 1,0,1,1),3),\"\"))","v":{"$error":"#REF!"}},{"$f":"IF( $AC4 = 0, \"\", IF( OFFSET(#REF!, $AC4 - 1,0,1,1)<>0, IF(LEN(OFFSET(#REF!, $AC4 - 1,0,1,1))=9,   RIGHT(OFFSET(#REF!, $AC4 - 1,0,1,1),5),    LEFT(RIGHT(OFFSET(#REF!, $AC4 - 1,0,1,1),6), 5)      ),\"\"))","v":{"$error":"#REF!"}},{"$f":"IF(SUM(A4:T4)<>0,SUM(A4:T4),IF(OR(AD4=\"LUMP\", AD4=\"LS\"), \"LUMP\", \"\"))","v":{"$error":"#REF!"}},{"$f":"IF( $AC4 = 0, \"\", IF( OFFSET(#REF!, $AC4 - 1,0,1,1)<>0,IF(OR(AD4=\"LUMP\", AD4=\"LS\"), \"\", AD4),\"\"))","v":{"$error":"#REF!"}},{"$f":"IF( $AC4 = 0, \"\", IF( OFFSET(#REF!, $AC4 - 1,0,1,1)<>0, VLOOKUP( OFFSET(#REF!, $AC4 - 1,0,1,1),[1]Items!$A$2:$E$10001,4,0),\"\"))","v":{"$error":"#REF!"}},null,{"$f":"AA3+1","v":2},0,2,{"$f":"IF( $AC4 = 0, \"\", IF( OFFSET(#REF!, $AC4 - 1,0,1,1)<>0, VLOOKUP( OFFSET(#REF!, $AC4 - 1,0,1,1),[1]Items!$A$2:$E$10001,3,0),\"\"))","v":{"$error":"#REF!"}}]
[{"$f":"IF( $AC5 = 0, \"\", IF( OFFSET(#REF!, $AC5 - 1,0,1,1)<>0, IF(OR($AD5=\"LUMP\", $AD5=\"LS\"), \"LUMP\", OFFSET(#REF!, $AC5 - 1,0,1,1)),\"\"))","v":{"$error":"#REF!"}},{"$f":"IF( $AC5 = 0, \"\", IF( OFFSET(#REF!, $AC5 - 1,0,1,1)<>0, IF(OR($AD5=\"LUMP\", $AD5=\"LS\"), \"LUMP\", OFFSET(#REF!, $AC5 - 1,0,1,1)),\"\"))","v":{"$error":"#REF!"}},{"$f":"IF( $AC5 = 0, \"\", IF( OFFSET(#REF!, $AC5 - 1,0,1,1)<>0, IF(OR($AD5=\"LUMP\", $AD5=\"LS\"), \"LUMP\", OFFSET(#REF!, $AC5 - 1,0,1,1)),\"\"))","v":{"$error":"#REF!"}},{"$f":"IF( $AC5 = 0, \"\", IF( OFFSET(#REF!, $AC5 - 1,0,1,1)<>0, IF(OR($AD5=\"LUMP\", $AD5=\"LS\"), \"LUMP\", OFFSET(#REF!, $AC5 - 1,0,1,1)),\"\"))","v":{"$error":"#REF!"}},{"$f":"IF( $AC5 = 0, \"\", IF( OFFSET(#REF!, $AC5 - 1,0,1,1)<>0, IF(OR($AD5=\"LUMP\", $AD5=\"LS\"), \"LUMP\", OFFSET(#REF!, $AC5 - 1,0,1,1)),\"\"))","v":{"$error":"#REF!"}},{"$f":"IF( $AC5 = 0, \"\", IF( OFFSET(#REF!, $AC5 - 1,0,1,1)<>0, IF(OR($AD5=\"LUMP\", $AD5=\"LS\"), \"LUMP\", OFFSET(#REF!, $AC5 - 1,0,1,1)),\"\"))","v":{"$error":"#REF!"}},{"$f":"IF( $AC5 = 0, \"\", IF( OFFSET(#REF!, $AC5 - 1,0,1,1)<>0, IF(OR($AD5=\"LUMP\", $AD5=\"LS\"), \"LUMP\", OFFSET(#REF!, $AC5 - 1,0,1,1)),\"\"))","v":{"$error":"#REF!"}},{"$f":"IF( $AC5 = 0, \"\", IF( OFFSET(#REF!, $AC5 - 1,0,1,1)<>0, IF(OR($AD5=\"LUMP\", $AD5=\"LS\"), \"LUMP\", OFFSET(#REF!, $AC5 - 1,0,1,1)),\"\"))","v":{"$error":"#REF!"}},{"$f":"IF( $AC5 = 0, \"\", IF( OFFSET(#REF!, $AC5 - 1,0,1,1)<>0, IF(OR($AD5=\"LUMP\", $AD5=\"LS\"), \"LUMP\", OFFSET(#REF!, $AC5 - 1,0,1,1)),\"\"))","v":{"$error":"#REF!"}},{"$f":"IF( $AC5 = 0, \"\", IF( OFFSET(#REF!, $AC5 - 1,0,1,1)<>0, IF(OR($AD5=\"LUMP\", $AD5=\"LS\"), \"LUMP\", OFFSET(#REF!, $AC5 - 1,0,1,1)),\"\"))","v":{"$error":"#REF!"}},{"$f":"IF( $AC5 = 0, \"\", IF( OFFSET(#REF!, $AC5 - 1,0,1,1)<>0, IF(OR($AD5=\"LUMP\", $AD5=\"LS\"), \"LUMP\", OFFSET(#REF!, $AC5 - 1,0,1,1)),\"\"))","v":{"$error":"#REF!"}},{"$f":"IF( $AC5 = 0, \"\", IF( OFFSET(#REF!, $AC5 - 1,0,1,1)<>0, IF(OR($AD5=\"LUMP\", $AD5=\"LS\"), \"LUMP\", OFFSET(#REF!, $AC5 - 1,0,1,1)),\"\"))","v":{"$error":"#REF!"}},{"$f":"IF( $AC5 = 0, \"\", IF( OFFSET(#REF!, $AC5 - 1,0,1,1)<>0, IF(OR($AD5=\"LUMP\", $AD5=\"LS\"), \"LUMP\", OFFSET(#REF!, $AC5 - 1,0,1,1)),\"\"))","v":{"$error":"#REF!"}},{"$f":"IF( $AC5 = 0, \"\", IF( OFFSET(#REF!, $AC5 - 1,0,1,1)<>0, IF(OR($AD5=\"LUMP\", $AD5=\"LS\"), \"LUMP\", OFFSET(#REF!, $AC5 - 1,0,1,1)),\"\"))","v":{"$error":"#REF!"}},{"$f":"IF( $AC5 = 0, \"\", IF( OFFSET(#REF!, $AC5 - 1,0,1,1)<>0, IF(OR($AD5=\"LUMP\", $AD5=\"LS\"), \"LUMP\", OFFSET(#REF!, $AC5 - 1,0,1,1)),\"\"))","v":{"$error":"#REF!"}},{"$f":"IF( $AC5 = 0, \"\", IF( OFFSET(#REF!, $AC5 - 1,0,1,1)<>0, IF(OR($AD5=\"LUMP\", $AD5=\"LS\"), \"LUMP\", OFFSET(#REF!, $AC5 - 1,0,1,1)),\"\"))","v":{"$error":"#REF!"}},{"$f":"IF( $AC5 = 0, \"\", IF( OFFSET(#REF!, $AC5 - 1,0,1,1)<>0, IF(OR($AD5=\"LUMP\", $AD5=\"LS\"), \"LUMP\", OFFSET(#REF!, $AC5 - 1,0,1,1)),\"\"))","v":{"$error":"#REF!"}},{"$f":"IF( $AC5 = 0, \"\", IF( OFFSET(#REF!, $AC5 - 1,0,1,1)<>0, IF(OR($AD5=\"LUMP\", $AD5=\"LS\"), \"LUMP\", OFFSET(#REF!, $AC5 - 1,0,1,1)),\"\"))","v":{"$error":"#REF!"}},{"$f":"IF( $AC5 = 0, \"\", IF( OFFSET(#REF!, $AC5 - 1,0,1,1)<>0, IF(OR($AD5=\"LUMP\", $AD5=\"LS\"), \"LUMP\", OFFSET(#REF!, $AC5 - 1,0,1,1)),\"\"))","v":{"$error":"#REF!"}},{"$f":"IF( $AC5 = 0, \"\", IF( OFFSET(#REF!, $AC5 - 1,0,1,1)<>0, IF(OR($AD5=\"LUMP\", $AD5=\"LS\"), \"LUMP\", OFFSET(#REF!, $AC5 - 1,0,1,1)),\"\"))","v":{"$error":"#REF!"}},{"$f":"IF( $AC5 = 0, \"\", IF( OFFSET(#REF!, $AC5 - 1,0,1,1)<>0, LEFT(OFFSET(#REF!, $AC5 - 1,0,1,1),3),\"\"))","v":{"$error":"#REF!"}},{"$f":"IF( $AC5 = 0, \"\", IF( OFFSET(#REF!, $AC5 - 1,0,1,1)<>0, IF(LEN(OFFSET(#REF!, $AC5 - 1,0,1,1))=9,   RIGHT(OFFSET(#REF!, $AC5 - 1,0,1,1),5),    LEFT(RIGHT(OFFSET(#REF!, $AC5 - 1,0,1,1),6), 5)      ),\"\"))","v":{"$error":"#REF!"}},{"$f":"IF(SUM(A5:T5)<>0,SUM(A5:T5),IF(OR(AD5=\"LUMP\", AD5=\"LS\"), \"LUMP\", \"\"))","v":{"$error":"#REF!"}},{"$f":"IF( $AC5 = 0, \"\", IF( OFFSET(#REF!, $AC5 - 1,0,1,1)<>0,IF(OR(AD5=\"LUMP\", AD5=\"LS\"), \"\", AD5),\"\"))","v":{"$error":"#REF!"}},{"$f":"IF( $AC5 = 0, \"\", IF( OFFSET(#REF!, $AC5 - 1,0,1,1)<>0, VLOOKUP( OFFSET(#REF!, $AC5 - 1,0,1,1),[1]Items!$A$2:$E$10001,4,0),\"\"))","v":{"$error":"#REF!"}},null,3,0,3,{"$f":"IF( $AC5 = 0, \"\", IF( OFFSET(#REF!, $AC5 - 1,0,1,1)<>0, VLOOKUP( OFFSET(#REF!, $AC5 - 1,0,1,1),[1]Items!$A$2:$E$10001,3,0),\"\"))","v":{"$error":"#REF!"}}]
[{"$f":"IF( $AC6 = 0, \"\", IF( OFFSET(#REF!, $AC6 - 1,0,1,1)<>0, IF(OR($AD6=\"LUMP\", $AD6=\"LS\"), \"LUMP\", OFFSET(#REF!, $AC6 - 1,0,1,1)),\"\"))","v":{"$error":"#REF!"}},{"$f":"IF( $AC6 = 0, \"\", IF( OFFSET(#REF!, $AC6 - 1,0,1,1)<>0, IF(OR($AD6=\"LUMP\", $AD6=\"LS\"), \"LUMP\", OFFSET(#REF!, $AC6 - 1,0,1,1)),\"\"))","v":{"$error":"#REF!"}},{"$f":"IF( $AC6 = 0, \"\", IF( OFFSET(#REF!, $AC6 - 1,0,1,1)<>0, IF(OR($AD6=\"LUMP\", $AD6=\"LS\"), \"LUMP\", OFFSET(#REF!, $AC6 - 1,0,1,1)),\"\"))","v":{"$error":"#REF!"}},{"$f":"IF( $AC6 = 0, \"\", IF( OFFSET(#REF!, $AC6 - 1,0,1,1)<>0, IF(OR($AD6=\"LUMP\", $AD6=\"LS\"), \"LUMP\", OFFSET(#REF!, $AC6 - 1,0,1,1)),\"\"))","v":{"$error":"#REF!"}},{"$f":"IF( $AC6 = 0, \"\", IF( OFFSET(#REF!, $AC6 - 1,0,1,1)<>0, IF(OR($AD6=\"LUMP\", $AD6=\"LS\"), \"LUMP\", OFFSET(#REF!, $AC6 - 1,0,1,1)),\"\"))","v":{"$error":"#REF!"}},{"$f":"IF( $AC6 = 0, \"\", IF( OFFSET(#REF!, $AC6 - 1,0,1,1)<>0, IF(OR($AD6=\"LUMP\", $AD6=\"LS\"), \"LUMP\", OFFSET(#REF!, $AC6 - 1,0,1,1)),\"\"))","v":{"$error":"#REF!"}},{"$f":"IF( $AC6 = 0, \"\", IF( OFFSET(#REF!, $AC6 - 1,0,1,1)<>0, IF(OR($AD6=\"LUMP\", $AD6=\"LS\"), \"LUMP\", OFFSET(#REF!, $AC6 - 1,0,1,1)),\"\"))","v":{"$error":"#REF!"}},{"$f":"IF( $AC6 = 0, \"\", IF( OFFSET(#REF!, $AC6 - 1,0,1,1)<>0, IF(OR($AD6=\"LUMP\", $AD6=\"LS\"), \"LUMP\", OFFSET(#REF!, $AC6 - 1,0,1,1)),\"\"))","v":{"$error":"#REF!"}},{"$f":"IF( $AC6 = 0, \"\", IF( OFFSET(#REF!, $AC6 - 1,0,1,1)<>0, IF(OR($AD6=\"LUMP\", $AD6=\"LS\"), \"LUMP\", OFFSET(#REF!, $AC6 - 1,0,1,1)),\"\"))","v":{"$error":"#REF!"}},{"$f":"IF( $AC6 = 0, \"\", IF( OFFSET(#REF!, $AC6 - 1,0,1,1)<>0, IF(OR($AD6=\"LUMP\", $AD6=\"LS\"), \"LUMP\", OFFSET(#REF!, $AC6 - 1,0,1,1)),\"\"))","v":{"$error":"#REF!"}},{"$f":"IF( $AC6 = 0, \"\", IF( OFFSET(#REF!, $AC6 - 1,0,1,1)<>0, IF(OR($AD6=\"LUMP\", $AD6=\"LS\"), \"LUMP\", OFFSET(#REF!, $AC6 - 1,0,1,1)),\"\"))","v":{"$error":"#REF!"}},{"$f":"IF( $AC6 = 0, \"\", IF( OFFSET(#REF!, $AC6 - 1,0,1,1)<>0, IF(OR($AD6=\"LUMP\", $AD6=\"LS\"), \"LUMP\", OFFSET(#REF!, $AC6 - 1,0,1,1)),\"\"))","v":{"$error":"#REF!"}},{"$f":"IF( $AC6 = 0, \"\", IF( OFFSET(#REF!, $AC6 - 1,0,1,1)<>0, IF(OR($AD6=\"LUMP\", $AD6=\"LS\"), \"LUMP\", OFFSET(#REF!, $AC6 - 1,0,1,1)),\"\"))","v":{"$error":"#REF!"}},{"$f":"IF( $AC6 = 0, \"\", IF( OFFSET(#REF!, $AC6 - 1,0,1,1)<>0, IF(OR($AD6=\"LUMP\", $AD6=\"LS\"), \"LUMP\", OFFSET(#REF!, $AC6 - 1,0,1,1)),\"\"))","v":{"$error":"#REF!"}},{"$f":"IF( $AC6 = 0, \"\", IF( OFFSET(#REF!, $AC6 - 1,0,1,1)<>0, IF(OR($AD6=\"LUMP\", $AD6=\"LS\"), \"LUMP\", OFFSET(#REF!, $AC6 - 1,0,1,1)),\"\"))","v":{"$error":"#REF!"}},{"$f":"IF( $AC6 = 0, \"\", IF( OFFSET(#REF!, $AC6 - 1,0,1,1)<>0, IF(OR($AD6=\"LUMP\", $AD6=\"LS\"), \"LUMP\", OFFSET(#REF!, $AC6 - 1,0,1,1)),\"\"))","v":{"$error":"#REF!"}},{"$f":"IF( $AC6 = 0, \"\", IF( OFFSET(#REF!, $AC6 - 1,0,1,1)<>0, IF(OR($AD6=\"LUMP\", $AD6=\"LS\"), \"LUMP\", OFFSET(#REF!, $AC6 - 1,0,1,1)),\"\"))","v":{"$error":"#REF!"}},{"$f":"IF( $AC6 = 0, \"\", IF( OFFSET(#REF!, $AC6 - 1,0,1,1)<>0, IF(OR($AD6=\"LUMP\", $AD6=\"LS\"), \"LUMP\", OFFSET(#REF!, $AC6 - 1,0,1,1)),\"\"))","v":{"$error":"#REF!"}},{"$f":"IF( $AC6 = 0, \"\", IF( OFFSET(#REF!, $AC6 - 1,0,1,1)<>0, IF(OR($AD6=\"LUMP\", $AD6=\"LS\"), \"LUMP\", OFFSET(#REF!, $AC6 - 1,0,1,1)),\"\"))","v":{"$error":"#REF!"}},{"$f":"IF( $AC6 = 0, \"\", IF( OFFSET(#REF!, $AC6 - 1,0,1,1)<>0, IF(OR($AD6=\"LUMP\", $AD6=\"LS\"), \"LUMP\", OFFSET(#REF!, $AC6 - 1,0,1,1)),\"\"))","v":{"$error":"#REF!"}},{"$f":"IF( $AC6 = 0, \"\", IF( OFFSET(#REF!, $AC6 - 1,0,1,1)<>0, LEFT(OFFSET(#REF!, $AC6 - 1,0,1,1),3),\"\"))","v":{"$error":"#REF!"}},{"$f":"IF( $AC6 = 0, \"\", IF( OFFSET(#REF!, $AC6 - 1,0,1,1)<>0, IF(LEN(OFFSET(#REF!, $AC6 - 1,0,1,1))=9,   RIGHT(OFFSET(#REF!, $AC6 - 1,0,1,1),5),    LEFT(RIGHT(OFFSET(#REF!, $AC6 - 1,0,1,1),6), 5)      ),\"\"))","v":{"$error":"#REF!"}},{"$f":"IF(SUM(A6:T6)<>0,SUM(A6:T6),IF(OR(AD6=\"LUMP\", AD6=\"LS\"), \"LUMP\", \"\"))","v":{"$error":"#REF!"}},{"$f":"IF( $AC6 = 0, \"\", IF( OFFSET(#REF!, $AC6 - 1,0,1,1)<>0,IF(OR(AD6=\"LUMP\", AD6=\"LS\"), \"\", AD6),\"\"))","v":{"$error":"#REF!"}},{"$f":"IF( $AC6 = 0, \"\", IF( OFFSET(#REF!, $AC6 - 1,0,1,1)<>0, VLOOKUP( OFFSET(#REF!, $AC6 - 1,0,1,1),[1]Items!$A$2:$E$10001,4,0),\"\"))","v":{"$error":"#REF!"}},null,4,0,4,{"$f":"IF( $AC6 = 0, \"\", IF( OFFSET(#REF!, $AC6 - 1,0,1,1)<>0, VLOOKUP( OFFSET(#REF!, $AC6 - 1,0,1,1),[1]Items!$A$2:$E$10001,3,0),\"\"))","v":{"$error":"#REF!"}}]
{"$rows_left_out":70}
{"sheet":"Sub01","index":4,"n_rows":156,"n_cols":42,"rows_kept":156,"cut":false,"hidden":false,"merged":[[6,13,7,13],[4,8,8,8],[4,1,8,1],[4,6,7,7],[4,11,7,11],[4,10,7,10],[6,12,7,12],[6,39,7,39],[6,29,7,29],[6,41,7,41],[6,34,7,34],[6,40,7,40],[6,35,7,35],[6,32,7,32],[6,33,7,33],[6,36,7,36],[6,37,7,37],[6,23,7,23],[6,20,7,20],[6,38,7,38],[6,24,7,24],[6,27,7,27],[6,28,7,28],[6,31,7,31],[6,25,7,25],[6,30,7,30],[6,26,7,26],[6,14,7,14],[6,15,7,15],[6,22,7,22],[6,16,7,16],[6,21,7,21],[6,17,7,17],[6,18,7,18],[6,19,7,19],[69,0,69,11],[8,2,8,3],[8,4,8,5],[4,0,8,0],[4,9,7,9],[4,2,7,5],[89,14,89,15],[89,16,89,17],[79,0,79,11],[71,0,71,11],[70,0,70,11]]}
[]
[]
[]
[]
["ROUTE","SHEET\nNO.","STATION",null,null,null,"WIDTH\n",null,"SIDE","LENGTH","AVERAGE WIDTH","SURFACE AREA\n(CA = CADD Generated Area)","202","441","","407","","301","","304","","204","","","","","","","","","","","","","","","","","","","",""]
[null,null,null,null,null,null,null,null,null,null,null,null,"DEPTH",3,"","DEPTH","",9,"",6,"","DEPTH","","","","","","","","","","","","","","","","","","","",""]
{"$rows_left_out":150}