{"text_format":"1","workbook":"xlsx","n_sheets":4,"sheets":["Final","MOT Phase 2","MOT Phase 3 & 3A","Tables"],"not_rendered":{"charts":0,"images":5,"macros":0,"external_links":0,"defined_names":21,"comments":0,"pivot_tables":0},"unopened":[],"bounds":{"document_bytes":16777216,"sheet_cells":100000,"rows_first":2000,"rows_last":500,"rows_between":2000,"halvings":0,"cell_chars":16384,"cell_head_chars":4096},"cells_cut":0,"cells_raw":0,"read":"whole","date_system":"1900"}

{"sheet":"Final","index":0,"n_rows":77,"n_cols":33,"rows_kept":77,"cut":false,"hidden":false,"merged":[[49,30,50,30],[49,31,50,31],[50,10,50,11],[62,2,62,3],[48,20,48,29],[48,30,48,32],[48,4,48,19],[49,32,50,32],[49,21,49,26],[49,27,49,29],[49,4,49,11],[49,12,49,14],[49,15,49,17],[49,18,49,19],[49,20,50,20],[4,13,4,15],[6,13,6,15],[58,2,58,3],[59,2,59,3],[54,2,54,3],[55,2,55,3],[51,10,51,11],[48,2,50,3],[5,13,5,15],[7,13,7,15],[61,1,67,1],[69,1,75,1],[70,2,70,3],[71,2,71,3],[74,2,74,3],[75,2,75,3],[68,1,68,29],[63,2,63,3],[66,2,66,3],[67,2,67,3]]}
[]
[]
[]
[]
[null,"Calculated:","CJM",null,null,"Date:","2018-11-07",null,null,null,null,null,"Stage Review Submission:","Stage 2"]
[null,"Checked:","JDC",null,null,"Date:","2018-11-07",null,null,null,null,null,"PID/Job No.:",102858]
[null,"Concurred:",null,null,null,"Date:",null,null,null,null,null,null,"Bridge No.:","POR-76-1658"]
[null,"Back Checked:",null,null,null,"Date:",null,null,null,null,null,null,"SFN:",6702880]
[null,"Released:",null,null,null,"Date:"]
[null,"Project:","POR-76-1658/2118"]
[null,"Subject:","Spread check and Discharge Calculations, Final Condition"]
[null,null,null,null,null,null,null,null,null,null,null,null,"(Input values are shown underlined and in italics.)"]
[null,null,null,null,null,null,null,null,null,null,null,null,"References"]
["Drainage and Gutter Spread Calculations"]
[]
[null,"General Data"]
[]
[null,null,"Zone",null,"A",null,null,null,"(Fig. 1101-3)",null,"a",{"$f":"IF($E$18=\"A\",VLOOKUP($E$19,Tables!ZoneA,2),IF($E$18=\"B\",VLOOKUP($E$19,Tables!ZoneB,2),IF($E$18=\"C\",VLOOKUP($E$19,Tables!ZoneC,2),IF($E$18=\"D\",VLOOKUP($E$19,Tables!ZoneD,2)))))","v":46.183999999999997}]
[null,null,"Return",null,2,"yrs",{"$f":"IF(E19=10,\"Freeways\",IF(E19=5,\"High volume highways.\",IF(E19=2,\"All other highways.\",\"Check frequency.\")))","v":"All other highways."},null,"(1103.2)",null,"b",{"$f":"IF($E$18=\"A\",VLOOKUP($E$19,Tables!ZoneA,3),IF($E$18=\"B\",VLOOKUP($E$19,Tables!ZoneB,3),IF($E$18=\"C\",VLOOKUP($E$19,Tables!ZoneC,3),IF($E$18=\"D\",VLOOKUP($E$19,Tables!ZoneD,3)))))","v":9}]
[null,null,"Pvmt. Spread",null,6,"Max. Allow.",null,null,"(1103.2)",null,"c",{"$f":"IF($E$18=\"A\",VLOOKUP($E$19,Tables!ZoneA,4),IF($E$18=\"B\",VLOOKUP($E$19,Tables!ZoneB,4),IF($E$18=\"C\",VLOOKUP($E$19,Tables!ZoneC,4),IF($E$18=\"D\",VLOOKUP($E$19,Tables!ZoneD,4)))))","v":0.85899999999999999}]
[]
[null,null,"Vertical Curve 1"]
[null,null,null,"PVI-1",null,"L","G1","G2","e"]
[null,null,null,"Station","Elev.",null,"Back","Ahead"]
[null,null,null,5008.45,1126.33,635.5,3.0800000000000001E-2,-4.5100000000000001E-2,{"$f":"(H25-G25)*F25/8","v":-6.0293062499999994}]
[]
[null,null,null,"PVC-1",null,"PVT-1",null,{"$f":"IF(H25-G25<0,\"High Point\",IF(H25-G25>0,\"Low Point\",\"\"))","v":"High Point"}]
[null,null,null,"Station","Elev.","Station","Elev.","Station","Elev."]
[null,null,null,4690.7,1116.54,5326.2,1112,{"$f":"IF(AND(G25>0,H25>0),F29,IF(AND(G25<0,H25<0),D29,D29+F25*G25/-(H25-G25)))","v":4948.5840579710148},{"$f":"IF(H29<$D$29,$E$29+$G$25*(H29-$D$29),IF(AND(H29>=$D$29,H29<=$F$29),$E$29+$G$25*(H29-$D$29)+$I$25*((H29-$D$29)/$F$25*2)^2,IF(AND(H29>$F$29,H29<$K$29),$E$25+$H$25*(H29-$D$25),IF(AND(H29>=$K$29,H29<=$M$29),$L$29+$N$25*(H29-$K$29)+$P$25*((H29-$K$29)/$M$25*2)^2,$L$25+$O$25*(H29-$K$25)))))","v":1120.5114144927536}]
[]
[null,"General Formulae"]
[]
[null,null,"Hydrology"]
[null,null,"to       =","1.8 ( 1.1 - C ) L1/2 / s1/3  ≥ 10 min  where \"s\" is in percent"]
[null,null,"i        =","a / ( t + b )c"]
[null,null,"Q      =","C i A"]
[null,null,"Z       =","1 / Cross Slope"]
[null,null,"Q      =","0.56 ( Z / n ) s1/2 d8/3  for triangular channel flow."]
[null,null,"d       =","{ Q / [ 0.56 ( Z / n ) s1/2 ] }3/8  where \"s\" is in ft/ft"]
[null,null,"SG     =","Z d"]
[]
[null,null,"Neenah Inlet Capacity"]
[null,null,"Qi     =","K d5/3","Inlet capacity.",null,null,null,null,null,"(Neenah Foundry Co., Inlet Grate Capacities, p. ii)"]
[null,null,"K      =",35,"Inlet capacity factor.",null,null,null,null,null,"(Neenah, Inlet Capacities, No. R-3924, p. 37)"]
[]
[]
[null,"Tabulated Data"]
[]
[null,null,"Region",null,"Input Data",null,null,null,null,null,null,null,null,null,null,null,null,null,null,null,"Flow and Gutter Spread",null,null,null,null,null,null,null,null,null,"Neenah Inlets"]
[null,null,null,null,"Drainage Area",null,null,null,null,null,null,null,"Grade",null,null,"Roadway Data",null,null,"Parameters",null,"Critical Point","Hydrological Data",null,null,null,null,null,"Spread Data",null,null,"Inlet \nCapacity \nFactor","Inlet \nCapacity","Inlets \nRequired"]
[null,null,null,null,"Begin Station","End Station","Length","Begin\nWidth","End\nWidth","Average\nWidth","Drainage\nArea",null,"Begin\nElevation","End\nElevation","Average\nLongitudinal\nGrade","Cross Slope","Curb Height","Distance from\nCurb to\nEdge of Lane","Roughness\nCoefficient","Runoff\nCoefficient",null,"Concentration\nTime","Rainfall\nIntensity","Drainage\nArea","Discharge","Previous\nDischarge","Total\nDischarge","Average\nLongitudinal\nGrade","Depth at Curb","Spread"]
[null,null,"Variable",null,null,null,"L","W1","W2","W","L W",null,null,null,null,"Sx",null,null,"n","C",null,"to","i","A","Q","Qp","Qt","s","d","SG","K","Qi"]
[null,null,"Units",null,null,null,"ft","ft","ft","ft","ft2","acres",null,null,"ft/ft","ft/ft","in","ft",null,null,null,"min","in/hr","acres","cfs","cfs","cfs","ft/ft","ft","ft",null,"cfs","ea"]
[null,null,"Median Side of the Bridge Forward - Final Condition"]
[null,null,"From High Point",null,{"$f":"H29","v":4948.5840579710148},{"$f":"60112.41+25","v":60137.41},{"$f":"ABS(E55-F55)","v":55188.825942028991},13.75,13.75,13.75,{"$f":"G55*J55","v":758846.35670289863},{"$f":"ROUND(K55*2.2957*10^-5,4)","v":17.4208},{"$f":"ROUND(IF(E55<$D$29,$E$29+$G$25*(E55-$D$29),IF(AND(E55>=$D$29,E55<=$F$29),$E$29+$G$25*(E55-$D$29)+$I$25*((E55-$D$29)/$F$25*2)^2,IF(AND(E55>$F$29,E55<$K$29),$E$25+$H$25*(E55-$D$25),IF(AND(E55>=$K$29,E55<=$M$29),$L$29+$N$25*(E55-$K$29)+$P$25*((E55-$K$29)/$M$25*2)^2,$L$25+$O$25*(E55-$K$25))))),3)","v":1120.511},0,{"$f":"ROUND((M55-N55)/G55,4)","v":2.0299999999999999E-2},0.04,6,12,1.4999999999999999E-2,0.9,{"$f":"IF(M55=MIN(M55:N55),E55,F55)","v":60137.41},{"$f":"MAX(ROUND(1.8*(1.1-T55)*G55^(1/2)/(ABS(O55)*100)^(1/3),3),10)","v":66.793000000000006},{"$f":"ROUND($L$18/(V55+$L$19)^$L$20,3)","v":1.1220000000000001},{"$f":"L55","v":17.4208},{"$f":"ROUND(T55*W55*X55,3)","v":17.591999999999999},0,{"$f":"SUM(Y55:Z55)","v":17.591999999999999},{"$f":"ABS(O55)","v":2.0299999999999999E-2},{"$f":"ROUND((AA55/(0.56*(1/P55)/S55*AB55^(1/2)))^(3/8),3)","v":0.46800000000000003},{"$f":"(1/P55)*AC55","v":11.700000000000001},{"$f":"$D$44","v":35},{"$f":"AE55*AC55^(5/3)","v":9.8736516173139943},{"$f":"CEILING(AA55/AF55,1)","v":2}]
[null,null,"to End/A.S."]
[]
[null,null,"Median Side of the Bridge Back - Final Condition"]
[null,null,"HP Bk",null,{"$f":"H29","v":4948.5840579710148},{"$f":"59798.5-25","v":59773.5},{"$f":"ABS(F59-E59)","v":54824.915942028987},13.75,13.75,13.75,{"$f":"G59*J59","v":753842.59420289856},{"$f":"ROUND(K59*2.2957*10^-5,4)","v":17.306000000000001},{"$f":"ROUND(IF(E59<$D$29,$E$29+$G$25*(E59-$D$29),IF(AND(E59>=$D$29,E59<=$F$29),$E$29+$G$25*(E59-$D$29)+$I$25*((E59-$D$29)/$F$25*2)^2,IF(AND(E59>$F$29,E59<$K$29),$E$25+$H$25*(E59-$D$25),IF(AND(E59>=$K$29,E59<=$M$29),$L$29+$N$25*(E59-$K$29)+$P$25*((E59-$K$29)/$M$25*2)^2,$L$25+$O$25*(E59-$K$25))))),3)","v":1120.511},0,{"$f":"ROUND((M59-N59)/G59,4)","v":2.0400000000000001E-2},0.04,6,12,1.4999999999999999E-2,0.9,{"$f":"F59","v":59773.5},{"$f":"MAX(ROUND(1.8*(1.1-T59)*G59^(1/2)/(ABS(O59)*100)^(1/3),3),10)","v":66.462999999999994},{"$f":"ROUND($L$18/(V59+$L$19)^$L$20,3)","v":1.1259999999999999},{"$f":"L59","v":17.306000000000001},{"$f":"ROUND(T59*W59*X59,3)","v":17.538},0,{"$f":"SUM(Y59:Z59)","v":17.538},{"$f":"ABS(O59)","v":2.0400000000000001E-2},{"$f":"ROUND((AA59/(0.56*(1/P59)/S59*AB59^(1/2)))^(3/8),3)","v":0.46700000000000003},{"$f":"(1/P59)*AC59","v":11.675000000000001},{"$f":"$D$44","v":35},{"$f":"AE59*AC59^(5/3)","v":9.8385140908500013},{"$f":"CEILING(AA59/AF59,1)","v":2}]
[null,null,"to End/A.S."]
{"$rows_left_out":18}
{"sheet":"MOT Phase 2","index":1,"n_rows":96,"n_cols":39,"rows_kept":96,"cut":false,"hidden":false,"merged":[[88,2,88,3],[86,2,86,3],[87,2,87,3],[55,8,55,12],[84,2,84,3],[85,2,85,3],[75,36,76,36],[75,35,76,35],[75,34,76,34],[74,30,74,31],[75,31,76,31],[75,30,76,30],[75,20,76,20],[76,10,76,11],[79,2,79,3],[74,32,74,38],[75,21,75,26],[75,27,75,29],[74,20,74,29],[74,4,74,19],[75,18,75,19],[75,4,75,11],[75,12,75,14],[75,15,75,17],[75,33,76,33],[75,32,76,32],[75,38,76,38],[75,37,76,37],[3,13,3,15],[5,13,5,15],[81,2,81,3],[61,8,61,12],[56,8,56,12],[57,8,57,12],[58,8,58,12],[59,8,59,12],[60,8,60,12],[4,13,4,15],[6,13,6,15],[77,10,77,11],[74,2,76,3],[54,8,54,12]]}
[null,"JMT"]
[]
[]
[null,"Calculated:","CM",null,null,"Date:","2016-03-03",null,null,null,null,null,"Stage Review Submission:","Stage 1"]
[null,"Checked:",null,null,null,"Date:",null,null,null,null,null,null,"PID/Job No.:",99626]
[null,"Concurred:",null,null,null,"Date:",null,null,null,null,null,null,"Bridge No.:","MAH-76K-1482"]
[null,"Back Checked:",null,null,null,"Date:",null,null,null,null,null,null,"SFN:",5029784]
[null,"Released:",null,null,null,"Date:"]
[null,"Project:","MAH-164/626-4.85/1.05"]
[null,"Subject:","Spread check for MOT condition, Phase 2 on new structure"]
[null,null,null,null,null,null,null,null,null,null,null,null,"(Input values are shown underlined and in italics.)"]
[null,null,null,null,null,null,null,null,null,null,null,null,"References"]
["Drainage and Gutter Spread Calculations"]
[]
[null,"General Data"]
[]
[null,null,"Zone",null,"a",null,null,null,"(Fig. 1101-3)",null,"a",{"$f":"IF($E$17=\"A\",VLOOKUP($E$18,Tables!ZoneA,2),IF($E$17=\"B\",VLOOKUP($E$18,Tables!ZoneB,2),IF($E$17=\"C\",VLOOKUP($E$18,Tables!ZoneC,2),IF($E$17=\"D\",VLOOKUP($E$18,Tables!ZoneD,2)))))","v":46.183999999999997}]
[null,"MOT Condition","Return",null,2,"yrs",{"$f":"IF(E18=10,\"Freeways\",IF(E18=5,\"High volume highways.\",IF(E18=2,\"All other highways.\",\"Check frequency.\")))","v":"All other highways."},null,"(1103.2)",null,"b",{"$f":"IF($E$17=\"A\",VLOOKUP($E$18,Tables!ZoneA,3),IF($E$17=\"B\",VLOOKUP($E$18,Tables!ZoneB,3),IF($E$17=\"C\",VLOOKUP($E$18,Tables!ZoneC,3),IF($E$17=\"D\",VLOOKUP($E$18,Tables!ZoneD,3)))))","v":9}]
[null,null,"Pvmt. Spread",null,1,"Max. Allow.",null,null,"(1103.2)",null,"c",{"$f":"IF($E$17=\"A\",VLOOKUP($E$18,Tables!ZoneA,4),IF($E$17=\"B\",VLOOKUP($E$18,Tables!ZoneB,4),IF($E$17=\"C\",VLOOKUP($E$18,Tables!ZoneC,4),IF($E$17=\"D\",VLOOKUP($E$18,Tables!ZoneD,4)))))","v":0.85899999999999999}]
[]
[null,null,"Constant -2.12% grade, no vertical curve on bridge."]
[]
[null,null,"Elevation at Station 204+00 = 1126.26 from P & P sheet"]
[]
[]
[]
[]
[null,"General Formulae"]
[]
[null,null,"Hydrology"]
[null,null,"to       =","1.8 ( 1.1 - C ) L1/2 / s1/3  ≥ 10 min  where \"s\" is in percent"]
[null,null,"i        =","a / ( t + b )c"]
[null,null,"Q      =","C i A"]
[null,null,"Z       =","1 / Cross Slope"]
[null,null,"Q      =","0.56 ( Z / n ) s1/2 d8/3  for triangular channel flow."]
[null,null,"d       =","{ Q / [ 0.56 ( Z / n ) s1/2 ] }3/8  where \"s\" is in ft/ft"]
[null,null,"SG     =","Z d"]
[]
[null,null,"Neenah Inlet Capacity"]
[null,null,"Qi     =","K d5/3","Inlet capacity.",null,null,null,null,null,"(Neenah Foundry Co., Inlet Grate Capacities, p. ii)"]
[null,null,"K      =",35,"Inlet capacity factor.",null,null,null,null,null,"(Neenah, Inlet Capacities, No. R-3924, p. 37)"]
[]
[null,null,"Flow By-Pass",null,null,null,null,null,null,null,null,null,null,null,null,"(FHWA, HEC 12, Drainage of Highway Pavements, Chap 7,"]
[null,null,"W",18,"in",null,null,null,null,null,null,null,null,null,null,"and TxDOT, Hydaulic Design Manual, pp. 10-36 - 10-41.)"]
[null,null,null,{"$f":"D44/12","v":1.5},"ft",null,"Grate width. (Transverse to the flow.)"]
[null,null,"L",6,"in"]
[null,null,null,{"$f":"D46/12","v":0.5},"ft",null,"Grate length. (Along the flow.)"]
[null,null,"T       =","SG",null,null,"Flow width in the gutter."]
[null,null,"EO     =","1 - ( 1 - W/T )8/3 ≤ 1.0",null,null,"Ratio of frontal flow to total flow.",null,null,null,null,null,null,null,null,"(FHWA, HEC 12, Drainage of Highway Pavements, eq. (7).)"]
[null,null,"V       =","Q/A",null,null,"Flow in the gutter."]
[null,null,"=","Q / (  d SG / 2 )"]
[]
[null,null,"VO",null,null,"Velocity where splash-over occurs.",null,null,null,null,null,null,null,null,null,"(TxDOT, Hydraulic Design Manual, p. 10-40.)"]
[]
[null,"Grate Type","Grate Configuration",null,null,null,"Typical Bar Spacing (in.)",null,"Splash-over Velocity Equation"]
[null,1,"Parallel Bars",null,null,null,2,null,"Vo = 2.218 + 4.031L - 0.649L² + 0.056L³",null,null,null,null,null,null,null,1,"Parallel Bars",2.218,4.0309999999999997,-0.64900000000000002,5.6000000000000001E-2]
[null,2,"Parallel Bars",null,null,null,1.2,null,"Vo = 1.762 + 3.117L - 0.451L² + 0.033L³",null,null,null,null,null,null,null,2,"Parallel Bars",1.762,3.117,-0.45100000000000001,3.3000000000000002E-2]
[null,3,"Transverse Curved Vane",null,null,null,4.5,null,"Vo = 1.381 + 2.780L - 0.300L² + 0.020L³",null,null,null,null,null,null,null,3,"Transverse Curved Vane",1.381,2.78,-0.3,0.02]
[null,4,"Transverse 45° Tilted Vane",null,null,null,4,null,"Vo = 0.988 + 2.625L - 0.359L² + 0.029L³",null,null,null,null,null,null,null,4,"Transverse 45° Tilted Vane",0.98799999999999999,2.625,-0.35899999999999999,2.9000000000000001E-2]
[null,5,"Parallel bars w/ transverse rods",null,null,null,"2 parallel/4 trans",null,"Vo = 0.735 + 2.437L - 0.265L² + 0.018L³",null,null,null,null,null,null,null,5,"Parallel bars w/ transverse rods",0.73499999999999999,2.4369999999999998,-0.26500000000000001,1.7999999999999999E-2]
{"$rows_left_out":37}
{"sheet":"MOT Phase 3 & 3A","index":2,"n_rows":59,"n_cols":30,"rows_kept":59,"cut":false,"hidden":false,"merged":[[45,10,45,11],[48,2,48,3],[51,2,51,3],[43,31,44,31],[43,21,43,26],[43,27,43,29],[43,30,44,30],[42,2,44,3],[42,4,42,19],[42,20,42,29],[42,30,42,36],[43,4,43,11],[43,12,43,14],[43,15,43,17],[43,18,43,19],[43,32,44,32],[43,33,44,33],[43,34,44,34],[43,35,44,35],[43,36,44,36],[43,20,44,20],[44,10,44,11],[3,13,3,15],[4,13,4,15],[5,13,5,15],[6,13,6,15]]}
[null,"BARR & PREVOST"]
[]
[]
[null,"Calculated:","NCM",null,null,"Date:","2016-03-01",null,null,null,null,null,"Stage Review Submission:","Stage 1"]
[null,"Checked:",null,null,null,"Date:",null,null,null,null,null,null,"PID/Job No.:",99626]
[null,"Concurred:",null,null,null,"Date:",null,null,null,null,null,null,"Bridge No.:","MAH-76K-1482"]
[null,"Back Checked:",null,null,null,"Date:",null,null,null,null,null,null,"SFN:",5029784]
[null,"Released:",null,null,null,"Date:"]
[null,"Project:","MAH-164/626-4.85/1.05"]
[null,"Subject:","Spread check for MOT condition, Phase 2 on proposed structure"]
[null,null,null,null,null,null,null,null,null,null,null,null,"(Input values are shown underlined and in italics.)"]
[null,null,null,null,null,null,null,null,null,null,null,null,"References"]
["Drainage and Gutter Spread Calculations"]
[]
[null,"General Data"]
[]
[null,null,"Zone",null,"c",null,null,null,"(Fig. 1101-3)",null,"a",{"$f":"IF($E$17=\"A\",VLOOKUP($E$18,Tables!ZoneA,2),IF($E$17=\"B\",VLOOKUP($E$18,Tables!ZoneB,2),IF($E$17=\"C\",VLOOKUP($E$18,Tables!ZoneC,2),IF($E$17=\"D\",VLOOKUP($E$18,Tables!ZoneD,2)))))","v":56.298999999999999}]
["MOT",null,"Return",null,2,"yrs",{"$f":"IF(E18=10,\"Freeways\",IF(E18=5,\"High volume highways.\",IF(E18=2,\"All other highways.\",\"Check frequency.\")))","v":"All other highways."},null,"(1103.2)",null,"b",{"$f":"IF($E$17=\"A\",VLOOKUP($E$18,Tables!ZoneA,3),IF($E$17=\"B\",VLOOKUP($E$18,Tables!ZoneB,3),IF($E$17=\"C\",VLOOKUP($E$18,Tables!ZoneC,3),IF($E$17=\"D\",VLOOKUP($E$18,Tables!ZoneD,3)))))","v":10}]
[null,null,"Pvmt. Spread",null,1,"Max. Allow.",null,null,"(1103.2)",null,"c",{"$f":"IF($E$17=\"A\",VLOOKUP($E$18,Tables!ZoneA,4),IF($E$17=\"B\",VLOOKUP($E$18,Tables!ZoneB,4),IF($E$17=\"C\",VLOOKUP($E$18,Tables!ZoneC,4),IF($E$17=\"D\",VLOOKUP($E$18,Tables!ZoneD,4)))))","v":0.876}]
[]
[null,null,"Vertical Curve 1"]
[null,null,null,"PVI-1",null,"L","G1","G2","e"]
[null,null,null,"Station","Elev.",null,"Back","Ahead"]
[null,null,null,59953.84,728.75,900,1.5100000000000001E-2,-1.52E-2,{"$f":"(H24-G24)*F24/8","v":-3.4087499999999999}]
[]
[null,null,null,"PVC-1",null,"PVT-1",null,{"$f":"IF(H24-G24<0,\"High Point\",IF(H24-G24>0,\"Low Point\",\"\"))","v":"High Point"}]
[null,null,null,"Station","Elev.","Station","Elev.","Station","Elev."]
[null,null,null,{"$f":"(D24-F24/2)","v":59503.839999999997},{"$f":"(E24-G24*F24/2)","v":721.95500000000004},{"$f":"(D24+F24/2)","v":60403.839999999997},{"$f":"(E24+H24*F24/2)","v":721.91},{"$f":"IF(AND(G24>0,H24>0),F28,IF(AND(G24<0,H24<0),D28,D28+F24*G24/-(H24-G24)))","v":59952.354851485143},{"$f":"IF(H28<$D$28,$E$28+$G$24*(H28-$D$28),IF(AND(H28>=$D$28,H28<=$F$28),$E$28+$G$24*(H28-$D$28)+$I$24*((H28-$D$28)/$F$24*2)^2,IF(AND(H28>$F$28,H28<$K$28),$E$24+$H$24*(H28-$D$24),IF(AND(H28>=$K$28,H28<=$M$28),$L$28+$N$24*(H28-$K$28)+$P$24*((H28-$K$28)/$M$24*2)^2,$L$24+$O$24*(H28-$K$24)))))","v":725.34128712871291}]
[]
[null,"General Formulae"]
[]
[null,null,"Hydrology"]
[null,null,"to       =","1.8 ( 1.1 - C ) L1/2 / s1/3  ≥ 10 min  where \"s\" is in percent"]
[null,null,"i        =","a / ( t + b )c"]
[null,null,"Q      =","C i A"]
[null,null,"Z       =","1 / Cross Slope"]
[null,null,"Q      =","0.56 ( Z / n ) s1/2 d8/3  for triangular channel flow."]
[null,null,"d       =","{ Q / [ 0.56 ( Z / n ) s1/2 ] }3/8  where \"s\" is in ft/ft"]
[null,null,"SG     =","Z d"]
[]
[null,"Tabulated Data"]
[]
[null,null,"Region",null,"Input Data",null,null,null,null,null,null,null,null,null,null,null,null,null,null,null,"Flow and Gutter Spread"]
[null,null,null,null,"Drainage Area",null,null,null,null,null,null,null,"Grade",null,null,"Roadway Data",null,null,"Parameters",null,"Critical Point","Hydrological Data",null,null,null,null,null,"Spread Data"]
[null,null,null,null,"Begin Station","End Station","Length","Begin\nWidth","End\nWidth","Average\nWidth","Drainage\nArea",null,"Begin\nElevation","End\nElevation","Average\nLongitudinal\nGrade","Cross Slope","Curb Height","Distance from\nCurb to\nEdge of Lane","Roughness\nCoefficient","Runoff\nCoefficient",null,"Concentration\nTime","Rainfall\nIntensity","Drainage\nArea","Discharge","Previous\nDischarge","Total\nDischarge","Average\nLongitudinal\nGrade","Depth at Curb","Spread"]
[null,null,"Variable",null,null,null,"L","W1","W2","W","L W",null,null,null,null,"Sx",null,null,"n","C",null,"to","i","A","Q","Qp","Qt","s","d","SG"]
[null,null,"Units",null,null,null,"ft","ft","ft","ft","ft2","acres",null,null,"ft/ft","ft/ft","in","ft",null,null,null,"min","in/hr","acres","cfs","cfs","cfs","ft/ft","ft","ft"]
[null,null,"Median Side of the Bridge Forward - MOT Condition, Phase 3 and 3A"]
[null,null,"From High Point to End FWD AS",null,{"$f":"H28","v":59952.354851485143},{"$f":"60114.46","v":60114.46},{"$f":"ABS(E49-F49)","v":162.10514851485641},13.75,13.75,13.75,{"$f":"G49*J49","v":2228.9457920792756},{"$f":"ROUND(K49*2.2957*10^-5,4)","v":5.1200000000000002E-2},{"$f":"ROUND(IF(E49<$D$28,$E$28+$G$24*(E49-$D$28),IF(AND(E49>=$D$28,E49<=$F$28),$E$28+$G$24*(E49-$D$28)+$I$24*((E49-$D$28)/$F$24*2)^2,IF(AND(E49>$F$28,E49<$K$28),$E$24+$H$24*(E49-$D$24),IF(AND(E49>=$K$28,E49<=$M$28),$L$28+$N$24*(E49-$K$28)+$P$24*((E49-$K$28)/$M$24*2)^2,$L$24+$O$24*(E49-$K$24))))),3)","v":725.34100000000001},724.899,{"$f":"ROUND((M49-N49)/G49,4)","v":2.7000000000000001E-3},0.04,6,1.5,1.4999999999999999E-2,0.9,{"$f":"IF(M49=MIN(M49:N49),E49,F49)","v":60114.46},{"$f":"MAX(ROUND(1.8*(1.1-T49)*G49^(1/2)/(ABS(O49)*100)^(1/3),3),10)","v":10},{"$f":"ROUND($L$17/(V49+$L$18)^$L$19,3)","v":4.0810000000000004},{"$f":"L49","v":5.1200000000000002E-2},{"$f":"ROUND(T49*W49*X49,3)","v":0.188},0,{"$f":"SUM(Y49:Z49)","v":0.188},{"$f":"ABS(O49)","v":2.7000000000000001E-3},{"$f":"ROUND((AA49/(0.56*(1/P49)/S49*AB49^(1/2)))^(3/8),3)","v":0.125},{"$f":"(1/P49)*AC49","v":3.125}]
[]
[null,null,"Median Side of the Bridge Back - MOTCondition, Phase 3 & 3A"]
[null,null,"HP Bk to Begin of Rear A.S.",null,{"$f":"H28","v":59952.354851485143},59750.55,{"$f":"ABS(F52-E52)","v":201.80485148513981},13.75,13.75,13.75,{"$f":"G52*J52","v":2774.8167079206723},{"$f":"ROUND(K52*2.2957*10^-5,4)","v":6.3700000000000007E-2},{"$f":"ROUND(IF(E52<$D$28,$E$28+$G$24*(E52-$D$28),IF(AND(E52>=$D$28,E52<=$F$28),$E$28+$G$24*(E52-$D$28)+$I$24*((E52-$D$28)/$F$24*2)^2,IF(AND(E52>$F$28,E52<$K$28),$E$24+$H$24*(E52-$D$24),IF(AND(E52>=$K$28,E52<=$M$28),$L$28+$N$24*(E52-$K$28)+$P$24*((E52-$K$28)/$M$24*2)^2,$L$24+$O$24*(E52-$K$24))))),3)","v":725.34100000000001},724.65599999999995,{"$f":"ROUND((M52-N52)/G52,4)","v":3.3999999999999998E-3},0.04,6,1.5,1.4999999999999999E-2,0.9,{"$f":"F52","v":59750.55},{"$f":"MAX(ROUND(1.8*(1.1-T52)*G52^(1/2)/(ABS(O52)*100)^(1/3),3),10)","v":10},{"$f":"ROUND($L$17/(V52+$L$18)^$L$19,3)","v":4.0810000000000004},{"$f":"L52","v":6.3700000000000007E-2},{"$f":"ROUND(T52*W52*X52,3)","v":0.23400000000000001},0,{"$f":"SUM(Y52:Z52)","v":0.23400000000000001},{"$f":"ABS(O52)","v":3.3999999999999998E-3},{"$f":"ROUND((AA52/(0.56*(1/P52)/S52*AB52^(1/2)))^(3/8),3)","v":0.13},{"$f":"(1/P52)*AC52","v":3.25}]
[]
[]
[]
["NOTES"]
[null,"1. Bridge dimensions and  vertical curve data used from proposed plans.  "]
[null,"2. No scuppers required for FINAL condition."]
[null,"3.  Allowable Pavement spread was determined by adding 1 foot from the outside 11' lane + 1.5 foot shoulder = 2.5' total.  See L&D Volume 2, Section 1010.1 - must provide 10 foot minimum dry lanes."]

{"sheet":"Tables","index":3,"n_rows":26,"n_cols":14,"rows_kept":26,"cut":false,"hidden":false,"merged":[[20,9,25,9],[14,9,19,9],[8,9,13,9],[2,9,7,9]]}
[null,null,null,null,null,null,null,null,null,"(L&D, Vol. 2, General Notes - Figs. 1101-2 through 1101-3)"]
[null,null,null,null,null,null,null,null,null,"Zone","Freq.","a","b","c"]
[null,null,null,null,null,null,null,null,null,"A",2,46.183999999999997,9,0.85899999999999999]
[null,null,null,null,null,null,null,null,null,null,5,56.984999999999999,10.25,0.85099999999999998]
[null,null,null,null,null,null,null,null,null,null,10,64.167000000000002,11,0.84199999999999997]
[null,null,null,null,null,null,null,null,null,null,25,66.528000000000006,11,0.81100000000000005]
[null,null,null,null,null,null,null,null,null,null,50,65.701999999999998,10.75,0.78200000000000003]
[null,null,null,null,null,null,null,null,null,null,100,64.489000000000004,10.5,0.754]
[null,null,null,null,null,null,null,null,null,"B",2,47.987000000000002,9,0.85899999999999999]
[null,null,null,null,null,null,null,null,null,null,5,60.683999999999997,10.5,0.85799999999999998]
[null,null,null,null,null,null,null,null,null,null,10,73.126000000000005,12,0.86299999999999999]
[null,null,null,null,null,null,null,null,null,null,25,75.840999999999994,12,0.83299999999999996]
[null,null,null,null,null,null,null,null,null,null,50,65.620999999999995,10,0.78100000000000003]
[null,null,null,null,null,null,null,null,null,null,100,85.046999999999997,13.25,0.80600000000000005]
[null,null,null,null,null,null,null,null,null,"C",2,56.298999999999999,10,0.876]
[null,null,null,null,null,null,null,null,null,null,5,67.933000000000007,11,0.86899999999999999]
[null,null,null,null,null,null,null,null,null,null,10,84.55,13,0.88200000000000001]
[null,null,null,null,null,null,null,null,null,null,25,95.736000000000004,14,0.871]
[null,null,null,null,null,null,null,null,null,null,50,96.783000000000001,14,0.85]
[null,null,null,null,null,null,null,null,null,null,100,80.436000000000007,11.5,0.79400000000000004]
[null,null,null,null,null,null,null,null,null,"D",2,57.448,10,0.876]
[null,null,null,null,null,null,null,null,null,null,5,67.933000000000007,11,0.86899999999999999]
[null,null,null,null,null,null,null,null,null,null,10,79.191999999999993,12,0.86399999999999999]
[null,null,null,null,null,null,null,null,null,null,25,87.885999999999996,12.75,0.84899999999999998]
[null,null,null,null,null,null,null,null,null,null,50,95.168999999999997,13.5,0.83899999999999997]
[null,null,null,null,null,null,null,null,null,null,100,91.981999999999999,13,0.81]