{"text_format":"1","workbook":"xlsx","n_sheets":2,"sheets":["Final","Tables"],"not_rendered":{"charts":0,"images":5,"macros":0,"external_links":0,"defined_names":15,"comments":0,"pivot_tables":0},"unopened":[],"bounds":{"document_bytes":16777216,"sheet_cells":100000,"rows_first":2000,"rows_last":500,"rows_between":2000,"halvings":0,"cell_chars":16384,"cell_head_chars":4096},"cells_cut":0,"cells_raw":0,"read":"whole","date_system":"1900"}

{"sheet":"Final","index":0,"n_rows":77,"n_cols":33,"rows_kept":77,"cut":false,"hidden":false,"merged":[[61,1,67,1],[69,1,75,1],[70,2,70,3],[71,2,71,3],[74,2,74,3],[75,2,75,3],[68,1,68,29],[4,13,4,15],[6,13,6,15],[58,2,58,3],[59,2,59,3],[54,2,54,3],[55,2,55,3],[51,10,51,11],[48,2,50,3],[5,13,5,15],[7,13,7,15],[63,2,63,3],[66,2,66,3],[67,2,67,3],[49,30,50,30],[49,31,50,31],[50,10,50,11],[62,2,62,3],[48,20,48,29],[48,30,48,32],[48,4,48,19],[49,32,50,32],[49,21,49,26],[49,27,49,29],[49,4,49,11],[49,12,49,14],[49,15,49,17],[49,18,49,19],[49,20,50,20]]}
[]
[]
[]
[]
[null,"Calculated:","CJM",null,null,"Date:","2018-11-07",null,null,null,null,null,"Stage Review Submission:","Stage 2"]
[null,"Checked:","JDC",null,null,"Date:","2018-11-07",null,null,null,null,null,"PID/Job No.:",102858]
[null,"Concurred:",null,null,null,"Date:",null,null,null,null,null,null,"Bridge No.:","POR-76-2118"]
[null,"Back Checked:",null,null,null,"Date:",null,null,null,null,null,null,"SFN:",6702880]
[null,"Released:",null,null,null,"Date:"]
[null,"Project:","POR-76-1658/2118"]
[null,"Subject:","Spread check and Discharge Calculations, Final Condition"]
[null,null,null,null,null,null,null,null,null,null,null,null,"(Input values are shown underlined and in italics.)"]
[null,null,null,null,null,null,null,null,null,null,null,null,"References"]
["Drainage and Gutter Spread Calculations"]
[]
[null,"General Data"]
[]
[null,null,"Zone",null,"A",null,null,null,"(Fig. 1101-3)",null,"a",{"$f":"IF($E$18=\"A\",VLOOKUP($E$19,Tables!ZoneA,2),IF($E$18=\"B\",VLOOKUP($E$19,Tables!ZoneB,2),IF($E$18=\"C\",VLOOKUP($E$19,Tables!ZoneC,2),IF($E$18=\"D\",VLOOKUP($E$19,Tables!ZoneD,2)))))","v":46.183999999999997}]
[null,null,"Return",null,2,"yrs",{"$f":"IF(E19=10,\"Freeways\",IF(E19=5,\"High volume highways.\",IF(E19=2,\"All other highways.\",\"Check frequency.\")))","v":"All other highways."},null,"(1103.2)",null,"b",{"$f":"IF($E$18=\"A\",VLOOKUP($E$19,Tables!ZoneA,3),IF($E$18=\"B\",VLOOKUP($E$19,Tables!ZoneB,3),IF($E$18=\"C\",VLOOKUP($E$19,Tables!ZoneC,3),IF($E$18=\"D\",VLOOKUP($E$19,Tables!ZoneD,3)))))","v":9}]
[null,null,"Pvmt. Spread",null,6,"Max. Allow.",null,null,"(1103.2)",null,"c",{"$f":"IF($E$18=\"A\",VLOOKUP($E$19,Tables!ZoneA,4),IF($E$18=\"B\",VLOOKUP($E$19,Tables!ZoneB,4),IF($E$18=\"C\",VLOOKUP($E$19,Tables!ZoneC,4),IF($E$18=\"D\",VLOOKUP($E$19,Tables!ZoneD,4)))))","v":0.85899999999999999}]
[]
[null,null,"Vertical Curve 1"]
[null,null,null,"PVI-1",null,"L","G1","G2","e"]
[null,null,null,"Station","Elev.",null,"Back","Ahead"]
[null,null,null,5050.5,1001.79,670,4.2599999999999999E-2,-2.1999999999999999E-2,{"$f":"(H25-G25)*F25/8","v":-5.4102499999999996}]
[]
[null,null,null,"PVC-1",null,"PVT-1",null,{"$f":"IF(H25-G25<0,\"High Point\",IF(H25-G25>0,\"Low Point\",\"\"))","v":"High Point"}]
[null,null,null,"Station","Elev.","Station","Elev.","Station","Elev."]
[null,null,null,4700,986.86,5385.5,994.44,{"$f":"IF(AND(G25>0,H25>0),F29,IF(AND(G25<0,H25<0),D29,D29+F25*G25/-(H25-G25)))","v":5141.826625386997},{"$f":"IF(H29<$D$29,$E$29+$G$25*(H29-$D$29),IF(AND(H29>=$D$29,H29<=$F$29),$E$29+$G$25*(H29-$D$29)+$I$25*((H29-$D$29)/$F$25*2)^2,IF(AND(H29>$F$29,H29<$K$29),$E$25+$H$25*(H29-$D$25),IF(AND(H29>=$K$29,H29<=$M$29),$L$29+$N$25*(H29-$K$29)+$P$25*((H29-$K$29)/$M$25*2)^2,$L$25+$O$25*(H29-$K$25)))))","v":996.27090712074312}]
[]
[null,"General Formulae"]
[]
[null,null,"Hydrology"]
[null,null,"to       =","1.8 ( 1.1 - C ) L1/2 / s1/3  ≥ 10 min  where \"s\" is in percent"]
[null,null,"i        =","a / ( t + b )c"]
[null,null,"Q      =","C i A"]
[null,null,"Z       =","1 / Cross Slope"]
[null,null,"Q      =","0.56 ( Z / n ) s1/2 d8/3  for triangular channel flow."]
[null,null,"d       =","{ Q / [ 0.56 ( Z / n ) s1/2 ] }3/8  where \"s\" is in ft/ft"]
[null,null,"SG     =","Z d"]
[]
[null,null,"Neenah Inlet Capacity"]
[null,null,"Qi     =","K d5/3","Inlet capacity.",null,null,null,null,null,"(Neenah Foundry Co., Inlet Grate Capacities, p. ii)"]
[null,null,"K      =",35,"Inlet capacity factor.",null,null,null,null,null,"(Neenah, Inlet Capacities, No. R-3924, p. 37)"]
[]
[]
[null,"Tabulated Data"]
[]
[null,null,"Region",null,"Input Data",null,null,null,null,null,null,null,null,null,null,null,null,null,null,null,"Flow and Gutter Spread",null,null,null,null,null,null,null,null,null,"Neenah Inlets"]
[null,null,null,null,"Drainage Area",null,null,null,null,null,null,null,"Grade",null,null,"Roadway Data",null,null,"Parameters",null,"Critical Point","Hydrological Data",null,null,null,null,null,"Spread Data",null,null,"Inlet \nCapacity \nFactor","Inlet \nCapacity","Inlets \nRequired"]
[null,null,null,null,"Begin Station","End Station","Length","Begin\nWidth","End\nWidth","Average\nWidth","Drainage\nArea",null,"Begin\nElevation","End\nElevation","Average\nLongitudinal\nGrade","Cross Slope","Curb Height","Distance from\nCurb to\nEdge of Lane","Roughness\nCoefficient","Runoff\nCoefficient",null,"Concentration\nTime","Rainfall\nIntensity","Drainage\nArea","Discharge","Previous\nDischarge","Total\nDischarge","Average\nLongitudinal\nGrade","Depth at Curb","Spread"]
[null,null,"Variable",null,null,null,"L","W1","W2","W","L W",null,null,null,null,"Sx",null,null,"n","C",null,"to","i","A","Q","Qp","Qt","s","d","SG","K","Qi"]
[null,null,"Units",null,null,null,"ft","ft","ft","ft","ft2","acres",null,null,"ft/ft","ft/ft","in","ft",null,null,null,"min","in/hr","acres","cfs","cfs","cfs","ft/ft","ft","ft",null,"cfs","ea"]
[null,null,"Median Side of the Bridge Forward - Final Condition"]
[null,null,"From High Point",null,{"$f":"H29","v":5141.826625386997},{"$f":"60112.41+25","v":60137.41},{"$f":"ABS(E55-F55)","v":54995.583374613008},13.75,13.75,13.75,{"$f":"G55*J55","v":756189.27140092885},{"$f":"ROUND(K55*2.2957*10^-5,4)","v":17.3598},{"$f":"ROUND(IF(E55<$D$29,$E$29+$G$25*(E55-$D$29),IF(AND(E55>=$D$29,E55<=$F$29),$E$29+$G$25*(E55-$D$29)+$I$25*((E55-$D$29)/$F$25*2)^2,IF(AND(E55>$F$29,E55<$K$29),$E$25+$H$25*(E55-$D$25),IF(AND(E55>=$K$29,E55<=$M$29),$L$29+$N$25*(E55-$K$29)+$P$25*((E55-$K$29)/$M$25*2)^2,$L$25+$O$25*(E55-$K$25))))),3)","v":996.27099999999996},0,{"$f":"ROUND((M55-N55)/G55,4)","v":1.8100000000000002E-2},0.04,6,12,1.4999999999999999E-2,0.9,{"$f":"IF(M55=MIN(M55:N55),E55,F55)","v":60137.41},{"$f":"MAX(ROUND(1.8*(1.1-T55)*G55^(1/2)/(ABS(O55)*100)^(1/3),3),10)","v":69.275000000000006},{"$f":"ROUND($L$18/(V55+$L$19)^$L$20,3)","v":1.091},{"$f":"L55","v":17.3598},{"$f":"ROUND(T55*W55*X55,3)","v":17.045999999999999},0,{"$f":"SUM(Y55:Z55)","v":17.045999999999999},{"$f":"ABS(O55)","v":1.8100000000000002E-2},{"$f":"ROUND((AA55/(0.56*(1/P55)/S55*AB55^(1/2)))^(3/8),3)","v":0.47299999999999998},{"$f":"(1/P55)*AC55","v":11.824999999999999},{"$f":"$D$44","v":35},{"$f":"AE55*AC55^(5/3)","v":10.050089875883458},{"$f":"CEILING(AA55/AF55,1)","v":2}]
[null,null,"to End/A.S."]
[]
[null,null,"Median Side of the Bridge Back - Final Condition"]
[null,null,"HP Bk",null,{"$f":"H29","v":5141.826625386997},{"$f":"59798.5-25","v":59773.5},{"$f":"ABS(F59-E59)","v":54631.673374613005},13.75,13.75,13.75,{"$f":"G59*J59","v":751185.50890092878},{"$f":"ROUND(K59*2.2957*10^-5,4)","v":17.245000000000001},{"$f":"ROUND(IF(E59<$D$29,$E$29+$G$25*(E59-$D$29),IF(AND(E59>=$D$29,E59<=$F$29),$E$29+$G$25*(E59-$D$29)+$I$25*((E59-$D$29)/$F$25*2)^2,IF(AND(E59>$F$29,E59<$K$29),$E$25+$H$25*(E59-$D$25),IF(AND(E59>=$K$29,E59<=$M$29),$L$29+$N$25*(E59-$K$29)+$P$25*((E59-$K$29)/$M$25*2)^2,$L$25+$O$25*(E59-$K$25))))),3)","v":996.27099999999996},0,{"$f":"ROUND((M59-N59)/G59,4)","v":1.8200000000000001E-2},0.04,6,12,1.4999999999999999E-2,0.9,{"$f":"F59","v":59773.5},{"$f":"MAX(ROUND(1.8*(1.1-T59)*G59^(1/2)/(ABS(O59)*100)^(1/3),3),10)","v":68.918000000000006},{"$f":"ROUND($L$18/(V59+$L$19)^$L$20,3)","v":1.095},{"$f":"L59","v":17.245000000000001},{"$f":"ROUND(T59*W59*X59,3)","v":16.995000000000001},0,{"$f":"SUM(Y59:Z59)","v":16.995000000000001},{"$f":"ABS(O59)","v":1.8200000000000001E-2},{"$f":"ROUND((AA59/(0.56*(1/P59)/S59*AB59^(1/2)))^(3/8),3)","v":0.47199999999999998},{"$f":"(1/P59)*AC59","v":11.799999999999999},{"$f":"$D$44","v":35},{"$f":"AE59*AC59^(5/3)","v":10.014702258916556},{"$f":"CEILING(AA59/AF59,1)","v":2}]
[null,null,"to End/A.S."]
[]
[null,"LEFT","Outside Side of the Bridge Forward Abutment - Final Condition"]
[null,null,"From High Point",null,{"$f":"H29","v":5141.826625386997},5137.43,{"$f":"ABS(E63-F63)","v":4.3966253869966749},14.5,14.5,{"$f":"AVERAGE(H63:I63)","v":14.5},{"$f":"G63*J63","v":63.751068111451787},{"$f":"ROUND(K63*2.2957*10^-5,4)","v":1.5E-3},{"$f":"ROUND(IF(E63<$D$29,$E$29+$G$25*(E63-$D$29),IF(AND(E63>=$D$29,E63<=$F$29),$E$29+$G$25*(E63-$D$29)+$I$25*((E63-$D$29)/$F$25*2)^2,IF(AND(E63>$F$29,E63<$K$29),$E$25+$H$25*(E63-$D$25),IF(AND(E63>=$K$29,E63<=$M$29),$L$29+$N$25*(E63-$K$29)+$P$25*((E63-$K$29)/$M$25*2)^2,$L$25+$O$25*(E63-$K$25))))),3)","v":996.27099999999996},996.27,{"$f":"ROUND((M63-N63)/G63,4)","v":2.0000000000000001E-4},1.6E-2,4,4,1.4999999999999999E-2,0.9,{"$f":"IF(M63=MIN(M63:N63),E63,F63)","v":5137.43},{"$f":"MAX(ROUND(1.8*(1.1-T63)*G63^(1/2)/(ABS(O63)*100)^(1/3),3),10)","v":10},{"$f":"ROUND($L$18/(V63+$L$19)^$L$20,3)","v":3.6819999999999999},{"$f":"L63","v":1.5E-3},{"$f":"ROUND(T63*W63*X63,3)","v":5.0000000000000001E-3},0,{"$f":"SUM(Y63:Z63)","v":5.0000000000000001E-3},{"$f":"ABS(O63)","v":2.0000000000000001E-4},{"$f":"ROUND((AA63/(0.56*(1/P63)/S63*AB63^(1/2)))^(3/8),3)","v":3.6999999999999998E-2},{"$f":"(1/P63)*AC63","v":2.3125},{"$f":"$D$44","v":35},{"$f":"AE63*AC63^(5/3)","v":0.14379294696819883},{"$f":"CEILING(AA63/AF63,1)","v":1}]
[null,null,"to End/A.S."]
[]
[null,null,"Outside Side of the Bridge Rear Abutment - Final Condition"]
[null,null,"HP Bk",null,{"$f":"H29","v":5141.826625386997},4854.0200000000004,{"$f":"ABS(F67-E67)","v":287.80662538699653},14.5,14.5,{"$f":"AVERAGE(H67:I67)","v":14.5},{"$f":"G67*J67","v":4173.1960681114497},{"$f":"ROUND(K67*2.2957*10^-5,4)","v":9.5799999999999996E-2},{"$f":"ROUND(IF(E67<$D$29,$E$29+$G$25*(E67-$D$29),IF(AND(E67>=$D$29,E67<=$F$29),$E$29+$G$25*(E67-$D$29)+$I$25*((E67-$D$29)/$F$25*2)^2,IF(AND(E67>$F$29,E67<$K$29),$E$25+$H$25*(E67-$D$25),IF(AND(E67>=$K$29,E67<=$M$29),$L$29+$N$25*(E67-$K$29)+$P$25*((E67-$K$29)/$M$25*2)^2,$L$25+$O$25*(E67-$K$25))))),3)","v":996.27099999999996},992.27800000000002,{"$f":"ROUND((M67-N67)/G67,4)","v":1.3899999999999999E-2},1.6E-2,4,4,1.4999999999999999E-2,0.9,{"$f":"F67","v":4854.0200000000004},{"$f":"MAX(ROUND(1.8*(1.1-T67)*G67^(1/2)/(ABS(O67)*100)^(1/3),3),10)","v":10},{"$f":"ROUND($L$18/(V67+$L$19)^$L$20,3)","v":3.6819999999999999},{"$f":"L67","v":9.5799999999999996E-2},{"$f":"ROUND(T67*W67*X67,3)","v":0.317},0,{"$f":"SUM(Y67:Z67)","v":0.317},{"$f":"ABS(O67)","v":1.3899999999999999E-2},{"$f":"ROUND((AA67/(0.56*(1/P67)/S67*AB67^(1/2)))^(3/8),3)","v":7.9000000000000001E-2},{"$f":"(1/P67)*AC67","v":4.9375},{"$f":"$D$44","v":35},{"$f":"AE67*AC67^(5/3)","v":0.50907276491609721},{"$f":"CEILING(AA67/AF67,1)","v":1}]
[null,null,"to End/A.S."]
[]
[null,"RIGHT","Outside Side of the Bridge Forward Abutment - Final Condition"]
[null,null,"From High Point",null,{"$f":"H29","v":5141.826625386997},5137.43,{"$f":"ABS(E71-F71)","v":4.3966253869966749},14.5,14.5,{"$f":"AVERAGE(H71:I71)","v":14.5},{"$f":"G71*J71","v":63.751068111451787},{"$f":"ROUND(K71*2.2957*10^-5,4)","v":1.5E-3},{"$f":"ROUND(IF(E71<$D$29,$E$29+$G$25*(E71-$D$29),IF(AND(E71>=$D$29,E71<=$F$29),$E$29+$G$25*(E71-$D$29)+$I$25*((E71-$D$29)/$F$25*2)^2,IF(AND(E71>$F$29,E71<$K$29),$E$25+$H$25*(E71-$D$25),IF(AND(E71>=$K$29,E71<=$M$29),$L$29+$N$25*(E71-$K$29)+$P$25*((E71-$K$29)/$M$25*2)^2,$L$25+$O$25*(E71-$K$25))))),3)","v":996.27099999999996},{"$f":"ROUND(IF(F71<$D$29,$E$29+$G$25*(F71-$D$29),IF(AND(F71>=$D$29,F71<=$F$29),$E$29+$G$25*(F71-$D$29)+$I$25*((F71-$D$29)/$F$25*2)^2,IF(AND(F71>$F$29,F71<$K$29),$E$25+$H$25*(F71-$D$25),IF(AND(F71>=$K$29,F71<=$M$29),$L$29+$N$25*(F71-$K$29)+$P$25*((F71-$K$29)/$M$25*2)^2,$L$25+$O$25*(F71-$K$25))))),3)","v":996.27},{"$f":"ROUND((M71-N71)/G71,4)","v":2.0000000000000001E-4},1.6E-2,4,4,1.4999999999999999E-2,0.9,{"$f":"IF(M71=MIN(M71:N71),E71,F71)","v":5137.43},{"$f":"MAX(ROUND(1.8*(1.1-T71)*G71^(1/2)/(ABS(O71)*100)^(1/3),3),10)","v":10},{"$f":"ROUND($L$18/(V71+$L$19)^$L$20,3)","v":3.6819999999999999},{"$f":"L71","v":1.5E-3},{"$f":"ROUND(T71*W71*X71,3)","v":5.0000000000000001E-3},0,{"$f":"SUM(Y71:Z71)","v":5.0000000000000001E-3},{"$f":"ABS(O71)","v":2.0000000000000001E-4},{"$f":"ROUND((AA71/(0.56*(1/P71)/S71*AB71^(1/2)))^(3/8),3)","v":3.6999999999999998E-2},{"$f":"(1/P71)*AC71","v":2.3125},{"$f":"$D$44","v":35},{"$f":"AE71*AC71^(5/3)","v":0.14379294696819883},{"$f":"CEILING(AA71/AF71,1)","v":1}]
[null,null,"to End/A.S."]
[]
[null,null,"Outside Side of the Bridge Rear Abutment - Final Condition"]
[null,null,"HP Bk",null,{"$f":"H29","v":5141.826625386997},4854.0200000000004,{"$f":"ABS(F75-E75)","v":287.80662538699653},14.5,14.5,{"$f":"AVERAGE(H75:I75)","v":14.5},{"$f":"G75*J75","v":4173.1960681114497},{"$f":"ROUND(K75*2.2957*10^-5,4)","v":9.5799999999999996E-2},{"$f":"ROUND(IF(E75<$D$29,$E$29+$G$25*(E75-$D$29),IF(AND(E75>=$D$29,E75<=$F$29),$E$29+$G$25*(E75-$D$29)+$I$25*((E75-$D$29)/$F$25*2)^2,IF(AND(E75>$F$29,E75<$K$29),$E$25+$H$25*(E75-$D$25),IF(AND(E75>=$K$29,E75<=$M$29),$L$29+$N$25*(E75-$K$29)+$P$25*((E75-$K$29)/$M$25*2)^2,$L$25+$O$25*(E75-$K$25))))),3)","v":996.27099999999996},{"$f":"ROUND(IF(F75<$D$29,$E$29+$G$25*(F75-$D$29),IF(AND(F75>=$D$29,F75<=$F$29),$E$29+$G$25*(F75-$D$29)+$I$25*((F75-$D$29)/$F$25*2)^2,IF(AND(F75>$F$29,F75<$K$29),$E$25+$H$25*(F75-$D$25),IF(AND(F75>=$K$29,F75<=$M$29),$L$29+$N$25*(F75-$K$29)+$P$25*((F75-$K$29)/$M$25*2)^2,$L$25+$O$25*(F75-$K$25))))),3)","v":992.27800000000002},{"$f":"ROUND((M75-N75)/G75,4)","v":1.3899999999999999E-2},1.6E-2,4,4,1.4999999999999999E-2,0.9,{"$f":"F75","v":4854.0200000000004},{"$f":"MAX(ROUND(1.8*(1.1-T75)*G75^(1/2)/(ABS(O75)*100)^(1/3),3),10)","v":10},{"$f":"ROUND($L$18/(V75+$L$19)^$L$20,3)","v":3.6819999999999999},{"$f":"L75","v":9.5799999999999996E-2},{"$f":"ROUND(T75*W75*X75,3)","v":0.317},0,{"$f":"SUM(Y75:Z75)","v":0.317},{"$f":"ABS(O75)","v":1.3899999999999999E-2},{"$f":"ROUND((AA75/(0.56*(1/P75)/S75*AB75^(1/2)))^(3/8),3)","v":7.9000000000000001E-2},{"$f":"(1/P75)*AC75","v":4.9375},{"$f":"$D$44","v":35},{"$f":"AE75*AC75^(5/3)","v":0.50907276491609721},{"$f":"CEILING(AA75/AF75,1)","v":1}]
[null,null,"to End/A.S."]
[null,"4. No scuppers required for FINAL condition."]

{"sheet":"Tables","index":1,"n_rows":26,"n_cols":14,"rows_kept":26,"cut":false,"hidden":false,"merged":[[20,9,25,9],[14,9,19,9],[8,9,13,9],[2,9,7,9]]}
[null,null,null,null,null,null,null,null,null,"(L&D, Vol. 2, General Notes - Figs. 1101-2 through 1101-3)"]
[null,null,null,null,null,null,null,null,null,"Zone","Freq.","a","b","c"]
[null,null,null,null,null,null,null,null,null,"A",2,46.183999999999997,9,0.85899999999999999]
[null,null,null,null,null,null,null,null,null,null,5,56.984999999999999,10.25,0.85099999999999998]
[null,null,null,null,null,null,null,null,null,null,10,64.167000000000002,11,0.84199999999999997]
[null,null,null,null,null,null,null,null,null,null,25,66.528000000000006,11,0.81100000000000005]
[null,null,null,null,null,null,null,null,null,null,50,65.701999999999998,10.75,0.78200000000000003]
[null,null,null,null,null,null,null,null,null,null,100,64.489000000000004,10.5,0.754]
[null,null,null,null,null,null,null,null,null,"B",2,47.987000000000002,9,0.85899999999999999]
[null,null,null,null,null,null,null,null,null,null,5,60.683999999999997,10.5,0.85799999999999998]
[null,null,null,null,null,null,null,null,null,null,10,73.126000000000005,12,0.86299999999999999]
[null,null,null,null,null,null,null,null,null,null,25,75.840999999999994,12,0.83299999999999996]
[null,null,null,null,null,null,null,null,null,null,50,65.620999999999995,10,0.78100000000000003]
[null,null,null,null,null,null,null,null,null,null,100,85.046999999999997,13.25,0.80600000000000005]
[null,null,null,null,null,null,null,null,null,"C",2,56.298999999999999,10,0.876]
[null,null,null,null,null,null,null,null,null,null,5,67.933000000000007,11,0.86899999999999999]
[null,null,null,null,null,null,null,null,null,null,10,84.55,13,0.88200000000000001]
[null,null,null,null,null,null,null,null,null,null,25,95.736000000000004,14,0.871]
[null,null,null,null,null,null,null,null,null,null,50,96.783000000000001,14,0.85]
[null,null,null,null,null,null,null,null,null,null,100,80.436000000000007,11.5,0.79400000000000004]
[null,null,null,null,null,null,null,null,null,"D",2,57.448,10,0.876]
[null,null,null,null,null,null,null,null,null,null,5,67.933000000000007,11,0.86899999999999999]
[null,null,null,null,null,null,null,null,null,null,10,79.191999999999993,12,0.86399999999999999]
[null,null,null,null,null,null,null,null,null,null,25,87.885999999999996,12.75,0.84899999999999998]
[null,null,null,null,null,null,null,null,null,null,50,95.168999999999997,13.5,0.83899999999999997]
[null,null,null,null,null,null,null,null,null,null,100,91.981999999999999,13,0.81]