{"text_format":"1","workbook":"xlsx","n_sheets":9,"sheets":["Instructions","Safety Application","DSRTSignature","Project Scoring","ScoringCalculations","ScoringTable","RefTables","RSI_Data","Import"],"not_rendered":{"charts":0,"images":5,"macros":1,"external_links":0,"defined_names":38,"comments":1,"pivot_tables":0},"unopened":[],"bounds":{"document_bytes":16777216,"sheet_cells":100000,"rows_first":2000,"rows_last":500,"rows_between":2000,"halvings":0,"cell_chars":16384,"cell_head_chars":4096},"cells_cut":0,"cells_raw":0,"read":"whole","date_system":"1900"}

{"sheet":"Instructions","index":0,"n_rows":16,"n_cols":12,"rows_kept":16,"cut":false,"hidden":false,"merged":[[7,0,7,8],[16,0,16,8],[3,0,3,8],[4,0,4,8],[8,0,8,8],[9,0,9,8],[11,0,11,8],[12,0,12,8],[14,0,14,8],[15,0,15,8],[13,0,13,8],[0,0,0,8],[1,0,1,8],[2,0,2,8],[5,0,5,8],[6,0,6,8]]}
["Highway Safety Improvement Program",null,null,null,null,null,null,null,null,null,"Version",20240514]
["Formal Funding Application"]
["Scoring Tool Instructions"]
[]
["The instructions can be used to understand the functionality of the tool.  The tool attempts to complete as many fields as possible form information entered in the Economic Crash Analysis Tool (ECAT).  "]
[]
["The worksheets have been protected because the tool is standardized to import into the ODOT Central Office Database. Once submitted, the complete data layouts will be imported into the current database.  At this point, the district will be able to make any changes desired prior to the HSIP Program Committee Review."]
[]
[]
["I recommend starting a new application by importing data from existing ECAT Tool(s).  The import functionality will obtain information from (1) an ECAT Tool that does not have a fundamental change in Safety Performance Function (SPF) ('No' response in Cell \"K14\" on the Project Information Worksheet) or (2) an ECAT Tool that has have a fundamental change in Safety Performance Function (SPF) ('Yes' response in Cell \"K14\" on the Project Information Worksheet).  Follow the coded prompts.  Two files will be required for Item (2).  The order of import is does not matter.  Following the import process, please verify the data as assumptions have been made.  For example, it was assumed that only one route (major route) was used in the Project Element Description Table when determining project limits (All NLFIDs match in Column F).\n\nNote:  If you choose to import a new dataset, any previous information will be overridden."]
[]
[]
["At times, it will be necessary to change the font size of cells to make the text visible.  Once the tool is activated, select the cells you desire to decrease / increase the font size (selection can be contiguous or noncontiguous cells).  Once the cells have been selected, select the desired functionality."]
[]
[]
["This tool can be used to add rows of details for either work locations of funding sources.  Submitters can add up to a total of 10 work locations.  Similarly, there are a ten (10) total funding sources possible (including the three already defined).  For funding sources, we are asking that each source be individually itemized."]

{"sheet":"Safety Application","index":1,"n_rows":117,"n_cols":28,"rows_kept":117,"cut":false,"hidden":false,"merged":[[79,0,79,2],[84,0,84,2],[77,0,77,2],[78,0,78,2],[82,0,82,2],[80,0,80,2],[52,0,52,9],[47,0,47,2],[48,0,48,2],[50,0,50,2],[47,6,47,8],[48,6,48,8],[49,6,49,8],[49,0,49,2],[50,6,50,8],[47,3,47,5],[48,3,48,5],[116,0,116,9],[114,0,114,2],[73,0,73,2],[76,0,76,2],[53,4,53,9],[54,4,54,9],[55,4,55,9],[56,4,56,9],[57,4,57,9],[69,6,69,9],[70,6,70,9],[74,0,74,2],[75,0,75,2],[73,9,75,9],[60,6,60,9],[61,6,61,9],[62,6,62,9],[63,6,63,9],[64,6,64,9],[65,6,65,9],[66,6,66,9],[67,6,67,9],[68,6,68,9],[83,0,83,2],[61,10,61,11],[61,12,61,13],[61,14,61,15],[62,14,62,15],[63,14,63,15],[64,14,64,15],[65,14,65,15],[66,14,66,15],[67,14,67,15],[66,12,66,13],[67,10,67,11],[67,12,67,13],[68,14,68,15],[69,14,69,15],[70,14,70,15],[62,10,62,11],[62,12,62,13],[63,10,63,11],[63,12,63,13],[64,10,64,11],[64,12,64,13],[65,10,65,11],[65,12,65,13],[66,10,66,11],[68,10,68,11],[68,12,68,13],[69,10,69,11],[69,12,69,13],[70,10,70,11],[70,12,70,13],[0,0,0,9],[6,0,6,2],[1,3,1,9],[2,3,2,9],[3,3,3,9],[4,3,4,9],[5,3,5,9],[6,3,6,9],[4,0,4,2],[5,0,5,2],[2,0,2,2],[3,0,3,2],[16,0,16,9],[15,0,15,9],[1,0,1,2],[9,7,9,9],[10,7,10,9],[8,0,8,9],[9,0,9,1],[10,0,10,1],[11,0,11,1],[9,5,9,6],[10,5,10,6],[11,5,11,6],[11,7,11,9],[9,2,9,4],[10,2,10,4],[11,2,11,4],[13,0,13,1],[12,2,12,4],[13,5,13,6],[12,7,12,9],[12,0,12,1],[12,5,12,6],[13,2,13,4],[13,7,13,9],[38,0,38,6],[39,0,39,6],[40,0,40,6],[17,0,17,9],[18,0,18,9],[19,0,19,9],[20,0,20,9],[21,0,21,9],[30,0,30,9],[23,0,23,9],[22,0,22,9],[32,0,32,3],[34,0,34,9],[35,0,35,6],[36,0,36,6],[37,0,37,6],[24,0,24,4],[25,0,25,4],[26,0,26,4],[27,0,27,4],[29,0,29,4],[28,0,28,4],[41,0,41,6],[42,0,42,6],[43,0,43,6],[72,0,72,9],[53,0,53,3],[54,0,54,3],[55,0,55,3],[56,0,56,3],[62,0,62,1],[63,0,63,1],[64,0,64,1],[65,0,65,1],[66,0,66,1],[46,0,46,9],[67,0,67,1],[68,0,68,1],[69,0,69,1],[70,0,70,1],[61,0,61,1],[59,0,59,9],[60,0,60,1],[44,0,44,7],[49,3,49,5],[50,3,50,5],[110,0,110,9],[105,5,105,7],[104,8,104,9],[105,8,105,9],[104,5,104,7],[85,0,85,2],[107,8,107,9],[106,0,106,7],[107,0,107,7],[106,8,106,9],[101,4,101,6],[101,7,101,9],[100,4,100,6],[100,7,100,9],[104,0,104,4],[105,0,105,4],[100,0,100,3],[101,0,101,3],[96,4,96,6],[96,7,96,9],[99,4,99,6],[99,7,99,9],[87,0,87,9],[88,0,88,9],[103,0,103,9],[91,0,91,3],[92,0,92,3],[91,6,91,7],[81,0,81,2],[96,0,96,3],[97,0,97,3],[98,0,98,3],[99,0,99,3],[90,0,90,9],[97,4,97,6],[97,7,97,9],[98,4,98,6],[98,7,98,9],[95,0,95,9],[91,4,91,5],[92,4,92,5],[91,8,91,9],[92,8,92,9],[92,6,92,7],[93,0,93,3],[93,4,93,5],[93,6,93,7],[93,8,93,9]]}
["General Project Information",null,null,null,null,null,null,null,null,null,null,null,null,null,null,null,null,null,null,null,null,null,null,null,null,"Show Conditional Format:","Yes"]
["Project Sponsoring Agency",null,null,"ODOT",null,null,null,null,null,null,null,null,null,null,null,null,null,null,null,null,null,null,null,null,null,"Lat Long Format:","Yes"]
["Project Name",null,null,{"$f":"IF(ScoringCalculations!C2=\"\",\"\",ScoringCalculations!C2)","v":"WAR US 22 19.24 (Clarksville Rd)"},null,null,null,null,null,null,null,null,null,null,null,null,null,null,null,null,null,null,null,null,null,"Priority Rank Format:","Yes"]
["PID",null,null,{"$f":"IF(ScoringCalculations!C4=\"\",\"\",ScoringCalculations!C4)","v":"TBD"}]
["Applicant Name",null,null,"Tom Mazza"]
["Contact Phone",null,null,"513-933-6591"]
["Contact Email",null,null,"Thomas.Mazza@dot.ohio.gov"]
[]
["Location Information"]
["ODOT District",null,{"$f":"IFERROR(VLOOKUP(H10,RefTables!A:B,2,FALSE),\"\")","v":8},null,null,"County",null,{"$f":"MID(A62,2,3)","v":"WAR"}]
["Route Number",null,"US-22",null,null,"Road Name",null,"US-22"]
["Begin Logpoint",null,{"$f":"IF(C62=\"\",\"\",C62)","v":19.239999999999998},null,null,"End Logpoint",null,19.239999999999998]
["Begin Latitude",null,39.417250000000003,null,null,"Begin Longitude",null,-83.998694439999994]
["End Latitude",null,39.417250000000003,null,null,"End Longitude",null,-83.998694439999994]
[]
["Project Description"]
["Summary of Crash Patterns"]
["From 2022-2024, there were 22 total crashes at the US 22/Clarksville Rd intersection (WAR US 22 19.24).  There were 7 crashes in 2022, 6 crashes in 2023, and 9 crashes in 2024.  There were 0 fatal crashes, 2 serious injury crashes, 13 minor injury crashes, 4 possible injury crashes, and 3 property damage only crashes.  The fatal and injury crash rate was 86.4%.  \n\nEvery crash at the US 22/Clarksville Rd intersection was an angle crash.  Crashes occurred most often in dry (86%) and daylight (77%) conditions.  The majority of crashes occurred between 2-7 PM.  Running the stop sign is NOT a major contributing factor with only 14% of crashes resulting from running a stop sign.  The most common angle crash was WB/NB with 10 occurrences.  There were 15 angle crashes involving westbound vehicles on US 22.\n\nHistorically, there have been 2-3 angle crashes at the US 22/Clarksville Rd intersection each year from 2015-2020.  However, the past 4 years have seen a significant increase in the number of angle crashes.  There have been at least 5 angle crashes each year from 2021-2024, with a peak of 9 angle crashes in 2024.  A long-term solution is needed to eliminate the potential for high severity angle crashes.\n\n"]
["Summary of Recommended Countermeasures"]
["StreetLight Data was used to create an estimated AADT and turning movement count at the intersection.  This data was used to complete a signal warrant analysis utilizing ODOT’s Traffic Signal Warrant Spreadsheet.  Based on this analysis, a traffic signal is not warranted at the US 22/Clarksville Rd intersection.  ODOT District 8 will not pursue a new traffic signal at this location because a traffic signal is not warranted and a new traffic signal is predicted to increase the number of overall crashes.\n\nAll-way stop control is not being considered at this intersection.  The 85th percentile speeds on US 22 are near 60 mph and the nearest stopped conditions on US 22 are over 8 miles away in either direction (Nelson Ave to the north and SR 123 to the south).   \n\nBased on the historical crash data and past countermeasures, the recommended countermeasure at this time is to construct a single lane modern roundabout at US 22/Clarksville Rd.  If funding is awarded to this project, a new traffic count will need to be collected.  Then, proper traffic analysis would be completed to confirm a traffic signal is unwarranted and a single lane modern roundabout would operate sufficiently in the design year."]
["Project Priority Information"]
["Per the 2024 HSIP priority list, the US 22/Clarksville Rd intersection is ranked as rural intersection #105.  This intersection does not appear on the current SIP map."]
["Crash Data"]
["Crash Totals"]
["(average per year)",null,null,null,null,"Fatal & Serious Injury  (KA)","Visible Injury (B)","Non-Visible (C)","Property Damage Only (O)","Total"]
["Existing Conditions: Predicted Crash Frequency",null,null,null,null,{"$f":"IF(ScoringCalculations!D43=0,\"\",ScoringCalculations!D43)","v":9.4299999999999995E-2},{"$f":"IF(ScoringCalculations!E43=0,\"\",ScoringCalculations!E43)","v":0.2288},{"$f":"IF(ScoringCalculations!F43=0,\"\",ScoringCalculations!F43)","v":0.15229999999999999},{"$f":"IF(ScoringCalculations!G43=0,\"\",ScoringCalculations!G43)","v":0.81850000000000001},{"$f":"ROUND(SUM(F26:I26),2)","v":1.29}]
["Existing Conditions: Expected Crash Frequency",null,null,null,null,{"$f":"IF(ScoringCalculations!D44=0,\"\",ScoringCalculations!D44)","v":0.2135},{"$f":"IF(ScoringCalculations!E44=0,\"\",ScoringCalculations!E44)","v":0.51729999999999998},{"$f":"IF(ScoringCalculations!F44=0,\"\",ScoringCalculations!F44)","v":0.34449999999999997},{"$f":"IF(ScoringCalculations!G44=0,\"\",ScoringCalculations!G44)","v":0.84830000000000005},{"$f":"ROUND(SUM(F27:I27),2)","v":1.92}]
["Potential for Safety Improvement",null,null,null,null,{"$f":"IF(ScoringCalculations!D45=0,\"\",ScoringCalculations!D45)","v":0.1192},{"$f":"IF(ScoringCalculations!E45=0,\"\",ScoringCalculations!E45)","v":0.28849999999999998},{"$f":"IF(ScoringCalculations!F45=0,\"\",ScoringCalculations!F45)","v":0.19219999999999998},{"$f":"IF(ScoringCalculations!G45=0,\"\",ScoringCalculations!G45)","v":2.9800000000000049E-2},0.63]
[{"$f":"\"Proposed Conditions: \"&IF('Project Scoring'!H7=\"ECAT - Change in base SPF\",\"Predicted\",\"Expected\")&\" Crash Frequency\"","v":"Proposed Conditions: Expected Crash Frequency"},null,null,null,null,{"$f":"IF(ScoringCalculations!D46=0,\"\",ScoringCalculations!D46)","v":2.0999999999999999E-3},{"$f":"IF(ScoringCalculations!E46=0,\"\",ScoringCalculations!E46)","v":1.84E-2},{"$f":"IF(ScoringCalculations!F46=0,\"\",ScoringCalculations!F46)","v":2.3E-2},{"$f":"IF(ScoringCalculations!G46=0,\"\",ScoringCalculations!G46)","v":0.59279999999999999},0.64]
["Observed Crashes",null,null,null,null,{"$f":"IF(ScoringCalculations!D47=\"\",\"\",ScoringCalculations!D47)","v":0.66669999999999996},{"$f":"IF(ScoringCalculations!E47=\"\",\"\",ScoringCalculations!E47)","v":4.3333000000000004},{"$f":"IF(ScoringCalculations!F47=\"\",\"\",ScoringCalculations!F47)","v":1.3332999999999999},{"$f":"IF(ScoringCalculations!G47=\"\",\"\",ScoringCalculations!G47)","v":1},7.33]
["Observed People Injury Totals"]
[null,null,null,null,null,"Fatal Injury  (K)","Serious Injury  (A)","Visible Injury (B)","Non-Visible (C)","Total"]
["Observed People Injury Totals",null,null,null,null,{"$f":"IF(ScoringCalculations!D53=\"\",\"\",ScoringCalculations!D53)","v":0},{"$f":"IF(ScoringCalculations!E53=\"\",\"\",ScoringCalculations!E53)","v":1},{"$f":"IF(ScoringCalculations!F53=\"\",\"\",ScoringCalculations!F53)","v":7.6666999999999996},{"$f":"IF(ScoringCalculations!G53=\"\",\"\",ScoringCalculations!G53)","v":4.6666999999999996},{"$f":"ROUND(SUM(F33:I33),2)","v":13.33}]
[]
["Application Scoring"]
["Category",null,null,null,null,null,null,"Scoring Value","Points Awarded","Points Possible"]
["Ratio of Observed Fatal and Serious Injuries to Observed Total Crashes",null,null,null,null,null,null,{"$f":"IF(J30=0,\"\",ROUND(SUM(F33:G33)/J30,2))","v":0.14000000000000001},{"$f":"IFERROR(VLOOKUP(H37,ScoringTable!AA:AB,2,TRUE),\"\")","v":28},{"$f":"MAX(ScoringTable!AB:AB)","v":30}]
["Percentage of the Potential for Safety Improvement to Total Expected Crashes",null,null,null,null,null,null,{"$f":"IF(J27=0,\"\",IF(J28<0,0,IFERROR(ROUND(J28/J27,4),0)))","v":0.3281},{"$f":"IFERROR(VLOOKUP(H38,ScoringTable!AC:AD,2,TRUE),\"\")","v":20},{"$f":"MAX(ScoringTable!AD:AD)","v":20}]
["Relative Severity Index",null,null,null,null,null,null,{"$f":"IF(ScoringCalculations!B36=0,\"\",ScoringCalculations!B36)","v":54875.839999999997},{"$f":"IFERROR(VLOOKUP(H39,ScoringTable!AE:AF,2,TRUE),\"\")","v":20},{"$f":"MAX(ScoringTable!AF:AF)","v":20}]
["Equivalent Property Damage Only Index",null,null,null,null,null,null,{"$f":"IF(J27=0,IF(J30=0,\"\",ROUND((F30*ScoringCalculations!D48+G30*ScoringCalculations!E48+H30*ScoringCalculations!F48+I30*ScoringCalculations!G48)/J30,2)),ROUND((F27*ScoringCalculations!D48+G27*ScoringCalculations!E48+H27*ScoringCalculations!F48+I27*ScoringCalculations!G48)/J27,2))","v":8.08},{"$f":"IFERROR(VLOOKUP(H40,ScoringTable!AG:AH,2,TRUE),\"\")","v":20},{"$f":"MAX(ScoringTable!AH:AH)","v":20}]
["Location Equity Measure",null,null,null,null,null,null,0.03,{"$f":"IF(H41=0,\"\",IFERROR(VLOOKUP(H41,ScoringTable!AI:AJ,2,TRUE),\"\"))","v":0},{"$f":"MAX(ScoringTable!AJ:AJ)","v":10}]
[null,null,null,null,null,null,null,null,{"$f":"IFERROR(VLOOKUP(H42,ScoringTable!AM:AN,2,TRUE),\"\")","v":""}]
[null,null,null,null,null,null,null,null,{"$f":"IFERROR(IF(H43<0,0,VLOOKUP(H43,ScoringTable!AO:AP,2,TRUE)),\"\")","v":""}]
[null,null,null,null,null,null,null,null,{"$f":"IFERROR(VLOOKUP(H44,ScoringTable!AQ:AR,2,TRUE),\"\")","v":""}]
["Total",null,null,null,null,null,null,null,{"$f":"IF(SUM(I37:I44)=0,\"\",SUM(I37:I44))","v":88},{"$f":"SUM(J37:J44)","v":100}]
[]
["Safety Key Metrics"]
["Functional Class",null,null,"5 - Major Collector Roadway",null,null,"Active Transportation Need",null,null,1]
["Major Route AADT",null,null,2200,null,null,"Active Transportation Demand",null,null,1]
["Maximum Posted Speed Limit",null,null,55,null,null,"Bicycle Level of traffic stress (if available)"]
[null,null,null,null,null,null,"TOAST Score (if available)",null,null,90.8]
[]
["Strategic Highway Safety Plan"]
["Ohio Emphasis Area",null,null,null,"Serious Crash Types"]
["Ohio Emphasis Area Subcategory",null,null,null,"Intersection"]
["FHWA Emphasis Area",null,null,null,"Improving the design and operation of highway intersections"]
["FHWA Improvement Category",null,null,null,"Intersection traffic control"]
["FHWA Improvement Subcategory",null,null,null,"Modify control - two-way stop to roundabout"]
[]
["Work Locations"]
["NLFID",null,"Begin Logpoint","End \nLogpoint","Begin \nLatitude","Begin Longitude","Location Termini\n(i.e. from Street 1 to Street 2)",null,null,null,null,null,null,null,null,null,null,null,null,null,null,null,null,null,null,null,"EndLatitude","EndLongitude"]
["SWARUS00022**C",null,19.239999999999998,19.239999999999998,39.417250000000003,-83.998694439999994,"US 22 and Clarksville Rd",null,null,null,{"$f":"IF(OR(E62=\"\",F62=\"\"),\"\",HYPERLINK(CONCATENATE(\"http://maps.google.com/maps?q=\",+E62,\",+\",+F62,\"+(Begin Project)&iwloc=A&hl=en\"),\"Google Map\"))","v":"Google Map"},null,{"$f":"IF(OR(E62=\"\",F62=\"\"),\"\",HYPERLINK(CONCATENATE(\"http://bing.com/maps/default.aspx?rtop=1~0&rtp=pos.\",E62,\"_\",F62,\"_\",\"Begin Project\"),\"Bing Maps\"))","v":"Bing Maps"},null,{"$f":"IF(A62=\"\",\"\",IF(OR(MID(A62,5,2)=\"IR\",MID(A62,5,2)=\"SR\",MID(A62,5,2)=\"US\"),IF(RIGHT(A62,1)=\"C\",HYPERLINK(\"http://pathweb.pathwayservices.com/ohiopublic/?nlfid='\"&A62&\"'&logpoint=\"&C62,\"Pathway Images\"),\"Not Available\"),\"Not Available\"))","v":"Pathway Images"}]
[null,null,null,null,null,null,null,null,null,null,{"$f":"IF(OR(E63=\"\",F63=\"\"),\"\",HYPERLINK(CONCATENATE(\"http://maps.google.com/maps?q=\",+E63,\",+\",+F63,\"+(Begin Project)&iwloc=A&hl=en\"),\"Google Map\"))","v":""},null,{"$f":"IF(OR(E63=\"\",F63=\"\"),\"\",HYPERLINK(CONCATENATE(\"http://bing.com/maps/default.aspx?rtop=1~0&rtp=pos.\",E63,\"_\",F63,\"_\",\"Begin Project\"),\"Bing Maps\"))","v":""},null,""]
[null,null,null,null,null,null,null,null,null,null,"",null,"",null,""]
[null,null,null,null,null,null,null,null,null,null,"",null,"",null,""]
[null,null,null,null,null,null,null,null,null,null,"",null,"",null,""]
[null,null,null,null,null,null,null,null,null,null,"",null,"",null,""]
[null,null,null,null,null,null,null,null,null,null,"",null,"",null,""]
[null,null,null,null,null,null,null,null,null,null,"",null,"",null,""]
[null,null,null,null,null,null,null,null,null,null,"",null,"",null,""]
[null,null,null,null,null,null,null,null,null,null,"",null,"",null,""]
[]
["Project Funding"]
["Project Phase",null,null,"Safety Study","Interchange Mod. Study","PE - Environmental","PE - Detailed Design","Right of Way /Utilities","Construction","Total"]
["Fiscal Year",null,null,null,null,2026,2028,2028,2029]
["Project Phase Completed",null,null,null,null,null,null,null,"N/A"]
["Previous Safety",null,null,null,null,null,null,null,null,{"$f":"SUM(D77:I77)","v":0}]
["New Safety",null,null,null,null,400000,125000,200000,2373862,{"$f":"SUM(D78:I78)","v":3098862}]
["Sponsor Funding",null,null,null,null,null,null,null,null,0]
[null,null,null,null,null,null,null,null,null,0]
[null,null,null,null,null,null,null,null,null,0]
[null,null,null,null,null,null,null,null,null,0]
[null,null,null,null,null,null,null,null,null,0]
[null,null,null,null,null,null,null,null,null,0]
[null,null,null,null,null,null,null,null,null,0]
[null,null,null,null,null,null,null,null,null,0]
[null,null,"Total",{"$f":"SUM(D77:D86)","v":0},{"$f":"SUM(E77:E86)","v":0},400000,125000,200000,2373862,3098862]
["Additional Funding Detail"]
["District requesting funding be combined with the CLI US 22 RAB application (202503D08-02). Design and construction for both roundabouts to be completed as 1 project. Design consultant to be selected through the January 2026 programmatic. "]
[]
["Safety Economic Analysis Results"]
["Net Present Value of Project",null,null,null,{"$f":"IF(ScoringCalculations!D58=0,\"\",ScoringCalculations!D58)","v":2714862},null,"Net Benefit",null,{"$f":"IF(ScoringCalculations!D60=0,\"\",ScoringCalculations!D60)","v":-1753686.75}]
["Net Present Value of Safety Benefits",null,null,null,{"$f":"IF(ScoringCalculations!D59=0,\"\",ScoringCalculations!D59)","v":961175.25},null,"Benefit / \nTotal Project Cost Ratio",null,{"$f":"IF(ScoringCalculations!D61=\"Unable to calculate\",\"\",ROUND(ScoringCalculations!D61,2))","v":0.35}]
[null,null,null,null,null,null,"Benefit / Safety Funding Request Ratio",null,{"$f":"IF(E93=\"\",\"\",IF(J78=0,\"Please complete project funding table\",ROUND(E93/J78,2)))","v":0.31}]
[]
["Project Development"]
["Project Phase",null,null,null,"Completed by",null,null,"Completion Date"]
["Safety Study"]
["Interchange Modification Study"]
["PE-Environmental"]
["PE-Detailed Design"]
["Right of Way / Utilities"]
[]
["Applicant Information"]
["Name",null,null,null,null,"Title",null,null,"Phone Number"]
["Tom Mazza",null,null,null,null,"Traffic Studies Engineer",null,null,{"$f":"IF(D6=\"\",\"\",D6)","v":"513-933-6591"}]
["Signature",null,null,null,null,null,null,null,"Date"]
[null,null,null,null,null,null,null,null,{"$f":"NOW()","v":"2025-03-31T12:31:18.960"}]
[]
[null,null,null,null,null,null,null,null,"Version:",20230523]
["The following information should be included in submission of the safety project application:\n1. An electronic copy of the Safety Engineering Study\n2. All Excel Analysis Files\n      May include Crash Analysis Module (CAM) Tool, Economic Crash Analysis Tool (ECAT), HSIP Application and Scoring Tool.\n3. Benefit-Cost Results (Economic Analysis)\n4. DSRT approval signatures"]
[]
["ODOT Use Only:"]
["Application ID:"]
["202503D08-01"]
["Document Library on Odrive:"]
["O:\\Planning\\TED\\SAFETY\\D08\\SAFETY APPLICATIONS\\202503 Applications\\Formal\\202503D08-01 (CLI US-22 @ Clarksville Rd)"]

{"sheet":"DSRTSignature","index":2,"n_rows":47,"n_cols":27,"rows_kept":47,"cut":false,"hidden":true,"merged":[[3,0,3,2],[3,3,3,9],[0,0,0,9],[1,0,1,2],[1,3,1,9],[2,0,2,2],[2,3,2,9],[23,0,23,4],[8,0,8,9],[9,0,9,9],[4,0,4,2],[4,3,4,9],[5,0,5,2],[5,3,5,9],[6,0,6,2],[6,3,6,9],[10,0,10,9],[11,0,11,9],[12,0,12,9],[17,0,17,4],[17,5,17,7],[13,0,13,9],[14,0,14,9],[46,0,46,9],[41,0,41,9],[42,0,42,4],[42,5,42,7],[43,0,43,4],[43,5,43,7],[44,0,44,7],[44,8,44,9],[45,0,45,7],[45,8,45,9],[40,0,40,7],[40,8,40,9],[35,0,35,7],[36,0,36,9],[34,0,34,7],[34,8,34,9],[35,8,35,9],[39,8,39,9],[37,0,37,4],[37,5,37,7],[38,0,38,4],[38,5,38,7],[39,0,39,7],[30,0,30,7],[24,8,24,9],[25,0,25,7],[29,8,29,9],[29,0,29,7],[30,8,30,9],[25,8,25,9],[26,0,26,9],[16,0,16,9],[27,0,27,4],[27,5,27,7],[28,0,28,4],[28,5,28,7],[23,5,23,7],[24,0,24,7],[19,0,19,7],[19,8,19,9],[20,0,20,7],[20,8,20,9],[18,0,18,4],[18,5,18,7],[21,0,21,9],[22,0,22,4],[22,5,22,7],[31,0,31,9],[32,0,32,4],[32,5,32,7],[33,0,33,4],[33,5,33,7]]}
["General Project Information",null,null,null,null,null,null,null,null,null,null,null,null,null,null,null,null,null,null,null,null,null,null,null,null,"Show Conditional Format:","Yes"]
["Project Sponsoring Agency",null,null,null,null,null,null,null,null,null,null,null,null,null,null,null,null,null,null,null,null,null,null,null,null,"Lat Long Format:","Yes"]
["Project Name",null,null,"","","","","","","",null,null,null,null,null,null,null,null,null,null,null,null,null,null,null,"Priority Rank Format:","Yes"]
["PID",null,null,"","","","","","",""]
["Project Manager"]
["Contact Phone"]
["Contact Email"]
[]
["Project Description"]
["Summary of Crash Patterns"]
[]
["Summary of Recommended Countermeasures","Summary of Recommended Countermeasures","Summary of Recommended Countermeasures","Summary of Recommended Countermeasures","Summary of Recommended Countermeasures","Summary of Recommended Countermeasures","Summary of Recommended Countermeasures","Summary of Recommended Countermeasures","Summary of Recommended Countermeasures","Summary of Recommended Countermeasures"]
[]
["Project Priority Information","Project Priority Information","Project Priority Information","Project Priority Information","Project Priority Information","Project Priority Information","Project Priority Information","Project Priority Information","Project Priority Information","Project Priority Information"]
[]
[]
["District Safety Review Team Signatures"]
["Name",null,null,null,null,"Title",null,null,"Approve","Disapprove"]
[null,null,null,null,null,"Planning & Engineering Administrator",null,null,"¨","¨"]
["Signature",null,null,null,null,null,null,null,"Date"]
[]
["Comments:"]
["Name",null,null,null,null,"Title",null,null,"Approve","Disapprove"]
[null,null,null,null,null,"Highway Management Adminstrator",null,null,"¨","¨"]
["Signature",null,null,null,null,null,null,null,"Date"]
[]
["Comments:"]
["Name",null,null,null,null,"Title",null,null,"Approve","Disapprove"]
[null,null,null,null,null,"Design Engineer",null,null,"¨","¨"]
["Signature",null,null,null,null,null,null,null,"Date"]
[]
["Comments:"]
["Name",null,null,null,null,"Title",null,null,"Approve","Disapprove"]
[null,null,null,null,null,"Planning Manager",null,null,"¨","¨"]
["Signature",null,null,null,null,null,null,null,"Date"]
[]
["Comments:"]
["Name",null,null,null,null,"Title",null,null,"Approve","Disapprove"]
[null,null,null,null,null,"Traffic Engineer",null,null,"¨","¨"]
["Signature",null,null,null,null,null,null,null,"Date"]
[]
["Comments:"]
["Name",null,null,null,null,"Title",null,null,"Approve","Disapprove"]
[null,null,null,null,null,"Other",null,null,"¨","¨"]
["Signature",null,null,null,null,null,null,null,"Date"]
[]
["Comments:"]

{"sheet":"Project Scoring","index":3,"n_rows":16,"n_cols":9,"rows_kept":16,"cut":false,"hidden":true,"merged":[[5,0,5,1],[5,2,5,4],[5,5,5,6],[5,7,5,9],[6,0,6,1],[6,2,6,4],[6,5,6,6],[6,7,6,9],[3,0,3,1],[3,2,3,4],[3,5,3,6],[3,7,3,9],[4,0,4,1],[4,2,4,4],[4,5,4,6],[4,7,4,9],[0,0,0,9],[1,0,1,9],[2,0,2,1],[2,2,2,4],[2,5,2,6],[2,7,2,9],[8,1,8,6],[15,1,15,7],[12,1,12,6],[13,1,13,6],[10,1,10,6],[9,1,9,6],[11,1,11,6]]}
["Project Scoring Summary"]
["General Project Information"]
["Project Name",null,null,null,null,"Contact Email"]
["Project Description",null,null,null,null,"Contact Phone"]
["Reference Number",null,null,null,null,"Date Performed"]
["Analyst",null,null,null,null,"Analysis Year"]
["Agency/Company",null,null,null,null,"Analysis Type Performed"]
[]
[null,"Category",null,null,null,null,null,"Value","Points Awarded"]
[null,{"$f":"'Safety Application'!A37","v":"Ratio of Observed Fatal and Serious Injuries to Observed Total Crashes"},null,null,null,null,null,{"$f":"IF('Safety Application'!H37=\"\",\"\",'Safety Application'!H37)","v":0.14000000000000001},{"$f":"IF('Safety Application'!I37=\"\",\"\",'Safety Application'!I37)","v":28}]
[null,{"$f":"'Safety Application'!A38","v":"Percentage of the Potential for Safety Improvement to Total Expected Crashes"},null,null,null,null,null,{"$f":"IF('Safety Application'!H38=\"\",\"\",'Safety Application'!H38)","v":0.3281},{"$f":"IF('Safety Application'!I38=\"\",\"\",'Safety Application'!I38)","v":20}]
[null,{"$f":"'Safety Application'!A39","v":"Relative Severity Index"},null,null,null,null,null,{"$f":"IF('Safety Application'!H39=\"\",\"\",'Safety Application'!H39)","v":54875.839999999997},{"$f":"IF('Safety Application'!I39=\"\",\"\",'Safety Application'!I39)","v":20}]
[null,{"$f":"'Safety Application'!A40","v":"Equivalent Property Damage Only Index"},null,null,null,null,null,{"$f":"IF('Safety Application'!H40=\"\",\"\",'Safety Application'!H40)","v":8.08},{"$f":"IF('Safety Application'!I40=\"\",\"\",'Safety Application'!I40)","v":20}]
[null,{"$f":"'Safety Application'!A41","v":"Location Equity Measure"},null,null,null,null,null,{"$f":"IF('Safety Application'!H41=\"\",\"\",'Safety Application'!H41)","v":0.03},{"$f":"IF('Safety Application'!I41=\"\",\"\",'Safety Application'!I41)","v":0}]
[]
[null,"Safety Application Score",null,null,null,null,null,null,{"$f":"SUM(I10:I14)","v":88}]

{"sheet":"ScoringCalculations","index":4,"n_rows":61,"n_cols":56,"rows_kept":61,"cut":false,"hidden":false,"merged":[[40,0,40,7],[35,1,35,2],[39,0,39,7],[7,0,7,3],[12,0,12,3],[50,0,50,7],[51,0,51,2],[52,0,52,2],[41,0,41,2],[42,0,42,2],[43,0,43,2],[44,0,44,2],[46,0,46,2],[45,0,45,2],[48,0,48,2],[47,0,47,2],[55,0,55,7],[57,3,57,4],[58,3,58,4],[59,3,59,4],[60,3,60,4],[50,26,50,28],[40,26,40,33],[41,26,41,28],[42,26,42,28],[43,26,43,28],[44,26,44,28],[45,26,45,28],[47,26,47,33],[48,26,48,28],[49,26,49,28],[0,0,0,9],[1,0,1,1],[1,2,1,4],[1,5,1,6],[1,7,1,9],[2,0,2,1],[2,2,2,4],[2,5,2,6],[2,7,2,9],[3,0,3,1],[3,2,3,4],[3,5,3,6],[3,7,3,9],[4,0,4,1],[4,2,4,4],[4,5,4,6],[4,7,4,9],[5,0,5,1],[5,2,5,4],[5,5,5,6],[5,7,5,9]]}
["Project Scoring Summary",null,null,null,null,null,null,null,null,null,null,null,null,null,null,null,null,null,null,null,null,null,null,null,null,null,"HSM Analysis Type:","ECAT - Change in base SPF"]
["Project Name",null,"WAR US 22 19.24 (Clarksville Rd)",null,null,"Contact Email",null,"Thomas.Mazza@dot.ohio.gov"]
["Project Description",null,"Proposed Single Lane Roundabout",null,null,"Contact Phone",null,"513-933-6591"]
["Reference Number",null,"TBD",null,null,"Date Performed",null,"2025-03-04"]
["Analyst",null,"Tom Mazza",null,null,"Analysis Year",null,2029]
["Agency/Company",null,"ODOT D08",null,null,"Analysis Type Performed",null,"ECAT"]
[]
["Relative Severity Index Calculation",null,null,null,null,null,null,null,null,null,null,null,null,null,null,null,null,null,null,null,null,null,null,null,null,null,null,null,null,null,null,null,null,null,"All Sites"]
["ODOT District",8,null,null,null,null,null,null,null,null,null,null,null,null,null,null,null,null,null,null,null,null,null,null,null,null,"NLFID:",null,null,null,"FindTruck",0,null,null,"HSM Elements Only",null,null,null,null,null,null,null,null,null,null,null,null,null,null,null,null,null,"Crash Costs (2023)"]
["Urban Area","No",null,null,null,null,null,null,null,null,null,null,null,null,null,null,null,null,null,null,null,null,null,null,null,null,"Blog:",null,null,null,"FindVC",0,null,null,"Observed Elements Only",null,null,null,null,null,null,null,null,null,null,null,null,null,null,null,null,null,"KA","B","C","O"]
["Freeway","No",null,null,null,null,null,null,null,null,null,null,null,null,null,null,null,null,null,null,null,null,null,null,null,null,"Elog:",null,null,null,null,null,null,null,null,null,null,null,null,null,null,null,null,null,null,null,null,null,null,null,null,null,502809,72068,48848,11008]
[null,null,null,null,null,null,null,null,null,null,null,null,null,null,null,null,null,null,null,null,null,null,null,null,null,null,"WAADT:",null,null,null,null,null,null,null,null,null,null,null,null,null,null,null,null,null,null,null,null,null,null,null,null,null,{"$f":"ROUND(BA11/$BD$11,2)","v":45.68},{"$f":"ROUND(BB11/$BD$11,2)","v":6.55},{"$f":"ROUND(BC11/$BD$11,2)","v":4.4400000000000004},{"$f":"ROUND(BD11/$BD$11,2)","v":1}]
["Fill in the Number of Crashes by Crash Type",null,null,null,null,null,null,null,null,null,null,null,null,null,null,null,null,null,null,null,null,null,null,null,null,null,"WAADTT:"]
["Crash Type","Number of Crashes","Crash Type Severity Calc","RSI Multiplier",null,null,null,null,null,null,null,null,null,null,null,null,null,null,null,null,null,null,null,null,null,null,"WVCRatio:"]
["Unknown",7.1000000000000004E-3,{"$f":"IF(OR($B$9=\"\",$B$10=\"\",$B$11=\"\"),\"\",B15*D15)","v":158.42940000000002},{"$f":"IFERROR(ROUND(IF($B$9=\"STW\",SUMIFS(RSI_Data!$F:$F,RSI_Data!$C:$C,$B$10,RSI_Data!$D:$D,$B$11,RSI_Data!$E:$E,$A15)/SUMIFS(RSI_Data!$G:$G,RSI_Data!$C:$C,$B$10,RSI_Data!$D:$D,$B$11,RSI_Data!$E:$E,$A15),SUMIFS(RSI_Data!$F:$F,RSI_Data!$C:$C,$B$10,RSI_Data!$D:$D,$B$11,RSI_Data!$A:$A,$B$9,RSI_Data!$E:$E,$A15)/SUMIFS(RSI_Data!$G:$G,RSI_Data!$C:$C,$B$10,RSI_Data!$D:$D,$B$11,RSI_Data!$A:$A,$B$9,RSI_Data!$E:$E,$A15)),0),0)","v":22314},null,null,null,null,null,null,null,null,null,null,null,null,null,null,null,null,null,null,null,null,null,null,"TotalLength:"]
["Head On",2.0500000000000001E-2,{"$f":"IF(OR($B$9=\"\",$B$10=\"\",$B$11=\"\"),\"\",B16*D16)","v":2516.3135000000002},{"$f":"IFERROR(ROUND(IF($B$9=\"STW\",SUMIFS(RSI_Data!$F:$F,RSI_Data!$C:$C,$B$10,RSI_Data!$D:$D,$B$11,RSI_Data!$E:$E,$A16)/SUMIFS(RSI_Data!$G:$G,RSI_Data!$C:$C,$B$10,RSI_Data!$D:$D,$B$11,RSI_Data!$E:$E,$A16),SUMIFS(RSI_Data!$F:$F,RSI_Data!$C:$C,$B$10,RSI_Data!$D:$D,$B$11,RSI_Data!$A:$A,$B$9,RSI_Data!$E:$E,$A16)/SUMIFS(RSI_Data!$G:$G,RSI_Data!$C:$C,$B$10,RSI_Data!$D:$D,$B$11,RSI_Data!$A:$A,$B$9,RSI_Data!$E:$E,$A16)),0),0)","v":122747},null,null,null,null,null,null,null,null,null,null,null,null,null,null,null,null,null,null,null,null,null,null,"Functional Class:",null,{"$f":"IFERROR(VLOOKUP(AB16,RefTables!E27:F34,2,FALSE),\"Other\")","v":"Other"}]
["Rear End",0.39200000000000002,13663.944000000001,{"$f":"IFERROR(ROUND(IF($B$9=\"STW\",SUMIFS(RSI_Data!$F:$F,RSI_Data!$C:$C,$B$10,RSI_Data!$D:$D,$B$11,RSI_Data!$E:$E,$A17)/SUMIFS(RSI_Data!$G:$G,RSI_Data!$C:$C,$B$10,RSI_Data!$D:$D,$B$11,RSI_Data!$E:$E,$A17),SUMIFS(RSI_Data!$F:$F,RSI_Data!$C:$C,$B$10,RSI_Data!$D:$D,$B$11,RSI_Data!$A:$A,$B$9,RSI_Data!$E:$E,$A17)/SUMIFS(RSI_Data!$G:$G,RSI_Data!$C:$C,$B$10,RSI_Data!$D:$D,$B$11,RSI_Data!$A:$A,$B$9,RSI_Data!$E:$E,$A17)),0),0)","v":34857},null,null,null,null,null,null,null,null,null,null,null,null,null,null,null,null,null,null,null,null,null,null,"Truck %:",{"$f":"IFERROR(ROUND(AB13/AB12,4),\"\")","v":""}]
["Backing",5.7100000000000005E-2,969.21540000000005,{"$f":"IFERROR(ROUND(IF($B$9=\"STW\",SUMIFS(RSI_Data!$F:$F,RSI_Data!$C:$C,$B$10,RSI_Data!$D:$D,$B$11,RSI_Data!$E:$E,$A18)/SUMIFS(RSI_Data!$G:$G,RSI_Data!$C:$C,$B$10,RSI_Data!$D:$D,$B$11,RSI_Data!$E:$E,$A18),SUMIFS(RSI_Data!$F:$F,RSI_Data!$C:$C,$B$10,RSI_Data!$D:$D,$B$11,RSI_Data!$A:$A,$B$9,RSI_Data!$E:$E,$A18)/SUMIFS(RSI_Data!$G:$G,RSI_Data!$C:$C,$B$10,RSI_Data!$D:$D,$B$11,RSI_Data!$A:$A,$B$9,RSI_Data!$E:$E,$A18)),0),0)","v":16974}]
["Sideswipe - Meeting",5.7599999999999998E-2,3083.6736000000001,{"$f":"IFERROR(ROUND(IF($B$9=\"STW\",SUMIFS(RSI_Data!$F:$F,RSI_Data!$C:$C,$B$10,RSI_Data!$D:$D,$B$11,RSI_Data!$E:$E,$A19)/SUMIFS(RSI_Data!$G:$G,RSI_Data!$C:$C,$B$10,RSI_Data!$D:$D,$B$11,RSI_Data!$E:$E,$A19),SUMIFS(RSI_Data!$F:$F,RSI_Data!$C:$C,$B$10,RSI_Data!$D:$D,$B$11,RSI_Data!$A:$A,$B$9,RSI_Data!$E:$E,$A19)/SUMIFS(RSI_Data!$G:$G,RSI_Data!$C:$C,$B$10,RSI_Data!$D:$D,$B$11,RSI_Data!$A:$A,$B$9,RSI_Data!$E:$E,$A19)),0),0)","v":53536}]
["Sideswipe - Passing",7.6999999999999999E-2,2626.47,{"$f":"IFERROR(ROUND(IF($B$9=\"STW\",SUMIFS(RSI_Data!$F:$F,RSI_Data!$C:$C,$B$10,RSI_Data!$D:$D,$B$11,RSI_Data!$E:$E,$A20)/SUMIFS(RSI_Data!$G:$G,RSI_Data!$C:$C,$B$10,RSI_Data!$D:$D,$B$11,RSI_Data!$E:$E,$A20),SUMIFS(RSI_Data!$F:$F,RSI_Data!$C:$C,$B$10,RSI_Data!$D:$D,$B$11,RSI_Data!$A:$A,$B$9,RSI_Data!$E:$E,$A20)/SUMIFS(RSI_Data!$G:$G,RSI_Data!$C:$C,$B$10,RSI_Data!$D:$D,$B$11,RSI_Data!$A:$A,$B$9,RSI_Data!$E:$E,$A20)),0),0)","v":34110}]
["Angle",0.80519999999999992,53101.329599999997,{"$f":"IFERROR(ROUND(IF($B$9=\"STW\",SUMIFS(RSI_Data!$F:$F,RSI_Data!$C:$C,$B$10,RSI_Data!$D:$D,$B$11,RSI_Data!$E:$E,$A21)/SUMIFS(RSI_Data!$G:$G,RSI_Data!$C:$C,$B$10,RSI_Data!$D:$D,$B$11,RSI_Data!$E:$E,$A21),SUMIFS(RSI_Data!$F:$F,RSI_Data!$C:$C,$B$10,RSI_Data!$D:$D,$B$11,RSI_Data!$A:$A,$B$9,RSI_Data!$E:$E,$A21)/SUMIFS(RSI_Data!$G:$G,RSI_Data!$C:$C,$B$10,RSI_Data!$D:$D,$B$11,RSI_Data!$A:$A,$B$9,RSI_Data!$E:$E,$A21)),0),0)","v":65948}]
["Parked Vehicle",5.3800000000000001E-2,1823.4434000000001,{"$f":"IFERROR(ROUND(IF($B$9=\"STW\",SUMIFS(RSI_Data!$F:$F,RSI_Data!$C:$C,$B$10,RSI_Data!$D:$D,$B$11,RSI_Data!$E:$E,$A22)/SUMIFS(RSI_Data!$G:$G,RSI_Data!$C:$C,$B$10,RSI_Data!$D:$D,$B$11,RSI_Data!$E:$E,$A22),SUMIFS(RSI_Data!$F:$F,RSI_Data!$C:$C,$B$10,RSI_Data!$D:$D,$B$11,RSI_Data!$A:$A,$B$9,RSI_Data!$E:$E,$A22)/SUMIFS(RSI_Data!$G:$G,RSI_Data!$C:$C,$B$10,RSI_Data!$D:$D,$B$11,RSI_Data!$A:$A,$B$9,RSI_Data!$E:$E,$A22)),0),0)","v":33893}]
["Pedestrian",1.3100000000000001E-2,2412.3780999999999,{"$f":"IFERROR(ROUND(IF($B$9=\"STW\",SUMIFS(RSI_Data!$F:$F,RSI_Data!$C:$C,$B$10,RSI_Data!$D:$D,$B$11,RSI_Data!$E:$E,$A23)/SUMIFS(RSI_Data!$G:$G,RSI_Data!$C:$C,$B$10,RSI_Data!$D:$D,$B$11,RSI_Data!$E:$E,$A23),SUMIFS(RSI_Data!$F:$F,RSI_Data!$C:$C,$B$10,RSI_Data!$D:$D,$B$11,RSI_Data!$A:$A,$B$9,RSI_Data!$E:$E,$A23)/SUMIFS(RSI_Data!$G:$G,RSI_Data!$C:$C,$B$10,RSI_Data!$D:$D,$B$11,RSI_Data!$A:$A,$B$9,RSI_Data!$E:$E,$A23)),0),0)","v":184151}]
["Animal",0,0,{"$f":"IFERROR(ROUND(IF($B$9=\"STW\",SUMIFS(RSI_Data!$F:$F,RSI_Data!$C:$C,$B$10,RSI_Data!$D:$D,$B$11,RSI_Data!$E:$E,$A24)/SUMIFS(RSI_Data!$G:$G,RSI_Data!$C:$C,$B$10,RSI_Data!$D:$D,$B$11,RSI_Data!$E:$E,$A24),SUMIFS(RSI_Data!$F:$F,RSI_Data!$C:$C,$B$10,RSI_Data!$D:$D,$B$11,RSI_Data!$A:$A,$B$9,RSI_Data!$E:$E,$A24)/SUMIFS(RSI_Data!$G:$G,RSI_Data!$C:$C,$B$10,RSI_Data!$D:$D,$B$11,RSI_Data!$A:$A,$B$9,RSI_Data!$E:$E,$A24)),0),0)","v":16996}]
["Train",3.9999999999999996E-4,61.581199999999995,{"$f":"IFERROR(ROUND(IF($B$9=\"STW\",SUMIFS(RSI_Data!$F:$F,RSI_Data!$C:$C,$B$10,RSI_Data!$D:$D,$B$11,RSI_Data!$E:$E,$A25)/SUMIFS(RSI_Data!$G:$G,RSI_Data!$C:$C,$B$10,RSI_Data!$D:$D,$B$11,RSI_Data!$E:$E,$A25),SUMIFS(RSI_Data!$F:$F,RSI_Data!$C:$C,$B$10,RSI_Data!$D:$D,$B$11,RSI_Data!$A:$A,$B$9,RSI_Data!$E:$E,$A25)/SUMIFS(RSI_Data!$G:$G,RSI_Data!$C:$C,$B$10,RSI_Data!$D:$D,$B$11,RSI_Data!$A:$A,$B$9,RSI_Data!$E:$E,$A25)),0),0)","v":153953}]
["Pedalcycles",9.2999999999999992E-3,1774.5422999999998,{"$f":"IFERROR(ROUND(IF($B$9=\"STW\",SUMIFS(RSI_Data!$F:$F,RSI_Data!$C:$C,$B$10,RSI_Data!$D:$D,$B$11,RSI_Data!$E:$E,$A26)/SUMIFS(RSI_Data!$G:$G,RSI_Data!$C:$C,$B$10,RSI_Data!$D:$D,$B$11,RSI_Data!$E:$E,$A26),SUMIFS(RSI_Data!$F:$F,RSI_Data!$C:$C,$B$10,RSI_Data!$D:$D,$B$11,RSI_Data!$A:$A,$B$9,RSI_Data!$E:$E,$A26)/SUMIFS(RSI_Data!$G:$G,RSI_Data!$C:$C,$B$10,RSI_Data!$D:$D,$B$11,RSI_Data!$A:$A,$B$9,RSI_Data!$E:$E,$A26)),0),0)","v":190811}]
["Other Non-Vehicle",2.0000000000000001E-4,0,{"$f":"IFERROR(ROUND(IF($B$9=\"STW\",SUMIFS(RSI_Data!$F:$F,RSI_Data!$C:$C,$B$10,RSI_Data!$D:$D,$B$11,RSI_Data!$E:$E,$A27)/SUMIFS(RSI_Data!$G:$G,RSI_Data!$C:$C,$B$10,RSI_Data!$D:$D,$B$11,RSI_Data!$E:$E,$A27),SUMIFS(RSI_Data!$F:$F,RSI_Data!$C:$C,$B$10,RSI_Data!$D:$D,$B$11,RSI_Data!$A:$A,$B$9,RSI_Data!$E:$E,$A27)/SUMIFS(RSI_Data!$G:$G,RSI_Data!$C:$C,$B$10,RSI_Data!$D:$D,$B$11,RSI_Data!$A:$A,$B$9,RSI_Data!$E:$E,$A27)),0),0)","v":0}]
["Fixed Object",0.30099999999999999,16431.289000000001,{"$f":"IFERROR(ROUND(IF($B$9=\"STW\",SUMIFS(RSI_Data!$F:$F,RSI_Data!$C:$C,$B$10,RSI_Data!$D:$D,$B$11,RSI_Data!$E:$E,$A28)/SUMIFS(RSI_Data!$G:$G,RSI_Data!$C:$C,$B$10,RSI_Data!$D:$D,$B$11,RSI_Data!$E:$E,$A28),SUMIFS(RSI_Data!$F:$F,RSI_Data!$C:$C,$B$10,RSI_Data!$D:$D,$B$11,RSI_Data!$A:$A,$B$9,RSI_Data!$E:$E,$A28)/SUMIFS(RSI_Data!$G:$G,RSI_Data!$C:$C,$B$10,RSI_Data!$D:$D,$B$11,RSI_Data!$A:$A,$B$9,RSI_Data!$E:$E,$A28)),0),0)","v":54589}]
["Other Object",8.8999999999999999E-3,136.33019999999999,{"$f":"IFERROR(ROUND(IF($B$9=\"STW\",SUMIFS(RSI_Data!$F:$F,RSI_Data!$C:$C,$B$10,RSI_Data!$D:$D,$B$11,RSI_Data!$E:$E,$A29)/SUMIFS(RSI_Data!$G:$G,RSI_Data!$C:$C,$B$10,RSI_Data!$D:$D,$B$11,RSI_Data!$E:$E,$A29),SUMIFS(RSI_Data!$F:$F,RSI_Data!$C:$C,$B$10,RSI_Data!$D:$D,$B$11,RSI_Data!$A:$A,$B$9,RSI_Data!$E:$E,$A29)/SUMIFS(RSI_Data!$G:$G,RSI_Data!$C:$C,$B$10,RSI_Data!$D:$D,$B$11,RSI_Data!$A:$A,$B$9,RSI_Data!$E:$E,$A29)),0),0)","v":15318}]
["Overturning",2.3599999999999999E-2,2858.7624000000001,{"$f":"IFERROR(ROUND(IF($B$9=\"STW\",SUMIFS(RSI_Data!$F:$F,RSI_Data!$C:$C,$B$10,RSI_Data!$D:$D,$B$11,RSI_Data!$E:$E,$A30)/SUMIFS(RSI_Data!$G:$G,RSI_Data!$C:$C,$B$10,RSI_Data!$D:$D,$B$11,RSI_Data!$E:$E,$A30),SUMIFS(RSI_Data!$F:$F,RSI_Data!$C:$C,$B$10,RSI_Data!$D:$D,$B$11,RSI_Data!$A:$A,$B$9,RSI_Data!$E:$E,$A30)/SUMIFS(RSI_Data!$G:$G,RSI_Data!$C:$C,$B$10,RSI_Data!$D:$D,$B$11,RSI_Data!$A:$A,$B$9,RSI_Data!$E:$E,$A30)),0),0)","v":121134}]
["Other Non-Collision",2.1100000000000001E-2,725.41800000000001,{"$f":"IFERROR(ROUND(IF($B$9=\"STW\",SUMIFS(RSI_Data!$F:$F,RSI_Data!$C:$C,$B$10,RSI_Data!$D:$D,$B$11,RSI_Data!$E:$E,$A31)/SUMIFS(RSI_Data!$G:$G,RSI_Data!$C:$C,$B$10,RSI_Data!$D:$D,$B$11,RSI_Data!$E:$E,$A31),SUMIFS(RSI_Data!$F:$F,RSI_Data!$C:$C,$B$10,RSI_Data!$D:$D,$B$11,RSI_Data!$A:$A,$B$9,RSI_Data!$E:$E,$A31)/SUMIFS(RSI_Data!$G:$G,RSI_Data!$C:$C,$B$10,RSI_Data!$D:$D,$B$11,RSI_Data!$A:$A,$B$9,RSI_Data!$E:$E,$A31)),0),0)","v":34380}]
["Left Turn",7.569999999999999E-2,3216.0387999999994,{"$f":"IFERROR(ROUND(IF($B$9=\"STW\",SUMIFS(RSI_Data!$F:$F,RSI_Data!$C:$C,$B$10,RSI_Data!$D:$D,$B$11,RSI_Data!$E:$E,$A32)/SUMIFS(RSI_Data!$G:$G,RSI_Data!$C:$C,$B$10,RSI_Data!$D:$D,$B$11,RSI_Data!$E:$E,$A32),SUMIFS(RSI_Data!$F:$F,RSI_Data!$C:$C,$B$10,RSI_Data!$D:$D,$B$11,RSI_Data!$A:$A,$B$9,RSI_Data!$E:$E,$A32)/SUMIFS(RSI_Data!$G:$G,RSI_Data!$C:$C,$B$10,RSI_Data!$D:$D,$B$11,RSI_Data!$A:$A,$B$9,RSI_Data!$E:$E,$A32)),0),0)","v":42484}]
["Right Turn",0,0,{"$f":"IFERROR(ROUND(IF($B$9=\"STW\",SUMIFS(RSI_Data!$F:$F,RSI_Data!$C:$C,$B$10,RSI_Data!$D:$D,$B$11,RSI_Data!$E:$E,$A33)/SUMIFS(RSI_Data!$G:$G,RSI_Data!$C:$C,$B$10,RSI_Data!$D:$D,$B$11,RSI_Data!$E:$E,$A33),SUMIFS(RSI_Data!$F:$F,RSI_Data!$C:$C,$B$10,RSI_Data!$D:$D,$B$11,RSI_Data!$A:$A,$B$9,RSI_Data!$E:$E,$A33)/SUMIFS(RSI_Data!$G:$G,RSI_Data!$C:$C,$B$10,RSI_Data!$D:$D,$B$11,RSI_Data!$A:$A,$B$9,RSI_Data!$E:$E,$A33)),0),0)","v":38174}]
["Totals",{"$f":"SUM(B15:B33)","v":1.9236},{"$f":"SUM(C15:C33)","v":105559.15890000001}]
[]
["RSI Value = ",{"$f":"IFERROR(ROUND(C34/B34,2),0)","v":54875.839999999997}]
[]
[]
[]
["All Sites"]
["Crash Frequencies Per Year Summary Results",null,null,null,null,null,null,null,null,null,null,null,null,null,null,null,null,null,null,null,null,null,null,null,null,null,"Project EB Method Summary Results (Without Animal Crashes)"]
[null,null,null,"KA","B","C","O","Total",null,null,null,null,null,null,null,null,null,null,null,null,null,null,null,null,null,null,null,null,null,"KA","B","C","O","Total"]
["Existing Conditions: Predicted Crash Frequency",null,null,{"$f":"IF($AH$43+$AH$50=0,\"\",IF($A$40=$AI$10,AD50,IF($A$40=$AI$9,AD43,AD43+AD50)))","v":9.4299999999999995E-2},{"$f":"IF($AH$43+$AH$50=0,\"\",IF($A$40=$AI$10,AE50,IF($A$40=$AI$9,AE43,AE43+AE50)))","v":0.2288},0.15229999999999999,0.81850000000000001,{"$f":"ROUND(SUM(D43:G43),2)","v":1.29},null,null,null,null,null,null,null,null,null,null,null,null,null,null,null,null,null,null,"Existing Conditions: Predicted Crash Frequency",null,null,9.4299999999999995E-2,0.2288,0.15229999999999999,0.81850000000000001,1.2939000000000001]
["Existing Conditions: Expected Crash Frequency",null,null,{"$f":"IF($AH$44+$AH$50=0,\"\",IF($A$41=$AI$10,AD50,IF($A$41=$AI$9,AD44,AD44+AD50)))","v":0.2135},{"$f":"IF($AH$44+$AH$50=0,\"\",IF($A$41=$AI$10,AE50,IF($A$41=$AI$9,AE44,AE44+AE50)))","v":0.51729999999999998},0.34449999999999997,0.84830000000000005,1.92,null,null,null,null,null,null,null,null,null,null,null,null,null,null,null,null,null,null,"Existing Conditions: Expected Crash Frequency",null,null,0.2135,0.51729999999999998,0.34449999999999997,0.84830000000000005,1.9236]
["Potential for Safety Improvement",null,null,{"$f":"IF($AH$43+$AH$50=0,\"\",D44-D43)","v":0.1192},{"$f":"IF($AH$43+$AH$50=0,\"\",E44-E43)","v":0.28849999999999998},0.19219999999999998,2.9800000000000049E-2,0.63,null,null,null,null,null,null,null,null,null,null,null,null,null,null,null,null,null,null,"Potential for Safety Improvement",null,null,0.1192,0.28849999999999998,0.19219999999999998,2.9800000000000049E-2,0.62969999999999993]
[{"$f":"\"Proposed Conditions: \"&IF('Project Scoring'!$H$7=\"ECAT - Change in base SPF\",\"Predicted\",\"Expected\")&\" Crash Frequency\"","v":"Proposed Conditions: Expected Crash Frequency"},null,null,{"$f":"IF($AH$46+$AH$51=0,\"\",IF($A$43=$AI$10,AD51,IF($A$43=$AI$9,AD46,AD46+AD51)))","v":2.0999999999999999E-3},{"$f":"IF($AH$46+$AH$51=0,\"\",IF($A$43=$AI$10,AE51,IF($A$43=$AI$9,AE46,AE46+AE51)))","v":1.84E-2},2.3E-2,0.59279999999999999,0.64,null,null,null,null,null,null,null,null,null,null,null,null,null,null,null,null,null,null,{"$f":"\"Proposed Conditions: \"&IF('Project Scoring'!$H$7=\"ECAT - Change in base SPF\",\"Predicted\",\"Expected\")&\" Crash Frequency\"","v":"Proposed Conditions: Expected Crash Frequency"},null,null,2.0999999999999999E-3,1.84E-2,2.3E-2,0.59279999999999999,0.63629999999999998]
["Observed Crashes",null,null,0.66669999999999996,4.3333000000000004,1.3332999999999999,1,7.33]
["Equivalent Property Damage Only Factor",null,null,{"$f":"BA12","v":45.68},{"$f":"BB12","v":6.55},4.4400000000000004,1,null,null,null,null,null,null,null,null,null,null,null,null,null,null,null,null,null,null,null,"Project EB Method Summary Results (Without Animal Crashes)"]
["Equivalent Property Damage Only Value",null,null,{"$f":"IF($H$44=0,D48*D47,D44*D48)","v":9.7526799999999998},{"$f":"IF($H$44=0,E48*E47,E44*E48)","v":3.388315},1.5295799999999999,0.84830000000000005,{"$f":"ROUND(SUM(D49:G49),2)","v":15.52},null,null,null,null,null,null,null,null,null,null,null,null,null,null,null,null,null,null,null,null,null,"KA","B","C","O","Total"]
[null,null,null,null,null,null,null,null,null,null,null,null,null,null,null,null,null,null,null,null,null,null,null,null,null,null,"Existing Conditions Observed Crashes",null,null,0,0,0,0,0]
["People Injuries Per Year Summary Results ",null,null,null,null,null,null,null,null,null,null,null,null,null,null,null,null,null,null,null,null,null,null,null,null,null,"Proposed Conditions Observed Crashes",null,null,0,0,0,0,0]
[null,null,null,"K","A","B","C","Total"]
["Observed Totals",null,null,0,1,7.6666999999999996,4.6666999999999996,{"$f":"ROUND(SUM(D53:G53),2)","v":13.33}]
[]
[]
["Benefit - Cost Ratio Calculations"]
[]
[null,null,"Net Present Value of Project",2714862]
[null,null,"Net Present Value of Safety Benefits",961175.25]
[null,null,"Net Benefit",-1753686.75]
[null,null,"Benefit / Cost Ratio",0.35404202824516678]

{"sheet":"ScoringTable","index":5,"n_rows":26,"n_cols":36,"rows_kept":26,"cut":false,"hidden":false,"merged":[[25,9,26,9],[23,9,24,9],[2,6,2,7],[2,8,2,9],[2,0,2,1],[2,2,2,3],[2,4,2,5],[0,0,0,9],[0,26,0,35],[1,26,1,27],[1,28,1,29],[1,30,1,31],[1,32,1,33],[1,34,1,35],[1,0,1,9]]}
["ODOT Highway Safety Improvement Program (HSIP)",null,null,null,null,null,null,null,null,null,null,null,null,null,null,null,null,null,null,null,null,null,null,null,null,null,"Safety Criteria"]
["Formal Funding Application Scoring Criteria",null,null,null,null,null,null,null,null,null,null,null,null,null,null,null,null,null,null,null,null,null,null,null,null,null,"Ratio of Observed Fatal and Serious Injuries to Observed Total Crashes",null,"Percentage of the Potential for Safety Improvement to Total Expected Crashes",null,"Relative Severity Index",null,"Equivalent Property Damage Only Index",null,"Location Equity Measure"]
[{"$f":"AA2","v":"Ratio of Observed Fatal and Serious Injuries to Observed Total Crashes"},null,{"$f":"AC2","v":"Percentage of the Potential for Safety Improvement to Total Expected Crashes"},null,{"$f":"AE2","v":"Relative Severity Index"},null,{"$f":"AG2","v":"Equivalent Property Damage Only Index"},null,{"$f":"AI2","v":"Location Equity Measure"},null,null,null,null,null,null,null,null,null,null,null,null,null,null,null,null,null,"Value","Points","Value","Points","Value","Points","Value","Points","Value","Points"]
["Value","Points","Value","Points","Value","Points","Value","Points","Value","Points",null,null,null,null,null,null,null,null,null,null,null,null,null,null,null,null,0,0,0,0,0,0,0,0,0,0]
[{"$f":"\"< \"&TEXT(AA5,\"#0.00\")","v":"< 0.01"},{"$f":"IF(AB4=\"\",\"\",AB4)","v":0},{"$f":"\"< \"&AC5*100&\"%\"","v":"< 2.5%"},{"$f":"IF(AD4=\"\",\"\",AD4)","v":0},{"$f":"\"< \"&TEXT(AE5,\"00,000\")","v":"< 20,000"},{"$f":"IF(AF4=\"\",\"\",AF4)","v":0},{"$f":"\"< \"&TEXT(AG5,\"#0.00\")","v":"< 1.00"},{"$f":"IF(AH4=\"\",\"\",AH4)","v":0},{"$f":"\"< \"&AI5*100&\"%\"","v":"< 10%"},{"$f":"IF(AJ4=\"\",\"\",AJ4)","v":0},null,null,null,null,null,null,null,null,null,null,null,null,null,null,null,null,0.01,2,2.5000000000000001E-2,2,20000,2,1,2,0.1,2]
[{"$f":"TEXT(AA5,\"#0.00\")&\"-\"&TEXT(AA6-0.001,\"#0.000\")","v":"0.01-0.019"},{"$f":"IF(AB5=\"\",\"\",AB5)","v":2},{"$f":"AC5*100&\"%\"&\"-\"&(AC6-0.0001)*100&\"%\"","v":"2.5%-4.99%"},2,{"$f":"TEXT(AE5,\"00,000\")&\"-\"&TEXT(AE6-0.01,\"00,000.00\")","v":"20,000-22,499.99"},2,{"$f":"TEXT(AG5,\"#0.00\")&\"-\"&TEXT(AG6-0.001,\"#0.000\")","v":"1.00-1.499"},2,{"$f":"AI5*100&\"%\"&\"-\"&(AI6-0.0001)*100&\"%\"","v":"10%-14.99%"},2,null,null,null,null,null,null,null,null,null,null,null,null,null,null,null,null,{"$f":"AA5+0.01","v":0.02},4,{"$f":"AC5+0.025","v":0.05},4,{"$f":"AE5+2500","v":22500},4,{"$f":"AG5+0.5","v":1.5},4,{"$f":"AI5+0.05","v":0.15000000000000002},4]
[{"$f":"TEXT(AA6,\"#0.00\")&\"-\"&TEXT(AA7-0.001,\"#0.000\")","v":"0.02-0.029"},4,{"$f":"AC6*100&\"%\"&\"-\"&(AC7-0.0001)*100&\"%\"","v":"5%-7.49%"},4,{"$f":"TEXT(AE6,\"00,000\")&\"-\"&TEXT(AE7-0.01,\"00,000.00\")","v":"22,500-24,999.99"},4,{"$f":"TEXT(AG6,\"#0.00\")&\"-\"&TEXT(AG7-0.001,\"#0.000\")","v":"1.50-1.999"},4,{"$f":"AI6*100&\"%\"&\"-\"&(AI7-0.0001)*100&\"%\"","v":"15%-19.99%"},4,null,null,null,null,null,null,null,null,null,null,null,null,null,null,null,null,{"$f":"AA6+0.01","v":0.03},6,{"$f":"AC6+0.025","v":7.5000000000000011E-2},6,{"$f":"AE6+2500","v":25000},6,{"$f":"AG6+0.5","v":2},6,{"$f":"AI6+0.05","v":0.2},6]
["0.03-0.039",6,"7.5%-9.99%",6,"25,000-27,499.99",6,"2.00-2.499",6,"20%-24.99%",6,null,null,null,null,null,null,null,null,null,null,null,null,null,null,null,null,0.04,8,0.1,8,27500,8,2.5,8,0.25,8]
["0.04-0.049",8,"10%-12.49%",8,"27,500-29,999.99",8,"2.50-2.999",8,"25%-29.99%",8,null,null,null,null,null,null,null,null,null,null,null,null,null,null,null,null,0.05,10,0.125,10,30000,10,3,10,0.3,10]
["0.05-0.059",10,"12.5%-14.99%",10,"30,000-32,499.99",10,"3.00-3.499",10,{"$f":"\"≥ \"&AI9*100&\"%\"","v":"≥ 30%"},10,null,null,null,null,null,null,null,null,null,null,null,null,null,null,null,null,6.0000000000000005E-2,12,0.15,12,32500,12,3.5,12]
["0.06-0.069",12,"15%-17.49%",12,"32,500-34,999.99",12,"3.50-3.999",12,null,"",null,null,null,null,null,null,null,null,null,null,null,null,null,null,null,null,7.0000000000000007E-2,14,0.17499999999999999,14,35000,14,4,14]
["0.07-0.079",14,"17.5%-19.99%",14,"35,000-37,499.99",14,"4.00-4.499",14,null,"",null,null,null,null,null,null,null,null,null,null,null,null,null,null,null,null,0.08,16,0.19999999999999998,16,37500,16,4.5,16]
["0.08-0.089",16,"20%-22.49%",16,"37,500-39,999.99",16,"4.50-4.999",16,null,"",null,null,null,null,null,null,null,null,null,null,null,null,null,null,null,null,0.09,18,0.22499999999999998,18,40000,18,5,18]
["0.09-0.099",18,"22.5%-24.99%",18,"40,000-42,499.99",18,"5.00-5.499",18,null,"",null,null,null,null,null,null,null,null,null,null,null,null,null,null,null,null,9.9999999999999992E-2,20,0.24999999999999997,20,42500,20,5.5,20]
["0.10-0.109",20,{"$f":"\"≥ \"&AC14*100&\"%\"","v":"≥ 25%"},20,{"$f":"\"≥ \"&TEXT(AE14,\"00,000\")","v":"≥ 42,500"},20,{"$f":"\"≥ \"&TEXT(AG14,\"#0.00\")","v":"≥ 5.50"},20,null,"",null,null,null,null,null,null,null,null,null,null,null,null,null,null,null,null,0.10999999999999999,22]
["0.11-0.119",22,null,"",null,"",null,"",null,"",null,null,null,null,null,null,null,null,null,null,null,null,null,null,null,null,0.11999999999999998,24]
["0.12-0.129",24,null,"",null,"",null,"",null,"",null,null,null,null,null,null,null,null,null,null,null,null,null,null,null,null,0.12999999999999998,26]
["0.13-0.139",26,null,"",null,"",null,"",null,"",null,null,null,null,null,null,null,null,null,null,null,null,null,null,null,null,0.13999999999999999,28]
["0.14-0.149",28,null,"",null,"",null,"",null,"",null,null,null,null,null,null,null,null,null,null,null,null,null,null,null,null,0.15,30]
[{"$f":"\"≥ \"&TEXT(AA19,\"#0.00\")","v":"≥ 0.15"},30,null,"",null,"",null,"",null,""]
[]
[]
[]
[null,null,null,null,null,null,null,null,null,"Total Points"]
[]
[null,null,null,null,null,null,null,null,null,{"$f":"SUM(MAX(AB4:AB1000),MAX(AD4:AD1000),MAX(AF4:AF1000),MAX(AH4:AH1000),MAX(AJ4:AJ1000),MAX(AL4:AL1000),MAX(AN4:AN1000),MAX(AP4:AP1000),MAX(AR4:AR1000))","v":100}]

{"sheet":"RefTables","index":6,"n_rows":93,"n_cols":19,"rows_kept":93,"cut":false,"hidden":true,"merged":[]}
["County Code","District Number",null,"Ohio SHSP Emphasis Area",null,"FHWA SHSP Emphasis Area",null,"Improvement Type","Access management","Advanced technology and ITS","Alignment","Interchange design","Intersection geometry",null,null,null,null,null,"MPH"]
[{"$f":"LEFT(C2,3)","v":"ADA"},9,"ADA - Adams","Serious Crash Types",null,"Creating more effective processes and safety management systems",null,"Access management",null,null,"Alignment - other","Acceleration / deceleration / merge lane",null,null,null,null,null,null,5]
[{"$f":"LEFT(C3,3)","v":"ALL"},1,"ALL - Allen","High Risk Drivers and Behaviors",null,"Curbing aggressive driving",null,"Advanced technology and ITS","Access management - other","AdvancedtechnologyandITS","Horizontal curve realignment","Convert at-grade intersection to interchange","Auxiliary lanes - add acceleration lane",null,null,null,null,null,{"$f":"S2+5","v":10}]
["ASD",3,"ASD - Ashland","Special Vehicles and Roadway Users",null,"Designing safer work zones",null,"Alignment","Change in access - close or restrict existing access","Advanced technology and ITS - other","Horizontal and vertical alignment","Extend existing lane on ramp","Auxiliary lanes - add auxiliary through lane",null,null,null,null,null,{"$f":"S3+5","v":15}]
["ATB",4,"ATB - Ashtabula","Data",null,"Enhancing emergency medical capabilities to increase survivability",null,"Animal-related","Change in access - miscellaneous/unspecified","Congestion detection / traffic monitoring system","Vertical alignment or elevation change","Improve intersection radius at ramp terminus","Auxiliary lanes - add left-turn lane",null,null,null,null,null,20]
["ATH",10,"ATH - Athens",null,null,"Ensuring drivers are licensed and fully competent",null,"Interchange design","Grassed median - extend existing","Dynamic message signs",null,"Installation of new lane on ramp","Auxiliary lanes - add right-turn lane",null,null,null,null,null,25]
["AUG",7,"AUG - Auglaize",null,null,"Ensuring safer bicycle travel",null,"Intersection geometry","Median crossover - close crossover","Over height vehicle detection","Roadside","Interchange design - other","Auxiliary lanes - add right-turn lane (free-flow)",null,null,null,null,null,30]
["BEL",11,"BEL - Belmont","Data",null,"Improving information and decision support systems",null,"Intersection traffic control","Median crossover - directional crossover",null,null,"Ramp closure","Auxiliary lanes - add slip lane",null,null,null,null,null,35]
["BRO",9,"BRO - Brown","Timely Data",null,"Improving motorcycle safety and increasing motorcycle awareness",null,"Lighting","Median crossover - relocate existing",null,"Barrier end treatments (crash cushions, terminals)","Ramp metering","Auxiliary lanes - add two-way left-turn lane",null,null,null,null,null,40]
["BUT",8,"BUT - Butler","Reliable Data",null,"Improving the design and operation of highway intersections",null,"Miscellaneous","Median crossover - unspecified",null,"Barrier transitions",null,"Auxiliary lanes - extend acceleration/deceleration lane",null,null,null,null,null,45]
["CAR",11,"CAR - Carroll","Comprehensive Data",null,"Increasing driver safety awareness",null,"Non-infrastructure ","Raised island - install new",null,"Barrier - cable",null,"Auxiliary lanes - extend existing left-turn lane",null,null,null,null,null,50]
["CHP",7,"CHP - Champaign","Integrated Data and Analysis Systems",null,"Increasing safety enhancements in vehicles",null,"Parking","Raised island - modify existing",null,"Barrier - concrete",null,"Auxiliary lanes - extend existing right-turn lane",null,null,null,null,null,{"$f":"S11+5","v":55}]
["CLA",7,"CLA - Clark",null,null,"Increasing seat belt use and improving airbag effectiveness",null,"Pedestrians and bicyclists","Raised island - remove existing",null,"Barrier- metal",null,"Auxiliary lanes - miscellaneous/other/unspecified",null,null,null,null,null,60]
["CLE",8,"CLE - Clermont","SeriousCrashTypes",null,"Instituting graduated licensing for younger drivers",null,"Railroad grade crossings","Raised island - unspecified",null,"Barrier - other",null,"Auxiliary lanes - modify acceleration lane",null,null,null,null,null,65]
["CLI",8,"CLI - Clinton","Roadway Departure",null,"Keeping drivers alert",null,"Roadside",null,null,"Barrier - removal",null,"Auxiliary lanes - modify auxiliary through lane",null,null,null,null,null,70]
["COL",11,"COL - Columbiana","Intersection",null,"Keeping vehicles in the roadway",null,"Roadway",null,null,"Curb or curb and gutter",null,"Auxiliary lanes - modify free-flow turn  lane"]
["COS",5,"COS - Coshocton","Highway Railroad Crossing",null,"Making truck travel safer",null,"Roadway delineation",null,null,"Drainage improvements",null,"Auxiliary lanes - modify left-turn lane offset"]
["CRA",3,"CRA - Crawford",null,null,"Making walking and street crossing easier",null,"Roadway signs and traffic control",null,null,"Fencing",null,"Auxiliary lanes - modify right-turn lane offset"]
["CUY",12,"CUY - Cuyahoga",null,null,"Minimizing the consequences of leaving the road",null,"Shoulder treatments",null,null,"Removal of roadside objects (trees, poles, etc.)",null,"Auxiliary lanes - modify turn lane storage"]
["DAR",7,"DAR - Darke","HighRiskDriversandBehaviors",null,"Reducing head-on and across-median crashes",null,"Speed management",null,null,"Roadside grading",null,"Auxiliary lanes - modify turn lane taper"]
["DEF",1,"DEF - Defiance","Impaired Drivers",null,"Reducing impaired driving",null,"Work Zone",null,null,"Roadside - other",null,"Auxiliary lanes - modify two-way left-turn lane"]
["DEL",6,"DEL - Delaware","Seat Belt",null,"Reducing vehicle-train crashes",null,null,null,null,null,null,"Intersection geometrics - miscellaneous/other/unspecified"]
["ERI",3,"ERI - Erie","Speed",null,"Sustaining proficiency in older drivers",null,null,null,null,null,null,"Intersection geometrics - modify intersection corner radius"]
["FAI",5,"FAI - Fairfield","Young Drivers",null,"Other",null,"Animal-related","Intersection traffic control","Lighting","Roadway",null,"Intersection geometrics - modify skew angle"]
["FAY",6,"FAY - Fayette","Older Drivers",null,null,null,null,null,null,null,null,"Intersection geometrics - realignment to align offset cross streets"]
["FRA",6,"FRA - Franklin","Distracted Drivers",null,"Functional Class",null,null,"Intersection flashers - add \"when flashing\" warning sign-mounted","Continuous roadway lighting","Install / remove / modify passing zone",null,"Intersection geometrics - realignment to increase cross street offset"]
["FUL",2,"FUL - Fulton",null,1,"1 - Interstates",null,null,"Intersection flashers - add advance emergency vehicle warning sign-mounted","Intersection lighting","Pavement surface - high friction surface",null,"Intersection geometrics - re-assign existing lane use"]
["GAL",10,"GAL - Gallia","SpecialVehiclesandRoadwayUsers",2,"2 - Other Freeways or Expressways",null,null,"Intersection flashers - add advance heavy vehicle warning sign-mounted","Lighting - other","Pavement surface - miscellaneous",null,"Intersection geometry - other"]
["GEA",12,"GEA - Geauga","Bicycle Riders",3,"3 - Other Principal Arterial Roadway",null,null,"Intersection flashers - add advance intersection warning sign-mounted","Site lighting - horizontal curve ","Roadway narrowing (road diet, roadway reconfiguration)",null,"Splitter island - install on one or more approaches"]
["GRE",8,"GRE - Greene","Pedestrians",4,"4 - Minor Arterial Roadway",null,null,"Intersection flashers - add miscellaneous/other/unspecified","Site lighting - intersection","Roadway - other",null,"Splitter island - remove from one or more approaches"]
["GUE",5,"GUE - Guernsey","Commercial Vehicles",5,"5 - Major Collector Roadway",null,null,"Intersection flashers - add overhead (actuated)","Site lighting - interchange","Roadway - restripe to revise separation between opposing lanes and/or shoulder widths ",null,"Splitter island - unspecified"]
["HAM",8,"HAM - Hamilton","Motorcycles",6,"6 - Minor Collector Roadway",null,null,"Intersection flashers - add overhead (continuous)","Site lighting - pedestrian crosswalk","Roadway widening - add lane(s) along segment",null,"Through lanes - add additional through lane"]
["HAN",1,"HAN - Hancock",null,7,"7 - Local Roadway",null,null,"Intersection flashers - add stop sign-mounted",null,"Roadway widening - curve "]
["HAR",1,"HAR - Hardin",null,99,"99 - Other Roadway",null,null,"Intersection flashers - modify existing",null,"Roadway widening - travel lanes"]
["HAS",11,"HAS - Harrison",null,null,null,null,null,"Intersection flashers - remove existing","Parking","Rumble strips - center"]
["HEN",2,"HEN - Henry",null,null,null,null,null,"Intersection signing - add basic advance warning",null,"Rumble strips - edge or shoulder"]
["HIG",9,"HIG - Highland",null,null,null,null,null,"Intersection signing - add enhanced advance warning (double-up and/or oversize)","Modify parking","Rumble strips - transverse"]
["HOC",10,"HOC - Hocking",null,null,null,null,null,"Intersection signing - add enhanced regulatory sign (double-up and/or oversize)","Parking - other","Rumble strips - unspecified or other"]
["HOL",11,"HOL - Holmes",null,null,null,null,null,"Intersection signing - miscellaneous/other/unspecified","Remove parking","Superelevation / cross slope"]
["HUR",3,"HUR - Huron",null,null,null,null,null,"Intersection signing - relocate existing regulatory sign","Restrict parking"]
["JAC",9,"JAC - Jackson",null,null,null,null,null,"Intersection traffic control - other","Truck parking facilities"]
["JEF",11,"JEF - Jefferson",null,null,null,null,null,"Modify control - all-way stop to roundabout"]
["KNO",5,"KNO - Knox",null,null,null,null,null,"Modify control - modifications to roundabout","Pedestrians and bicyclists","Roadway delineation"]
["LAK",12,"LAK - Lake",null,null,null,null,null,"Modify control - no control to roundabout"]
["LAW",9,"LAW - Lawrence",null,null,null,null,null,"Modify control - no control to two-way stop","Crosswalk","Improve retroreflectivity"]
["LIC",5,"LIC - Licking",null,null,null,null,null,"Modify control - remove right-turn yield","Install new \"smart\" crosswalk","Longitudinal pavement markings - new"]
["LOG",7,"LOG - Logan",null,null,null,null,null,"Modify control - reverse priority of stop condition","Install new crosswalk","Longitudinal pavement markings - remarking"]
["LOR",3,"LOR - Lorain",null,null,null,null,null,"Modify control - traffic signal to roundabout","Install sidewalk","Delineators post-mounted or on barrier "]
["LUC",2,"LUC - Lucas",null,null,null,null,null,"Modify control - two-way stop to all-way stop","Medians and pedestrian refuge areas","Raised pavement markers"]
["MAD",6,"MAD - Madison",null,null,null,null,null,"Modify control - two-way stop to signal operation","Miscellaneous pedestrians and bicyclists","Roadway delineation - other"]
["MAH",4,"MAH - Mahoning",null,null,null,null,null,"Modify control - two-way stop to roundabout","Modify existing crosswalk"]
["MAR",6,"MAR - Marion",null,null,null,null,null,"Modify control - two-way yield to two-way stop","Pedestrian beacons"]
["MED",3,"MED - Medina",null,null,null,null,null,"Pavement Markings - add advance signal ahead","Pedestrian bridge","Roadway signs and traffic control"]
["MEG",10,"MEG - Meigs",null,null,null,null,null,"Pavement markings - add advance stop ahead","Pedestrian signal"]
["MER",7,"MER - Mercer",null,null,null,null,null,"Pavement markings - add dashed edge line along mainline","Pedestrian signal - audible device","Curve-related warning signs and flashers"]
["MIA",7,"MIA - Miami",null,null,null,null,null,"Pavement markings - add lane use symbols","Pedestrian signal - Pedestrian Hybrid Beacon","Sign sheeting - upgrade or replacement"]
["MOE",10,"MOE - Monroe",null,null,null,null,null,"Pavement markings - add stop line","Pedestrian signal - install new at intersection","Roadway signs and traffic control - other"]
["MOT",7,"MOT - Montgomery",null,null,null,null,null,"Pavement markings - add yield line","Pedestrian signal - install new at non-intersection location","Roadway signs (including post) - new or updated"]
["MRG",10,"MRG - Morgan",null,null,null,null,null,"Pavement markings - miscellaneous/other/unspecified","Pedestrian signal - modify existing"]
["MRW",6,"MRW - Morrow",null,null,null,null,null,"Pavement markings - refresh existing pavement markings","Pedestrian signal - remove existing"]
["MUS",5,"MUS - Muskingum",null,null,null,null,null,"Modify traffic signal - add additional signal heads","Pedestrian warning signs - add/modify flashers"]
["NOB",10,"NOB - Noble",null,null,null,null,null,"Modify traffic signal - add backplates","Pedestrian warning signs - overhead"]
["OTT",2,"OTT - Ottawa",null,null,null,null,null,"Modify traffic signal - add backplates with retroreflective borders"]
["PAU",1,"PAU - Paulding",null,null,null,null,null,"Modify traffic signal - add closed loop system","Railroad grade crossings"]
["PER",5,"PER - Perry",null,null,null,null,null,"Modify traffic signal - add emergency vehicle preemption"]
["PIC",6,"PIC - Pickaway",null,null,null,null,null,"Modify traffic signal - add flashing yellow arrow","Grade separation"]
[{"$f":"LEFT(C67,3)","v":"PIK"},9,"PIK - Pike",null,null,null,null,null,"Modify traffic signal - add long vehicle detection","Model enforcement activity"]
["POR",4,"POR - Portage",null,null,null,null,null,"Modify traffic signal - add railroad preemption","Protective devices"]
["PRE",8,"PRE - Preble",null,null,null,null,null,"Modify traffic signal - add wireless system","Railroad grade crossing gates"]
["PUT",1,"PUT - Putnam",null,null,null,null,null,"Modify traffic signal - miscellaneous/other/unspecified","Railroad grade crossing signing"]
["RIC",3,"RIC - Richland",null,null,null,null,null,"Modify traffic signal - modernization/replacement","Railroad grade crossings - other","Speed management"]
["ROS",9,"ROS - Ross",null,null,null,null,null,"Modify traffic signal - modify signal mounting (spanwire to mast arm)","Surface treatment"]
["SAN",2,"SAN - Sandusky",null,null,null,null,null,"Modify traffic signal - remove existing signal","Upgrade railroad crossing signal","Modify speed limit"]
["SCI",9,"SCI - Scioto",null,null,null,null,null,"Modify traffic signal - replace existing indications (incandescent-to-LED and/or 8-to-12 inch dia.)","Widen crossing for additional lane","Radar speed signs"]
["SEN",2,"SEN - Seneca",null,null,null,null,null,"Modify traffic signal timing - left-turn phasing (permissive to protected/permissive)",null,"Speed detection system / truck warning"]
["SHE",7,"SHE - Shelby",null,null,null,null,null,"Modify traffic signal timing - left-turn phasing (permissive to protected-only)",null,"Speed management - other"]
["STA",4,"STA - Stark",null,null,null,null,null,"Modify traffic signal timing - adjust clearance interval (yellow change and/or all-red)",null,"Traffic calming feature"]
["SUM",4,"SUM - Summit",null,null,null,null,null,"Modify traffic signal timing - general retiming"]
["TRU",4,"TRU - Trumbull",null,null,null,null,null,"Modify traffic signal timing - signal coordination"]
["TUS",11,"TUS - Tuscarawas",null,null,null,null,null,"Systemic improvements - signal-controlled"]
["UNI",6,"UNI - Union",null,null,null,null,null,"Systemic improvements - stop-controlled","Miscellaneous"]
["VAN",1,"VAN - Van Wert"]
["VIN",10,"VIN - Vinton"]
["WAR",8,"WAR - Warren"]
["WAS",10,"WAS - Washington",null,null,null,null,"Non-infrastructure ","Shoulder treatments","Work Zone"]
["WAY",3,"WAY - Wayne",null,null,null,null,"Educational efforts","Widen shoulder – paved or other"]
["WIL",2,"WIL - Williams",null,null,null,null,"Enforcement","Pave existing shoulders"]
["WOO",2,"WOO - Wood",null,null,null,null,"Data/traffic records","Shoulder grading"]
["WYA",1,"WYA - Wyandot",null,null,null,null,"Non-infrastructure - other","Shoulder treatments - other"]
[null,null,null,null,null,null,null,"Outreach"]
[null,null,null,null,null,null,null,"Road safety audits"]
[null,null,null,null,null,null,null,"Training and workforce development"]
[null,null,null,null,null,null,null,"Transportation safety planning"]

{"sheet":"RSI_Data","index":7,"n_rows":6928,"n_cols":10,"rows_kept":6928,"cut":false,"hidden":true,"merged":[]}
[null,null,null,null,{"$f":"F1/G1","v":36160.358166038335},{"$f":"SUBTOTAL(9,F3:F86584)","v":48101774045},{"$f":"SUBTOTAL(9,G3:G86584)","v":1330235}]
["DISTRICT_NBR","NLF_COUNTY_CD","URBAN_AREA","FREEWAY_IND","CRASH_TYPE_CD","CRASH_COST_NBR","Crash_Count",null,null,"Select "]
[3,"LOR","Yes","No","Left Turn",45052452,1075,null,null,"--CRASH_YR,"]
[7,"DAR","Yes","No","Unknown",11008,1,null,null,"DISTRICT_NBR,"]
[3,"MED","Yes","No","Backing",220160,20,null,null,"NLF_COUNTY_CD,"]
[5,"MUS","No","Yes","Left Turn",83076,2]
[9,"PIK","Yes","No","Overturning",525288,11,null,null,"--CASE WHEN ODOT_MAINTAINED_HWY_IND = 'Y' THEN 'Yes'"]
[12,"CUY","No","No","Fixed Object",5018074,71,null,null,"--ELSE 'No' END AS ODOT_MAINTAINED_HWY_IND,"]
[7,"SHE","Yes","No","Animal",11008,1]
[9,"LAW","Yes","Yes","Sideswipe - Passing",11008,1,null,null,"CASE WHEN AREA_CODE = 'CLEVE' THEN 'Yes'"]
[12,"CUY","Yes","No","Right Turn",2339372,129,null,null,"WHEN AREA_CODE = 'YOUNG' THEN 'Yes'"]
[10,"VIN","No","No","Sideswipe - Passing",1729050,31,null,null,"WHEN AREA_CODE = 99999 THEN 'No'"]
[7,"LOG","Yes","No","Backing",2554769,166,null,null,"ELSE 'Yes' END AS URBAN_AREA,"]
[11,"BEL","No","No","Sideswipe - Passing",2963269,136]
[9,"ROS","Yes","Yes","Fixed Object",7108443,137,null,null,"--CASE WHEN FUNCTIONAL_CLASS_CD = 1 THEN 'Interstate Route'"]
[5,"LIC","Yes","Yes","Rear End",7211431,241,null,null,"--WHEN FUNCTIONAL_CLASS_CD = 2 THEN 'Other Freeways or Expressways'"]
[11,"BEL","Yes","Yes","Other Object",506196,37,null,null,"--WHEN FUNCTIONAL_CLASS_CD = 3 THEN 'Other Principal Arterial Roads'"]
[3,"LOR","Yes","Yes","Parked Vehicle",1231626,8,null,null,"--WHEN FUNCTIONAL_CLASS_CD = 4 THEN 'Minor Arterial Roads'"]
[3,"MED","No","No","Overturning",7945660,66,null,null,"--WHEN FUNCTIONAL_CLASS_CD = 5 THEN 'Major Collector Roads'"]
[11,"COL","Yes","No","Sideswipe - Passing",2792301,135,null,null,"--WHEN FUNCTIONAL_CLASS_CD = 6 THEN 'Minor Collector Roads'"]
[1,"DEF","Yes","No","Head On",1221253,24,null,null,"--WHEN FUNCTIONAL_CLASS_CD = 7 THEN 'Local Roads' END AS FUNCTIONAL_CLASS_CD,"]
[1,"DEF","Yes","No","Train",11008,1]
[8,"PRE","No","Yes","Animal",1045416,77,null,null,"CASE WHEN FREEWAY_IND = 'N' THEN 'No'"]
[7,"DAR","Yes","No","Unknown",22016,2,null,null,"WHEN FREEWAY_IND = 'Y' THEN 'Yes' END AS FREEWAY_IND,"]
[7,"MOT","Yes","No","Sideswipe - Passing",141977034,6122]
[3,"WAY","Yes","No","Parked Vehicle",81872,4,null,null,"CASE WHEN CRASH_TYPE_CD = 0 THEN 'Unknown'"]
[2,"SAN","Yes","No","Right Turn",695965,13,null,null,"WHEN CRASH_TYPE_CD = 1 THEN 'Head On'"]
[10,"NOB","No","No","Head On",3049878,9,null,null,"WHEN CRASH_TYPE_CD = 2 THEN 'Rear End'"]
[6,"UNI","No","No","Other Object",601881,10,null,null,"WHEN CRASH_TYPE_CD = 3 THEN 'Backing'"]
[3,"HUR","Yes","No","Overturning",105092,4,null,null,"WHEN CRASH_TYPE_CD = 4 THEN 'Sideswipe - Meeting'"]
[2,"OTT","No","No","Other Non-Collision",2278246,83,null,null,"WHEN CRASH_TYPE_CD = 5 THEN 'Sideswipe - Passing'"]
[10,"MEG","No","No","Sideswipe - Meeting",22016,2,null,null,"WHEN CRASH_TYPE_CD = 6 THEN 'Angle'"]
[7,"CLA","Yes","No","Animal",6024697,412,null,null,"WHEN CRASH_TYPE_CD = 7 THEN 'Parked Vehicle'"]
[6,"FRA","Yes","Yes","Parked Vehicle",11985715,223,null,null,"WHEN CRASH_TYPE_CD = 8 THEN 'Pedestrian'"]
[6,"FRA","Yes","No","Other Non-Collision",70864,3,null,null,"WHEN CRASH_TYPE_CD = 9 THEN 'Animal'"]
[10,"WAS","Yes","No","Sideswipe - Passing",1235476,57,null,null,"WHEN CRASH_TYPE_CD = 10 THEN 'Train'"]
[2,"WIL","Yes","No","Fixed Object",70864,3,null,null,"WHEN CRASH_TYPE_CD = 11 THEN 'Pedalcycles'"]
[6,"DEL","Yes","Yes","Other Non-Collision",460960,35,null,null,"WHEN CRASH_TYPE_CD = 12 THEN 'Other Non-Vehicle'"]
[6,"MAD","Yes","No","Animal",235984,18,null,null,"WHEN CRASH_TYPE_CD = 13 THEN 'Fixed Object'"]
[7,"MIA","No","No","Fixed Object",44899837,825,null,null,"WHEN CRASH_TYPE_CD = 14 THEN 'Other Object'"]
[6,"UNI","No","Yes","Angle",1098498,7,null,null,"WHEN CRASH_TYPE_CD = 15 THEN 'Falling From Or In Vehicle'"]
[6,"MAR","No","No","Right Turn",450984,23,null,null,"WHEN CRASH_TYPE_CD = 16 THEN 'Overturning'"]
[3,"RIC","Yes","No","Sideswipe - Passing",571040,45,null,null,"WHEN CRASH_TYPE_CD = 17 THEN 'Other Non-Collision'"]
[8,"BUT","Yes","No","Backing",588240,50,null,null,"WHEN CRASH_TYPE_CD = 18 THEN 'Left Turn'"]
[3,"HUR","No","No","Overturning",6609868,65,null,null,"WHEN CRASH_TYPE_CD = 19 THEN 'Right Turn' END AS CRASH_TYPE_CD,"]
[3,"ERI","No","Yes","Pedestrian",502809,1]
[1,"DEF","No","No","Pedalcycles",767861,5,null,null,"sum(CASE WHEN CRASH_SEVERITY_CD = '1' THEN 502809"]
[8,"CLI","No","Yes","Sideswipe - Passing",4286743,160,null,null,"WHEN CRASH_SEVERITY_CD = '2' THEN 502809"]
[1,"HAN","Yes","No","Angle",724636,32,null,null,"WHEN CRASH_SEVERITY_CD = '3' THEN 72068"]
[10,"ATH","No","Yes","Other Non-Collision",70864,3,null,null,"WHEN CRASH_SEVERITY_CD = '4' THEN 48848"]
[3,"HUR","Yes","No","Right Turn",83076,2,null,null,"ELSE 11008 END ) AS CRASH_COST_NBR -- 2023 VALUES"]
[7,"DAR","No","No","Other Non-Collision",2087895,39]
[10,"WAS","No","No","Overturning",12975880,85,null,null,",count(DOCUMENT_NBR) as Crash_Count"]
[5,"KNO","Yes","No","Angle",81872,4]
[7,"AUG","Yes","No","Head On",281048,11,null,null,"From warehouse.dbo.oh1_cr_crash_details"]
[8,"BUT","Yes","Yes","Left Turn",689204,28,null,null,"where CRASH_YR BETWEEN 2019 AND 2023"]
[2,"FUL","No","Yes","Animal",1431728,101,null,null,"Group by  --CRASH_YR,"]
[2,"HEN","Yes","No","Rear End",142932,4,null,null,"DISTRICT_NBR,"]
[10,"WAS","Yes","No","Right Turn",1493820,95,null,null,"NLF_COUNTY_CD,"]
[10,"MRG","No","No","Angle",4684738,69,null,null,"AREA_CODE,"]
[3,"MED","Yes","No","Angle",36730443,1095,null,null,"--ODOT_MAINTAINED_HWY_IND,"]
[10,"ATH","No","Yes","Angle",83076,2,null,null,"--FUNCTIONAL_CLASS_CD,"]
[11,"TUS","No","Yes","Other Object",275200,25,null,null,"FREEWAY_IND,"]
[6,"MRW","Yes","No","Fixed Object",11008,1,null,null,"CRASH_TYPE_CD"]
[8,"GRE","Yes","No","Left Turn",66048,6]
[4,"MAH","Yes","No","Sideswipe - Passing",149124,8]
[4,"SUM","Yes","No","Backing",2823552,229]
[5,"GUE","Yes","No","Pedestrian",2923233,11]
[4,"ATB","No","No","Left Turn",8742774,153]
[4,"POR","Yes","No","Sideswipe - Meeting",562665,3]
[3,"HUR","Yes","No","Backing",66048,6]
[8,"BUT","Yes","No","Left Turn",22693483,448]
[11,"CAR","Yes","No","Left Turn",574877,2]
[7,"MIA","Yes","Yes","Head On",83076,2]
[7,"MOT","Yes","No","Animal",771420,50]
[6,"MAD","No","No","Sideswipe - Meeting",141728,6]
[4,"STA","Yes","No","Rear End",189760471,8065]
[3,"ERI","Yes","No","Animal",368080,30]
[8,"BUT","Yes","No","Animal",171140,10]
[1,"HAR","Yes","No","Parked Vehicle",22016,2]
[1,"ALL","Yes","No","Sideswipe - Passing",22989005,969]
[8,"CLE","No","No","Fixed Object",89152013,1650]
[8,"CLI","Yes","No","Animal",2153837,142]
[3,"WAY","Yes","No","Overturning",1099702,5]
[1,"ALL","Yes","Yes","Right Turn",81872,4]
[1,"WYA","Yes","No","Other Object",33024,3]
[3,"HUR","Yes","No","Rear End",1997886,48]
[1,"PAU","No","Yes","Parked Vehicle",11008,1]
[3,"LOR","Yes","No","Overturning",5461887,45]
[7,"CHP","No","No","Rear End",10029162,189]
[1,"DEF","No","No","Animal",24053327,1823]
[10,"GAL","Yes","No","Parked Vehicle",33024,3]
[7,"CLA","Yes","No","Pedalcycles",12166686,76]
[2,"WIL","No","Yes","Other Object",165120,15]
[1,"PUT","No","No","Rear End",2899854,89]
[2,"OTT","Yes","No","Backing",1172868,101]
[11,"COL","Yes","Yes","Right Turn",22016,2]
[7,"MER","Yes","No","Animal",2446065,163]
[1,"ALL","Yes","Yes","Rear End",5627708,128]
[5,"MUS","No","Yes","Fixed Object",7941161,242]
[6,"FRA","No","No","Other Object",48848,1]
[6,"UNI","Yes","Yes","Animal",749404,48]
[3,"ERI","Yes","No","Pedalcycles",611513,4]
[6,"DEL","No","Yes","Angle",188168,6]
[1,"VAN","Yes","No","Right Turn",83076,2]
[8,"BUT","Yes","No","Rear End",1681472,74]
[2,"SAN","No","No","Animal",15402772,1204]
[3,"MED","Yes","Yes","Backing",22016,2]
[9,"JAC","Yes","Yes","Right Turn",11008,1]
[12,"CUY","Yes","Yes","Angle",12984995,346]
[11,"COL","Yes","No","Fixed Object",7063167,208]
[7,"LOG","Yes","No","Overturning",1580495,4]
[3,"RIC","Yes","No","Animal",357072,29]
[11,"JEF","No","No","Animal",3854335,149]
[9,"SCI","No","Yes","Head On",502809,1]
[7,"LOG","Yes","No","Left Turn",689032,19]
[6,"DEL","No","Yes","Right Turn",292056,12]
[7,"MOT","No","No","Pedalcycles",1243838,7]
[3,"WAY","Yes","No","Pedestrian",72068,1]
[0,"UNI","No","No","Sideswipe - Passing",11008,1]
[3,"ASD","No","Yes","Fixed Object",5405153,254]
[8,"GRE","No","Yes","Unknown",77056,7]
[6,"PIC","Yes","No","Parked Vehicle",132096,12]
[2,"OTT","Yes","No","Sideswipe - Passing",44032,4]
[10,"MOE","Yes","No","Sideswipe - Passing",66048,6]
[3,"RIC","Yes","No","Head On",59856,2]
[9,"HIG","Yes","No","Pedestrian",1489282,10]
[7,"AUG","No","No","Head On",5475753,33]
[4,"SUM","No","Yes","Other Object",121088,11]
[7,"AUG","Yes","No","Fixed Object",2054937,77]
[3,"LOR","No","No","Angle",34713519,498]
[11,"CAR","Yes","No","Backing",33024,3]
[8,"PRE","No","No","Sideswipe - Passing",5810650,138]
[5,"LIC","Yes","Yes","Animal",902140,55]
[9,"ROS","No","No","Parked Vehicle",2206866,53]
[9,"ROS","Yes","Yes","Left Turn",33024,3]
[5,"PER","No","No","Pedestrian",3624755,11]
[4,"SUM","Yes","No","Left Turn",10931778,359]
[7,"AUG","Yes","No","Left Turn",1074709,26]
[11,"BEL","Yes","No","Unknown",22016,2]
[8,"WAR","Yes","Yes","Sideswipe - Passing",59856,2]
[2,"OTT","No","Yes","Fixed Object",3655503,90]
[11,"COL","Yes","No","Pedestrian",216204,3]
[3,"WAY","Yes","Yes","Rear End",1698897,37]
[7,"LOG","No","Yes","Backing",83076,2]
[2,"WOO","Yes","No","Fixed Object",1032053,29]
[1,"DEF","Yes","Yes","Backing",33024,3]
[9,"ROS","No","Yes","Overturning",668961,5]
[4,"SUM","Yes","Yes","Sideswipe - Passing",400932,24]
[5,"LIC","No","Yes","Fixed Object",13916137,381]
[6,"FRA","No","No","Pedestrian",1652563,5]
[3,"ERI","Yes","No","Backing",471968,36]
[6,"FRA","Yes","No","Rear End",674437484,22479]
[9,"HIG","Yes","No","Other Non-Collision",33024,3]
[7,"AUG","Yes","No","Other Non-Collision",121088,11]
[7,"LOG","Yes","Yes","Overturning",72068,1]
[1,"VAN","No","No","Angle",11302743,131]
[4,"STA","Yes","No","Angle",16806306,472]
[3,"RIC","Yes","No","Rear End",652568,31]
[3,"CRA","No","Yes","Overturning",119712,4]
[8,"BUT","Yes","No","Parked Vehicle",14668743,514]
[2,"SAN","No","No","Backing",1008780,75]
[3,"CRA","Yes","Yes","Sideswipe - Passing",121088,11]
[4,"POR","No","Yes","Unknown",215172,14]
[5,"LIC","Yes","No","Sideswipe - Passing",655320,45]
[1,"DEF","Yes","Yes","Fixed Object",1967442,45]
[7,"MOT","No","No","Unknown",208980,10]
[4,"ATB","Yes","No","Backing",573448,41]
[8,"CLI","Yes","Yes","Rear End",99072,9]
[8,"BUT","Yes","No","Unknown",2070351,16]
[3,"WAY","Yes","No","Left Turn",83076,2]
[9,"ADA","No","No","Other Non-Collision",2670168,48]
[3,"MED","No","Yes","Angle",44032,4]
[5,"GUE","Yes","Yes","Sideswipe - Passing",4678440,157]
[5,"FAI","Yes","No","Angle",210184,8]
[4,"POR","Yes","Yes","Other Non-Collision",70864,3]
[5,"PER","No","No","Pedalcycles",657953,4]
[8,"PRE","No","Yes","Unknown",77056,7]
[9,"HIG","No","No","Fixed Object",67737377,1047]
[6,"MRW","No","Yes","Pedestrian",502809,1]
[2,"SEN","Yes","No","Other Object",259032,9]
[3,"MED","Yes","No","Other Object",204164,13]
[9,"LAW","Yes","Yes","Right Turn",312868,16]
[7,"SHE","Yes","No","Unknown",11008,1]
[3,"CRA","Yes","Yes","Other Object",33024,3]
[2,"OTT","No","No","Head On",6166267,32]
[2,"OTT","No","No","Train",22016,2]
[5,"FAI","No","No","Overturning",12082578,85]
[4,"SUM","Yes","No","Backing",34787503,2570]
[6,"DEL","No","No","Overturning",7226938,56]
[3,"LOR","Yes","No","Sideswipe - Passing",7008471,361]
[8,"PRE","No","Yes","Backing",66048,6]
[7,"MIA","No","No","Overturning",6884539,51]
[3,"CRA","Yes","No","Overturning",1402594,9]
[12,"LAK","Yes","No","Unknown",468012,19]
[8,"PRE","Yes","No","Sideswipe - Passing",673949,11]
[12,"GEA","No","Yes","Rear End",2078951,16]
[10,"NOB","No","Yes","Rear End",787469,11]
[2,"WOO","Yes","Yes","Head On",916985,13]
[9,"LAW","Yes","Yes","Parked Vehicle",94084,3]
[4,"MAH","Yes","Yes","Fixed Object",34189911,760]
[1,"WYA","Yes","No","Head On",872953,9]
[3,"MED","Yes","No","Animal",94084,3]
[12,"GEA","Yes","Yes","Animal",473172,34]
[8,"WAR","Yes","No","Angle",57912892,1610]
[6,"MAD","Yes","No","Other Non-Collision",22016,2]
[10,"NOB","Yes","Yes","Rear End",535833,4]
[10,"WAS","Yes","No","Rear End",13899413,571]
[6,"FAY","Yes","No","Left Turn",11008,1]
[9,"JAC","Yes","Yes","Rear End",320092,9]
[4,"POR","No","No","Rear End",23224976,475]
[3,"RIC","No","No","Angle",18393668,274]
[4,"STA","Yes","No","Overturning",607901,5]
[7,"AUG","Yes","Yes","Right Turn",120916,2]
[5,"PER","No","No","Sideswipe - Meeting",44032,4]
[11,"TUS","Yes","No","Pedalcycles",5091002,47]
[1,"DEF","Yes","No","Parked Vehicle",11008,1]
[4,"POR","Yes","No","Pedalcycles",83076,2]
[4,"STA","Yes","No","Right Turn",24497868,1130]
[7,"CLA","No","No","Overturning",2847275,29]
[8,"CLE","Yes","No","Parked Vehicle",215172,14]
[8,"WAR","No","Yes","Other Non-Collision",306848,21]
[6,"MAD","Yes","No","Backing",1141273,59]
[7,"CLA","Yes","Yes","Rear End",1606017,32]
[8,"BUT","Yes","No","Pedestrian",4570993,36]
[4,"POR","Yes","No","Other Object",11008,1]
[1,"WYA","Yes","No","Pedestrian",313900,5]
[1,"DEF","Yes","No","Parked Vehicle",3528911,116]
[3,"RIC","Yes","No","Unknown",457176,27]
[2,"FUL","Yes","No","Sideswipe - Passing",22016,2]
[6,"UNI","Yes","Yes","Rear End",1592204,68]
[1,"HAN","Yes","Yes","Pedestrian",1508427,3]
[8,"CLE","Yes","No","Other Non-Collision",6376781,300]
[4,"ATB","No","No","Parked Vehicle",6336388,75]
[3,"CRA","Yes","No","Pedestrian",2303583,15]
[11,"BEL","Yes","No","Right Turn",1469052,79]
[8,"CLE","Yes","No","Other Object",578436,47]
[12,"CUY","Yes","Yes","Other Object",11008,1]
[9,"HIG","Yes","No","Head On",105092,4]
[6,"MAR","No","No","Rear End",8320659,202]
[4,"ATB","Yes","No","Head On",1347726,13]
[1,"HAN","Yes","Yes","Overturning",592540,15]
[8,"BUT","No","Yes","Fixed Object",66048,6]
[3,"RIC","No","No","Pedestrian",2061751,11]
[7,"AUG","No","No","Other Non-Collision",1522822,40]
[4,"SUM","Yes","No","Other Non-Collision",2032114,44]
[1,"HAR","Yes","No","Right Turn",163744,8]
[4,"ATB","Yes","Yes","Pedestrian",72068,1]
[4,"MAH","Yes","Yes","Parked Vehicle",325080,15]
[11,"COL","Yes","No","Backing",880468,71]
[4,"TRU","Yes","No","Unknown",1831734,39]
[2,"OTT","No","Yes","Animal",374100,25]
[4,"ATB","No","Yes","Angle",956029,11]
[10,"GAL","Yes","No","Overturning",618909,6]
[10,"HOC","Yes","No","Left Turn",22016,2]
[7,"CLA","Yes","No","Backing",44032,4]
[7,"DAR","Yes","No","Fixed Object",4391782,145]
[7,"MOT","No","No","Backing",1043233,39]
[2,"FUL","No","No","Parked Vehicle",2316774,54]
[9,"JAC","No","No","Fixed Object",42903114,867]
[6,"FRA","Yes","Yes","Parked Vehicle",72068,1]
[3,"HUR","Yes","No","Animal",44032,4]
[11,"TUS","Yes","Yes","Head On",1132726,8]
[6,"PIC","No","No","Pedalcycles",458036,7]
[1,"DEF","Yes","No","Left Turn",4362767,108]
[10,"ATH","No","No","Other Object",656921,15]
[4,"POR","Yes","No","Right Turn",1748036,107]
[8,"CLI","Yes","No","Backing",555216,47]
[3,"WAY","Yes","Yes","Sideswipe - Passing",33024,3]
[7,"LOG","Yes","No","Rear End",1929033,74]
[6,"UNI","Yes","Yes","Overturning",313900,5]
[4,"POR","No","Yes","Overturning",1480854,14]
[2,"HEN","Yes","Yes","Rear End",1501666,18]
[6,"UNI","Yes","No","Pedalcycles",285864,8]
[11,"JEF","No","No","Rear End",2968429,86]
[10,"HOC","No","No","Animal",5717836,239]
[7,"AUG","Yes","No","Fixed Object",2960054,109]
[2,"WIL","No","No","Pedalcycles",1281678,7]
[7,"DAR","Yes","No","Left Turn",105092,4]
[10,"MEG","Yes","No","Overturning",596893,4]
[9,"ROS","Yes","Yes","Rear End",7039431,181]
[3,"HUR","Yes","No","Fixed Object",1308113,34]
[1,"VAN","Yes","No","Fixed Object",1905006,38]
[8,"WAR","Yes","No","Unknown",103888,6]
[2,"LUC","Yes","No","Other Object",116100,5]
[4,"SUM","Yes","No","Rear End",276513040,12179]
[5,"GUE","Yes","No","Sideswipe - Passing",22016,2]
[2,"FUL","Yes","No","Other Object",44032,4]
[10,"MOE","Yes","No","Other Non-Collision",70864,3]
[7,"MOT","Yes","No","Pedestrian",2866248,18]
[10,"HOC","Yes","No","Angle",22016,2]
[1,"HAN","Yes","Yes","Other Object",374272,34]
[8,"WAR","Yes","Yes","Pedestrian",551657,2]
[3,"CRA","No","No","Backing",1308854,24]
[12,"CUY","Yes","Yes","Other Non-Collision",16017832,392]
[4,"TRU","No","No","Angle",22118368,361]
[10,"GAL","No","No","Pedestrian",2022244,5]
[9,"JAC","Yes","No","Unknown",154112,14]
[1,"HAN","No","Yes","Rear End",2541406,53]
[9,"JAC","No","No","Rear End",6569223,102]
[4,"POR","No","No","Right Turn",1930237,67]
[3,"WAY","No","Yes","Animal",1108712,64]
[11,"COL","Yes","Yes","Parked Vehicle",70864,3]
[8,"WAR","No","No","Sideswipe - Meeting",11008,1]
[8,"GRE","Yes","Yes","Rear End",142932,4]
[11,"COL","Yes","No","Angle",5111483,130]
[11,"COL","Yes","No","Sideswipe - Passing",243208,11]
[8,"HAM","No","Yes","Animal",88064,8]
[2,"LUC","Yes","No","Pedestrian",1979879,12]
[12,"GEA","Yes","No","Unknown",22016,2]
[3,"ERI","Yes","Yes","Pedestrian",574877,2]
[8,"WAR","Yes","Yes","Backing",88064,8]
[3,"HUR","Yes","No","Parked Vehicle",127108,6]
[4,"STA","Yes","No","Pedalcycles",17738666,148]
[9,"SCI","No","No","Angle",13032322,211]
[4,"ATB","Yes","No","Other Non-Collision",2666847,48]
[9,"LAW","Yes","No","Sideswipe - Passing",4392073,214]
[4,"MAH","Yes","Yes","Fixed Object",611513,4]
[11,"JEF","No","Yes","Angle",551657,2]
[2,"HEN","No","Yes","Other Non-Collision",77056,7]
[0,"MOT","Yes","No","Other Object",11008,1]
[4,"MAH","Yes","No","Angle",2352206,58]
[7,"MOT","Yes","No","Fixed Object",5852036,96]
[6,"UNI","No","No","Overturning",8166971,65]
[2,"SAN","Yes","No","Rear End",337292,14]
[6,"MAD","Yes","No","Rear End",276060,5]
[4,"SUM","Yes","No","Pedalcycles",29406737,235]
[11,"TUS","Yes","No","Other Object",567084,28]
[11,"COL","Yes","Yes","Unknown",22016,2]
[11,"COL","Yes","No","Right Turn",1329097,47]
[10,"HOC","Yes","No","Parked Vehicle",44032,4]
[8,"HAM","No","Yes","Parked Vehicle",81872,4]
[7,"DAR","Yes","Yes","Right Turn",535833,4]
[5,"MUS","No","Yes","Parked Vehicle",249228,6]
[1,"HAN","No","No","Other Non-Collision",2169436,112]
[8,"BUT","Yes","No","Backing",14000906,988]
[7,"AUG","Yes","No","Other Object",11008,1]
[1,"PUT","No","No","Animal",10159008,851]
[8,"HAM","Yes","No","Other Non-Collision",32352805,820]
[11,"JEF","Yes","Yes","Parked Vehicle",546841,5]
[4,"STA","Yes","Yes","Left Turn",11008,1]
[4,"ATB","Yes","No","Rear End",3179526,93]
[2,"SAN","Yes","Yes","Backing",116100,5]
[7,"MIA","Yes","Yes","Parked Vehicle",1530046,33]
[2,"SAN","Yes","No","Left Turn",1499893,39]
[2,"SAN","Yes","Yes","Unknown",193156,12]
[5,"MUS","No","Yes","Overturning",684044,13]
[8,"GRE","Yes","No","Right Turn",8984063,430]
[10,"GAL","No","No","Sideswipe - Passing",4615078,64]
[0,"CUY","Yes","No","Pedalcycles",72068,1]
[9,"SCI","Yes","No","Other Non-Collision",1610542,30]
[6,"FAY","Yes","No","Overturning",11008,1]
[1,"HAN","No","Yes","Fixed Object",5561435,149]
[3,"ASD","Yes","No","Other Object",11008,1]
[3,"MED","No","No","Left Turn",17779787,291]
[4,"SUM","Yes","No","Unknown",158928,11]
[5,"MUS","Yes","No","Angle",42145969,1218]
[10,"MOE","No","No","Overturning",6250441,64]
[11,"BEL","No","Yes","Head On",116100,5]
[1,"WYA","No","Yes","Fixed Object",942785,23]
[4,"MAH","Yes","Yes","Rear End",22016,2]
[2,"LUC","No","Yes","Head On",513817,2]
[10,"HOC","No","No","Rear End",5396712,111]
[1,"VAN","Yes","No","Head On",1909187,18]
[6,"MAD","No","No","Pedestrian",5569202,19]
[7,"CHP","Yes","No","Sideswipe - Passing",11008,1]
[1,"PUT","Yes","No","Left Turn",22016,2]
[7,"LOG","Yes","No","Fixed Object",6876058,101]
[3,"LOR","Yes","No","Rear End",977820,55]
[4,"STA","No","No","Backing",2290233,124]
[1,"ALL","Yes","No","Pedestrian",600505,3]
[2,"WOO","Yes","No","Animal",1966304,153]
[4,"ATB","Yes","Yes","Other Non-Collision",105092,4]
[2,"HEN","Yes","Yes","Fixed Object",2047303,25]
[5,"FAI","Yes","No","Angle",2239718,47]
[10,"WAS","Yes","No","Other Non-Collision",268836,12]
[6,"PIC","Yes","No","Pedalcycles",120916,2]
[5,"LIC","No","No","Unknown",226180,15]
[3,"HUR","No","No","Pedestrian",3137770,8]
[5,"GUE","Yes","No","Unknown",304268,11]
[7,"LOG","No","No","Head On",6861491,55]
[4,"POR","No","Yes","Parked Vehicle",500004,33]
[7,"MOT","Yes","No","Backing",341248,31]
[3,"LOR","Yes","No","Pedestrian",1580495,4]
[5,"LIC","Yes","Yes","Animal",1349684,88]
[7,"MOT","Yes","No","Sideswipe - Passing",1488422,30]
[5,"COS","Yes","No","Backing",33024,3]
[6,"MAR","Yes","No","Fixed Object",138116,7]
[10,"WAS","Yes","Yes","Angle",502809,1]
[10,"ATH","Yes","No","Angle",13699973,315]
[2,"WIL","No","Yes","Overturning",249228,6]
[8,"GRE","Yes","No","Backing",110080,10]
[5,"FAI","Yes","Yes","Sideswipe - Passing",193156,12]
[11,"CAR","No","No","Pedalcycles",551657,2]
[1,"ALL","Yes","No","Head On",11196407,207]
[1,"ALL","Yes","No","Train",141728,6]
[5,"KNO","Yes","No","Sideswipe - Passing",70864,3]
[7,"DAR","Yes","No","Parked Vehicle",55040,5]
[7,"AUG","Yes","No","Unknown",33024,3]
[3,"LOR","Yes","No","Unknown",3423409,53]
[0,"CUY","Yes","No","Fixed Object",551657,2]
[4,"POR","Yes","Yes","Other Non-Collision",612889,11]
[5,"LIC","No","No","Animal",16229405,689]
[9,"ROS","No","No","Right Turn",1378408,56]
[3,"ASD","No","No","Other Non-Vehicle",72068,1]
[5,"GUE","No","Yes","Unknown",198144,18]
[1,"HAR","Yes","No","Animal",903688,71]
[9,"BRO","No","No","Pedestrian",5437278,16]
[5,"FAI","Yes","No","Overturning",4652111,33]
[11,"TUS","No","No","Left Turn",8329233,153]
[7,"MIA","Yes","No","Sideswipe - Passing",3161757,172]
[5,"GUE","Yes","No","Other Object",77056,7]
[6,"UNI","Yes","No","Left Turn",579124,18]
[10,"WAS","Yes","No","Parked Vehicle",11008,1]
[10,"MEG","No","No","Other Object",219988,11]
[0,"CUY","No","No","Sideswipe - Passing",48848,1]
[7,"MER","No","No","Sideswipe - Passing",4526617,84]
[2,"OTT","Yes","No","Backing",77056,7]
[3,"ASD","Yes","Yes","Rear End",2119662,30]
[2,"FUL","Yes","No","Angle",160132,9]
[2,"SAN","Yes","No","Right Turn",11008,1]
[5,"LIC","Yes","No","Head On",10859896,105]
[5,"LIC","Yes","No","Train",11008,1]
[9,"BRO","Yes","No","Angle",48848,1]
[7,"MOT","Yes","No","Sideswipe - Meeting",215172,14]
[6,"MAD","No","No","Pedalcycles",1845547,8]
[7,"MOT","Yes","Yes","Head On",7193795,68]
[6,"DEL","Yes","No","Pedestrian",15536034,94]
[4,"ATB","Yes","No","Rear End",2031148,96]
[8,"CLI","Yes","No","Animal",33024,3]
[7,"AUG","Yes","No","Sideswipe - Passing",81872,4]
[6,"PIC","Yes","No","Pedestrian",48848,1]
[7,"MER","Yes","No","Parked Vehicle",2802502,105]
[12,"CUY","Yes","Yes","Overturning",21908396,254]
[4,"POR","Yes","No","Angle",463024,13]
[8,"WAR","Yes","No","Fixed Object",17296705,356]
[8,"WAR","Yes","No","Rear End",17127655,503]
[4,"ATB","Yes","No","Right Turn",264020,15]
[4,"POR","Yes","No","Other Object",319060,20]
[12,"GEA","Yes","No","Parked Vehicle",196768,11]
[12,"CUY","Yes","No","Right Turn",132598853,5287]
[1,"DEF","Yes","Yes","Rear End",419164,18]
[11,"CAR","No","No","Unknown",55040,5]
[12,"LAK","Yes","No","Left Turn",47696039,1251]
[10,"GAL","Yes","No","Pedestrian",1917615,9]
[9,"PIK","Yes","No","Parked Vehicle",11008,1]
[3,"ASD","Yes","No","Right Turn",896292,69]
[4,"SUM","Yes","Yes","Animal",4016716,237]
[7,"SHE","Yes","No","Parked Vehicle",198144,18]
[4,"STA","Yes","No","Angle",2691562,55]
[7,"SHE","Yes","No","Other Non-Collision",452188,21]
[10,"NOB","Yes","No","Head On",1049650,6]
[9,"LAW","Yes","Yes","Backing",81872,4]
[0,"MUS","No","No","Rear End",11008,1]
[6,"PIC","Yes","No","Rear End",13581610,428]
[7,"CHP","No","No","Animal",6714510,218]
[5,"FAI","No","No","Left Turn",10922755,178]
[3,"RIC","Yes","No","Angle",574877,2]
[4,"ATB","Yes","No","Pedalcycles",72068,1]
[1,"DEF","Yes","No","Backing",11008,1]
[6,"UNI","Yes","No","Parked Vehicle",77056,7]
[4,"STA","No","Yes","Parked Vehicle",22016,2]
[8,"BUT","No","No","Other Non-Collision",1899621,60]
[11,"TUS","No","No","Fixed Object",70967046,1438]
[6,"MAR","Yes","No","Head On",7192313,88]
[6,"MAR","Yes","No","Train",155144,3]
[11,"TUS","Yes","No","Animal",99072,9]
[3,"WAY","Yes","Yes","Right Turn",22016,2]
[11,"TUS","No","No","Parked Vehicle",3312191,81]
[10,"ATH","Yes","Yes","Animal",368080,30]
[3,"MED","No","Yes","Pedestrian",1005618,2]
[4,"ATB","Yes","No","Fixed Object",8896079,146]
[4,"MAH","Yes","No","Parked Vehicle",16586887,632]
[8,"HAM","No","No","Other Non-Collision",351912,14]
[4,"SUM","No","No","Head On",1170566,8]
[4,"SUM","Yes","No","Right Turn",41902231,1977]
[4,"SUM","No","Yes","Head On",94084,3]
[4,"SUM","Yes","Yes","Pedestrian",7236385,24]
[11,"BEL","No","Yes","Left Turn",22016,2]
[5,"GUE","Yes","Yes","Other Non-Collision",358276,27]
[6,"PIC","Yes","No","Right Turn",275028,16]
[10,"MOE","No","No","Sideswipe - Passing",2045530,46]
[2,"OTT","Yes","No","Right Turn",11008,1]
[3,"WAY","No","No","Other Object",938604,43]
[8,"GRE","Yes","Yes","Pedestrian",502809,1]
[1,"WYA","No","No","Sideswipe - Passing",5938724,97]
[3,"MED","No","No","Right Turn",2833409,111]
[7,"SHE","Yes","Yes","Parked Vehicle",215000,5]
[9,"ROS","No","Yes","Left Turn",22016,2]
[9,"JAC","No","No","Head On",4148733,51]
[7,"CLA","No","Yes","Other Object",385280,35]
[3,"RIC","Yes","No","Unknown",22016,2]
[2,"WOO","Yes","No","Other Non-Collision",1316144,58]
[5,"MUS","No","No","Sideswipe - Passing",4586817,104]
[4,"TRU","Yes","No","Other Object",11008,1]
[9,"ROS","Yes","No","Sideswipe - Passing",9107506,478]
[2,"LUC","No","No","Head On",3614210,18]
[6,"DEL","No","Yes","Overturning",321296,7]
[8,"HAM","Yes","No","Other Object",3362600,190]
[4,"MAH","Yes","No","Left Turn",191780,5]
[4,"ATB","No","No","Right Turn",2355990,61]
[3,"ERI","Yes","No","Left Turn",584681,5]
[11,"COL","No","No","Pedalcycles",741029,6]
[9,"HIG","Yes","No","Backing",44032,4]
[6,"DEL","Yes","Yes","Sideswipe - Meeting",502809,1]
[7,"AUG","Yes","Yes","Fixed Object",4620648,138]
[3,"ERI","Yes","No","Pedalcycles",3156187,28]
[11,"BEL","Yes","Yes","Overturning",274856,7]
[3,"MED","Yes","Yes","Left Turn",11008,1]
[8,"PRE","Yes","No","Other Object",138116,7]
[9,"PIK","Yes","No","Fixed Object",59856,2]
[9,"ROS","No","Yes","Parked Vehicle",535833,4]
[7,"MOT","No","No","Overturning",4004703,22]
[8,"CLE","No","No","Pedalcycles",850937,7]
[6,"FAY","Yes","Yes","Rear End",254216,12]
[4,"MAH","No","Yes","Pedestrian",719013,4]
[12,"LAK","No","Yes","Parked Vehicle",629917,7]
[7,"SHE","Yes","No","Sideswipe - Passing",92880,5]
[7,"CHP","Yes","No","Pedalcycles",968241,10]
[12,"GEA","No","No","Unknown",259204,18]
[11,"COL","Yes","Yes","Rear End",1786445,83]
[3,"MED","No","Yes","Other Object",402308,31]
[1,"HAR","Yes","No","Overturning",574877,2]
[1,"PUT","No","No","Backing",511184,43]
[6,"MAR","No","No","Left Turn",5564346,90]
[2,"SAN","Yes","No","Sideswipe - Passing",4431911,151]
[8,"GRE","No","Yes","Rear End",4834259,44]
[3,"MED","Yes","Yes","Animal",865901,25]
[12,"LAK","Yes","No","Rear End",3255272,134]
[8,"PRE","Yes","No","Pedestrian",312696,7]
[6,"MAD","Yes","No","Parked Vehicle",1699413,64]
[9,"ROS","Yes","No","Right Turn",105092,4]
[10,"GAL","Yes","No","Other Non-Collision",153940,5]
[9,"ROS","Yes","No","Other Non-Collision",864525,18]
[5,"FAI","Yes","Yes","Other Object",22016,2]
[4,"TRU","No","No","Sideswipe - Passing",7659491,231]
[6,"DEL","No","Yes","Pedestrian",83076,2]
[6,"FRA","Yes","No","Other Non-Collision",645344,33]
[6,"FAY","No","No","Right Turn",1590934,24]
[9,"LAW","Yes","Yes","Unknown",99072,9]
[4,"ATB","No","Yes","Other Object",711961,20]
[3,"WAY","Yes","No","Animal",11008,1]
[3,"RIC","No","Yes","Other Non-Collision",363264,33]
[11,"TUS","Yes","No","Fixed Object",695965,13]
[4,"ATB","No","No","Unknown",711961,20]
[6,"MAR","Yes","No","Rear End",44032,4]
[6,"FRA","Yes","Yes","Head On",22016,2]
[6,"FAY","Yes","No","Head On",1433673,24]
[6,"FAY","Yes","No","Train",22016,2]
[1,"HAN","No","No","Head On",6396522,54]
[1,"HAN","No","No","Train",94084,3]
[8,"BUT","Yes","No","Head On",9026283,114]
[8,"BUT","Yes","No","Train",72068,1]
[1,"ALL","Yes","Yes","Fixed Object",10950394,288]
[3,"CRA","Yes","No","Overturning",646945,3]
[2,"SAN","Yes","No","Backing",418132,29]
[3,"HUR","Yes","No","Unknown",22016,2]
[6,"PIC","Yes","No","Animal",852260,65]
[12,"GEA","Yes","No","Pedestrian",668961,5]
[6,"UNI","Yes","No","Animal",1347620,110]
[10,"HOC","No","Yes","Overturning",202788,6]
[6,"PIC","No","No","Animal",10528160,672]
[5,"LIC","Yes","Yes","Backing",110080,10]
[8,"WAR","Yes","No","Angle",2884718,62]
[9,"HIG","Yes","No","Backing",423120,35]
[4,"SUM","Yes","No","Left Turn",1455292,54]
[9,"HIG","Yes","No","Overturning",105092,4]
[2,"SEN","Yes","No","Sideswipe - Passing",6826151,336]
[12,"GEA","No","No","Backing",2809501,140]
[4,"SUM","Yes","Yes","Overturning",9651781,96]
[7,"SHE","Yes","No","Angle",16329284,469]
[5,"COS","Yes","No","Left Turn",48848,1]
[8,"GRE","No","No","Head On",10179927,94]
[8,"GRE","No","No","Train",48848,1]
[3,"HUR","Yes","No","Animal",187136,17]
[5,"GUE","No","No","Rear End",2548696,82]
[12,"GEA","Yes","No","Pedalcycles",166152,4]
[3,"WAY","Yes","No","Unknown",94084,3]
[9,"JAC","Yes","No","Sideswipe - Passing",72068,1]
[2,"SEN","Yes","No","Sideswipe - Meeting",11008,1]
[6,"UNI","Yes","No","Backing",158928,11]
[2,"SAN","No","No","Right Turn",1075913,24]
[4,"STA","Yes","No","Animal",18983111,1336]
[7,"MOT","No","Yes","Pedestrian",502809,1]
[0,"CUY","Yes","No","Right Turn",48848,1]
[11,"COL","Yes","No","Sideswipe - Passing",1269241,45]
[0,"CUY","Yes","No","Rear End",70864,3]
[5,"GUE","No","No","Fixed Object",37709349,789]
[10,"NOB","No","No","Unknown",55040,5]
[2,"SAN","Yes","No","Sideswipe - Meeting",11008,1]
[2,"OTT","Yes","No","Animal",297216,27]
[5,"GUE","Yes","No","Angle",263848,6]
[3,"MED","Yes","No","Fixed Object",9399470,210]
[2,"WOO","Yes","No","Overturning",249228,6]
[2,"SAN","Yes","No","Pedestrian",3653254,16]
[8,"CLI","Yes","Yes","Left Turn",11008,1]
[3,"MED","Yes","No","Right Turn",116100,5]
[8,"BUT","Yes","Yes","Unknown",429140,30]
[6,"FRA","Yes","Yes","Left Turn",12112638,203]
[12,"LAK","Yes","No","Fixed Object",4004888,118]
[8,"GRE","No","Yes","Fixed Object",2992099,72]
[3,"RIC","Yes","No","Rear End",210184,8]
[6,"FAY","Yes","Yes","Fixed Object",1064905,23]
[3,"RIC","Yes","Yes","Rear End",10715852,258]
[1,"HAR","No","No","Rear End",3561075,74]
[6,"DEL","Yes","No","Other Object",577060,40]
[10,"HOC","No","No","Pedalcycles",502809,1]
[9,"PIK","Yes","No","Angle",12737805,254]
[4,"ATB","Yes","Yes","Overturning",513817,2]
[11,"BEL","Yes","No","Sideswipe - Meeting",535833,4]
[2,"WOO","Yes","No","Sideswipe - Passing",9024536,449]
[3,"CRA","Yes","Yes","Other Object",110080,10]
[11,"JEF","No","Yes","Overturning",48848,1]
[5,"COS","Yes","No","Head On",48848,1]
[11,"TUS","Yes","No","Rear End",232200,10]
[10,"VIN","No","No","Head On",4555619,29]
[10,"MOE","No","Yes","Angle",48848,1]
[10,"MEG","No","No","Pedestrian",72068,1]
[9,"ADA","No","No","Sideswipe - Passing",4222124,110]
[7,"CLA","Yes","No","Right Turn",8916017,412]
[7,"MOT","Yes","No","Angle",3624490,121]
[8,"HAM","Yes","Yes","Backing",22016,2]
[3,"RIC","Yes","Yes","Overturning",1163064,33]
[3,"CRA","Yes","No","Parked Vehicle",1106132,59]
[3,"WAY","Yes","No","Backing",1760764,133]
[7,"DAR","No","No","Overturning",9043417,83]
[6,"UNI","Yes","Yes","Unknown",121088,11]
[4,"ATB","Yes","No","Unknown",116100,5]
[11,"JEF","Yes","No","Rear End",92880,5]
[5,"FAI","Yes","No","Head On",8425712,75]
[11,"BEL","No","Yes","Other Non-Collision",927133,34]
[10,"HOC","Yes","Yes","Parked Vehicle",11008,1]
[9,"ROS","Yes","Yes","Animal",1436544,98]
[3,"WAY","Yes","No","Fixed Object",116100,5]
[9,"LAW","No","Yes","Animal",308052,19]
[6,"MAD","No","Yes","Angle",392160,10]
[8,"CLE","Yes","No","Angle",85553809,2578]
[4,"SUM","Yes","Yes","Other Non-Collision",22016,2]
[2,"FUL","No","Yes","Left Turn",11008,1]
[1,"DEF","No","No","Fixed Object",34840217,535]
[11,"JEF","Yes","Yes","Unknown",235984,18]
[7,"SHE","No","Yes","Rear End",4206247,93]
[3,"HUR","Yes","No","Left Turn",1381954,14]
[11,"HAS","Yes","No","Right Turn",11008,1]
[4,"MAH","No","No","Angle",24404129,451]
[3,"CRA","Yes","No","Pedalcycles",553324,8]
[4,"STA","Yes","No","Sideswipe - Meeting",11008,1]
[3,"LOR","Yes","No","Head On",108704,3]
[4,"STA","Yes","No","Backing",19104900,1540]
[8,"BUT","Yes","No","Pedalcycles",1809374,14]
[11,"COL","Yes","No","Rear End",6975050,256]
[3,"HUR","Yes","No","Fixed Object",2525357,92]
[1,"ALL","Yes","Yes","Backing",127108,6]
[8,"WAR","Yes","Yes","Right Turn",22016,2]
[4,"POR","Yes","Yes","Sideswipe - Passing",243208,11]
[10,"HOC","Yes","No","Head On",2110771,21]
[7,"MOT","Yes","No","Other Object",5631942,122]
[6,"PIC","No","Yes","Overturning",238220,5]
[4,"POR","Yes","Yes","Sideswipe - Passing",5082534,189]
[8,"HAM","Yes","No","Other Non-Collision",1986878,42]
[7,"CLA","Yes","No","Unknown",568857,7]
[4,"SUM","Yes","Yes","Animal",33024,3]
[8,"WAR","Yes","Yes","Other Object",986764,73]
[4,"STA","Yes","Yes","Overturning",4032924,45]
[6,"PIC","No","No","Backing",910912,69]
[3,"HUR","Yes","No","Backing",275200,25]
[3,"CRA","No","No","Animal",13596918,839]
[8,"CLE","No","No","Rear End",20733926,662]
[2,"WOO","Yes","No","Overturning",48848,1]
[8,"WAR","No","No","Other Object",149124,8]
[1,"HAN","Yes","No","Sideswipe - Passing",264020,15]
[5,"PER","Yes","No","Backing",568857,7]
[4,"ATB","No","No","Overturning",9991415,65]
[8,"CLE","Yes","No","Rear End",264192,24]
[8,"WAR","Yes","Yes","Other Non-Collision",456144,38]
[10,"HOC","No","No","Right Turn",694020,25]
[5,"MUS","Yes","Yes","Head On",44032,4]
[6,"FRA","No","Yes","Other Non-Collision",70864,3]
[9,"SCI","No","Yes","Sideswipe - Passing",83076,2]
[4,"TRU","Yes","Yes","Right Turn",483836,17]
[8,"HAM","Yes","Yes","Fixed Object",646376,22]
[2,"SAN","Yes","No","Unknown",33024,3]
[11,"HAS","Yes","No","Animal",11008,1]
[10,"WAS","No","No","Unknown",99072,9]
[5,"COS","Yes","No","Head On",1221253,24]
[7,"SHE","Yes","No","Angle",152736,7]
[10,"GAL","Yes","No","Other Object",55040,5]
[6,"MAD","Yes","No","Fixed Object",249228,6]
[5,"LIC","No","No","Parked Vehicle",2843147,73]
[4,"STA","Yes","Yes","Other Non-Collision",120916,2]
[2,"SAN","Yes","No","Head On",3342397,29]
[2,"SAN","Yes","No","Train",611513,4]
[7,"MOT","No","No","Right Turn",616964,18]
[7,"DAR","Yes","No","Animal",11008,1]
[4,"TRU","Yes","Yes","Unknown",287240,15]
[8,"CLE","Yes","Yes","Left Turn",153940,5]
[11,"TUS","Yes","No","Pedestrian",8100460,46]
[2,"WOO","No","No","Other Object",915953,24]
[11,"JEF","Yes","No","Other Non-Collision",1709045,58]
[9,"ROS","Yes","No","Animal",99072,9]
[11,"COL","Yes","Yes","Other Non-Collision",11008,1]
[10,"HOC","No","No","Backing",594260,45]
[6,"MRW","No","No","Right Turn",2777959,47]
[3,"CRA","No","No","Right Turn",351912,14]
[11,"COL","Yes","Yes","Backing",11008,1]
[4,"SUM","Yes","Yes","Rear End",15907262,534]
[10,"GAL","No","Yes","Head On",11008,1]
[7,"MIA","No","No","Rear End",9497179,299]
[6,"FAY","No","Yes","Other Non-Collision",396116,27]
[5,"PER","Yes","No","Unknown",11008,1]
[5,"COS","No","No","Other Non-Collision",3212484,55]
[9,"BRO","No","No","Angle",38331818,436]
[6,"FRA","Yes","Yes","Unknown",3567677,132]
[9,"SCI","Yes","No","Parked Vehicle",169936,12]
[4,"POR","Yes","Yes","Overturning",270040,10]
[7,"LOG","No","No","Sideswipe - Passing",4823661,102]
[1,"HAN","Yes","No","Rear End",248024,8]
[10,"ATH","No","Yes","Sideswipe - Passing",208980,10]
[8,"WAR","Yes","Yes","Right Turn",197972,9]
[5,"MUS","No","No","Rear End",9303573,231]
[9,"BRO","Yes","No","Sideswipe - Passing",11008,1]
[4,"MAH","No","Yes","Other Object",1029764,88]
[7,"LOG","No","Yes","Unknown",99072,9]
[2,"HEN","No","No","Pedestrian",1088694,4]
[5,"LIC","Yes","No","Head On",4623797,59]
[5,"FAI","No","Yes","Other Object",44032,4]
[6,"PIC","Yes","No","Sideswipe - Passing",83076,2]
[6,"PIC","Yes","No","Left Turn",321296,7]
[8,"CLE","Yes","No","Right Turn",55040,5]
[7,"CLA","Yes","Yes","Right Turn",72068,1]
[7,"SHE","Yes","Yes","Head On",546841,5]
[10,"VIN","No","No","Other Object",44032,4]
[3,"MED","Yes","No","Sideswipe - Passing",9270774,456]
[3,"LOR","Yes","No","Overturning",513817,2]
[9,"PIK","No","No","Fixed Object",51954457,837]
[1,"HAN","No","Yes","Left Turn",142932,4]
[6,"PIC","Yes","No","Overturning",502809,1]
[5,"LIC","Yes","Yes","Fixed Object",12150782,289]
[2,"HEN","Yes","No","Left Turn",769872,34]
[7,"MIA","Yes","No","Fixed Object",19258246,536]
[0,"HAM","No","No","Rear End",22016,2]
[11,"HAS","No","Yes","Parked Vehicle",11008,1]
[4,"MAH","Yes","No","Head On",94084,3]
[9,"BRO","No","No","Pedalcycles",1353746,8]
[6,"MAD","Yes","No","Unknown",320092,9]
[10,"NOB","No","No","Left Turn",149124,8]
[8,"WAR","Yes","Yes","Animal",815452,54]
[7,"CLA","No","No","Other Non-Collision",638292,49]
[3,"MED","Yes","Yes","Unknown",143104,13]
[12,"CUY","Yes","No","Animal",449780,25]
[11,"COL","Yes","No","Other Object",11008,1]
[6,"MAD","No","Yes","Head On",1757655,9]
[7,"MOT","Yes","Yes","Other Non-Collision",22016,2]
[3,"HUR","Yes","No","Rear End",3557873,134]
[3,"CRA","No","No","Pedalcycles",646945,3]
[12,"GEA","No","No","Left Turn",14321290,257]
[8,"CLE","Yes","No","Backing",264192,24]
[9,"SCI","No","No","Overturning",12379900,85]
[6,"FAY","Yes","Yes","Animal",132096,12]
[3,"WAY","Yes","No","Parked Vehicle",2994454,119]
[8,"HAM","Yes","No","Pedestrian",251983624,1742]
[3,"LOR","Yes","Yes","Sideswipe - Passing",44032,4]
[4,"TRU","Yes","No","Sideswipe - Passing",31611736,1232]
[9,"SCI","No","No","Sideswipe - Meeting",22016,2]
[10,"WAS","Yes","No","Other Object",22016,2]
[8,"WAR","Yes","Yes","Angle",1632386,23]
[8,"WAR","Yes","No","Animal",907300,70]
[2,"LUC","Yes","No","Angle",4044342,110]
[7,"MIA","Yes","Yes","Fixed Object",9260917,294]
[2,"FUL","Yes","No","Angle",5082415,134]
[11,"CAR","No","No","Parked Vehicle",1009005,38]
[2,"SAN","Yes","No","Other Object",149124,8]
[7,"MOT","Yes","No","Angle",413463371,9444]
[4,"POR","Yes","Yes","Angle",306676,12]
[3,"MED","Yes","No","Backing",209152,19]
[4,"POR","Yes","Yes","Angle",11008,1]
[8,"GRE","Yes","No","Animal",7505908,596]
[4,"TRU","Yes","No","Pedestrian",48848,1]
[1,"PUT","Yes","No","Backing",176128,16]
[10,"ATH","No","No","Sideswipe - Meeting",11008,1]
[3,"MED","Yes","No","Parked Vehicle",81872,4]
[2,"WOO","No","No","Pedalcycles",348128,6]
[4,"POR","No","No","Backing",1405121,65]
[9,"PIK","No","No","Rear End",7796602,94]
[3,"WAY","Yes","No","Overturning",1265854,9]
[3,"RIC","Yes","No","Fixed Object",303064,13]
[8,"GRE","No","No","Backing",1310812,99]
[2,"WIL","Yes","No","Overturning",679969,6]
[1,"VAN","Yes","No","Backing",33024,3]
[2,"HEN","Yes","No","Unknown",110080,10]
[5,"MUS","Yes","No","Sideswipe - Passing",13386059,827]
[1,"VAN","Yes","No","Fixed Object",22016,2]
[1,"VAN","No","No","Overturning",5323202,57]
[12,"GEA","Yes","No","Other Object",44032,4]
[8,"CLI","Yes","Yes","Overturning",11008,1]
[9,"SCI","Yes","No","Left Turn",11008,1]
[6,"MAD","Yes","No","Left Turn",1074709,26]
[11,"HAS","Yes","No","Rear End",22016,2]
[1,"WYA","Yes","No","Sideswipe - Passing",1357305,53]
[6,"UNI","No","Yes","Sideswipe - Passing",1782264,108]
[3,"MED","No","No","Fixed Object",75228467,1295]
[3,"RIC","Yes","No","Sideswipe - Passing",11008,1]
[1,"PUT","Yes","No","Parked Vehicle",11008,1]
[5,"MUS","Yes","Yes","Parked Vehicle",562665,3]
[9,"LAW","No","No","Backing",751640,35]
[8,"GRE","Yes","No","Pedalcycles",9328487,77]
[2,"OTT","No","Yes","Rear End",1123557,27]
[3,"CRA","Yes","No","Unknown",164948,6]
[11,"BEL","No","No","Angle",7503077,194]
[6,"UNI","Yes","No","Parked Vehicle",88064,8]
[12,"CUY","No","No","Overturning",144136,2]
[8,"WAR","Yes","No","Other Non-Collision",596893,4]
[1,"WYA","No","No","Parked Vehicle",790049,16]
[10,"NOB","No","Yes","Animal",1342460,95]
[3,"MED","Yes","No","Head On",8956623,114]
[2,"SEN","No","No","Rear End",6242158,172]
[12,"GEA","No","No","Parked Vehicle",4894459,64]
[5,"KNO","Yes","No","Sideswipe - Passing",3849241,240]
[11,"BEL","No","Yes","Backing",110080,10]
[4,"STA","Yes","No","Other Non-Collision",22016,2]
[9,"ROS","No","No","Rear End",11732835,281]
[4,"SUM","No","No","Pedestrian",483664,8]
[11,"COL","Yes","No","Pedalcycles",1247450,6]
[2,"OTT","Yes","Yes","Unknown",11008,1]
[4,"SUM","Yes","Yes","Parked Vehicle",97696,2]
[3,"WAY","Yes","No","Right Turn",72068,1]
[6,"FAY","Yes","Yes","Backing",33024,3]
[6,"FRA","Yes","Yes","Overturning",22667485,215]
[4,"TRU","No","Yes","Head On",1038642,5]
[5,"MUS","No","No","Animal",8302718,532]
[3,"RIC","No","No","Sideswipe - Passing",4881466,138]
[8,"BUT","Yes","No","Fixed Object",5395495,91]
[12,"GEA","Yes","Yes","Rear End",1139381,25]
[8,"GRE","No","No","Unknown",291024,23]
[7,"SHE","Yes","Yes","Left Turn",249228,6]
[5,"FAI","No","No","Unknown",373928,16]
[3,"WAY","Yes","No","Head On",4321646,45]
[3,"MED","Yes","No","Rear End",402136,22]
[3,"WAY","Yes","No","Sideswipe - Meeting",11008,1]
[6,"MAR","No","No","Parked Vehicle",1198033,24]
[5,"FAI","Yes","No","Sideswipe - Passing",22016,2]
[7,"MER","No","Yes","Animal",70864,3]
[2,"FUL","Yes","No","Pedestrian",502809,1]
[6,"MRW","Yes","No","Fixed Object",11008,1]
[11,"JEF","Yes","No","Right Turn",44032,4]
[6,"MRW","Yes","No","Animal",11008,1]
[12,"CUY","Yes","No","Pedalcycles",111070451,1112]
[1,"PUT","Yes","No","Unknown",11008,1]
[8,"CLI","Yes","Yes","Fixed Object",1537098,17]
[4,"POR","Yes","No","Pedestrian",14552710,76]
[5,"LIC","Yes","No","Angle",737020,40]
[3,"ERI","No","No","Overturning",5542092,38]
[10,"ATH","Yes","Yes","Head On",144136,2]
[3,"ASD","No","No","Fixed Object",54106018,915]
[2,"WOO","Yes","Yes","Other Object",138116,7]
[11,"TUS","Yes","No","Angle",25879015,918]
[6,"FRA","Yes","No","Fixed Object",436244586,9509]
[5,"GUE","No","No","Backing",713800,40]
[3,"LOR","Yes","Yes","Other Object",1282948,111]
[10,"WAS","Yes","No","Angle",7360939,134]
[10,"ATH","No","No","Pedestrian",1868767,8]
[4,"POR","Yes","No","Rear End",25557639,1062]
[4,"SUM","No","No","Other Object",22016,2]
[3,"CRA","Yes","Yes","Angle",22016,2]
[8,"CLE","Yes","Yes","Parked Vehicle",688569,11]
[1,"PAU","No","Yes","Unknown",66048,6]
[11,"JEF","Yes","No","Pedestrian",72068,1]
[11,"COL","Yes","No","Backing",527008,41]
[7,"MER","No","No","Head On",4514339,44]
[7,"MER","No","No","Train",11008,1]
[12,"LAK","Yes","Yes","Other Object",919737,32]
[4,"SUM","Yes","No","Head On",6644268,90]
[4,"SUM","Yes","No","Train",11008,1]
[10,"MOE","Yes","No","Angle",717809,6]
[3,"LOR","Yes","No","Left Turn",92880,5]
[10,"VIN","No","No","Angle",7186399,61]
[10,"NOB","Yes","Yes","Animal",473344,43]
[2,"SAN","Yes","No","Animal",451328,41]
[3,"WAY","Yes","Yes","Animal",720164,53]
[10,"NOB","No","Yes","Fixed Object",2371814,59]
[10,"WAS","Yes","No","Pedalcycles",2236503,20]
[11,"HOL","No","No","Pedestrian",5017545,17]
[3,"LOR","Yes","Yes","Backing",286208,26]
[8,"WAR","Yes","Yes","Rear End",7968403,240]
[6,"PIC","Yes","No","Fixed Object",2065707,28]
[4,"SUM","No","Yes","Sideswipe - Passing",3333982,125]
[7,"LOG","No","Yes","Left Turn",48848,1]
[11,"BEL","No","Yes","Unknown",226180,15]
[1,"HAR","Yes","No","Left Turn",318888,11]
[3,"MED","Yes","No","Animal",958953,39]
[12,"GEA","No","Yes","Fixed Object",1384997,32]
[5,"COS","Yes","No","Sideswipe - Passing",3094320,72]
[11,"HAS","No","No","Other Non-Collision",1871519,27]
[8,"CLE","No","No","Right Turn",4496808,108]
[10,"NOB","Yes","No","Parked Vehicle",153940,5]
[12,"GEA","No","Yes","Overturning",679969,6]
[9,"ROS","Yes","No","Backing",22016,2]
[1,"HAN","Yes","No","Overturning",72068,1]
[3,"LOR","Yes","Yes","Pedestrian",607901,5]
[8,"PRE","No","Yes","Left Turn",48848,1]
[7,"CLA","No","Yes","Sideswipe - Passing",11834487,430]
[9,"JAC","Yes","No","Left Turn",4439188,93]
[5,"COS","Yes","No","Parked Vehicle",22016,2]
[8,"GRE","No","No","Parked Vehicle",2407934,99]
[12,"GEA","No","No","Animal",14385207,973]
[7,"AUG","Yes","Yes","Other Non-Collision",22016,2]
[12,"CUY","Yes","No","Sideswipe - Meeting",4206763,130]
[3,"ERI","Yes","Yes","Overturning",574877,2]
[9,"LAW","Yes","Yes","Animal",1402316,97]
[7,"CLA","Yes","No","Left Turn",2334265,58]
[7,"SHE","Yes","No","Left Turn",70864,3]
[1,"HAR","No","No","Backing",894109,31]
[5,"KNO","Yes","No","Pedestrian",1288161,15]
[5,"LIC","Yes","Yes","Rear End",5800687,148]
[3,"ASD","Yes","No","Backing",1094608,96]
[3,"WAY","No","No","Other Non-Collision",1151540,70]
[3,"ERI","Yes","Yes","Other Object",561408,51]
[9,"JAC","Yes","No","Fixed Object",18412284,293]
[7,"DAR","Yes","No","Head On",2387572,16]
[10,"GAL","No","Yes","Backing",88064,8]
[4,"POR","Yes","No","Other Non-Collision",11008,1]
[2,"FUL","Yes","Yes","Other Object",33024,3]
[8,"PRE","Yes","No","Head On",108704,3]
[10,"GAL","No","No","Other Object",246820,10]
[1,"DEF","Yes","No","Unknown",722797,12]
[4,"TRU","Yes","Yes","Other Non-Vehicle",11008,1]
[5,"FAI","Yes","No","Fixed Object",19710871,386]
[8,"WAR","Yes","No","Fixed Object",17704464,406]
[2,"SAN","Yes","No","Parked Vehicle",218784,13]
[5,"FAI","Yes","No","Rear End",24888771,993]
[10,"WAS","Yes","No","Overturning",1292686,8]
[10,"WAS","Yes","No","Pedestrian",1054466,3]
[3,"WAY","Yes","No","Angle",4604308,113]
[1,"PAU","No","No","Sideswipe - Passing",2509123,40]
[5,"GUE","Yes","Yes","Angle",202788,6]
[12,"GEA","Yes","No","Left Turn",4976119,137]
[6,"MAR","Yes","No","Left Turn",94084,3]
[2,"OTT","Yes","No","Unknown",11008,1]
[3,"LOR","No","No","Sideswipe - Meeting",33024,3]
[11,"HOL","Yes","No","Left Turn",11008,1]
[4,"POR","Yes","No","Fixed Object",72068,1]
[5,"MUS","Yes","Yes","Backing",33024,3]
[11,"BEL","Yes","Yes","Pedestrian",646945,3]
[10,"HOC","No","No","Fixed Object",57239925,922]
[7,"MIA","Yes","No","Angle",12223776,326]
[5,"MUS","Yes","Yes","Unknown",220160,20]
[4,"SUM","Yes","Yes","Right Turn",275028,16]
[7,"CHP","Yes","No","Head On",11008,1]
[2,"WOO","Yes","No","Angle",32858895,849]
[11,"JEF","Yes","Yes","Animal",2399572,144]
[12,"CUY","Yes","No","Rear End",888763580,32465]
[1,"PUT","Yes","No","Right Turn",11008,1]
[5,"KNO","Yes","No","Sideswipe - Meeting",11008,1]
[9,"ROS","No","No","Unknown",367908,21]
[2,"SAN","Yes","No","Angle",14431449,330]
[3,"RIC","Yes","Yes","Right Turn",237016,7]
[8,"HAM","No","Yes","Left Turn",33024,3]
[11,"BEL","Yes","No","Right Turn",33024,3]
[6,"MAD","No","No","Angle",32790070,381]
[1,"ALL","Yes","No","Sideswipe - Passing",1069893,29]
[7,"AUG","Yes","Yes","Rear End",243208,11]
[9,"ROS","No","No","Backing",913320,65]
[8,"WAR","Yes","No","Left Turn",8865608,243]
[5,"FAI","Yes","No","Left Turn",11707022,259]
[8,"PRE","No","Yes","Parked Vehicle",1198774,14]
[3,"ASD","Yes","No","Unknown",33024,3]
[2,"FUL","Yes","No","Pedestrian",2514045,5]
[4,"MAH","Yes","No","Overturning",22016,2]
[11,"BEL","No","Yes","Parked Vehicle",606697,7]
[3,"CRA","Yes","No","Left Turn",661737,12]
[7,"LOG","Yes","No","Rear End",8784490,386]
[7,"DAR","Yes","No","Left Turn",48848,1]
[7,"CHP","No","No","Right Turn",967209,21]
[6,"FAY","No","Yes","Pedestrian",502809,1]
[8,"GRE","Yes","Yes","Overturning",4366710,33]
[11,"CAR","No","No","Animal",6442115,161]
[10,"VIN","Yes","No","Backing",44032,4]
[7,"CLA","Yes","No","Fixed Object",208980,10]
[11,"JEF","Yes","No","Parked Vehicle",33024,3]
[10,"WAS","No","Yes","Other Object",55040,5]
[6,"MAD","No","No","Other Object",356900,20]
[5,"GUE","Yes","No","Head On",72068,1]
[11,"HAS","Yes","No","Sideswipe - Meeting",11008,1]
[3,"HUR","Yes","No","Head On",3171892,36]
[8,"GRE","No","No","Left Turn",7322874,166]
[2,"LUC","No","Yes","Sideswipe - Passing",667360,35]
[1,"HAR","No","No","Right Turn",221192,9]
[3,"WAY","No","Yes","Parked Vehicle",1220790,16]
[11,"COL","Yes","No","Head On",2290802,40]
[10,"GAL","No","Yes","Unknown",22016,2]
[7,"CLA","Yes","No","Rear End",44032,4]
[3,"HUR","Yes","No","Left Turn",2415039,32]
[1,"ALL","No","Yes","Right Turn",584681,5]
[1,"PAU","No","Yes","Right Turn",72068,1]
[7,"SHE","Yes","Yes","Unknown",224976,17]
[10,"GAL","No","No","Angle",6638777,134]
[2,"HEN","No","No","Other Object",171140,10]
[7,"LOG","Yes","No","Fixed Object",7384331,203]
[1,"DEF","Yes","Yes","Rear End",11008,1]
[6,"PIC","Yes","No","Animal",1382933,54]
[3,"CRA","No","No","Rear End",3421927,78]
[7,"AUG","Yes","No","Angle",274856,7]
[7,"MIA","No","No","Pedalcycles",287068,6]
[1,"HAR","Yes","No","Pedalcycles",1221822,5]
[10,"ATH","Yes","No","Other Non-Collision",1313670,21]
[6,"DEL","Yes","No","Other Object",11008,1]
[6,"MRW","No","No","Sideswipe - Meeting",22016,2]
[0,"VAN","No","No","Rear End",11008,1]
[1,"WYA","No","No","Animal",14721626,920]
[6,"DEL","No","No","Fixed Object",49688277,868]
[5,"FAI","Yes","No","Other Non-Collision",94084,3]
[7,"SHE","No","Yes","Right Turn",22016,2]
[7,"AUG","No","Yes","Fixed Object",4062627,118]
[12,"LAK","No","No","Other Non-Collision",785061,10]
[2,"WOO","No","No","Sideswipe - Meeting",44032,4]
[2,"FUL","No","No","Left Turn",6404169,123]
[10,"HOC","Yes","Yes","Backing",11008,1]
[7,"SHE","No","No","Pedalcycles",227212,4]
[12,"CUY","Yes","No","Overturning",846121,10]
[2,"HEN","No","No","Angle",26222276,225]
[4,"SUM","Yes","Yes","Rear End",343312,14]
[11,"COL","No","Yes","Other Object",77056,7]
[8,"GRE","No","Yes","Head On",94084,3]
[1,"VAN","No","No","Right Turn",171140,10]
[10,"HOC","Yes","No","Other Non-Collision",1131522,10]
[4,"MAH","No","No","Rear End",19627569,570]
[6,"FRA","Yes","No","Animal",11583843,625]
[8,"WAR","No","No","Sideswipe - Passing",6418379,139]
[2,"SEN","Yes","No","Head On",820493,14]
[2,"SEN","Yes","No","Train",11008,1]
[7,"DAR","Yes","No","Rear End",158928,11]
[1,"ALL","Yes","No","Head On",248024,8]
[7,"MER","Yes","No","Backing",22016,2]
[5,"LIC","No","No","Left Turn",17137420,300]
[8,"CLE","Yes","Yes","Fixed Object",15475502,607]
[3,"WAY","Yes","Yes","Overturning",105092,4]
[8,"BUT","Yes","Yes","Rear End",33024,3]
[9,"ADA","No","No","Head On",6984418,86]
[11,"BEL","Yes","Yes","Sideswipe - Passing",6917774,329]
[6,"FRA","No","Yes","Angle",48848,1]
[4,"TRU","Yes","Yes","Animal",7174173,439]
[8,"WAR","Yes","Yes","Animal",147920,10]
[6,"UNI","Yes","No","Right Turn",1392909,66]
[2,"WIL","No","Yes","Sideswipe - Passing",2622312,169]
[7,"LOG","Yes","No","Head On",502809,1]
[5,"GUE","Yes","No","Sideswipe - Meeting",22016,2]
[5,"GUE","Yes","No","Overturning",1535722,10]
[7,"MIA","Yes","Yes","Rear End",10537091,273]
[11,"JEF","Yes","Yes","Left Turn",419164,18]
[10,"HOC","Yes","Yes","Sideswipe - Passing",1489798,37]
[7,"MER","No","No","Pedestrian",2658181,7]
[12,"LAK","Yes","No","Pedalcycles",14711082,123]
[5,"KNO","Yes","No","Other Non-Collision",413144,23]
[3,"CRA","Yes","No","Right Turn",407124,28]
[5,"KNO","Yes","No","Other Object",149124,8]
[2,"WOO","No","Yes","Other Non-Collision",1505569,81]
[3,"ASD","No","No","Animal",15400695,949]
[11,"TUS","Yes","No","Head On",11008,1]
[3,"LOR","No","No","Other Object",213968,16]
[7,"AUG","No","Yes","Animal",1446348,101]
[2,"WIL","No","No","Animal",25492623,1995]
[7,"CLA","Yes","No","Animal",538016,42]
[4,"ATB","Yes","No","Pedestrian",5131528,25]
[1,"PAU","No","Yes","Rear End",1291945,18]
[10,"WAS","Yes","No","Angle",105092,4]
[11,"TUS","No","No","Animal",17210413,1116]
[4,"SUM","Yes","No","Parked Vehicle",1689781,75]
[3,"LOR","No","No","Pedalcycles",1231626,8]
[9,"HIG","Yes","No","Parked Vehicle",818892,44]
[4,"MAH","Yes","Yes","Left Turn",449780,25]
[7,"CLA","No","No","Angle",14637360,198]
[8,"BUT","Yes","No","Fixed Object",43981277,761]
[3,"LOR","Yes","Yes","Fixed Object",15969566,384]
[6,"PIC","No","No","Rear End",18545306,346]
[2,"LUC","Yes","Yes","Sideswipe - Passing",52625042,2298]
[7,"LOG","Yes","No","Animal",1103896,67]
[7,"CLA","Yes","No","Pedalcycles",337120,5]
[8,"PRE","Yes","No","Backing",33024,3]
[9,"ROS","Yes","Yes","Parked Vehicle",535833,4]
[8,"HAM","No","No","Head On",4963775,51]
[7,"AUG","Yes","No","Parked Vehicle",1533433,69]
[3,"MED","Yes","Yes","Overturning",502809,1]
[8,"HAM","Yes","Yes","Train",11008,1]
[8,"HAM","Yes","Yes","Head On",11775492,89]
[7,"CLA","Yes","Yes","Backing",99072,9]
[5,"FAI","Yes","No","Other Object",171140,10]
[4,"ATB","Yes","No","Overturning",1651359,7]
[11,"COL","Yes","Yes","Fixed Object",912169,16]
[7,"CLA","Yes","No","Animal",33024,3]
[6,"PIC","Yes","No","Fixed Object",5222304,120]
[5,"FAI","Yes","No","Pedalcycles",2061751,11]
[6,"PIC","Yes","No","Rear End",1119032,34]
[6,"UNI","Yes","Yes","Backing",11008,1]
[1,"PAU","No","No","Backing",1030796,77]
[5,"FAI","No","Yes","Angle",177160,5]
[12,"CUY","No","No","Parked Vehicle",66048,6]
[3,"WAY","Yes","No","Fixed Object",14608199,401]
[3,"RIC","No","No","Other Object",444964,28]
[3,"WAY","Yes","No","Pedestrian",216204,3]
[7,"SHE","Yes","No","Sideswipe - Meeting",11008,1]
[11,"CAR","No","No","Fixed Object",42128149,695]
[6,"FRA","Yes","Yes","Other Non-Collision",94084,3]
[12,"LAK","Yes","Yes","Rear End",77056,7]
[11,"TUS","Yes","No","Rear End",29101342,1332]
[4,"SUM","Yes","No","Overturning",14470613,114]
[6,"PIC","Yes","No","Angle",33024,3]
[1,"ALL","Yes","No","Angle",973692,29]
[2,"SAN","Yes","Yes","Other Non-Collision",66048,6]
[3,"RIC","No","No","Other Non-Collision",561408,51]
[4,"STA","Yes","Yes","Sideswipe - Passing",138116,7]
[1,"HAR","Yes","No","Fixed Object",22016,2]
[3,"LOR","No","Yes","Other Non-Collision",176128,16]
[2,"SAN","No","No","Pedalcycles",695793,4]
[12,"CUY","No","No","Left Turn",909761,20]
[8,"PRE","No","No","Head On",11072303,78]
[8,"PRE","No","No","Train",502809,1]
[10,"MRG","No","No","Other Non-Collision",1982631,26]
[8,"WAR","Yes","Yes","Sideswipe - Passing",10372050,516]
[5,"FAI","Yes","Yes","Animal",215172,14]
[3,"RIC","Yes","Yes","Sideswipe - Passing",11008,1]
[9,"JAC","Yes","No","Pedalcycles",1232830,6]
[1,"HAN","Yes","No","Rear End",32716028,1460]
[10,"GAL","Yes","No","Sideswipe - Passing",2184797,102]
[4,"SUM","Yes","No","Fixed Object",29317045,652]
[1,"DEF","No","No","Right Turn",400760,15]
[6,"DEL","Yes","No","Angle",80773454,1704]
[8,"GRE","Yes","Yes","Other Object",665296,57]
[7,"LOG","No","Yes","Animal",1376688,96]
[4,"SUM","Yes","No","Overturning",11008,1]
[6,"DEL","Yes","Yes","Sideswipe - Passing",11008,1]
[11,"HAS","No","No","Sideswipe - Meeting",524825,3]
[2,"WIL","Yes","No","Pedalcycles",249228,6]
[4,"SUM","No","No","Sideswipe - Passing",507400,35]
[9,"HIG","No","No","Other Non-Collision",898528,56]
[12,"CUY","Yes","Yes","Pedalcycles",1704745,23]
[4,"SUM","No","Yes","Other Non-Collision",180944,13]
[12,"GEA","No","No","Fixed Object",88214428,1554]
[6,"PIC","Yes","No","Parked Vehicle",909933,29]
[8,"WAR","Yes","No","Other Non-Collision",2736335,44]
[5,"LIC","No","No","Rear End",25261469,777]
[11,"JEF","Yes","No","Head On",11008,1]
[1,"HAR","Yes","No","Left Turn",841940,35]
[7,"DAR","Yes","No","Other Non-Collision",105092,4]
[7,"CLA","Yes","Yes","Pedestrian",574877,2]
[9,"BRO","Yes","No","Right Turn",11008,1]
[9,"HIG","No","No","Unknown",88064,8]
[11,"JEF","Yes","Yes","Rear End",4169214,129]
[5,"MUS","Yes","No","Sideswipe - Passing",11008,1]
[2,"SEN","No","No","Backing",648096,52]
[4,"ATB","Yes","No","Left Turn",2699236,34]
[4,"SUM","Yes","Yes","Overturning",11008,1]
[8,"CLI","Yes","No","Fixed Object",22016,2]
[4,"POR","Yes","Yes","Head On",237016,7]
[8,"GRE","No","No","Sideswipe - Passing",5579257,154]
[4,"ATB","No","Yes","Overturning",2864012,26]
[5,"FAI","Yes","No","Unknown",55040,5]
[1,"DEF","Yes","No","Fixed Object",55040,5]
[5,"FAI","Yes","No","Pedestrian",14318565,83]
[9,"HIG","Yes","No","Other Object",164948,6]
[3,"ERI","Yes","No","Fixed Object",1913037,62]
[10,"ATH","Yes","No","Other Object",66048,6]
[3,"HUR","Yes","No","Right Turn",403340,20]
[10,"ATH","No","No","Sideswipe - Passing",3150286,93]
[6,"FRA","Yes","No","Sideswipe - Passing",330162147,14092]
[0,"TUS","No","No","Animal",22016,2]
[2,"HEN","Yes","No","Backing",1298772,109]
[7,"DAR","Yes","No","Right Turn",22016,2]
[7,"CLA","Yes","Yes","Fixed Object",2085381,70]
[0,"MOT","Yes","No","Overturning",11008,1]
[2,"SEN","No","No","Pedalcycles",634733,4]
[11,"JEF","Yes","Yes","Other Non-Collision",347268,26]
[8,"BUT","No","No","Head On",10777283,111]
[8,"BUT","No","No","Train",574877,2]
[12,"LAK","Yes","No","Parked Vehicle",10789521,349]
[8,"HAM","No","No","Other Object",70864,3]
[5,"MUS","Yes","Yes","Fixed Object",5186713,194]
[7,"CLA","Yes","No","Left Turn",36549936,711]
[6,"MAR","Yes","No","Animal",22016,2]
[11,"CAR","Yes","No","Fixed Object",22016,2]
[1,"HAN","Yes","Yes","Angle",298076,7]
[7,"CHP","No","Yes","Other Object",11008,1]
[11,"TUS","Yes","No","Sideswipe - Meeting",11008,1]
[3,"LOR","Yes","Yes","Left Turn",375132,14]
[4,"POR","Yes","No","Sideswipe - Passing",17169583,792]
[6,"MRW","No","Yes","Overturning",1563930,16]
[3,"LOR","Yes","Yes","Other Non-Collision",11008,1]
[4,"STA","Yes","Yes","Pedestrian",120916,2]
[9,"ROS","No","No","Animal",15614200,1012]
[7,"DAR","Yes","No","Parked Vehicle",2590545,118]
[9,"BRO","No","No","Sideswipe - Meeting",623897,12]
[11,"JEF","Yes","No","Overturning",72068,1]
[6,"MAD","Yes","No","Head On",11008,1]
[11,"HOL","Yes","No","Backing",22016,2]
[1,"DEF","Yes","Yes","Unknown",33024,3]
[7,"LOG","No","No","Backing",899097,37]
[4,"ATB","Yes","Yes","Animal",368080,30]
[4,"MAH","Yes","Yes","Unknown",1429770,26]
[4,"ATB","Yes","No","Right Turn",858505,23]
[4,"STA","Yes","Yes","Fixed Object",59856,2]
[2,"SEN","Yes","No","Other Non-Collision",943989,21]
[11,"COL","No","No","Parked Vehicle",2850199,57]
[6,"UNI","Yes","No","Left Turn",5180045,100]
[10,"WAS","No","No","Right Turn",653772,29]
[5,"PER","No","No","Fixed Object",76802572,1047]
[4,"SUM","No","Yes","Parked Vehicle",1121718,7]
[6,"FRA","Yes","Yes","Rear End",325227668,8233]
[11,"BEL","No","No","Sideswipe - Meeting",153940,5]
[3,"ERI","No","Yes","Angle",177160,5]
[4,"TRU","Yes","No","Parked Vehicle",9934866,385]
[4,"STA","Yes","No","Sideswipe - Passing",834888,51]
[7,"MIA","No","Yes","Rear End",83076,2]
[1,"ALL","Yes","No","Pedalcycles",513817,2]
[11,"JEF","No","Yes","Right Turn",72068,1]
[3,"WAY","Yes","No","Angle",7211643,107]
[8,"CLI","No","No","Pedestrian",1319518,7]
[11,"JEF","Yes","No","Sideswipe - Passing",11008,1]
[8,"CLI","Yes","No","Sideswipe - Passing",2903188,171]
[4,"ATB","Yes","No","Angle",17707586,467]
[7,"AUG","Yes","Yes","Rear End",2121845,63]
[1,"ALL","No","Yes","Rear End",2757610,56]
[7,"LOG","No","No","Parked Vehicle",1629118,42]
[11,"COL","No","No","Unknown",1424782,20]
[9,"JAC","No","No","Unknown",110080,10]
[3,"MED","No","No","Rear End",30404653,832]
[4,"ATB","Yes","No","Sideswipe - Passing",33024,3]
[3,"ASD","Yes","No","Angle",94084,3]
[2,"HEN","Yes","No","Animal",1128664,88]
[2,"OTT","No","Yes","Backing",22016,2]
[8,"BUT","Yes","No","Sideswipe - Passing",1040600,80]
[4,"TRU","Yes","No","Backing",11706135,774]
[6,"PIC","No","No","Right Turn",2510327,38]
[5,"KNO","No","No","Head On",9559814,90]
[8,"HAM","Yes","No","Head On",3111123,40]
[3,"ERI","Yes","No","Parked Vehicle",197972,9]
[6,"UNI","No","Yes","Other Non-Collision",231168,21]
[8,"BUT","Yes","No","Fixed Object",4439995,124]
[3,"CRA","No","No","Fixed Object",32089805,443]
[11,"BEL","Yes","Yes","Other Non-Collision",611116,32]
[2,"SEN","No","No","Overturning",7794591,60]
[7,"MOT","Yes","No","Other Non-Collision",274856,7]
[5,"KNO","No","Yes","Fixed Object",11008,1]
[10,"MEG","Yes","No","Right Turn",147920,10]
[1,"PUT","Yes","No","Animal",70864,3]
[3,"ERI","Yes","No","Angle",72068,1]
[6,"UNI","Yes","No","Rear End",307880,10]
[2,"LUC","No","No","Sideswipe - Passing",3631939,77]
[3,"ERI","Yes","No","Fixed Object",2019902,45]
[11,"HAS","Yes","No","Parked Vehicle",11008,1]
[1,"DEF","Yes","Yes","Parked Vehicle",72068,1]
[3,"RIC","Yes","Yes","Unknown",358276,27]
[4,"STA","Yes","No","Pedestrian",3310868,23]
[1,"HAN","Yes","No","Pedestrian",6725161,49]
[9,"PIK","No","No","Overturning",3714208,43]
[12,"LAK","Yes","No","Backing",10704592,849]
[5,"FAI","Yes","No","Pedalcycles",5353183,47]
[4,"ATB","Yes","Yes","Fixed Object",1563361,40]
[5,"KNO","Yes","No","Overturning",502809,1]
[5,"COS","Yes","No","Angle",9800693,228]
[8,"WAR","Yes","Yes","Parked Vehicle",1270842,15]
[1,"HAR","Yes","No","Head On",11008,1]
[6,"UNI","Yes","No","Sideswipe - Passing",88064,8]
[7,"LOG","Yes","Yes","Rear End",215172,14]
[12,"LAK","Yes","No","Fixed Object",71900107,1597]
[4,"POR","Yes","Yes","Other Object",22016,2]
[5,"MUS","Yes","No","Head On",13726673,162]
[7,"CLA","No","No","Pedalcycles",646945,3]
[9,"PIK","No","No","Animal",7854420,422]
[3,"ASD","Yes","Yes","Parked Vehicle",33024,3]
[8,"CLI","No","No","Angle",19728415,269]
[8,"WAR","No","Yes","Other Object",154112,14]
[1,"HAN","Yes","No","Left Turn",11008,1]
[3,"RIC","Yes","No","Unknown",72068,1]
[5,"LIC","No","No","Head On",14601042,120]
[5,"LIC","No","No","Train",72068,1]
[11,"COL","Yes","No","Pedalcycles",502809,1]
[11,"COL","Yes","No","Other Object",125904,8]
[7,"MIA","No","Yes","Overturning",502809,1]
[2,"WOO","Yes","No","Animal",132096,12]
[9,"JAC","Yes","No","Head On",11008,1]
[3,"RIC","Yes","No","Backing",138116,7]
[7,"MIA","Yes","No","Parked Vehicle",165120,15]
[8,"CLE","No","Yes","Rear End",103888,6]
[1,"ALL","Yes","Yes","Head On",199176,7]
[4,"MAH","No","Yes","Overturning",1734898,17]
[5,"COS","No","No","Head On",8425527,44]
[1,"PAU","No","Yes","Animal",704512,64]
[12,"GEA","Yes","No","Fixed Object",13286313,280]
[10,"GAL","No","Yes","Parked Vehicle",149124,8]
[6,"UNI","Yes","No","Fixed Object",7970679,224]
[9,"SCI","Yes","No","Sideswipe - Passing",13206703,562]
[1,"ALL","No","No","Animal",15976842,1140]
[6,"DEL","Yes","Yes","Head On",717809,6]
[3,"CRA","Yes","No","Pedalcycles",1402594,9]
[8,"HAM","Yes","No","Sideswipe - Passing",9141959,507]
[5,"FAI","Yes","No","Backing",928112,74]
[7,"AUG","Yes","Yes","Overturning",967037,12]
[7,"MIA","Yes","Yes","Right Turn",77056,7]
[6,"MAR","Yes","No","Parked Vehicle",121088,11]
[1,"PUT","Yes","No","Animal",582048,46]
[1,"HAN","No","Yes","Backing",132096,12]
[10,"HOC","Yes","No","Backing",114896,7]
[2,"SAN","No","No","Overturning",6263407,65]
[2,"OTT","Yes","Yes","Animal",1403692,104]
[6,"PIC","Yes","No","Angle",5441141,82]
[8,"WAR","Yes","No","Sideswipe - Meeting",11008,1]
[8,"CLI","Yes","No","Sideswipe - Passing",22016,2]
[8,"WAR","Yes","No","Rear End",90768384,3918]
[3,"ERI","Yes","No","Rear End",1900997,72]
[3,"ERI","No","Yes","Other Object",1112840,90]
[3,"ASD","Yes","Yes","Fixed Object",881156,42]
[3,"LOR","Yes","Yes","Unknown",165120,15]
[3,"RIC","No","Yes","Head On",83076,2]
[4,"STA","No","Yes","Fixed Object",2672761,75]
[0,"POR","No","No","Sideswipe - Passing",11008,1]
[5,"GUE","No","No","Animal",8615639,502]
[9,"BRO","No","No","Rear End",13984368,430]
[2,"WIL","Yes","No","Right Turn",11008,1]
[1,"DEF","No","No","Rear End",6541081,137]
[11,"CAR","No","No","Right Turn",886144,48]
[2,"FUL","No","Yes","Fixed Object",8501630,185]
[7,"LOG","Yes","No","Right Turn",105092,4]
[1,"HAN","No","No","Sideswipe - Passing",6044795,136]
[3,"WAY","Yes","No","Animal",44032,4]
[8,"CLE","Yes","Yes","Backing",187136,17]
[9,"LAW","No","No","Parked Vehicle",1727846,33]
[9,"ROS","Yes","No","Overturning",634733,4]
[4,"ATB","Yes","No","Other Object",712993,9]
[9,"BRO","No","No","Overturning",8704921,61]
[7,"SHE","No","Yes","Animal",2456213,119]
[7,"AUG","Yes","No","Angle",1183876,37]
[9,"ROS","No","Yes","Fixed Object",4772590,126]
[3,"MED","Yes","No","Pedestrian",7536591,45]
[3,"WAY","No","Yes","Unknown",77056,7]
[3,"CRA","Yes","No","Backing",951332,74]
[3,"WAY","Yes","No","Right Turn",428968,21]
[6,"UNI","Yes","No","Fixed Object",2001101,70]
[4,"POR","Yes","Yes","Sideswipe - Passing",2744882,95]
[2,"WOO","Yes","No","Parked Vehicle",198144,18]
[1,"HAN","Yes","No","Animal",5339224,438]
[8,"BUT","Yes","Yes","Backing",374272,34]
[4,"POR","No","Yes","Left Turn",203992,4]
[7,"SHE","Yes","Yes","Fixed Object",6777700,237]
[11,"COL","No","Yes","Angle",574877,2]
[10,"GAL","Yes","No","Head On",1016626,3]
[7,"MIA","Yes","No","Other Non-Collision",66048,6]
[2,"SEN","Yes","No","Other Non-Collision",114896,7]
[3,"WAY","No","Yes","Backing",191952,14]
[1,"HAR","No","No","Animal",11872168,783]
[1,"DEF","No","No","Left Turn",3007116,44]
[11,"HAS","No","No","Other Object",237188,16]
[7,"AUG","Yes","Yes","Other Object",11008,1]
[11,"JEF","No","No","Left Turn",3256979,67]
[10,"MOE","Yes","No","Overturning",155144,3]
[3,"HUR","Yes","No","Head On",144136,2]
[5,"FAI","No","No","Fixed Object",66207847,976]
[11,"COL","Yes","No","Parked Vehicle",2102925,98]
[6,"FRA","Yes","No","Pedestrian",72068,1]
[1,"HAR","Yes","No","Animal",11008,1]
[7,"MER","No","Yes","Sideswipe - Passing",502809,1]
[8,"GRE","Yes","No","Right Turn",127108,6]
[2,"HEN","No","No","Right Turn",759433,14]
[6,"UNI","Yes","No","Parked Vehicle",1949620,115]
[3,"HUR","No","No","Pedalcycles",574877,2]
[6,"UNI","Yes","No","Rear End",3252057,107]
[4,"TRU","No","No","Other Object",154112,14]
[3,"LOR","Yes","No","Pedalcycles",22016,2]
[7,"SHE","No","Yes","Unknown",169936,12]
[10,"NOB","No","No","Backing",77056,7]
[11,"JEF","Yes","Yes","Sideswipe - Passing",4833531,211]
[3,"HUR","Yes","No","Parked Vehicle",1748830,46]
[3,"RIC","Yes","No","Parked Vehicle",33024,3]
[3,"MED","Yes","Yes","Angle",11008,1]
[3,"HUR","Yes","No","Animal",2265928,181]
[5,"LIC","Yes","Yes","Sideswipe - Passing",11008,1]
[5,"LIC","Yes","No","Sideswipe - Passing",6628748,238]
[7,"MOT","Yes","Yes","Falling From Or In Vehicle",502809,1]
[8,"GRE","Yes","Yes","Rear End",14281531,453]
[10,"NOB","No","Yes","Parked Vehicle",513817,2]
[2,"SEN","Yes","No","Backing",11008,1]
[3,"WAY","Yes","No","Pedalcycles",574877,2]
[3,"LOR","Yes","No","Right Turn",866073,34]
[4,"SUM","Yes","Yes","Rear End",110513523,4047]
[4,"SUM","Yes","No","Unknown",55040,5]
[7,"MIA","No","No","Animal",12937430,1041]
[3,"ERI","Yes","No","Rear End",1191444,48]
[3,"WAY","Yes","No","Sideswipe - Passing",3710040,220]
[1,"VAN","No","No","Other Object",110080,10]
[7,"SHE","No","Yes","Other Object",275200,25]
[2,"OTT","No","No","Sideswipe - Meeting",11008,1]
[5,"COS","Yes","No","Other Non-Collision",934185,18]
[2,"LUC","Yes","Yes","Left Turn",2726875,59]
[9,"ROS","No","Yes","Rear End",3009074,54]
[3,"LOR","Yes","Yes","Sideswipe - Passing",10019768,315]
[12,"LAK","Yes","No","Rear End",137401515,5207]
[8,"CLE","No","No","Backing",2972213,159]
[8,"WAR","Yes","Yes","Rear End",2359496,92]
[3,"ERI","Yes","Yes","Right Turn",72068,1]
[11,"COL","Yes","Yes","Animal",429140,30]
[4,"SUM","Yes","No","Backing",1518760,120]
[5,"FAI","Yes","No","Fixed Object",26491892,558]
[11,"TUS","Yes","Yes","Other Object",506368,46]
[3,"LOR","Yes","No","Animal",7812346,493]
[10,"HOC","Yes","No","Angle",3577018,127]
[4,"POR","No","Yes","Fixed Object",15109473,408]
[1,"ALL","No","Yes","Unknown",154112,14]
[5,"LIC","No","Yes","Animal",3867764,233]
[11,"BEL","No","No","Pedestrian",4000919,14]
[7,"LOG","Yes","No","Backing",455972,29]
[9,"JAC","Yes","No","Backing",1661692,124]
[8,"HAM","Yes","Yes","Other Non-Collision",13106758,341]
[4,"SUM","Yes","No","Animal",147920,10]
[11,"COL","No","No","Right Turn",3056136,54]
[5,"GUE","Yes","Yes","Other Object",242176,22]
[11,"HOL","No","No","Other Object",147920,10]
[4,"POR","No","Yes","Right Turn",155144,3]
[7,"CLA","Yes","Yes","Unknown",347268,26]
[9,"JAC","Yes","No","Animal",2174596,192]
[10,"GAL","Yes","No","Rear End",22016,2]
[4,"STA","No","No","Sideswipe - Passing",10004288,270]
[3,"CRA","Yes","No","Other Non-Collision",48848,1]
[9,"HIG","Yes","No","Angle",1471857,42]
[7,"MOT","Yes","No","Unknown",55040,5]
[11,"BEL","Yes","No","Animal",1265404,88]
[11,"COL","Yes","Yes","Fixed Object",3177224,65]
[3,"ERI","Yes","No","Left Turn",11008,1]
[3,"LOR","Yes","No","Head On",7387070,75]
[3,"LOR","Yes","No","Train",83076,2]
[7,"CLA","No","Yes","Other Non-Collision",853636,72]
[6,"DEL","Yes","No","Pedestrian",1058541,10]
[2,"WOO","Yes","No","Left Turn",295668,11]
[3,"ERI","No","Yes","Other Non-Collision",824224,68]
[7,"CHP","Yes","No","Animal",484180,35]
[7,"AUG","Yes","No","Animal",1095812,94]
[10,"MEG","Yes","No","Parked Vehicle",865901,25]
[3,"ERI","Yes","No","Right Turn",149124,8]
[8,"CLI","No","No","Other Object",231168,21]
[7,"MIA","Yes","No","Pedalcycles",5833976,41]
[5,"PER","Yes","No","Right Turn",11008,1]
[6,"FRA","Yes","No","Backing",56312933,3948]
[8,"CLI","Yes","No","Unknown",22016,2]
[11,"TUS","No","Yes","Fixed Object",9296164,187]
[2,"WIL","Yes","No","Other Object",33024,3]
[5,"FAI","No","No","Right Turn",2288566,48]
[4,"MAH","No","Yes","Sideswipe - Passing",8672796,379]
[9,"JAC","No","Yes","Animal",308052,19]
[10,"ATH","Yes","No","Pedalcycles",1304898,7]
[2,"WOO","Yes","No","Right Turn",590873,9]
[11,"TUS","No","No","Right Turn",1102348,51]
[2,"WOO","Yes","Yes","Sideswipe - Passing",2208877,82]
[4,"MAH","Yes","No","Sideswipe - Passing",251808,16]
[12,"GEA","Yes","No","Backing",690752,49]
[5,"LIC","No","No","Backing",1616456,122]
[3,"LOR","Yes","Yes","Other Non-Collision",407124,28]
[12,"LAK","Yes","Yes","Pedestrian",513817,2]
[6,"PIC","Yes","No","Rear End",5323056,227]
[7,"CLA","No","Yes","Head On",651933,9]
[3,"CRA","Yes","Yes","Other Non-Collision",125904,8]
[2,"WOO","Yes","No","Pedestrian",6056663,47]
[11,"JEF","Yes","Yes","Fixed Object",17624643,353]
[2,"SAN","Yes","Yes","Parked Vehicle",11008,1]
[4,"POR","Yes","No","Pedestrian",192984,3]
[6,"FRA","No","Yes","Other Object",127108,6]
[6,"FRA","Yes","Yes","Right Turn",6561205,170]
[5,"MUS","Yes","Yes","Other Non-Collision",444964,28]
[12,"CUY","No","No","Right Turn",535833,4]
[5,"GUE","No","Yes","Overturning",536296,12]
[4,"STA","Yes","No","Overturning",9615727,92]
[5,"FAI","No","Yes","Pedestrian",574877,2]
[2,"OTT","Yes","No","Rear End",1254277,27]
[1,"ALL","Yes","No","Other Object",70864,3]
[6,"UNI","Yes","No","Backing",110080,10]
[7,"CLA","Yes","No","Rear End",62127513,2034]
[8,"PRE","No","No","Other Object",149124,8]
[5,"MUS","Yes","Yes","Left Turn",33024,3]
[6,"FRA","Yes","No","Head On",1389178,12]
[4,"POR","Yes","No","Sideswipe - Passing",169936,12]
[3,"MED","Yes","No","Backing",1866372,164]
[9,"HIG","Yes","No","Animal",737364,58]
[2,"LUC","Yes","Yes","Sideswipe - Passing",33024,3]
[8,"HAM","No","Yes","Fixed Object",964801,25]
[6,"FRA","Yes","No","Other Object",340904,13]
[11,"TUS","No","Yes","Rear End",3372735,54]
[10,"ATH","Yes","No","Pedestrian",2640703,20]
[12,"LAK","Yes","No","Right Turn",14417887,703]
[7,"SHE","Yes","No","Sideswipe - Passing",6171691,336]
[2,"SAN","Yes","No","Fixed Object",88064,8]
[7,"CHP","No","Yes","Animal",11008,1]
[4,"SUM","Yes","No","Unknown",11008,1]
[7,"MOT","Yes","No","Sideswipe - Passing",2520885,118]
[7,"AUG","No","Yes","Backing",77056,7]
[12,"LAK","No","Yes","Angle",849733,9]
[4,"SUM","Yes","Yes","Other Object",11008,1]
[1,"ALL","Yes","Yes","Animal",1590656,112]
[12,"CUY","Yes","Yes","Rear End",1924680,90]
[2,"SAN","No","Yes","Pedalcycles",11008,1]
[2,"WOO","Yes","No","Sideswipe - Meeting",22016,2]
[3,"WAY","No","No","Angle",59335070,708]
[1,"WYA","Yes","No","Angle",11008,1]
[6,"FRA","Yes","No","Unknown",17158073,447]
[2,"WOO","Yes","No","Rear End",17528838,679]
[8,"BUT","Yes","No","Backing",1183876,102]
[9,"ADA","No","No","Overturning",8252164,64]
[7,"AUG","Yes","No","Other Non-Collision",237016,7]
[12,"CUY","Yes","Yes","Angle",262644,8]
[1,"HAR","Yes","No","Unknown",147920,10]
[6,"MAD","No","Yes","Sideswipe - Passing",13260433,536]
[1,"VAN","Yes","No","Pedestrian",4722340,19]
[4,"POR","Yes","Yes","Other Object",270212,19]
[2,"LUC","Yes","No","Sideswipe - Meeting",110080,10]
[4,"MAH","Yes","No","Backing",11008,1]
[2,"OTT","Yes","No","Parked Vehicle",524825,3]
[3,"HUR","Yes","No","Rear End",44032,4]
[7,"SHE","Yes","No","Pedestrian",3587669,23]
[2,"OTT","No","Yes","Left Turn",72068,1]
[7,"MOT","Yes","Yes","Pedestrian",7090304,29]
[2,"SAN","Yes","No","Parked Vehicle",72068,1]
[2,"FUL","No","No","Backing",1605620,130]
[4,"STA","No","No","Parked Vehicle",2153374,64]
[4,"SUM","Yes","Yes","Backing",416928,31]
[3,"HUR","Yes","No","Fixed Object",336088,16]
[2,"WOO","Yes","Yes","Parked Vehicle",735009,11]
[2,"LUC","No","No","Other Object",55040,5]
[9,"LAW","No","No","Other Non-Collision",44032,4]
[7,"SHE","Yes","No","Head On",11008,1]
[1,"WYA","No","Yes","Pedalcycles",11008,1]
[4,"SUM","Yes","Yes","Pedalcycles",646945,3]
[4,"SUM","Yes","No","Fixed Object",230041496,5555]
[9,"HIG","Yes","No","Sideswipe - Meeting",11008,1]
[11,"BEL","No","No","Head On",9927656,70]
[3,"CRA","No","No","Unknown",1451614,19]
[4,"MAH","Yes","No","Rear End",799112,29]
[3,"WAY","Yes","No","Right Turn",623897,12]
[3,"HUR","Yes","No","Sideswipe - Passing",2676770,106]
[12,"GEA","Yes","No","Animal",996740,85]
[7,"AUG","Yes","Yes","Unknown",55040,5]
[4,"SUM","Yes","No","Animal",3552197,227]
[5,"COS","No","No","Other Object",110080,10]
[2,"OTT","Yes","No","Fixed Object",2832364,35]
[10,"WAS","Yes","No","Left Turn",6396257,169]
[6,"PIC","No","Yes","Unknown",22016,2]
[2,"SAN","Yes","No","Pedestrian",695793,4]
[10,"MRG","No","No","Head On",4899672,33]
[1,"DEF","Yes","No","Left Turn",48848,1]
[7,"SHE","Yes","Yes","Animal",1262824,78]
[3,"WAY","Yes","No","Rear End",132096,12]
[4,"STA","No","Yes","Animal",1311844,88]
[1,"HAR","No","No","Fixed Object",27007906,356]
[8,"WAR","Yes","Yes","Overturning",876565,8]
[8,"WAR","No","No","Overturning",6367110,45]
[9,"SCI","Yes","No","Fixed Object",1088694,4]
[5,"FAI","Yes","No","Parked Vehicle",803240,55]
[9,"JAC","Yes","No","Backing",55040,5]
[7,"MOT","Yes","No","Overturning",1148550,6]
[4,"MAH","No","No","Right Turn",2790515,69]
[11,"COL","Yes","No","Sideswipe - Passing",44032,4]
[8,"WAR","No","Yes","Angle",573673,4]
[3,"MED","Yes","No","Rear End",13310260,592]
[4,"MAH","Yes","Yes","Head On",3000289,18]
[1,"VAN","Yes","No","Animal",317856,22]
[8,"WAR","Yes","No","Right Turn",7856550,386]
[7,"MOT","Yes","No","Other Non-Collision",27315984,469]
[1,"VAN","Yes","No","Sideswipe - Passing",1635376,87]
[10,"VIN","Yes","No","Parked Vehicle",83076,2]
[5,"FAI","Yes","No","Right Turn",3478925,153]
[3,"CRA","No","Yes","Other Object",535833,4]
[7,"DAR","Yes","No","Left Turn",3192135,64]
[10,"GAL","No","Yes","Angle",105092,4]
[6,"UNI","Yes","No","Rear End",12088954,489]
[5,"LIC","Yes","No","Rear End",11008,1]
[3,"MED","Yes","No","Other Non-Collision",44032,4]
[10,"HOC","Yes","Yes","Unknown",33024,3]
[3,"WAY","Yes","No","Other Object",92880,5]
[2,"SAN","Yes","Yes","Angle",155144,3]
[11,"JEF","Yes","Yes","Other Object",22016,2]
[9,"HIG","No","No","Backing",611288,41]
[9,"LAW","Yes","No","Angle",502809,1]
[10,"ATH","Yes","Yes","Rear End",33024,3]
[6,"MAD","Yes","No","Sideswipe - Passing",11008,1]
[3,"HUR","Yes","No","Sideswipe - Passing",22016,2]
[3,"LOR","Yes","No","Other Object",334884,18]
[7,"CLA","Yes","Yes","Overturning",1857018,17]
[5,"COS","Yes","No","Other Non-Collision",11008,1]
[3,"RIC","Yes","Yes","Fixed Object",15371548,505]
[8,"CLE","Yes","Yes","Unknown",341248,31]
[10,"MEG","Yes","No","Sideswipe - Meeting",11008,1]
[7,"LOG","Yes","No","Sideswipe - Passing",22016,2]
[9,"ROS","Yes","No","Head On",7879334,78]
[7,"DAR","No","No","Angle",33837484,390]
[7,"AUG","No","No","Sideswipe - Passing",3245574,94]
[5,"FAI","Yes","Yes","Rear End",174752,9]
[11,"JEF","Yes","No","Pedestrian",4656755,26]
[10,"WAS","Yes","Yes","Right Turn",11008,1]
[11,"JEF","Yes","Yes","Backing",197972,9]
[11,"COL","Yes","No","Other Object",11008,1]
[2,"LUC","No","No","Other Non-Collision",215172,14]
[8,"CLE","Yes","No","Pedestrian",10659754,75]
[6,"DEL","No","Yes","Rear End",5619399,127]
[6,"UNI","Yes","No","Unknown",72068,1]
[6,"PIC","Yes","No","Right Turn",11008,1]
[7,"MER","Yes","No","Unknown",70864,3]
[2,"WOO","No","Yes","Head On",536296,12]
[2,"SAN","Yes","No","Pedalcycles",216204,3]
[4,"POR","Yes","No","Angle",995880,40]
[11,"JEF","Yes","No","Fixed Object",655545,8]
[9,"SCI","Yes","No","Rear End",142932,4]
[5,"LIC","Yes","Yes","Left Turn",1065474,4]
[11,"COL","Yes","Yes","Animal",1128717,42]
[7,"DAR","Yes","No","Right Turn",11008,1]
[3,"WAY","No","No","Pedestrian",3116217,14]
[7,"SHE","Yes","No","Rear End",77056,7]
[4,"MAH","No","Yes","Angle",811893,9]
[8,"HAM","No","No","Pedestrian",2505908,13]
[6,"DEL","Yes","No","Angle",752844,38]
[2,"SAN","No","Yes","Pedestrian",574877,2]
[6,"DEL","Yes","Yes","Sideswipe - Passing",10534339,324]
[6,"MAD","Yes","No","Animal",11008,1]
[5,"LIC","Yes","Yes","Head On",83076,2]
[11,"COL","Yes","No","Left Turn",2342865,63]
[9,"HIG","Yes","No","Fixed Object",2758126,83]
[3,"LOR","Yes","No","Animal",88064,8]
[1,"ALL","Yes","No","Other Non-Collision",3840575,129]
[8,"CLI","No","Yes","Head On",1171770,6]
[10,"GAL","Yes","Yes","Other Non-Collision",22016,2]
[3,"LOR","Yes","No","Rear End",124427463,4552]
[10,"ATH","No","No","Other Non-Collision",1504418,37]
[5,"GUE","No","Yes","Rear End",4455872,76]
[4,"ATB","Yes","No","Other Non-Collision",502809,1]
[7,"LOG","No","No","Other Non-Collision",578264,38]
[8,"HAM","Yes","No","Sideswipe - Meeting",70864,3]
[2,"LUC","Yes","No","Right Turn",595292,34]
[10,"GAL","No","No","Head On",5618116,56]
[2,"HEN","No","Yes","Head On",22016,2]
[7,"AUG","No","No","Sideswipe - Meeting",502809,1]
[3,"RIC","Yes","No","Right Turn",8634903,365]
[11,"TUS","Yes","Yes","Fixed Object",11008,1]
[10,"HOC","No","Yes","Fixed Object",1985277,72]
[6,"UNI","Yes","Yes","Animal",1574316,87]
[2,"WOO","Yes","No","Pedestrian",3884078,19]
[7,"DAR","No","No","Pedalcycles",513817,2]
[12,"LAK","Yes","Yes","Pedalcycles",72068,1]
[2,"LUC","No","Yes","Other Non-Collision",169936,12]
[8,"CLE","No","No","Unknown",507228,26]
[4,"SUM","Yes","Yes","Animal",7119477,452]
[3,"MED","Yes","No","Parked Vehicle",787244,48]
[3,"WAY","No","Yes","Rear End",2917107,48]
[6,"PIC","Yes","No","Overturning",370144,8]
[11,"BEL","No","Yes","Sideswipe - Passing",4284626,168]
[6,"FAY","No","No","Left Turn",5905991,93]
[2,"WIL","Yes","No","Right Turn",350880,25]
[9,"ADA","No","No","Sideswipe - Meeting",11008,1]
[6,"UNI","Yes","No","Animal",209152,19]
[7,"AUG","Yes","No","Other Non-Collision",22016,2]
[3,"CRA","Yes","No","Fixed Object",5025814,91]
[7,"SHE","Yes","No","Fixed Object",94084,3]
[12,"LAK","No","Yes","Sideswipe - Passing",4101790,176]
[2,"SAN","No","Yes","Angle",83076,2]
[6,"UNI","Yes","Yes","Unknown",44032,4]
[3,"MED","Yes","No","Head On",229620,5]
[6,"MAR","Yes","No","Sideswipe - Passing",15722375,711]
[5,"MUS","No","No","Head On",11835467,81]
[3,"ERI","No","No","Right Turn",1107733,29]
[6,"MAD","Yes","No","Rear End",4806302,180]
[3,"LOR","Yes","Yes","Overturning",11008,1]
[3,"RIC","Yes","Yes","Pedestrian",695793,4]
[2,"WOO","Yes","Yes","Overturning",72068,1]
[6,"FRA","Yes","Yes","Backing",11008,1]
[1,"WYA","No","No","Head On",3199002,17]
[8,"WAR","Yes","No","Pedalcycles",1663571,6]
[12,"CUY","Yes","No","Fixed Object",682384789,11539]
[11,"HAS","No","No","Head On",4426275,36]
[6,"FRA","Yes","No","Pedalcycles",2059343,15]
[2,"FUL","No","Yes","Rear End",5120295,61]
[11,"TUS","Yes","Yes","Angle",1142993,19]
[9,"PIK","Yes","No","Right Turn",845724,38]
[6,"MAR","No","No","Animal",13882848,893]
[2,"FUL","Yes","No","Pedalcycles",48848,1]
[3,"ERI","Yes","No","Overturning",1938427,13]
[10,"GAL","Yes","No","Angle",9278792,193]
[6,"MRW","Yes","No","Animal",11008,1]
[2,"FUL","Yes","No","Backing",165120,15]
[4,"POR","No","No","Fixed Object",68179495,1294]
[6,"FRA","No","Yes","Parked Vehicle",83076,2]
[11,"JEF","Yes","No","Angle",650729,11]
[3,"RIC","No","Yes","Sideswipe - Passing",3919192,184]
[2,"LUC","Yes","No","Other Non-Collision",13369733,285]
[5,"MUS","No","No","Backing",1250837,42]
[7,"DAR","Yes","No","Rear End",8053662,285]
[10,"NOB","No","No","Fixed Object",14854067,226]
[2,"OTT","Yes","No","Unknown",199176,7]
[3,"MED","Yes","No","Left Turn",5777745,130]
[6,"MAD","No","Yes","Other Non-Collision",995192,69]
[1,"WYA","No","No","Unknown",264020,15]
[1,"HAN","Yes","Yes","Sideswipe - Passing",6621868,258]
[9,"HIG","Yes","No","Animal",22016,2]
[2,"WOO","Yes","No","Rear End",750608,46]
[5,"FAI","No","No","Parked Vehicle",2507522,65]
[3,"MED","Yes","Yes","Animal",792060,45]
[8,"CLE","Yes","No","Animal",99072,9]
[10,"HOC","No","Yes","Other Object",33024,3]
[5,"LIC","Yes","Yes","Fixed Object",3974325,65]
[4,"POR","No","No","Animal",14276146,805]
[4,"STA","Yes","No","Rear End",13573936,589]
[3,"WAY","No","Yes","Left Turn",11008,1]
[2,"LUC","No","No","Angle",19518641,245]
[7,"MOT","No","Yes","Other Object",48848,1]
[8,"HAM","Yes","No","Angle",595619799,17660]
[6,"FRA","No","No","Sideswipe - Passing",1329097,47]
[10,"NOB","No","No","Parked Vehicle",684957,12]
[6,"FRA","Yes","No","Pedestrian",6836736,51]
[7,"CLA","No","No","Sideswipe - Passing",6373712,108]
[9,"HIG","Yes","No","Pedestrian",502809,1]
[1,"HAR","Yes","No","Rear End",22016,2]
[7,"MER","No","No","Other Object",88064,8]
[8,"BUT","Yes","No","Rear End",5956122,235]
[7,"AUG","Yes","No","Sideswipe - Passing",147920,10]
[11,"CAR","No","No","Rear End",7452231,251]
[3,"MED","Yes","No","Unknown",22016,2]
[2,"WIL","Yes","No","Animal",2328536,197]
[11,"JEF","Yes","No","Other Object",127108,6]
[6,"FRA","Yes","No","Angle",10883565,290]
[4,"ATB","Yes","Yes","Other Object",11008,1]
[10,"NOB","Yes","Yes","Fixed Object",370316,17]
[10,"GAL","No","Yes","Other Non-Collision",22016,2]
[5,"PER","No","No","Rear End",9739937,254]
[3,"WAY","Yes","No","Other Non-Collision",939001,15]
[0,"HAM","Yes","Yes","Rear End",22016,2]
[3,"RIC","Yes","No","Pedalcycles",502809,1]
[2,"SAN","No","Yes","Other Object",1066400,90]
[1,"VAN","Yes","No","Animal",48848,1]
[1,"WYA","No","No","Backing",357072,29]
[3,"ASD","Yes","No","Animal",2256984,158]
[3,"RIC","Yes","No","Animal",9840001,725]
[5,"PER","Yes","No","Overturning",11008,1]
[2,"HEN","No","Yes","Sideswipe - Passing",1813502,45]
[3,"ASD","No","No","Pedalcycles",634733,4]
[4,"SUM","No","No","Other Non-Collision",755821,15]
[3,"MED","Yes","Yes","Parked Vehicle",94084,3]
[3,"ERI","No","No","Sideswipe - Meeting",143104,13]
[5,"KNO","No","No","Other Non-Collision",463368,31]
[10,"WAS","Yes","No","Fixed Object",9242672,218]
[6,"MRW","Yes","No","Backing",11008,1]
[4,"SUM","Yes","Yes","Other Object",3230094,184]
[2,"WOO","No","No","Pedestrian",2347152,11]
[3,"WAY","No","Yes","Other Non-Collision",418132,29]
[4,"SUM","Yes","Yes","Fixed Object",296872,9]
[4,"STA","No","Yes","Rear End",667016,17]
[3,"ERI","No","No","Pedalcycles",72068,1]
[6,"MRW","No","Yes","Sideswipe - Passing",8510428,298]
[1,"VAN","No","No","Rear End",4536077,69]
[2,"SAN","Yes","No","Other Object",22016,2]
[4,"POR","Yes","No","Fixed Object",11008,1]
[6,"UNI","Yes","No","Fixed Object",877941,15]
[1,"HAR","No","No","Left Turn",1300717,32]
[10,"WAS","No","No","Left Turn",6494641,132]
[10,"ATH","No","No","Overturning",8319588,77]
[7,"MER","No","No","Other Non-Collision",2147579,32]
[8,"BUT","Yes","No","Left Turn",102557824,2211]
[5,"COS","No","No","Sideswipe - Passing",2838159,67]
[2,"OTT","Yes","No","Parked Vehicle",1063476,62]
[9,"BRO","Yes","No","Parked Vehicle",44032,4]
[3,"MED","No","Yes","Overturning",1121718,7]
[11,"COL","No","No","Overturning",16362772,131]
[10,"VIN","Yes","No","Left Turn",276060,5]
[2,"OTT","No","No","Sideswipe - Passing",3149426,113]
[4,"ATB","Yes","No","Overturning",2718500,17]
[3,"RIC","Yes","No","Pedalcycles",5047711,33]
[9,"ROS","No","Yes","Unknown",66048,6]
[1,"ALL","No","Yes","Pedestrian",502809,1]
[3,"CRA","Yes","No","Angle",131924,3]
[12,"LAK","No","Yes","Backing",153940,5]
[6,"FRA","Yes","Yes","Pedalcycles",888777,7]
[8,"BUT","No","Yes","Rear End",158928,11]
[7,"SHE","No","No","Backing",680948,46]
[9,"HIG","Yes","No","Fixed Object",535833,4]
[10,"HOC","No","No","Left Turn",5607346,100]
[3,"LOR","No","No","Overturning",7576548,42]
[5,"LIC","Yes","Yes","Left Turn",855925,13]
[6,"DEL","No","No","Parked Vehicle",2251639,47]
[4,"STA","Yes","No","Pedestrian",238220,5]
[11,"COL","Yes","No","Rear End",2808469,86]
[8,"BUT","Yes","No","Unknown",33024,3]
[9,"JAC","Yes","Yes","Fixed Object",685592,29]
[2,"WOO","Yes","Yes","Other Non-Collision",243208,11]
[7,"CHP","No","No","Unknown",557849,6]
[8,"BUT","No","Yes","Sideswipe - Passing",22016,2]
[2,"WOO","Yes","No","Rear End",1775953,49]
[2,"HEN","Yes","No","Parked Vehicle",83076,2]
[3,"ERI","No","No","Animal",10707503,775]
[8,"CLE","No","No","Parked Vehicle",2950475,64]
[6,"FAY","Yes","No","Angle",18737999,360]
[7,"AUG","Yes","No","Backing",1214320,100]
[7,"MER","Yes","No","Head On",1342910,16]
[7,"MER","Yes","No","Train",72068,1]
[12,"GEA","No","Yes","Animal",1215180,80]
[11,"HOL","No","No","Angle",18409611,417]
[3,"MED","Yes","Yes","Other Non-Collision",345892,19]
[3,"ERI","No","No","Backing",689548,46]
[6,"PIC","Yes","No","Other Non-Collision",72068,1]
[7,"DAR","Yes","No","Animal",1411088,111]
[3,"CRA","Yes","Yes","Overturning",83076,2]
[11,"COL","Yes","No","Angle",171140,10]
[10,"ATH","Yes","No","Backing",165120,15]
[10,"GAL","Yes","Yes","Other Object",33024,3]
[3,"RIC","No","No","Pedalcycles",2683809,8]
[3,"ERI","Yes","Yes","Unknown",22016,2]
[3,"MED","Yes","No","Right Turn",1719537,97]
[9,"BRO","Yes","No","Unknown",22016,2]
[7,"MER","Yes","No","Sideswipe - Passing",2269249,111]
[1,"DEF","Yes","No","Fixed Object",8360603,247]
[12,"CUY","Yes","No","Pedalcycles",2430691,21]
[9,"ROS","Yes","No","Overturning",48848,1]
[8,"GRE","No","No","Angle",16896580,278]
[12,"CUY","Yes","No","Backing",11353310,831]
[8,"BUT","Yes","No","Parked Vehicle",42317783,2091]
[7,"SHE","Yes","No","Right Turn",22016,2]
[10,"MEG","Yes","No","Backing",407296,37]
[7,"MOT","Yes","Yes","Other Object",11008,1]
[3,"LOR","Yes","No","Fixed Object",1387405,33]
[1,"VAN","No","No","Sideswipe - Meeting",513817,2]
[6,"PIC","Yes","No","Overturning",502809,1]
[7,"DAR","Yes","No","Parked Vehicle",66048,6]
[2,"LUC","Yes","No","Head On",84740558,1014]
[2,"LUC","Yes","No","Train",3515482,32]
[4,"SUM","Yes","No","Rear End",43002978,1833]
[5,"MUS","No","Yes","Rear End",5718114,91]
[2,"OTT","Yes","No","Left Turn",4183027,88]
[1,"HAR","Yes","No","Parked Vehicle",804841,25]
[3,"WAY","No","No","Head On",17621217,116]
[3,"WAY","No","No","Train",607901,5]
[1,"ALL","No","Yes","Fixed Object",7571930,168]
[6,"MRW","No","No","Animal",12197195,779]
[5,"MUS","Yes","No","Pedestrian",14001794,74]
[3,"WAY","Yes","No","Left Turn",8575656,201]
[1,"PUT","No","No","Unknown",33024,3]
[8,"BUT","No","No","Pedestrian",2718037,9]
[7,"CLA","No","Yes","Pedestrian",1005618,2]
[4,"ATB","Yes","No","Pedalcycles",72068,1]
[9,"JAC","No","No","Right Turn",293260,10]
[10,"ATH","Yes","Yes","Fixed Object",1846526,48]
[4,"POR","Yes","No","Fixed Object",11744399,256]
[4,"MAH","Yes","No","Angle",154442790,3954]
[5,"LIC","Yes","No","Other Non-Collision",270040,10]
[3,"LOR","Yes","No","Parked Vehicle",26671393,1067]
[6,"FRA","Yes","No","Sideswipe - Passing",138116,7]
[3,"MED","No","No","Parked Vehicle",6190294,63]
[2,"WOO","No","No","Angle",57349093,559]
[7,"MIA","Yes","No","Backing",121088,11]
[5,"PER","Yes","No","Rear End",11008,1]
[3,"WAY","Yes","No","Rear End",17856273,736]
[10,"WAS","No","No","Parked Vehicle",1308285,43]
[4,"SUM","Yes","No","Left Turn",33024,3]
[3,"LOR","Yes","No","Parked Vehicle",413144,23]
[12,"CUY","Yes","Yes","Sideswipe - Passing",246843973,7912]
[11,"COL","Yes","Yes","Rear End",103888,6]
[3,"ERI","No","No","Unknown",637948,31]
[5,"KNO","Yes","No","Angle",13042165,430]
[11,"TUS","Yes","No","Left Turn",270040,10]
[8,"WAR","Yes","No","Other Object",33024,3]
[4,"MAH","Yes","Yes","Rear End",14659534,481]
[6,"FAY","No","Yes","Angle",1293890,6]
[5,"PER","No","No","Overturning",10924568,94]
[8,"CLE","Yes","Yes","Rear End",22021928,695]
[6,"PIC","No","No","Fixed Object",62283984,984]
[5,"FAI","Yes","No","Head On",33024,3]
[12,"LAK","Yes","Yes","Angle",1668453,44]
[9,"LAW","Yes","No","Parked Vehicle",3722305,183]
[7,"SHE","Yes","No","Other Non-Collision",105092,4]
[2,"LUC","Yes","Yes","Backing",749404,48]
[3,"ASD","No","Yes","Rear End",2856510,61]
[2,"WOO","Yes","No","Head On",127108,6]
[5,"MUS","No","No","Unknown",132096,12]
[5,"GUE","Yes","No","Left Turn",8297704,157]
[10,"MEG","Yes","No","Unknown",585885,3]
[4,"SUM","No","No","Angle",2280601,65]
[9,"BRO","Yes","No","Backing",44032,4]
[4,"MAH","Yes","Yes","Right Turn",325080,15]
[3,"MED","Yes","No","Unknown",513817,2]
[6,"UNI","Yes","No","Left Turn",11008,1]
[3,"WAY","No","No","Falling From Or In Vehicle",502809,1]
[8,"GRE","No","No","Other Non-Collision",2658022,80]
[1,"WYA","No","No","Left Turn",1049081,25]
[10,"GAL","Yes","No","Angle",11008,1]
[3,"ERI","Yes","No","Backing",4743072,359]
[6,"PIC","Yes","No","Left Turn",2611701,70]
[11,"COL","No","No","Backing",1392512,94]
[3,"MED","Yes","No","Left Turn",329896,12]
[3,"LOR","Yes","No","Pedestrian",4132843,17]
[5,"FAI","Yes","No","Animal",1846248,136]
[5,"FAI","Yes","Yes","Other Non-Collision",568857,7]
[4,"MAH","No","No","Other Object",334884,18]
[8,"WAR","No","Yes","Pedestrian",1005618,2]
[10,"WAS","No","No","Fixed Object",51636772,968]
[12,"GEA","Yes","No","Animal",2685952,184]
[7,"CLA","Yes","Yes","Rear End",6407265,165]
[9,"SCI","Yes","No","Overturning",3244701,27]
[2,"HEN","Yes","Yes","Left Turn",502809,1]
[12,"GEA","No","No","Rear End",32990316,847]
[4,"POR","Yes","No","Head On",70864,3]
[10,"VIN","Yes","No","Fixed Object",469216,17]
[11,"COL","Yes","No","Other Non-Collision",70864,3]
[2,"OTT","Yes","No","Fixed Object",7885248,165]
[4,"STA","Yes","Yes","Sideswipe - Meeting",11008,1]
[1,"WYA","No","No","Fixed Object",24592470,347]
[9,"ROS","No","Yes","Animal",2277624,153]
[3,"MED","Yes","Yes","Fixed Object",3286563,85]
[6,"FRA","Yes","Yes","Unknown",11008,1]
[6,"DEL","No","No","Animal",13910831,821]
[8,"BUT","Yes","No","Backing",2621452,194]
[10,"HOC","Yes","No","Sideswipe - Passing",44032,4]
[1,"HAR","Yes","No","Backing",220160,20]
[1,"PUT","No","No","Fixed Object",20747965,370]
[6,"UNI","Yes","Yes","Rear End",3249821,125]
[6,"DEL","No","No","Pedalcycles",3353974,11]
[4,"SUM","Yes","Yes","Left Turn",826685,18]
[9,"LAW","No","Yes","Rear End",502809,1]
[7,"MIA","No","No","Left Turn",4789327,128]
[3,"ASD","No","Yes","Unknown",110080,10]
[11,"TUS","No","Yes","Right Turn",72068,1]
[10,"VIN","Yes","No","Head On",574877,2]
[4,"STA","Yes","No","Parked Vehicle",26560214,1476]
[1,"HAR","No","No","Head On",5177214,18]
[1,"HAR","No","No","Train",11008,1]
[6,"PIC","No","No","Parked Vehicle",5205488,65]
[3,"LOR","No","Yes","Other Object",88064,8]
[6,"FAY","Yes","No","Fixed Object",72068,1]
[3,"RIC","Yes","Yes","Left Turn",894969,11]
[10,"HOC","No","Yes","Rear End",1548569,31]
[4,"POR","Yes","No","Unknown",651933,9]
[4,"SUM","Yes","Yes","Overturning",2734959,32]
[10,"ATH","Yes","No","Other Non-Collision",188168,6]
[2,"HEN","Yes","No","Rear End",3725692,154]
[4,"STA","Yes","Yes","Rear End",35109342,1264]
[10,"MRG","No","No","Other Object",44032,4]
[12,"CUY","Yes","No","Unknown",1259609,56]
[8,"WAR","Yes","Yes","Other Object",110080,10]
[6,"UNI","Yes","No","Head On",72068,1]
[6,"FRA","Yes","Yes","Angle",11008,1]
[4,"POR","Yes","Yes","Sideswipe - Passing",11008,1]
[8,"WAR","Yes","Yes","Unknown",246992,19]
[6,"PIC","Yes","No","Head On",969445,13]
[4,"POR","No","Yes","Backing",154112,14]
[3,"ASD","No","Yes","Pedestrian",1652563,5]
[3,"WAY","Yes","Yes","Overturning",72068,1]
[12,"LAK","Yes","No","Animal",369284,28]
[8,"PRE","Yes","No","Other Non-Collision",22016,2]
[2,"FUL","Yes","No","Head On",72068,1]
[3,"MED","Yes","Yes","Rear End",11008,1]
[4,"MAH","Yes","No","Animal",379088,31]
[3,"HUR","No","No","Fixed Object",42840414,721]
[3,"WAY","Yes","No","Fixed Object",116100,5]
[3,"LOR","Yes","Yes","Head On",1914003,15]
[1,"PUT","Yes","No","Backing",33024,3]
[3,"WAY","No","Yes","Sideswipe - Passing",2735422,110]
[4,"TRU","No","Yes","Angle",11008,1]
[4,"ATB","No","No","Rear End",18880587,326]
[8,"HAM","Yes","Yes","Left Turn",22016,2]
[3,"HUR","No","No","Sideswipe - Meeting",381324,18]
[2,"SEN","Yes","No","Animal",22016,2]
[2,"WOO","No","Yes","Pedestrian",646945,3]
[11,"HOL","No","No","Right Turn",1412808,71]
[4,"STA","Yes","No","Head On",213796,7]
[5,"LIC","Yes","No","Other Non-Collision",6112563,102]
[2,"WOO","Yes","No","Fixed Object",771645,13]
[1,"HAR","Yes","No","Rear End",796876,42]
[7,"SHE","No","Yes","Fixed Object",7356414,196]
[2,"WOO","Yes","Yes","Sideswipe - Passing",12741562,557]
[4,"POR","Yes","No","Overturning",11008,1]
[9,"JAC","No","No","Backing",468356,37]
[5,"GUE","No","No","Head On",6635774,48]
[10,"MEG","No","No","Overturning",4340513,51]
[6,"UNI","No","Yes","Other Object",103888,6]
[11,"COL","Yes","No","Parked Vehicle",1396177,42]
[5,"MUS","No","No","Fixed Object",56279621,1174]
[10,"ATH","Yes","No","Left Turn",1264650,11]
[10,"MEG","Yes","No","Rear End",3685775,84]
[6,"MRW","No","No","Other Object",94084,3]
[5,"PER","Yes","No","Fixed Object",11008,1]
[7,"AUG","Yes","Yes","Pedestrian",502809,1]
[4,"MAH","Yes","No","Other Object",522020,35]
[11,"HAS","No","No","Pedestrian",2634961,7]
[0,"WAR","No","No","Sideswipe - Passing",22016,2]
[2,"OTT","No","Yes","Unknown",66048,6]
[4,"POR","No","No","Head On",9584238,88]
[4,"POR","No","No","Train",11008,1]
[9,"PIK","No","No","Backing",1124933,34]
[5,"LIC","Yes","No","Parked Vehicle",2278709,96]
[11,"TUS","No","No","Pedalcycles",3485898,14]
[3,"ASD","Yes","Yes","Animal",324048,26]
[9,"ROS","Yes","No","Fixed Object",138116,7]
[12,"LAK","Yes","No","Backing",1107852,84]
[3,"RIC","Yes","No","Other Non-Collision",888949,16]
[2,"WIL","Yes","No","Angle",6417638,144]
[2,"LUC","No","Yes","Parked Vehicle",144136,2]
[8,"PRE","Yes","No","Rear End",103888,6]
[1,"VAN","Yes","No","Other Object",22016,2]
[3,"ASD","No","No","Backing",1206580,75]
[9,"LAW","Yes","Yes","Rear End",19160245,487]
[3,"ERI","Yes","Yes","Animal",921748,56]
[12,"GEA","Yes","No","Overturning",645741,5]
[4,"MAH","Yes","No","Right Turn",70864,3]
[8,"GRE","Yes","Yes","Angle",1109400,35]
[2,"SEN","No","No","Unknown",804669,16]
[6,"FAY","Yes","No","Sideswipe - Passing",2309669,121]
[8,"HAM","Yes","Yes","Parked Vehicle",72068,1]
[12,"GEA","No","No","Other Non-Vehicle",22016,2]
[2,"FUL","No","Yes","Unknown",110080,10]
[1,"PUT","Yes","No","Parked Vehicle",298248,16]
[9,"LAW","Yes","Yes","Left Turn",831964,23]
[9,"ROS","Yes","Yes","Head On",153940,5]
[7,"MIA","Yes","No","Other Non-Collision",11008,1]
[2,"FUL","Yes","No","Parked Vehicle",33024,3]
[2,"WOO","Yes","No","Unknown",386312,24]
[1,"VAN","Yes","No","Parked Vehicle",11008,1]
[7,"MIA","Yes","No","Rear End",24154913,1126]
[7,"SHE","Yes","Yes","Sideswipe - Passing",5346263,200]
[4,"STA","No","Yes","Unknown",22016,2]
[9,"PIK","No","No","Unknown",171140,10]
[1,"HAN","No","Yes","Head On",585885,3]
[3,"RIC","Yes","No","Other Object",44032,4]
[11,"BEL","Yes","No","Left Turn",153940,5]
[2,"WIL","Yes","No","Parked Vehicle",11008,1]
[3,"CRA","Yes","No","Fixed Object",5434777,134]
[4,"POR","Yes","No","Overturning",4860919,34]
[3,"RIC","Yes","No","Parked Vehicle",10632511,566]
[4,"POR","Yes","No","Backing",1023400,75]
[3,"ASD","No","No","Right Turn",2373587,38]
[8,"BUT","Yes","Yes","Rear End",31378715,1003]
[9,"LAW","No","Yes","Fixed Object",763045,8]
[5,"FAI","No","Yes","Right Turn",70864,3]
[3,"WAY","Yes","No","Pedestrian",192984,3]
[2,"OTT","Yes","Yes","Parked Vehicle",83076,2]
[2,"LUC","Yes","No","Sideswipe - Passing",183453114,8672]
[9,"JAC","No","Yes","Overturning",83076,2]
[4,"MAH","Yes","No","Other Non-Collision",7608209,125]
[5,"COS","No","No","Angle",6895150,80]
[6,"DEL","Yes","Yes","Other Object",220160,20]
[8,"CLE","Yes","No","Left Turn",33024,3]
[2,"OTT","No","No","Other Object",213968,16]
[7,"CLA","Yes","No","Backing",8032850,476]
[3,"MED","Yes","Yes","Parked Vehicle",11008,1]
[6,"MAR","Yes","No","Sideswipe - Passing",136912,9]
[7,"MOT","Yes","Yes","Angle",6500661,132]
[11,"BEL","Yes","No","Fixed Object",276232,14]
[9,"JAC","No","No","Animal",9771254,639]
[6,"PIC","No","Yes","Rear End",3003332,36]
[8,"WAR","Yes","No","Sideswipe - Passing",9726680,384]
[7,"LOG","Yes","Yes","Animal",379088,31]
[9,"ADA","Yes","No","Rear End",11008,1]
[9,"ROS","Yes","No","Left Turn",201584,8]
[6,"UNI","Yes","No","Unknown",285864,8]
[9,"PIK","Yes","No","Backing",11008,1]
[3,"MED","Yes","Yes","Left Turn",11008,1]
[1,"HAN","No","Yes","Animal",1644492,119]
[8,"CLE","Yes","No","Head On",32601783,360]
[3,"RIC","Yes","No","Other Non-Collision",11008,1]
[4,"MAH","Yes","No","Fixed Object",1931838,37]
[2,"WIL","No","No","Pedestrian",2000691,11]
[12,"GEA","Yes","No","Angle",6239287,168]
[11,"TUS","Yes","Yes","Other Non-Collision",1057853,39]
[4,"STA","Yes","No","Sideswipe - Passing",1915789,81]
[11,"TUS","Yes","No","Right Turn",66048,6]
[8,"PRE","No","No","Parked Vehicle",2152739,47]
[9,"BRO","Yes","No","Overturning",11008,1]
[6,"UNI","No","No","Pedestrian",850937,7]
[3,"RIC","Yes","No","Head On",2088755,19]
[6,"FAY","No","No","Fixed Object",29598834,573]
[3,"LOR","Yes","No","Right Turn",14010459,524]
[8,"BUT","Yes","No","Head On",41360103,494]
[8,"BUT","Yes","No","Train",55040,5]
[2,"WIL","Yes","No","Pedestrian",216204,3]
[7,"MER","Yes","No","Backing",2114793,144]
[9,"LAW","No","No","Head On",6011943,77]
[4,"TRU","Yes","No","Left Turn",48946718,967]
[1,"PUT","Yes","No","Fixed Object",22016,2]
[11,"HAS","No","No","Sideswipe - Passing",4465094,76]
[6,"PIC","Yes","No","Unknown",110080,10]
[10,"ATH","Yes","Yes","Other Non-Collision",579865,8]
[8,"BUT","No","No","Other Object",81872,4]
[2,"SAN","Yes","Yes","Left Turn",48848,1]
[1,"WYA","No","Yes","Animal",495188,36]
[8,"HAM","Yes","No","Pedalcycles",37677966,343]
[9,"JAC","Yes","No","Parked Vehicle",22016,2]
[5,"MUS","No","Yes","Animal",4356694,229]
[8,"BUT","Yes","Yes","Animal",1657392,89]
[10,"WAS","No","Yes","Angle",11008,1]
[11,"TUS","No","Yes","Overturning",1351338,12]
[3,"RIC","Yes","No","Right Turn",11008,1]
[3,"LOR","Yes","No","Animal",919737,32]
[5,"GUE","No","Yes","Parked Vehicle",175956,7]
[9,"SCI","No","No","Right Turn",2895832,31]
[3,"CRA","Yes","No","Rear End",2974224,128]
[1,"ALL","No","No","Pedalcycles",863149,6]
[7,"DAR","Yes","No","Rear End",192984,3]
[3,"HUR","No","No","Other Object",425356,22]
[8,"HAM","Yes","Yes","Animal",11008,1]
[8,"WAR","Yes","No","Parked Vehicle",2892974,119]
[3,"ERI","Yes","No","Parked Vehicle",22016,2]
[2,"SEN","Yes","No","Left Turn",11008,1]
[12,"LAK","Yes","No","Overturning",8951847,44]
[4,"STA","Yes","No","Right Turn",1200560,80]
[10,"MEG","No","No","Angle",5247694,66]
[8,"GRE","Yes","No","Animal",33024,3]
[3,"LOR","Yes","Yes","Angle",1402766,18]
[6,"FAY","No","No","Rear End",5224143,135]
[10,"VIN","No","No","Pedestrian",48848,1]
[3,"LOR","Yes","No","Other Object",33024,3]
[1,"HAN","Yes","No","Right Turn",3842017,187]
[7,"CHP","Yes","No","Pedestrian",1882646,18]
[3,"LOR","No","No","Pedestrian",3222513,16]
[3,"ERI","Yes","No","Unknown",44032,4]
[12,"LAK","No","No","Sideswipe - Passing",989860,45]
[6,"FAY","No","No","Overturning",8853701,61]
[11,"JEF","Yes","No","Head On",5237427,60]
[11,"COL","Yes","Yes","Other Non-Collision",33024,3]
[7,"CLA","Yes","No","Fixed Object",76505037,1780]
[6,"FRA","No","No","Overturning",995073,9]
[1,"DEF","Yes","Yes","Right Turn",22016,2]
[10,"NOB","No","No","Animal",1285409,61]
[7,"CHP","No","No","Pedalcycles",2105320,7]
[4,"STA","Yes","Yes","Other Object",1171492,94]
[2,"WOO","Yes","No","Unknown",72068,1]
[6,"PIC","Yes","No","Sideswipe - Passing",918996,42]
[2,"WIL","Yes","No","Animal",22016,2]
[4,"ATB","Yes","No","Pedalcycles",3304848,28]
[9,"LAW","Yes","No","Head On",7932985,59]
[4,"MAH","Yes","No","Parked Vehicle",11008,1]
[4,"SUM","Yes","Yes","Left Turn",11008,1]
[1,"PUT","No","No","Sideswipe - Passing",511012,34]
[4,"MAH","Yes","No","Left Turn",153940,5]
[2,"SAN","Yes","No","Angle",1670398,32]
[3,"MED","Yes","No","Head On",1680030,21]
[7,"AUG","Yes","No","Sideswipe - Passing",44032,4]
[3,"WAY","No","Yes","Fixed Object",7354284,182]
[2,"WOO","Yes","No","Backing",198144,18]
[4,"MAH","No","No","Sideswipe - Meeting",72068,1]
[11,"COL","Yes","No","Head On",562665,3]
[5,"COS","Yes","No","Fixed Object",72068,1]
[10,"ATH","Yes","No","Angle",44032,4]
[4,"TRU","No","No","Other Non-Collision",1781854,49]
[7,"DAR","No","No","Sideswipe - Passing",6779989,183]
[2,"WOO","Yes","No","Other Object",11008,1]
[3,"ASD","Yes","No","Overturning",72068,1]
[8,"HAM","No","Yes","Rear End",1407185,48]
[5,"MUS","Yes","No","Other Object",319060,20]
[2,"SEN","Yes","No","Angle",7070497,189]
[2,"HEN","Yes","Yes","Animal",413316,32]
[6,"FRA","Yes","No","Left Turn",399442843,8492]
[6,"UNI","Yes","No","Animal",11008,1]
[10,"MRG","No","No","Pedestrian",574877,2]
[1,"HAN","No","Yes","Unknown",121088,11]
[10,"HOC","Yes","No","Rear End",196768,11]
[4,"STA","Yes","No","Other Non-Collision",1103089,41]
[4,"ATB","Yes","No","Sideswipe - Passing",6449180,247]
[5,"GUE","Yes","No","Right Turn",1965841,80]
[6,"PIC","Yes","No","Backing",934304,78]
[8,"WAR","Yes","No","Pedestrian",192984,3]
[7,"LOG","Yes","No","Animal",193156,12]
[12,"CUY","Yes","No","Left Turn",316198651,8142]
[3,"WAY","Yes","Yes","Unknown",22016,2]
[3,"CRA","No","No","Left Turn",422776,17]
[5,"LIC","No","No","Sideswipe - Passing",11962098,321]
[3,"ERI","Yes","No","Backing",253184,23]
[4,"SUM","Yes","No","Unknown",6171572,216]
[9,"ROS","Yes","Yes","Unknown",55040,5]
[8,"PRE","Yes","No","Pedalcycles",515484,8]
[4,"POR","Yes","No","Pedalcycles",4672936,54]
[7,"MIA","No","No","Backing",826632,64]
[2,"SAN","No","No","Left Turn",6070767,90]
[9,"ROS","Yes","Yes","Other Non-Collision",231168,21]
[2,"HEN","Yes","No","Animal",127108,6]
[3,"LOR","Yes","No","Other Non-Collision",276060,5]
[12,"CUY","Yes","No","Pedestrian",307201177,1851]
[6,"MRW","No","No","Pedestrian",5448286,17]
[5,"COS","No","No","Overturning",4642770,43]
[2,"WIL","No","No","Left Turn",6926692,98]
[4,"MAH","No","No","Pedestrian",2238448,8]
[1,"PUT","Yes","No","Animal",210184,8]
[3,"CRA","Yes","No","Animal",907472,79]
[4,"STA","Yes","Yes","Animal",5314046,303]
[1,"DEF","Yes","No","Backing",2171672,169]
[1,"DEF","No","Yes","Rear End",155144,3]
[11,"HOL","No","No","Rear End",20791427,607]
[11,"TUS","Yes","No","Overturning",3673325,30]
[7,"CLA","Yes","No","Right Turn",1064905,23]
[7,"MOT","Yes","No","Overturning",16874644,150]
[2,"SAN","No","No","Unknown",187136,17]
[7,"MIA","Yes","No","Angle",315276,12]
[10,"ATH","Yes","No","Unknown",22016,2]
[3,"MED","Yes","Yes","Sideswipe - Passing",3449513,154]
[7,"SHE","No","No","Overturning",5613128,55]
[12,"GEA","Yes","No","Pedalcycles",11008,1]
[8,"HAM","Yes","Yes","Other Non-Collision",33024,3]
[12,"CUY","No","No","Backing",110080,10]
[1,"HAN","Yes","No","Fixed Object",17508238,656]
[8,"WAR","Yes","Yes","Fixed Object",9385392,296]
[3,"ASD","Yes","No","Rear End",12128673,411]
[8,"CLI","Yes","No","Rear End",7873803,275]
[3,"CRA","No","Yes","Animal",1231176,87]
[8,"BUT","Yes","Yes","Right Turn",1285462,15]
[9,"ROS","Yes","No","Unknown",48848,1]
[4,"SUM","Yes","Yes","Right Turn",2814542,100]
[3,"LOR","Yes","No","Backing",14023901,1020]
[11,"HAS","Yes","No","Fixed Object",94084,3]
[6,"UNI","No","No","Right Turn",1157957,37]
[2,"FUL","No","No","Other Non-Collision",1600910,36]
[1,"VAN","Yes","No","Backing",347268,26]
[6,"PIC","Yes","No","Other Non-Collision",590873,9]
[2,"SAN","Yes","No","Left Turn",22016,2]
[6,"FRA","No","No","Other Non-Collision",59856,2]
[5,"COS","No","No","Pedestrian",646945,3]
[3,"HUR","Yes","No","Head On",607901,5]
[9,"BRO","Yes","No","Rear End",486416,22]
[1,"PUT","No","No","Head On",1773651,16]
[1,"PUT","No","No","Train",105092,4]
[3,"ERI","No","No","Rear End",8314467,263]
[12,"GEA","Yes","No","Animal",77056,7]
[4,"MAH","Yes","No","Sideswipe - Passing",42948957,2075]
[10,"NOB","Yes","No","Sideswipe - Passing",154112,14]
[1,"DEF","Yes","No","Animal",11008,1]
[7,"AUG","Yes","Yes","Left Turn",33024,3]
[11,"COL","Yes","No","Angle",2347853,69]
[2,"FUL","Yes","No","Pedalcycles",94084,3]
[4,"MAH","Yes","No","Backing",22016,2]
[2,"SAN","Yes","No","Rear End",3549961,110]
[11,"JEF","Yes","Yes","Head On",932809,11]
[10,"ATH","Yes","Yes","Other Object",33024,3]
[3,"CRA","Yes","No","Sideswipe - Meeting",197972,9]
[3,"ERI","Yes","No","Parked Vehicle",860913,19]
[5,"LIC","Yes","No","Overturning",645741,5]
[2,"LUC","Yes","Yes","Parked Vehicle",1501097,37]
[9,"ADA","No","No","Other Object",180944,13]
[3,"MED","Yes","No","Sideswipe - Passing",1340674,29]
[5,"MUS","Yes","Yes","Animal",1309608,101]
[2,"OTT","Yes","No","Left Turn",390956,12]
[5,"LIC","No","Yes","Parked Vehicle",1381954,14]
[6,"FRA","Yes","No","Sideswipe - Passing",6005089,341]
[9,"HIG","Yes","No","Rear End",607901,5]
[2,"SAN","Yes","Yes","Head On",513817,2]
[7,"MOT","No","Yes","Right Turn",11008,1]
[10,"ATH","Yes","No","Parked Vehicle",474204,23]
[4,"TRU","Yes","No","Fixed Object",114368234,2129]
[3,"HUR","Yes","No","Backing",2865401,190]
[5,"LIC","No","No","Other Non-Vehicle",11008,1]
[11,"COL","No","No","Fixed Object",76500155,1467]
[4,"MAH","Yes","No","Head On",48848,1]
[4,"MAH","Yes","No","Train",502809,1]
[7,"MIA","Yes","Yes","Other Object",572244,43]
[10,"ATH","Yes","No","Angle",1666786,33]
[9,"ROS","Yes","No","Fixed Object",694020,25]
[5,"FAI","Yes","Yes","Overturning",585885,3]
[4,"ATB","No","Yes","Animal",5273004,358]
[1,"HAR","Yes","No","Parked Vehicle",3183363,120]
[3,"ERI","Yes","No","Fixed Object",32988108,556]
[7,"MOT","Yes","No","Other Object",131924,3]
[3,"HUR","Yes","No","Other Non-Collision",55040,5]
[9,"LAW","Yes","Yes","Head On",263848,6]
[2,"LUC","No","No","Overturning",3185877,19]
[4,"STA","Yes","No","Animal",1548000,115]
[8,"BUT","Yes","Yes","Head On",1527294,19]
[11,"JEF","Yes","No","Left Turn",22016,2]
[5,"MUS","No","Yes","Unknown",176128,16]
[8,"WAR","Yes","No","Head On",2800438,62]
[3,"CRA","Yes","Yes","Overturning",11008,1]
[7,"DAR","Yes","No","Animal",55040,5]
[8,"CLI","No","No","Pedalcycles",1103314,4]
[8,"WAR","Yes","No","Pedalcycles",2954775,34]
[7,"CLA","Yes","No","Rear End",7671187,208]
[7,"AUG","Yes","No","Angle",623725,3]
[5,"LIC","Yes","Yes","Head On",1082674,9]
[12,"GEA","Yes","No","Head On",4302779,29]
[7,"CLA","No","No","Pedestrian",3674807,10]
[3,"ERI","Yes","No","Parked Vehicle",9461866,415]
[9,"JAC","Yes","No","Other Non-Collision",33024,3]
[7,"DAR","No","No","Other Object",523396,42]
[3,"MED","Yes","Yes","Left Turn",11008,1]
[10,"GAL","Yes","No","Left Turn",11008,1]
[6,"UNI","Yes","Yes","Rear End",70864,3]
[8,"WAR","No","Yes","Head On",1005618,2]
[3,"CRA","No","Yes","Fixed Object",1396177,42]
[5,"FAI","Yes","Yes","Backing",33024,3]
[2,"SEN","No","No","Animal",23860330,1663]
[6,"FAY","No","No","Animal",7250078,467]
[2,"WOO","Yes","No","Left Turn",5298513,169]
[5,"FAI","Yes","Yes","Unknown",44032,4]
[7,"CLA","Yes","No","Parked Vehicle",55040,5]
[3,"RIC","No","Yes","Pedestrian",1005618,2]
[6,"PIC","Yes","No","Left Turn",6770807,110]
[11,"JEF","Yes","Yes","Sideswipe - Passing",219988,11]
[3,"ASD","No","No","Rear End",13640474,288]
[8,"GRE","Yes","No","Rear End",85311486,3260]
[5,"LIC","Yes","No","Other Non-Collision",1190981,40]
[7,"AUG","No","No","Other Object",722969,21]
[2,"SEN","Yes","No","Sideswipe - Passing",1679408,96]
[7,"AUG","Yes","No","Pedestrian",216204,3]
[2,"FUL","Yes","No","Overturning",1065474,4]
[4,"POR","Yes","No","Overturning",849733,9]
[8,"WAR","Yes","No","Animal",5555944,403]
[9,"ROS","No","No","Fixed Object",93191036,1738]
[3,"ERI","Yes","No","Unknown",282252,9]
[2,"WOO","No","No","Rear End",14340382,301]
[3,"MED","Yes","Yes","Right Turn",44032,4]
[9,"BRO","No","No","Animal",14460464,757]
[2,"SEN","No","No","Fixed Object",48764135,694]
[12,"CUY","Yes","No","Overturning",24632255,205]
[7,"SHE","Yes","No","Backing",55040,5]
[4,"STA","No","No","Head On",15711752,121]
[11,"JEF","No","No","Backing",346064,28]
[4,"STA","No","No","Train",11008,1]
[6,"FAY","No","No","Unknown",645741,5]
[1,"ALL","Yes","No","Overturning",83076,2]
[8,"CLE","Yes","Yes","Sideswipe - Passing",12607124,505]
[4,"SUM","Yes","No","Other Non-Collision",958609,21]
[1,"HAN","Yes","No","Other Object",330240,30]
[7,"MER","Yes","No","Fixed Object",4923196,119]
[3,"RIC","Yes","No","Parked Vehicle",533028,36]
[8,"WAR","Yes","Yes","Fixed Object",799112,29]
[2,"FUL","No","Yes","Parked Vehicle",203992,4]
[5,"PER","No","No","Unknown",845089,21]
[6,"PIC","Yes","No","Animal",88064,8]
[3,"WAY","Yes","No","Pedalcycles",802089,6]
[4,"STA","Yes","Yes","Pedalcycles",130720,5]
[3,"MED","Yes","Yes","Head On",535833,4]
[5,"GUE","Yes","No","Animal",2256984,158]
[3,"HUR","No","No","Right Turn",1218845,28]
[5,"FAI","No","No","Rear End",14669960,394]
[7,"CLA","Yes","No","Head On",15346212,169]
[7,"CLA","Yes","No","Train",105092,4]
[3,"ERI","Yes","Yes","Angle",1302490,11]
[7,"MER","Yes","No","Left Turn",2640478,62]
[10,"NOB","No","No","Other Non-Collision",773021,20]
[8,"WAR","Yes","Yes","Left Turn",48848,1]
[4,"POR","No","Yes","Rear End",4825897,89]
[6,"UNI","No","Yes","Overturning",237016,7]
[1,"HAN","No","Yes","Other Non-Collision",286208,26]
[7,"AUG","Yes","No","Animal",1122644,93]
[9,"JAC","Yes","No","Left Turn",94084,3]
[10,"MOE","No","No","Other Non-Collision",204164,13]
[7,"AUG","Yes","No","Pedalcycles",131924,3]
[2,"WOO","No","No","Overturning",6569329,75]
[3,"CRA","No","No","Parked Vehicle",821697,12]
[0,"LOR","Yes","No","Right Turn",11008,1]
[12,"GEA","No","No","Right Turn",2165652,104]
[7,"AUG","Yes","Yes","Unknown",22016,2]
[8,"WAR","Yes","Yes","Pedestrian",502809,1]
[2,"SAN","Yes","No","Backing",55040,5]
[2,"WOO","Yes","No","Right Turn",99072,9]
[5,"MUS","Yes","No","Other Non-Collision",1031656,57]
[4,"TRU","Yes","Yes","Fixed Object",26330357,677]
[5,"KNO","No","No","Sideswipe - Passing",6957546,155]
[4,"ATB","Yes","No","Left Turn",1044556,32]
[4,"ATB","No","Yes","Right Turn",546841,5]
[4,"STA","Yes","Yes","Right Turn",643968,26]
[7,"CLA","Yes","No","Fixed Object",10481800,196]
[4,"STA","Yes","No","Other Object",634905,13]
[2,"OTT","No","Yes","Head On",585885,3]
[8,"WAR","Yes","No","Parked Vehicle",1030452,59]
[2,"WOO","No","Yes","Sideswipe - Passing",10223442,460]
[6,"FAY","Yes","No","Backing",11008,1]
[9,"JAC","No","No","Left Turn",5668234,91]
[6,"MAD","No","Yes","Overturning",1650618,17]
[9,"SCI","No","No","Other Object",768033,14]
[11,"CAR","No","No","Backing",1614617,102]
[12,"GEA","Yes","Yes","Fixed Object",380120,20]
[8,"BUT","No","No","Sideswipe - Passing",4785318,172]
[6,"UNI","Yes","Yes","Left Turn",22016,2]
[12,"GEA","No","Yes","Right Turn",11008,1]
[12,"LAK","No","No","Other Object",11008,1]
[9,"HIG","Yes","No","Unknown",11008,1]
[8,"CLE","Yes","No","Sideswipe - Passing",26348046,1284]
[4,"MAH","Yes","No","Other Non-Collision",502809,1]
[8,"GRE","Yes","No","Parked Vehicle",16794041,779]
[3,"RIC","Yes","Yes","Animal",5356252,369]
[3,"MED","No","Yes","Rear End",8609646,162]
[2,"SAN","Yes","No","Head On",833909,11]
[5,"FAI","Yes","Yes","Overturning",312696,7]
[1,"ALL","Yes","No","Angle",1154808,51]
[4,"POR","Yes","No","Right Turn",590873,9]
[2,"WOO","Yes","Yes","Fixed Object",513817,2]
[10,"GAL","No","No","Other Non-Collision",757025,13]
[7,"AUG","Yes","No","Right Turn",446168,26]
[4,"STA","Yes","No","Angle",9711253,223]
[6,"DEL","Yes","No","Right Turn",149124,8]
[2,"LUC","Yes","No","Sideswipe - Meeting",48848,1]
[7,"LOG","No","Yes","Head On",33024,3]
[1,"VAN","Yes","No","Right Turn",81872,4]
[9,"HIG","No","No","Head On",9264887,69]
[7,"MOT","Yes","No","Pedestrian",128626338,721]
[7,"SHE","No","No","Animal",9768793,759]
[11,"COL","Yes","No","Overturning",227212,4]
[7,"AUG","Yes","No","Backing",962512,84]
[6,"FAY","Yes","Yes","Parked Vehicle",72068,1]
[3,"RIC","Yes","No","Fixed Object",410564,18]
[1,"HAR","No","No","Unknown",197972,9]
[7,"LOG","Yes","No","Pedalcycles",585885,3]
[1,"WYA","No","Yes","Right Turn",72068,1]
[2,"LUC","Yes","No","Pedestrian",99311488,593]
[4,"TRU","Yes","Yes","Parked Vehicle",749629,11]
[5,"LIC","Yes","Yes","Backing",535833,4]
[5,"GUE","No","Yes","Backing",242004,13]
[7,"CLA","Yes","No","Parked Vehicle",4231068,133]
[12,"CUY","Yes","No","Left Turn",4940515,189]
[10,"WAS","Yes","No","Overturning",1784487,8]
[12,"LAK","No","No","Angle",7656144,127]
[2,"WIL","No","No","Right Turn",1137145,33]
[4,"ATB","Yes","Yes","Fixed Object",88064,8]
[8,"CLE","No","Yes","Right Turn",22016,2]
[6,"MRW","No","No","Overturning",8967102,61]
[11,"COL","Yes","No","Train",502809,1]
[11,"COL","Yes","No","Head On",2400988,18]
[2,"HEN","No","No","Pedalcycles",634733,4]
[11,"TUS","No","No","Rear End",11522492,366]
[2,"OTT","No","No","Pedestrian",2707029,8]
[10,"ATH","Yes","Yes","Unknown",22016,2]
[2,"SAN","No","Yes","Overturning",393364,8]
[7,"MIA","Yes","Yes","Pedalcycles",72068,1]
[9,"HIG","Yes","No","Sideswipe - Passing",248196,17]
[5,"LIC","No","Yes","Unknown",182148,11]
[10,"WAS","No","Yes","Right Turn",11008,1]
[6,"MAD","No","No","Right Turn",2725499,52]
[10,"ATH","Yes","No","Right Turn",767464,38]
[11,"JEF","Yes","No","Unknown",22016,2]
[9,"JAC","Yes","Yes","Overturning",657953,4]
[9,"PIK","Yes","No","Other Object",92880,5]
[2,"WIL","No","No","Overturning",10186238,83]
[3,"CRA","Yes","No","Unknown",1126706,13]
[7,"MOT","Yes","No","Parked Vehicle",1434361,60]
[6,"DEL","Yes","No","Pedalcycles",155144,3]
[8,"BUT","Yes","No","Sideswipe - Passing",17338924,584]
[4,"ATB","No","No","Pedalcycles",1438026,8]
[2,"WOO","Yes","Yes","Rear End",11008,1]
[3,"RIC","No","No","Sideswipe - Meeting",72068,1]
[7,"MOT","No","No","Parked Vehicle",1170169,36]
[7,"CHP","Yes","No","Unknown",22016,2]
[2,"HEN","Yes","Yes","Backing",11008,1]
[4,"POR","No","No","Parked Vehicle",1190809,31]
[4,"SUM","Yes","Yes","Fixed Object",108847509,2393]
[10,"WAS","No","No","Backing",869116,52]
[3,"LOR","Yes","Yes","Overturning",3244529,23]
[4,"ATB","Yes","No","Fixed Object",6544508,105]
[6,"DEL","Yes","No","Right Turn",8463657,382]
[6,"MRW","No","Yes","Other Non-Collision",676304,58]
[7,"MIA","No","Yes","Other Object",22016,2]
[8,"GRE","Yes","Yes","Right Turn",705769,16]
[7,"CLA","Yes","No","Backing",721540,60]
[8,"BUT","Yes","No","Unknown",44032,4]
[6,"MAD","No","Yes","Pedestrian",1701411,6]
[9,"SCI","No","Yes","Angle",607901,5]
[7,"AUG","Yes","No","Pedalcycles",1190465,13]
[1,"ALL","No","No","Backing",907300,70]
[2,"SAN","Yes","No","Overturning",72068,1]
[7,"AUG","No","Yes","Unknown",66048,6]
[4,"ATB","Yes","Yes","Rear End",768033,14]
[3,"ERI","Yes","No","Right Turn",77056,7]
[4,"SUM","Yes","Yes","Unknown",110080,10]
[5,"PER","No","No","Other Object",369112,19]
[10,"NOB","No","Yes","Left Turn",11008,1]
[7,"MIA","Yes","Yes","Sideswipe - Passing",5270186,233]
[6,"FAY","No","No","Other Object",795037,22]
[3,"LOR","Yes","No","Rear End",6752535,269]
[11,"COL","Yes","No","Other Non-Collision",2775895,69]
[8,"GRE","Yes","No","Rear End",363092,24]
[9,"SCI","Yes","No","Pedalcycles",11008,1]
[3,"ERI","Yes","No","Head On",186964,8]
[1,"ALL","No","Yes","Other Object",99072,9]
[8,"WAR","Yes","No","Backing",2322860,155]
[8,"WAR","Yes","No","Pedestrian",9207386,49]
[8,"BUT","Yes","No","Other Non-Collision",1910285,48]
[2,"WOO","Yes","No","Overturning",2576031,21]
[2,"HEN","Yes","Yes","Overturning",1148550,6]
[9,"JAC","Yes","Yes","Unknown",11008,1]
[9,"JAC","No","Yes","Fixed Object",127108,6]
[7,"LOG","No","Yes","Rear End",2036295,24]
[7,"LOG","Yes","No","Parked Vehicle",281220,20]
[11,"COL","Yes","No","Right Turn",110080,10]
[6,"MAR","Yes","No","Angle",43587819,921]
[1,"HAN","Yes","No","Head On",11008,1]
[1,"HAN","Yes","No","Train",72068,1]
[11,"JEF","No","No","Parked Vehicle",898925,28]
[6,"MAD","No","No","Overturning",4132737,44]
[9,"SCI","Yes","No","Head On",7891890,95]
[9,"SCI","Yes","No","Train",502809,1]
[3,"ASD","No","Yes","Other Object",446340,35]
[6,"MAR","Yes","No","Parked Vehicle",7306031,336]
[7,"MIA","Yes","No","Overturning",2881781,17]
[12,"LAK","No","No","Head On",2845145,15]
[10,"HOC","No","Yes","Animal",1100456,82]
[3,"MED","Yes","No","Left Turn",114896,7]
[1,"HAN","Yes","No","Parked Vehicle",11008,1]
[3,"ERI","Yes","Yes","Rear End",243208,11]
[5,"LIC","No","Yes","Backing",88064,8]
[3,"WAY","Yes","Yes","Left Turn",103888,6]
[1,"PAU","No","Yes","Head On",1027634,4]
[2,"FUL","No","No","Sideswipe - Passing",4386900,107]
[0,"CUY","No","No","Other Non-Collision",11008,1]
[2,"FUL","No","No","Unknown",618909,6]
[1,"PAU","No","No","Left Turn",1554933,44]
[9,"ROS","No","Yes","Right Turn",22016,2]
[8,"WAR","Yes","No","Other Object",269008,21]
[6,"MAR","Yes","No","Other Non-Collision",94084,3]
[4,"STA","No","No","Unknown",926961,25]
[4,"STA","Yes","No","Other Object",164948,6]
[6,"FAY","No","Yes","Sideswipe - Passing",6106040,237]
[11,"JEF","Yes","Yes","Other Non-Collision",11008,1]
[5,"LIC","Yes","Yes","Unknown",99072,9]
[2,"HEN","Yes","No","Right Turn",520816,37]
[9,"HIG","Yes","No","Rear End",10942693,479]
[7,"SHE","Yes","Yes","Backing",44032,4]
[2,"OTT","Yes","No","Head On",957233,14]
[2,"OTT","Yes","No","Train",22016,2]
[7,"LOG","Yes","No","Unknown",44032,4]
[3,"ASD","Yes","Yes","Right Turn",48848,1]
[11,"COL","Yes","No","Pedestrian",502809,1]
[10,"ATH","Yes","Yes","Angle",1160762,5]
[6,"FAY","Yes","Yes","Other Non-Collision",44032,4]
[9,"HIG","No","No","Left Turn",6673918,129]
[2,"WIL","No","No","Fixed Object",37252199,776]
[7,"DAR","Yes","No","Backing",55040,5]
[10,"WAS","Yes","Yes","Other Object",11008,1]
[1,"VAN","Yes","No","Rear End",210184,8]
[5,"GUE","No","Yes","Animal",3646228,276]
[11,"BEL","Yes","No","Overturning",2584168,18]
[7,"AUG","Yes","Yes","Head On",22016,2]
[1,"ALL","No","No","Unknown",861085,28]
[3,"ERI","Yes","No","Right Turn",2705441,125]
[7,"AUG","Yes","No","Unknown",116100,5]
[9,"LAW","No","No","Sideswipe - Passing",2337586,58]
[9,"ROS","Yes","No","Backing",11008,1]
[1,"HAN","No","Yes","Sideswipe - Passing",3905710,141]
[4,"MAH","Yes","No","Pedestrian",216204,3]
[11,"BEL","Yes","No","Head On",105092,4]
[2,"SEN","Yes","No","Other Object",83076,2]
[7,"MOT","No","Yes","Overturning",72068,1]
[6,"FAY","Yes","Yes","Sideswipe - Passing",358104,18]
[8,"BUT","Yes","No","Sideswipe - Passing",64013612,3079]
[12,"CUY","Yes","No","Parked Vehicle",15488534,1069]
[9,"ADA","Yes","No","Backing",83076,2]
[8,"GRE","Yes","No","Parked Vehicle",226180,15]
[10,"VIN","No","No","Other Non-Collision",182148,11]
[11,"JEF","Yes","No","Sideswipe - Passing",5815704,250]
[9,"JAC","Yes","No","Angle",33024,3]
[3,"ERI","No","No","Left Turn",2258691,31]
[3,"ASD","No","No","Left Turn",6737386,130]
[9,"BRO","No","No","Right Turn",906956,52]
[4,"SUM","Yes","No","Parked Vehicle",58753654,2941]
[4,"POR","No","No","Left Turn",12514787,227]
[8,"WAR","No","No","Pedestrian",1795495,9]
[1,"WYA","No","Yes","Rear End",83076,2]
[8,"WAR","Yes","No","Overturning",11008,1]
[4,"ATB","Yes","No","Fixed Object",83076,2]
[1,"PAU","No","No","Head On",2069319,27]
[1,"PAU","No","No","Train",11008,1]
[3,"MED","Yes","Yes","Rear End",1834777,57]
[3,"HUR","Yes","No","Unknown",208980,10]
[7,"AUG","No","No","Angle",20958546,205]
[11,"JEF","No","No","Fixed Object",45688364,779]
[8,"GRE","Yes","No","Fixed Object",182148,11]
[6,"UNI","Yes","Yes","Parked Vehicle",22016,2]
[5,"FAI","No","Yes","Rear End",2715867,58]
[9,"PIK","No","No","Right Turn",1311553,24]
[10,"MEG","Yes","No","Fixed Object",5282266,95]
[0,"LOR","Yes","No","Fixed Object",22016,2]
[6,"MAD","No","No","Rear End",20099895,377]
[7,"CLA","No","No","Other Object",590873,9]
[3,"LOR","No","Yes","Sideswipe - Passing",871352,39]
[2,"FUL","No","No","Angle",47192465,458]
[5,"FAI","Yes","Yes","Fixed Object",1427256,57]
[5,"PER","Yes","No","Left Turn",502809,1]
[2,"SEN","Yes","No","Right Turn",11008,1]
[2,"SAN","No","Yes","Rear End",5292361,92]
[7,"MER","No","No","Angle",23610469,232]
[4,"STA","Yes","No","Unknown",2160942,80]
[6,"PIC","Yes","No","Unknown",1060658,7]
[4,"ATB","Yes","No","Backing",1338041,70]
[9,"ADA","No","No","Pedestrian",1580495,4]
[2,"WOO","Yes","Yes","Angle",1568918,22]
[4,"STA","No","No","Angle",33051152,520]
[7,"MOT","No","No","Rear End",5153451,151]
[10,"HOC","Yes","Yes","Fixed Object",4064453,56]
[1,"PUT","Yes","No","Rear End",3833867,103]
[4,"POR","Yes","No","Left Turn",8816985,205]
[3,"LOR","Yes","No","Angle",4695812,111]
[8,"BUT","Yes","No","Left Turn",1906673,44]
[10,"HOC","Yes","No","Overturning",127108,6]
[4,"ATB","Yes","Yes","Animal",66048,6]
[7,"MOT","No","No","Fixed Object",24000591,383]
[7,"CLA","Yes","Yes","Left Turn",11008,1]
[3,"LOR","Yes","Yes","Rear End",9859874,296]
[1,"ALL","No","Yes","Left Turn",70864,3]
[7,"CLA","Yes","Yes","Fixed Object",11008,1]
[8,"CLE","Yes","No","Head On",22016,2]
[9,"BRO","Yes","No","Overturning",11008,1]
[4,"TRU","Yes","No","Angle",314072,14]
[7,"DAR","Yes","Yes","Left Turn",70864,3]
[4,"TRU","Yes","No","Head On",24860962,261]
[4,"TRU","Yes","No","Train",70864,3]
[5,"LIC","Yes","No","Sideswipe - Passing",16796727,707]
[8,"GRE","Yes","Yes","Animal",11008,1]
[5,"GUE","No","Yes","Fixed Object",8527787,240]
[8,"WAR","Yes","Yes","Left Turn",11008,1]
[3,"CRA","Yes","Yes","Animal",542832,39]
[7,"MIA","Yes","No","Animal",2965452,239]
[2,"LUC","Yes","Yes","Unknown",2394346,88]
[12,"LAK","Yes","No","Parked Vehicle",501208,31]
[8,"GRE","No","Yes","Parked Vehicle",59856,2]
[8,"PRE","Yes","No","Rear End",6052270,276]
[10,"MEG","Yes","No","Animal",955169,31]
[11,"TUS","Yes","No","Parked Vehicle",182148,11]
[10,"MOE","Yes","No","Head On",72068,1]
[7,"MER","Yes","No","Left Turn",48848,1]
[5,"MUS","No","No","Left Turn",7567458,184]
[6,"PIC","Yes","No","Parked Vehicle",2664386,103]
[10,"WAS","No","No","Rear End",10340667,230]
[4,"TRU","No","No","Overturning",6264148,55]
[9,"BRO","No","No","Other Object",374100,25]
[11,"CAR","No","No","Left Turn",5253833,121]
[8,"PRE","No","No","Other Non-Collision",2000863,20]
[1,"HAN","Yes","Yes","Other Non-Collision",303236,22]
[7,"MOT","Yes","Yes","Sideswipe - Passing",84644418,3205]
[2,"WOO","No","Yes","Other Object",770388,61]
[3,"LOR","Yes","No","Fixed Object",105932335,1932]
[4,"TRU","No","No","Pedestrian",3388202,12]
[2,"OTT","No","Yes","Other Non-Collision",165120,15]
[7,"MIA","Yes","Yes","Angle",1016626,3]
[1,"ALL","Yes","No","Other Non-Collision",22016,2]
[10,"GAL","Yes","No","Sideswipe - Passing",11008,1]
[2,"SEN","No","No","Right Turn",2198200,12]
[2,"LUC","Yes","No","Angle",422249067,9870]
[8,"PRE","No","Yes","Head On",232200,10]
[7,"CHP","Yes","No","Angle",59856,2]
[2,"SEN","Yes","No","Pedestrian",2242523,15]
[11,"TUS","Yes","No","Right Turn",2962184,193]
[3,"LOR","No","Yes","Pedestrian",502809,1]
[1,"ALL","Yes","Yes","Parked Vehicle",33024,3]
[1,"HAR","No","No","Parked Vehicle",1176758,12]
[7,"CHP","Yes","No","Backing",908676,77]
[11,"HAS","No","No","Angle",6610212,88]
[3,"MED","Yes","Yes","Right Turn",33024,3]
[2,"HEN","No","Yes","Other Object",55040,5]
[1,"ALL","No","No","Fixed Object",36472140,640]
[8,"HAM","No","No","Sideswipe - Passing",4123171,161]
[7,"MOT","No","Yes","Rear End",436192,14]
[3,"WAY","No","No","Sideswipe - Passing",16607805,394]
[7,"CHP","No","No","Fixed Object",35817032,606]
[5,"GUE","No","No","Sideswipe - Passing",2075114,59]
[11,"TUS","Yes","Yes","Rear End",22016,2]
[9,"LAW","Yes","No","Angle",17970402,509]
[5,"FAI","Yes","No","Sideswipe - Passing",833856,62]
[2,"WOO","Yes","No","Sideswipe - Meeting",816881,15]
[3,"MED","Yes","Yes","Unknown",22016,2]
[2,"OTT","Yes","No","Other Non-Collision",1216609,41]
[1,"DEF","No","No","Backing",1182500,95]
[2,"FUL","Yes","No","Right Turn",426560,25]
[1,"WYA","No","No","Other Non-Collision",662544,38]
[4,"ATB","No","No","Backing",2253425,113]
[7,"MOT","Yes","Yes","Other Non-Collision",8279763,227]
[1,"VAN","Yes","No","Other Non-Collision",121088,11]
[3,"CRA","Yes","Yes","Rear End",628713,9]
[9,"LAW","Yes","No","Overturning",502809,1]
[2,"WOO","Yes","No","Right Turn",2296081,110]
[11,"BEL","No","No","Other Object",171140,10]
[12,"CUY","Yes","Yes","Pedestrian",24434125,75]
[7,"SHE","No","No","Right Turn",518064,18]
[4,"STA","No","Yes","Left Turn",11008,1]
[11,"BEL","Yes","No","Pedalcycles",646945,3]
[5,"GUE","No","No","Parked Vehicle",713628,26]
[0,"FRA","Yes","Yes","Sideswipe - Passing",11008,1]
[1,"HAN","Yes","No","Other Object",11008,1]
[1,"HAR","Yes","No","Pedalcycles",22016,2]
[3,"MED","Yes","No","Animal",1555621,80]
[6,"FAY","No","Yes","Overturning",2730712,21]
[9,"HIG","Yes","No","Left Turn",59856,2]
[2,"OTT","Yes","Yes","Fixed Object",3487909,43]
[2,"WIL","Yes","No","Backing",22016,2]
[4,"POR","Yes","Yes","Other Non-Collision",295840,20]
[7,"CLA","Yes","No","Head On",22016,2]
[8,"BUT","Yes","No","Angle",174562530,4321]
[3,"MED","No","No","Backing",3029026,143]
[8,"HAM","Yes","Yes","Sideswipe - Passing",177298823,7506]
[2,"HEN","Yes","No","Head On",2722284,25]
[7,"CLA","Yes","Yes","Fixed Object",10841875,376]
[12,"GEA","Yes","No","Rear End",7944098,307]
[7,"MER","Yes","No","Animal",33024,3]
[5,"LIC","No","Yes","Left Turn",142932,4]
[9,"PIK","No","No","Left Turn",4214212,76]
[3,"RIC","Yes","No","Left Turn",164948,6]
[12,"CUY","Yes","Yes","Other Object",4865470,276]
[9,"HIG","Yes","No","Right Turn",22016,2]
[3,"RIC","Yes","Yes","Other Non-Collision",44032,4]
[4,"ATB","Yes","No","Parked Vehicle",1118344,63]
[1,"DEF","No","No","Unknown",143104,13]
[2,"OTT","Yes","Yes","Rear End",509464,13]
[5,"GUE","Yes","No","Fixed Object",12063697,321]
[5,"FAI","No","No","Backing",2005454,54]
[8,"HAM","No","Yes","Right Turn",22016,2]
[3,"ERI","Yes","No","Animal",594432,54]
[1,"DEF","No","No","Head On",2398580,17]
[4,"SUM","Yes","No","Parked Vehicle",1642481,90]
[3,"LOR","Yes","Yes","Animal",2402152,154]
[1,"PAU","No","No","Parked Vehicle",1203193,39]
[10,"WAS","Yes","Yes","Overturning",83076,2]
[9,"JAC","No","Yes","Left Turn",72068,1]
[6,"FRA","Yes","No","Overturning",215000,5]
[6,"UNI","Yes","No","Right Turn",403340,20]
[8,"WAR","Yes","No","Backing",1276809,61]
[2,"WOO","Yes","No","Other Object",231168,21]
[2,"WIL","No","Yes","Other Non-Collision",374272,34]
[3,"WAY","Yes","No","Animal",770560,70]
[9,"PIK","Yes","No","Other Non-Collision",805873,14]
[11,"HOL","No","No","Pedalcycles",10104472,52]
[8,"CLI","Yes","No","Fixed Object",8220185,137]
[3,"LOR","Yes","No","Angle",25871897,758]
[10,"HOC","Yes","No","Other Object",22016,2]
[1,"DEF","No","Yes","Animal",88064,8]
[6,"FRA","Yes","Yes","Fixed Object",254570576,4693]
[2,"LUC","Yes","No","Other Object",3018534,104]
[9,"BRO","Yes","No","Fixed Object",1861609,51]
[3,"CRA","No","Yes","Rear End",585144,13]
[10,"WAS","Yes","No","Animal",1086868,76]
[10,"ATH","No","No","Pedalcycles",216204,3]
[5,"MUS","Yes","Yes","Sideswipe - Passing",5402348,351]
[3,"MED","No","No","Pedalcycles",2116328,8]
[1,"HAR","Yes","No","Overturning",11008,1]
[4,"MAH","Yes","Yes","Animal",5858545,343]
[3,"RIC","Yes","No","Backing",44032,4]
[5,"FAI","Yes","No","Rear End",37147820,1426]
[12,"GEA","Yes","No","Rear End",154112,14]
[7,"AUG","Yes","Yes","Other Object",77056,7]
[8,"CLI","No","No","Rear End",13626079,316]
[7,"LOG","Yes","Yes","Fixed Object",1240861,30]
[3,"MED","Yes","No","Fixed Object",5898701,59]
[9,"JAC","Yes","No","Right Turn",1271649,46]
[6,"MAR","No","No","Pedalcycles",144136,2]
[1,"DEF","Yes","No","Sideswipe - Passing",70864,3]
[12,"GEA","Yes","No","Right Turn",1104928,61]
[1,"PUT","Yes","No","Overturning",72068,1]
[12,"CUY","Yes","Yes","Right Turn",11008,1]
[6,"MAD","No","Yes","Other Object",676304,58]
[8,"BUT","Yes","No","Other Non-Collision",8819936,133]
[5,"GUE","No","No","Unknown",712993,9]
[7,"SHE","Yes","Yes","Other Non-Collision",341076,22]
[7,"CHP","No","No","Backing",1590074,44]
[11,"BEL","Yes","No","Other Object",410564,18]
[7,"MIA","Yes","No","Sideswipe - Passing",198144,18]
[12,"CUY","Yes","No","Unknown",36337225,982]
[8,"CLI","Yes","Yes","Animal",380292,29]
[11,"COL","Yes","No","Other Non-Collision",11008,1]
[5,"GUE","Yes","Yes","Pedestrian",502809,1]
[3,"MED","Yes","Yes","Backing",22016,2]
[3,"ERI","Yes","No","Sideswipe - Meeting",727388,46]
[10,"WAS","No","Yes","Overturning",153940,5]
[8,"GRE","No","Yes","Backing",11008,1]
[4,"STA","Yes","No","Left Turn",93107984,2273]
[2,"HEN","Yes","Yes","Unknown",22016,2]
[4,"POR","Yes","No","Parked Vehicle",1308854,24]
[10,"NOB","Yes","No","Angle",814473,19]
[6,"PIC","No","No","Left Turn",6028640,142]
[8,"GRE","Yes","No","Overturning",8074541,46]
[9,"LAW","Yes","No","Other Non-Collision",1075913,24]
[10,"WAS","Yes","No","Parked Vehicle",3937649,206]
[8,"CLE","No","Yes","Fixed Object",22016,2]
[4,"SUM","Yes","Yes","Parked Vehicle",1468814,24]
[7,"CLA","No","Yes","Angle",596893,4]
[7,"MIA","No","No","Parked Vehicle",3135944,75]
[4,"SUM","Yes","No","Left Turn",129889697,3388]
[2,"LUC","No","No","Pedestrian",719013,4]
[8,"BUT","Yes","No","Animal",1295041,55]
[6,"MAR","No","No","Fixed Object",36574202,688]
[4,"ATB","Yes","No","Angle",66048,6]
[6,"PIC","Yes","No","Backing",88064,8]
[9,"JAC","Yes","No","Head On",4472715,41]
[9,"JAC","Yes","No","Train",72068,1]
[1,"PAU","No","No","Angle",14562064,158]
[6,"UNI","Yes","Yes","Fixed Object",375132,14]
[5,"FAI","Yes","No","Animal",1379321,55]
[3,"RIC","Yes","No","Animal",66048,6]
[2,"SAN","Yes","No","Other Non-Collision",375304,23]
[2,"SEN","No","No","Parked Vehicle",1014853,24]
[5,"FAI","Yes","Yes","Angle",11008,1]
[6,"DEL","Yes","No","Sideswipe - Meeting",337292,14]
[3,"RIC","Yes","No","Backing",6201976,482]
[2,"WOO","No","Yes","Overturning",1913262,20]
[8,"BUT","Yes","No","Parked Vehicle",2191968,146]
[5,"LIC","Yes","Yes","Unknown",44032,4]
[2,"HEN","No","No","Overturning",3849744,45]
[8,"CLI","Yes","No","Parked Vehicle",2281686,73]
[3,"ASD","No","Yes","Animal",1504828,91]
[3,"MED","No","Yes","Animal",3566473,199]
[9,"SCI","Yes","No","Angle",44717039,1048]
[7,"CHP","Yes","No","Right Turn",1288677,42]
[10,"ATH","No","No","Angle",10692262,121]
[8,"PRE","No","No","Angle",18277436,277]
[4,"TRU","Yes","Yes","Left Turn",3732162,60]
[3,"WAY","Yes","Yes","Fixed Object",2458158,47]
[4,"SUM","Yes","Yes","Fixed Object",28486218,775]
[7,"DAR","Yes","No","Sideswipe - Passing",2033040,135]
[3,"CRA","Yes","No","Rear End",5682232,176]
[6,"PIC","Yes","No","Right Turn",1924217,72]
[6,"PIC","Yes","No","Backing",606300,35]
[7,"MIA","No","No","Right Turn",672176,32]
[2,"OTT","No","Yes","Sideswipe - Passing",1658424,78]
[7,"SHE","No","No","Fixed Object",25020776,491]
[6,"FRA","Yes","No","Sideswipe - Meeting",66048,6]
[11,"COL","No","No","Animal",10324274,506]
[6,"DEL","Yes","No","Overturning",4668398,39]
[1,"VAN","Yes","No","Left Turn",66048,6]
[9,"BRO","Yes","No","Animal",700953,19]
[1,"PUT","No","No","Other Non-Collision",1428566,28]
[1,"ALL","No","Yes","Overturning",1012273,14]
[12,"LAK","Yes","No","Left Turn",1644029,41]
[11,"COL","Yes","No","Animal",721368,51]
[3,"ASD","Yes","No","Fixed Object",9765367,197]
[3,"ERI","Yes","No","Animal",3319309,241]
[12,"GEA","No","No","Head On",17244775,136]
[5,"LIC","Yes","Yes","Parked Vehicle",131924,3]
[3,"WAY","Yes","No","Right Turn",44032,4]
[9,"ROS","Yes","No","Rear End",153940,5]
[8,"WAR","Yes","No","Animal",1613188,141]
[3,"ASD","No","Yes","Overturning",252840,5]
[7,"SHE","No","No","Unknown",1060658,7]
[2,"WIL","Yes","No","Rear End",44032,4]
[7,"MER","No","Yes","Fixed Object",22016,2]
[8,"WAR","No","No","Other Non-Collision",1220221,35]
[11,"JEF","No","No","Unknown",149124,8]
[1,"WYA","Yes","No","Angle",5482646,100]
[10,"HOC","No","No","Unknown",66048,6]
[7,"SHE","Yes","No","Head On",711220,30]
[7,"SHE","Yes","No","Train",11008,1]
[4,"MAH","No","Yes","Other Non-Collision",1562038,47]
[7,"MOT","Yes","Yes","Other Object",3945958,202]
[7,"MIA","Yes","No","Parked Vehicle",10877876,426]
[5,"COS","Yes","No","Sideswipe - Passing",11008,1]
[11,"TUS","No","Yes","Unknown",121088,11]
[11,"COL","No","No","Rear End",12248954,311]
[9,"ROS","Yes","No","Pedestrian",10700730,44]
[7,"CLA","Yes","Yes","Unknown",66048,6]
[4,"MAH","Yes","No","Right Turn",11008,1]
[1,"HAR","Yes","No","Fixed Object",384936,17]
[3,"HUR","No","No","Rear End",7022509,153]
[7,"CHP","No","No","Overturning",3306396,44]
[11,"JEF","Yes","No","Angle",18578634,455]
[9,"ROS","No","No","Head On",11434310,89]
[4,"TRU","No","Yes","Sideswipe - Passing",1616628,61]
[3,"HUR","Yes","No","Parked Vehicle",462164,33]
[7,"MIA","Yes","No","Backing",3844888,321]
[8,"BUT","Yes","No","Right Turn",1239829,41]
[4,"ATB","No","No","Fixed Object",83848287,1452]
[3,"HUR","Yes","No","Angle",13037918,389]
[4,"STA","Yes","No","Fixed Object",152565836,4018]
[3,"LOR","No","Yes","Angle",70864,3]
[10,"WAS","Yes","No","Unknown",596893,4]
[5,"LIC","No","Yes","Overturning",2226699,17]
[6,"MAD","Yes","No","Right Turn",449780,25]
[7,"DAR","Yes","No","Fixed Object",686624,23]
[4,"ATB","Yes","No","Parked Vehicle",695965,13]
[8,"HAM","Yes","No","Sideswipe - Meeting",602516,32]
[6,"UNI","No","No","Pedalcycles",607901,5]
[9,"PIK","No","No","Parked Vehicle",953793,24]
[4,"STA","Yes","No","Overturning",971853,9]
[2,"SAN","No","Yes","Right Turn",22016,2]
[3,"WAY","Yes","No","Rear End",248024,8]
[6,"DEL","No","Yes","Other Object",389924,23]
[5,"LIC","No","No","Fixed Object",100211112,1707]
[2,"WIL","No","Yes","Angle",546841,5]
[6,"MAR","Yes","No","Other Non-Collision",3310127,103]
[3,"WAY","No","Yes","Head On",535833,4]
[10,"NOB","Yes","No","Other Object",44032,4]
[7,"MIA","Yes","No","Overturning",1734435,9]
[12,"CUY","No","No","Rear End",1461021,55]
[11,"COL","Yes","No","Unknown",33024,3]
[7,"LOG","Yes","No","Other Non-Collision",343312,9]
[8,"CLE","No","No","Left Turn",15308808,402]
[11,"COL","Yes","No","Angle",6461736,194]
[12,"LAK","No","No","Overturning",2448632,16]
[10,"ATH","Yes","No","Overturning",3028325,15]
[6,"UNI","No","No","Animal",12577196,739]
[8,"WAR","Yes","No","Sideswipe - Passing",1022884,48]
[4,"TRU","Yes","No","Rear End",202960,15]
[5,"MUS","Yes","No","Angle",44032,4]
[1,"ALL","Yes","No","Angle",81087578,1956]
[3,"ERI","Yes","No","Angle",81872,4]
[11,"BEL","Yes","No","Rear End",290852,14]
[3,"RIC","Yes","No","Angle",4829284,125]
[9,"LAW","Yes","Yes","Fixed Object",5462641,122]
[3,"RIC","Yes","No","Right Turn",11008,1]
[10,"WAS","Yes","No","Sideswipe - Passing",70864,3]
[6,"FRA","Yes","Yes","Sideswipe - Passing",1019272,49]
[3,"ERI","Yes","Yes","Right Turn",11008,1]
[1,"HAR","Yes","No","Fixed Object",5417114,116]
[8,"WAR","No","No","Angle",24443332,376]
[12,"LAK","Yes","No","Unknown",127108,6]
[12,"LAK","No","No","Pedestrian",551657,2]
[1,"ALL","No","No","Left Turn",7714505,132]
[7,"CLA","Yes","Yes","Left Turn",717809,6]
[3,"CRA","Yes","No","Backing",1209504,103]
[8,"GRE","No","Yes","Animal",1654124,113]
[7,"MIA","Yes","No","Unknown",208980,10]
[12,"CUY","Yes","No","Animal",19223356,803]
[4,"ATB","Yes","No","Animal",1285409,61]
[8,"CLI","No","Yes","Other Non-Collision",535436,32]
[2,"OTT","No","No","Angle",15526587,196]
[8,"BUT","Yes","Yes","Fixed Object",19378434,500]
[12,"LAK","Yes","Yes","Right Turn",1296073,44]
[1,"PUT","No","No","Parked Vehicle",510840,25]
[3,"ASD","Yes","No","Parked Vehicle",1387352,79]
[10,"WAS","Yes","No","Backing",1254740,105]
[4,"MAH","Yes","Yes","Backing",292228,21]
[7,"SHE","No","Yes","Overturning",1601770,16]
[5,"MUS","Yes","No","Sideswipe - Meeting",22016,2]
[8,"CLI","No","Yes","Other Object",280016,22]
[6,"FRA","Yes","No","Other Non-Collision",46492887,905]
[6,"MAR","Yes","No","Other Object",396288,36]
[5,"FAI","Yes","No","Head On",175956,7]
[3,"WAY","Yes","No","Left Turn",1159558,7]
[4,"SUM","No","Yes","Angle",22016,2]
[8,"CLI","Yes","Yes","Unknown",11008,1]
[1,"ALL","No","No","Rear End",8733459,222]
[1,"PAU","No","No","Other Non-Collision",1562329,46]
[4,"STA","Yes","Yes","Sideswipe - Passing",11008,1]
[8,"HAM","Yes","No","Pedestrian",5685315,41]
[9,"ROS","Yes","No","Right Turn",535833,4]
[7,"DAR","Yes","Yes","Parked Vehicle",72068,1]
[6,"MRW","No","No","Pedalcycles",1353746,8]
[11,"TUS","Yes","Yes","Overturning",3227501,22]
[8,"CLI","No","Yes","Angle",105092,4]
[11,"COL","Yes","Yes","Unknown",33024,3]
[10,"NOB","Yes","No","Other Non-Collision",22016,2]
[3,"ERI","Yes","No","Rear End",38247085,1507]
[6,"FAY","No","Yes","Other Object",748200,50]
[12,"LAK","Yes","No","Right Turn",576888,31]
[10,"HOC","Yes","Yes","Sideswipe - Passing",72068,1]
[1,"PAU","No","Yes","Left Turn",11008,1]
[7,"CLA","Yes","Yes","Backing",44032,4]
[6,"FAY","Yes","No","Other Object",546841,5]
[5,"FAI","No","No","Pedalcycles",1221822,5]
[7,"CHP","No","No","Left Turn",7049262,94]
[3,"MED","Yes","No","Parked Vehicle",651933,9]
[8,"PRE","Yes","No","Fixed Object",72068,1]
[1,"HAN","Yes","No","Overturning",2066739,17]
[3,"MED","Yes","No","Fixed Object",77056,7]
[4,"SUM","Yes","No","Head On",1494270,16]
[4,"SUM","Yes","No","Train",72068,1]
[4,"MAH","No","No","Animal",13518764,677]
[6,"MAR","No","No","Unknown",176128,16]
[6,"FRA","Yes","Yes","Backing",2473982,105]
[7,"AUG","No","Yes","Sideswipe - Passing",2199880,105]
[2,"HEN","Yes","No","Parked Vehicle",715176,47]
[8,"BUT","Yes","No","Other Non-Collision",33024,3]
[7,"DAR","Yes","Yes","Fixed Object",275028,16]
[2,"WOO","Yes","No","Left Turn",689773,9]
[6,"MAR","No","No","Backing",832480,50]
[6,"FRA","Yes","Yes","Other Object",94084,3]
[7,"CLA","Yes","No","Unknown",1868542,50]
[3,"ERI","Yes","Yes","Sideswipe - Meeting",48848,1]
[3,"ERI","Yes","Yes","Overturning",5443470,20]
[3,"ERI","No","Yes","Overturning",703652,14]
[6,"UNI","Yes","No","Backing",1324228,101]
[10,"GAL","Yes","Yes","Angle",83076,2]
[9,"HIG","Yes","No","Unknown",88064,8]
[5,"MUS","No","No","Parked Vehicle",601312,29]
[3,"WAY","Yes","Yes","Sideswipe - Meeting",11008,1]
[9,"PIK","Yes","No","Pedestrian",1773479,7]
[2,"SAN","Yes","Yes","Sideswipe - Passing",650332,39]
[5,"FAI","Yes","No","Unknown",1159730,16]
[6,"FRA","No","No","Angle",3660266,78]
[7,"SHE","No","No","Rear End",8365406,152]
[1,"DEF","Yes","Yes","Animal",1092888,71]
[11,"TUS","No","Yes","Animal",4882220,280]
[3,"CRA","No","Yes","Unknown",127108,6]
[6,"UNI","Yes","Yes","Backing",11008,1]
[2,"OTT","Yes","Yes","Head On",513817,2]
[12,"LAK","No","Yes","Head On",722797,12]
[3,"ASD","Yes","No","Head On",2315967,28]
[4,"SUM","Yes","No","Fixed Object",1225606,13]
[11,"COL","No","Yes","Overturning",1160762,5]
[2,"FUL","Yes","No","Fixed Object",1038245,33]
[7,"LOG","Yes","Yes","Backing",11008,1]
[12,"LAK","Yes","No","Pedalcycles",216204,3]
[3,"ERI","Yes","No","Left Turn",2761394,64]
[8,"PRE","Yes","No","Overturning",94084,3]
[12,"GEA","Yes","Yes","Unknown",11008,1]
[3,"RIC","Yes","No","Left Turn",24648329,609]
[7,"MOT","No","No","Animal",2856629,181]
[6,"UNI","Yes","Yes","Right Turn",11008,1]
[1,"WYA","No","Yes","Parked Vehicle",11008,1]
[11,"COL","No","No","Left Turn",9921662,184]
[2,"WOO","Yes","Yes","Other Object",738568,56]
[7,"DAR","No","No","Pedestrian",3364982,12]
[12,"LAK","Yes","No","Animal",6611098,447]
[7,"AUG","Yes","Yes","Animal",1263856,72]
[1,"HAN","Yes","No","Backing",55040,5]
[5,"PER","Yes","No","Parked Vehicle",55040,5]
[2,"WOO","No","No","Right Turn",2975071,76]
[9,"JAC","Yes","Yes","Animal",430344,28]
[4,"MAH","Yes","No","Pedalcycles",1005618,2]
[4,"MAH","Yes","No","Animal",33024,3]
[3,"ERI","Yes","No","Sideswipe - Passing",11008,1]
[3,"MED","Yes","Yes","Rear End",3002194,79]
[1,"HAR","Yes","No","Rear End",3934090,161]
[2,"LUC","Yes","Yes","Other Non-Collision",4539120,152]
[9,"ROS","Yes","No","Parked Vehicle",121088,11]
[9,"LAW","No","No","Angle",5480185,80]
[3,"RIC","Yes","No","Fixed Object",55604441,1560]
[4,"POR","No","Yes","Animal",2825100,175]
[2,"WOO","Yes","No","Backing",2031320,170]
[10,"HOC","No","Yes","Left Turn",72068,1]
[7,"DAR","Yes","Yes","Rear End",463024,13]
[6,"DEL","Yes","No","Pedalcycles",9997898,73]
[1,"WYA","Yes","No","Other Non-Collision",114896,7]
[6,"FRA","Yes","No","Angle",465432,14]
[3,"MED","Yes","Yes","Fixed Object",2685489,106]
[1,"PUT","Yes","No","Head On",153940,5]
[7,"CLA","Yes","Yes","Animal",1832660,125]
[7,"CHP","No","No","Parked Vehicle",2360343,50]
[4,"MAH","Yes","No","Other Object",22016,2]
[4,"STA","Yes","No","Rear End",7344506,308]
[12,"CUY","Yes","Yes","Unknown",142932,4]
[5,"KNO","No","No","Overturning",8089518,81]
[2,"FUL","No","Yes","Angle",155144,3]
[11,"COL","No","Yes","Left Turn",83076,2]
[4,"POR","Yes","No","Train",502809,1]
[11,"JEF","No","No","Other Non-Collision",812065,18]
[9,"PIK","Yes","No","Angle",11008,1]
[8,"PRE","No","Yes","Other Non-Collision",451156,32]
[2,"LUC","No","No","Right Turn",884133,19]
[9,"HIG","No","No","Other Object",154112,14]
[3,"LOR","No","No","Animal",12155293,794]
[1,"PUT","Yes","No","Fixed Object",1287870,11]
[6,"FRA","Yes","No","Backing",44032,4]
[9,"ROS","No","Yes","Sideswipe - Passing",4692015,81]
[4,"SUM","Yes","Yes","Sideswipe - Passing",212592,9]
[4,"SUM","Yes","No","Pedestrian",4050230,23]
[2,"LUC","Yes","Yes","Other Object",1595988,136]
[6,"UNI","Yes","No","Angle",3231986,93]
[5,"LIC","Yes","No","Right Turn",143104,13]
[2,"SEN","No","No","Angle",21924088,225]
[9,"LAW","No","No","Right Turn",1663002,25]
[9,"LAW","No","Yes","Other Non-Collision",11008,1]
[4,"TRU","Yes","Yes","Other Object",616276,47]
[8,"GRE","Yes","Yes","Sideswipe - Passing",22016,2]
[2,"WOO","Yes","No","Other Non-Collision",850077,27]
[8,"WAR","Yes","Yes","Backing",72068,1]
[3,"WAY","No","No","Sideswipe - Meeting",11008,1]
[7,"AUG","Yes","No","Left Turn",77056,7]
[9,"SCI","Yes","No","Rear End",28803015,1063]
[3,"RIC","No","Yes","Unknown",209152,19]
[6,"MRW","Yes","No","Fixed Object",72068,1]
[1,"ALL","No","No","Pedestrian",2083304,5]
[12,"LAK","No","No","Rear End",3218001,115]
[4,"STA","Yes","Yes","Left Turn",1249289,26]
[3,"WAY","Yes","No","Other Non-Collision",11008,1]
[2,"SAN","No","No","Other Non-Collision",2045702,55]
[8,"BUT","No","No","Rear End",17215481,461]
[7,"DAR","No","No","Unknown",235984,18]
[2,"SAN","Yes","No","Other Non-Collision",66048,6]
[3,"MED","No","No","Head On",14146790,121]
[3,"MED","No","No","Train",513817,2]
[3,"LOR","Yes","No","Rear End",44952373,1800]
[3,"CRA","Yes","No","Parked Vehicle",1786842,55]
[4,"MAH","No","Yes","Unknown",391300,30]
[7,"MER","Yes","No","Angle",14637770,262]
[6,"DEL","Yes","No","Left Turn",125904,8]
[3,"WAY","Yes","No","Pedestrian",7011303,34]
[7,"MER","Yes","No","Pedalcycles",503272,9]
[6,"MAD","Yes","No","Right Turn",11008,1]
[7,"CLA","No","No","Unknown",169936,12]
[12,"CUY","Yes","Yes","Unknown",8368634,276]
[10,"ATH","Yes","No","Rear End",66048,6]
[7,"AUG","Yes","No","Fixed Object",33024,3]
[8,"CLI","Yes","No","Angle",8863544,255]
[5,"LIC","Yes","No","Animal",121088,11]
[10,"GAL","Yes","Yes","Right Turn",83076,2]
[3,"ERI","No","Yes","Fixed Object",15455206,490]
[7,"AUG","Yes","Yes","Sideswipe - Passing",2782550,86]
[10,"WAS","No","Yes","Rear End",496048,16]
[7,"MOT","No","No","Other Non-Collision",1419225,33]
[8,"HAM","Yes","Yes","Fixed Object",168879916,4247]
[8,"HAM","Yes","Yes","Head On",11008,1]
[1,"VAN","No","No","Pedestrian",1568283,5]
[10,"NOB","No","No","Sideswipe - Passing",136912,9]
[3,"MED","Yes","No","Other Non-Collision",2086122,60]
[2,"SAN","Yes","No","Right Turn",127108,6]
[2,"FUL","No","No","Head On",8359373,70]
[2,"FUL","No","No","Train",44032,4]
[3,"LOR","Yes","Yes","Right Turn",136912,9]
[5,"COS","Yes","No","Pedestrian",911997,7]
[4,"TRU","No","Yes","Other Non-Collision",187136,17]
[4,"POR","Yes","No","Animal",1090480,70]
[4,"TRU","Yes","Yes","Backing",231168,21]
[7,"MIA","Yes","Yes","Other Non-Collision",165120,15]
[11,"TUS","Yes","No","Animal",6730810,446]
[11,"TUS","No","No","Unknown",143104,13]
[7,"MER","Yes","No","Other Non-Collision",114896,7]
[11,"BEL","Yes","No","Backing",55040,5]
[4,"MAH","No","No","Overturning",3834661,37]
[8,"HAM","Yes","Yes","Other Object",4833650,266]
[4,"MAH","Yes","No","Other Non-Collision",175956,7]
[7,"DAR","Yes","No","Backing",55040,5]
[7,"CHP","Yes","No","Left Turn",2756578,67]
[4,"STA","Yes","No","Pedalcycles",2024374,19]
[12,"GEA","Yes","No","Fixed Object",315276,12]
[3,"RIC","No","Yes","Angle",668961,5]
[2,"HEN","No","Yes","Angle",513817,2]
[6,"MRW","No","Yes","Angle",127108,6]
[11,"TUS","No","No","Backing",1464924,113]
[3,"ERI","Yes","No","Unknown",2323707,48]
[11,"COL","Yes","No","Other Non-Collision",768033,14]
[2,"LUC","Yes","Yes","Head On",4170114,36]
[8,"CLE","Yes","No","Fixed Object",496220,25]
[5,"PER","No","No","Animal",4939655,204]
[3,"ERI","No","No","Parked Vehicle",704393,9]
[1,"VAN","Yes","No","Angle",8191818,209]
[7,"MIA","Yes","No","Right Turn",2512232,159]
[4,"STA","Yes","Yes","Fixed Object",37288094,898]
[6,"FAY","No","No","Pedalcycles",551657,2]
[2,"WOO","Yes","Yes","Other Non-Collision",859484,58]
[6,"PIC","No","Yes","Fixed Object",927424,33]
[6,"MAR","Yes","No","Backing",182148,11]
[2,"LUC","Yes","No","Pedalcycles",241832,4]
[7,"LOG","No","No","Angle",22243201,264]
[4,"STA","No","No","Other Non-Collision",1739833,74]
[7,"DAR","Yes","Yes","Animal",462336,42]
[2,"WOO","No","Yes","Angle",800885,8]
[4,"TRU","No","Yes","Other Object",132096,12]
[1,"ALL","Yes","No","Fixed Object",849905,18]
[1,"HAR","Yes","No","Head On",2784085,15]
[8,"CLI","No","No","Backing",1234788,81]
[3,"WAY","Yes","No","Parked Vehicle",447372,24]
[7,"AUG","Yes","No","Right Turn",22016,2]
[3,"RIC","No","Yes","Overturning",524825,3]
[2,"WOO","Yes","No","Pedestrian",48848,1]
[8,"BUT","No","No","Right Turn",3002763,55]
[4,"SUM","Yes","No","Overturning",144136,2]
[11,"JEF","Yes","No","Other Non-Collision",48848,1]
[6,"MAD","No","Yes","Right Turn",70864,3]
[3,"CRA","Yes","No","Rear End",77056,7]
[5,"COS","No","No","Pedalcycles",1077686,3]
[4,"SUM","Yes","No","Other Object",667929,16]
[6,"FAY","No","No","Backing",537844,33]
[7,"MOT","Yes","No","Left Turn",2237482,60]
[8,"GRE","Yes","No","Sideswipe - Passing",22556094,998]
[12,"CUY","Yes","Yes","Left Turn",188168,6]
[10,"WAS","Yes","No","Sideswipe - Passing",3374693,204]
[5,"GUE","No","Yes","Other Non-Collision",682324,53]
[6,"DEL","Yes","No","Unknown",677336,47]
[9,"HIG","Yes","No","Left Turn",1892225,58]
[4,"TRU","Yes","No","Angle",102086795,2388]
[8,"GRE","Yes","Yes","Unknown",187136,17]
[4,"SUM","Yes","Yes","Rear End",842509,16]
[9,"JAC","Yes","No","Other Object",125904,8]
[1,"ALL","No","No","Sideswipe - Passing",7594581,192]
[2,"OTT","Yes","No","Other Non-Collision",81872,4]
[4,"STA","No","Yes","Other Non-Collision",88064,8]
[8,"PRE","Yes","No","Backing",825256,57]
[10,"MEG","Yes","No","Head On",1790679,12]
[4,"ATB","Yes","Yes","Other Non-Collision",171140,10]
[8,"PRE","No","No","Rear End",8915766,210]
[1,"VAN","No","No","Parked Vehicle",1000233,24]
[3,"RIC","Yes","No","Animal",99072,9]
[6,"DEL","Yes","Yes","Backing",220160,20]
[7,"DAR","Yes","No","Pedestrian",4624644,17]
[7,"CLA","No","No","Animal",7468465,503]
[4,"ATB","No","Yes","Fixed Object",9884801,224]
[5,"LIC","Yes","No","Pedestrian",2985497,14]
[3,"CRA","No","No","Other Non-Collision",3078615,64]
[8,"PRE","Yes","No","Unknown",33024,3]
[2,"LUC","Yes","No","Unknown",66048,6]
[10,"GAL","Yes","No","Right Turn",11008,1]
[3,"ASD","No","No","Sideswipe - Passing",9604322,184]
[4,"MAH","Yes","No","Right Turn",105092,4]
[3,"HUR","No","No","Unknown",451156,32]
[5,"GUE","Yes","Yes","Rear End",1705261,50]
[9,"ROS","Yes","Yes","Other Object",121088,11]
[0,"WOO","Yes","Yes","Rear End",219988,11]
[4,"POR","Yes","No","Left Turn",727785,18]
[9,"ROS","Yes","No","Other Non-Collision",22016,2]
[3,"MED","Yes","No","Angle",119712,4]
[2,"WIL","Yes","No","Unknown",44032,4]
[11,"JEF","Yes","Yes","Rear End",573673,4]
[5,"LIC","Yes","No","Rear End",2007293,74]
[1,"PAU","No","No","Pedalcycles",1077686,3]
[3,"LOR","No","No","Backing",2412525,133]
[3,"ASD","Yes","No","Fixed Object",94084,3]
[1,"HAN","Yes","Yes","Fixed Object",11483144,337]
[3,"WAY","Yes","Yes","Backing",11008,1]
[6,"MRW","No","Yes","Fixed Object",13891435,471]
[6,"FRA","Yes","No","Unknown",72068,1]
[1,"WYA","Yes","No","Fixed Object",6897968,135]
[1,"DEF","No","No","Sideswipe - Passing",2408622,65]
[2,"SEN","No","No","Pedestrian",2443644,10]
[2,"WOO","Yes","No","Right Turn",4160045,213]
[4,"MAH","Yes","No","Sideswipe - Passing",22016,2]
[4,"SUM","Yes","Yes","Sideswipe - Passing",13596349,618]
[4,"SUM","Yes","No","Pedestrian",2492492,11]
[8,"CLE","Yes","Yes","Overturning",2381380,12]
[12,"CUY","Yes","Yes","Left Turn",4798390,156]
[1,"VAN","Yes","No","Sideswipe - Passing",11008,1]
[4,"STA","No","No","Other Object",341076,22]
[9,"HIG","No","No","Pedestrian",2166380,7]
[10,"ATH","Yes","No","Animal",11008,1]
[5,"MUS","Yes","Yes","Overturning",668961,5]
[0,"WOO","Yes","Yes","Right Turn",11008,1]
[6,"FRA","No","Yes","Pedalcycles",11008,1]
[4,"STA","Yes","Yes","Parked Vehicle",829093,14]
[7,"DAR","No","No","Left Turn",6419411,123]
[5,"MUS","No","Yes","Backing",66048,6]
[3,"ERI","Yes","Yes","Pedalcycles",72068,1]
[12,"CUY","Yes","Yes","Head On",33024,3]
[10,"VIN","Yes","No","Angle",476440,10]
[9,"HIG","No","No","Sideswipe - Meeting",524825,3]
[12,"GEA","No","No","Other Non-Collision",1326292,79]
[9,"ADA","No","No","Unknown",127108,6]
[9,"PIK","No","No","Sideswipe - Passing",3052815,59]
[7,"LOG","No","No","Sideswipe - Meeting",11008,1]
[4,"SUM","Yes","No","Other Non-Collision",16769366,444]
[8,"CLE","No","No","Sideswipe - Passing",7472342,262]
[8,"BUT","Yes","Yes","Other Non-Collision",941528,71]
[3,"WAY","Yes","Yes","Angle",847325,13]
[9,"LAW","Yes","Yes","Other Non-Collision",127108,6]
[5,"FAI","Yes","No","Parked Vehicle",10495361,427]
[6,"FRA","Yes","No","Backing",3945164,328]
[2,"LUC","Yes","Yes","Pedestrian",3160990,8]
[2,"OTT","Yes","No","Rear End",11008,1]
[2,"LUC","Yes","No","Overturning",16388400,132]
[2,"HEN","Yes","Yes","Other Non-Collision",688569,11]
[11,"HOL","No","No","Head On",11367058,90]
[9,"LAW","Yes","No","Parked Vehicle",44032,4]
[4,"TRU","No","No","Animal",14326886,830]
[2,"FUL","No","No","Overturning",8877000,114]
[6,"FRA","Yes","Yes","Overturning",188168,6]
[9,"SCI","No","No","Animal",8709154,519]
[7,"AUG","Yes","Yes","Animal",149124,8]
[7,"MIA","Yes","No","Sideswipe - Passing",8489100,477]
[6,"UNI","Yes","Yes","Head On",562665,3]
[11,"TUS","Yes","No","Other Object",83076,2]
[11,"BEL","No","No","Rear End",9136455,294]
[4,"STA","Yes","No","Right Turn",110080,10]
[6,"DEL","Yes","No","Fixed Object",58794076,1478]
[12,"LAK","No","No","Animal",1875885,98]
[7,"SHE","Yes","No","Rear End",197972,9]
[10,"ATH","Yes","Yes","Left Turn",741029,6]
[8,"BUT","No","No","Pedalcycles",791081,5]
[2,"LUC","Yes","No","Left Turn",2195858,52]
[8,"WAR","Yes","No","Pedestrian",1856555,9]
[7,"LOG","No","No","Pedestrian",1724631,6]
[9,"HIG","Yes","No","Head On",2743096,29]
[10,"ATH","Yes","Yes","Fixed Object",2666278,67]
[7,"MOT","Yes","Yes","Rear End",554872,29]
[6,"PIC","Yes","No","Angle",5494117,109]
[1,"ALL","No","Yes","Other Non-Collision",226180,15]
[1,"ALL","No","Yes","Backing",55040,5]
[1,"HAN","Yes","No","Rear End",740288,21]
[2,"WOO","Yes","No","Backing",3488676,272]
[8,"WAR","Yes","No","Backing",401104,33]
[12,"GEA","Yes","No","Overturning",407984,8]
[6,"DEL","Yes","No","Left Turn",49951198,937]
[5,"LIC","No","No","Angle",39069565,598]
[3,"ERI","Yes","Yes","Head On",83076,2]
[8,"GRE","Yes","No","Other Non-Collision",83076,2]
[0,"LUC","No","No","Rear End",22016,2]
[6,"FRA","Yes","No","Unknown",320264,18]
[1,"PUT","No","No","Angle",12115906,184]
[1,"HAN","Yes","No","Sideswipe - Passing",11008,1]
[3,"LOR","No","Yes","Overturning",83076,2]
[7,"MIA","Yes","No","Pedalcycles",1881442,20]
[7,"AUG","Yes","Yes","Other Non-Collision",127108,6]
[11,"COL","Yes","Yes","Rear End",116100,5]
[11,"CAR","No","No","Other Non-Collision",2148783,30]
[4,"SUM","Yes","Yes","Angle",799681,10]
[1,"WYA","No","No","Pedalcycles",513817,2]
[2,"HEN","No","Yes","Right Turn",22016,2]
[0,"CUY","Yes","No","Backing",11008,1]
[9,"PIK","Yes","No","Animal",1280024,83]
[7,"SHE","Yes","Yes","Pedestrian",502809,1]
[2,"OTT","Yes","Yes","Other Object",77056,7]
[3,"LOR","Yes","Yes","Fixed Object",22016,2]
[8,"CLI","No","No","Unknown",66048,6]
[9,"ADA","No","No","Backing",848476,57]
[2,"SEN","No","No","Head On",9519037,45]
[2,"SEN","No","No","Train",1088694,4]
[3,"MED","Yes","No","Rear End",48683807,2092]
[7,"SHE","No","No","Other Object",171140,10]
[4,"SUM","Yes","Yes","Parked Vehicle",6069735,101]
[1,"HAR","Yes","No","Angle",6991033,176]
[4,"MAH","Yes","Yes","Sideswipe - Passing",15131489,550]
[8,"WAR","No","Yes","Animal",1720397,82]
[0,"BUT","Yes","No","Rear End",11008,1]
[3,"ASD","No","No","Head On",9700907,74]
[6,"PIC","No","No","Sideswipe - Passing",7273113,236]
[4,"ATB","Yes","Yes","Unknown",502809,1]
[3,"ERI","No","No","Head On",6232606,37]
[2,"HEN","No","No","Unknown",169936,12]
[7,"SHE","Yes","No","Right Turn",1558492,94]
[10,"GAL","Yes","No","Left Turn",3414531,71]
[10,"HOC","Yes","No","Animal",22016,2]
[10,"ATH","Yes","No","Other Object",72068,1]
[7,"AUG","No","No","Unknown",684957,12]
[2,"SAN","Yes","No","Backing",242176,22]
[11,"BEL","Yes","No","Backing",1897504,133]
[2,"FUL","Yes","Yes","Unknown",11008,1]
[9,"BRO","Yes","No","Head On",1663571,6]
[8,"GRE","Yes","Yes","Parked Vehicle",838897,17]
[12,"CUY","Yes","Yes","Parked Vehicle",24402357,298]
[1,"VAN","No","No","Animal",8992676,707]
[3,"HUR","Yes","No","Overturning",1162429,11]
[1,"DEF","No","Yes","Head On",502809,1]
[6,"MAD","No","Yes","Parked Vehicle",1122353,24]
[1,"ALL","No","No","Other Object",281220,20]
[4,"POR","Yes","No","Right Turn",33024,3]
[5,"MUS","Yes","No","Pedalcycles",3729397,29]
[11,"BEL","Yes","No","Unknown",795037,22]
[5,"GUE","Yes","Yes","Backing",33024,3]
[2,"WOO","Yes","Yes","Overturning",3793037,34]
[4,"STA","Yes","No","Backing",1475072,134]
[5,"LIC","No","Yes","Other Object",462164,33]
[10,"WAS","No","Yes","Backing",11008,1]
[7,"SHE","Yes","No","Backing",2779864,238]
[2,"HEN","Yes","No","Sideswipe - Passing",1589333,54]
[8,"GRE","Yes","Yes","Fixed Object",21546838,623]
[6,"MAD","No","No","Backing",1587613,94]
[11,"COL","No","No","Sideswipe - Passing",8601853,173]
[5,"LIC","Yes","Yes","Angle",2064966,38]
[9,"BRO","No","No","Parked Vehicle",905580,40]
[8,"WAR","Yes","Yes","Overturning",11008,1]
[11,"JEF","No","No","Head On",7520013,40]
[5,"FAI","Yes","No","Animal",125904,8]
[12,"CUY","No","No","Other Non-Collision",585885,3]
[7,"AUG","Yes","No","Other Non-Collision",136912,9]
[9,"ROS","Yes","No","Right Turn",3578632,179]
[11,"TUS","Yes","Yes","Animal",6288373,404]
[8,"WAR","No","No","Head On",5958557,61]
[8,"WAR","No","No","Train",83076,2]
[4,"STA","Yes","No","Pedalcycles",216204,3]
[9,"LAW","Yes","No","Rear End",11008,1]
[2,"FUL","No","Yes","Backing",116100,5]
[3,"HUR","Yes","No","Other Non-Collision",1353349,36]
[12,"CUY","Yes","No","Fixed Object",26619979,669]
[3,"HUR","Yes","No","Backing",611460,50]
[9,"SCI","Yes","No","Backing",66048,6]
[3,"MED","No","Yes","Right Turn",22016,2]
[9,"ROS","No","No","Left Turn",10448789,210]
[9,"BRO","Yes","No","Left Turn",546841,5]
[7,"AUG","Yes","No","Parked Vehicle",2369988,131]
[2,"SEN","Yes","No","Angle",12280668,428]
[7,"AUG","Yes","Yes","Animal",638292,49]
[7,"MIA","No","No","Unknown",99072,9]
[9,"JAC","No","No","Parked Vehicle",783288,31]
[3,"MED","Yes","Yes","Backing",11008,1]
[12,"LAK","Yes","Yes","Rear End",35407062,932]
[10,"GAL","No","Yes","Sideswipe - Passing",744416,42]
[6,"DEL","Yes","Yes","Angle",1707603,10]
[3,"ASD","Yes","No","Left Turn",6110446,110]
[3,"RIC","Yes","No","Head On",17019243,170]
[4,"POR","Yes","No","Rear End",873588,31]
[5,"LIC","Yes","No","Pedestrian",14898430,86]
[8,"WAR","No","Yes","Sideswipe - Passing",4783823,165]
[12,"GEA","No","Yes","Left Turn",72068,1]
[6,"FAY","Yes","No","Other Non-Collision",33024,3]
[8,"WAR","Yes","No","Left Turn",8935374,201]
[10,"ATH","Yes","No","Head On",1651359,7]
[10,"ATH","Yes","No","Train",11008,1]
[5,"MUS","No","No","Other Non-Collision",1407357,52]
[3,"MED","Yes","No","Sideswipe - Meeting",59856,2]
[0,"LOR","Yes","No","Rear End",119712,4]
[10,"HOC","Yes","No","Sideswipe - Passing",1963605,93]
[5,"LIC","Yes","No","Angle",39251209,1078]
[2,"SEN","No","No","Left Turn",4811105,80]
[10,"WAS","No","No","Pedalcycles",131924,3]
[6,"UNI","Yes","Yes","Fixed Object",3644098,127]
[1,"HAN","No","Yes","Parked Vehicle",325080,15]
[8,"HAM","Yes","No","Angle",14225274,363]
[4,"SUM","Yes","Yes","Sideswipe - Meeting",72068,1]
[9,"ROS","Yes","Yes","Sideswipe - Passing",4924519,177]
[10,"HOC","No","Yes","Unknown",22016,2]
[8,"WAR","Yes","No","Right Turn",1551956,62]
[6,"MAD","Yes","No","Sideswipe - Passing",33024,3]
[2,"WIL","No","No","Backing",1583776,137]
[1,"HAN","Yes","No","Other Non-Collision",66048,6]
[8,"GRE","Yes","No","Left Turn",39254954,825]
[7,"AUG","Yes","Yes","Fixed Object",1589902,35]
[10,"HOC","Yes","No","Pedestrian",865557,7]
[12,"CUY","Yes","No","Rear End",17084231,726]
[10,"GAL","Yes","No","Fixed Object",22016,2]
[2,"WIL","Yes","No","Left Turn",83076,2]
[4,"TRU","Yes","No","Other Non-Collision",10793530,255]
[6,"MRW","No","No","Unknown",154112,14]
[1,"HAN","Yes","No","Fixed Object",130720,5]
[1,"HAR","Yes","No","Animal",132096,12]
[3,"RIC","No","Yes","Other Object",308224,28]
[1,"VAN","Yes","No","Parked Vehicle",143104,13]
[2,"WIL","No","No","Unknown",198144,18]
[3,"HUR","Yes","No","Parked Vehicle",66048,6]
[4,"POR","Yes","No","Pedestrian",120916,2]
[11,"HAS","Yes","No","Backing",44032,4]
[3,"WAY","Yes","No","Backing",11008,1]
[3,"LOR","Yes","No","Sideswipe - Passing",280016,22]
[1,"ALL","Yes","No","Other Object",491404,28]
[9,"ADA","No","No","Angle",12630821,216]
[3,"LOR","Yes","No","Other Non-Collision",2943648,43]
[0,"LOR","No","No","Sideswipe - Passing",72068,1]
[6,"MAD","Yes","No","Angle",11008,1]
[2,"FUL","Yes","No","Right Turn",303064,13]
[6,"DEL","Yes","No","Fixed Object",2271710,61]
[7,"MER","No","No","Pedalcycles",672573,4]
[2,"SAN","Yes","No","Animal",3222870,191]
[1,"HAN","Yes","No","Right Turn",33024,3]
[4,"TRU","Yes","Yes","Other Non-Collision",1904953,84]
[4,"POR","Yes","No","Parked Vehicle",232200,10]
[11,"COL","Yes","No","Fixed Object",92880,5]
[4,"STA","No","No","Pedalcycles",778869,6]
[11,"COL","Yes","No","Other Non-Collision",937969,26]
[6,"FRA","Yes","Yes","Overturning",574877,2]
[5,"LIC","Yes","No","Overturning",3153025,25]
[11,"JEF","Yes","No","Pedalcycles",1497882,10]
[8,"WAR","Yes","No","Parked Vehicle",379088,31]
[4,"POR","Yes","No","Rear End",460616,17]
[11,"COL","Yes","No","Left Turn",1169256,37]
[6,"MAR","Yes","No","Pedestrian",8498640,51]
[9,"ROS","No","Yes","Head On",1110710,6]
[11,"COL","No","Yes","Rear End",638808,11]
[11,"HOL","No","No","Left Turn",9384109,220]
[6,"DEL","Yes","No","Rear End",400932,24]
[3,"MED","Yes","Yes","Other Object",66048,6]
[9,"ADA","No","No","Animal",9215562,437]
[11,"JEF","Yes","No","Unknown",11008,1]
[11,"JEF","Yes","No","Angle",44032,4]
[2,"OTT","No","Yes","Other Object",187136,17]
[2,"LUC","Yes","Yes","Rear End",240800,15]
[2,"LUC","No","No","Left Turn",3137095,54]
[3,"LOR","Yes","No","Parked Vehicle",533200,45]
[1,"ALL","Yes","No","Rear End",590304,33]
[2,"SAN","Yes","No","Animal",224976,17]
[2,"WIL","No","No","Parked Vehicle",1048512,44]
[4,"POR","No","No","Other Non-Collision",1809890,46]
[9,"LAW","Yes","No","Fixed Object",22016,2]
[1,"VAN","Yes","No","Pedestrian",502809,1]
[12,"CUY","Yes","No","Angle",16286125,487]
[9,"PIK","Yes","No","Unknown",105092,4]
[1,"HAN","Yes","No","Backing",3481796,297]
[1,"ALL","Yes","No","Pedestrian",20731017,103]
[1,"PUT","No","No","Sideswipe - Meeting",22016,2]
[1,"VAN","Yes","No","Sideswipe - Passing",171140,10]
[2,"WOO","Yes","No","Parked Vehicle",2317065,123]
[4,"POR","No","Yes","Head On",119712,4]
[11,"JEF","Yes","Yes","Overturning",2442440,12]
[11,"BEL","Yes","No","Other Non-Collision",11008,1]
[1,"DEF","No","No","Angle",16561564,178]
[1,"HAN","Yes","No","Unknown",209152,19]
[3,"HUR","Yes","No","Angle",275028,16]
[10,"NOB","Yes","Yes","Other Object",11008,1]
[10,"GAL","Yes","Yes","Rear End",430172,19]
[4,"TRU","Yes","No","Unknown",513817,2]
[10,"HOC","No","No","Sideswipe - Meeting",11008,1]
[10,"ATH","Yes","No","Rear End",10237824,365]
[6,"FRA","Yes","No","Right Turn",155144,3]
[1,"PAU","No","No","Other Object",121088,11]
[4,"MAH","Yes","Yes","Other Object",764196,57]
[7,"LOG","No","No","Right Turn",523052,24]
[9,"ROS","No","No","Other Non-Collision",1794529,56]
[8,"CLE","Yes","No","Pedalcycles",2175443,20]
[10,"HOC","Yes","Yes","Angle",83076,2]
[1,"HAR","No","No","Angle",19565849,165]
[10,"GAL","Yes","Yes","Sideswipe - Passing",419336,27]
[5,"FAI","Yes","No","Left Turn",21574967,446]
[4,"ATB","Yes","Yes","Sideswipe - Passing",160132,9]
[3,"CRA","Yes","Yes","Fixed Object",1045469,31]
[2,"WOO","Yes","Yes","Angle",186964,8]
[6,"PIC","Yes","No","Fixed Object",9367875,168]
[2,"SAN","No","No","Parked Vehicle",2186795,39]
[8,"BUT","Yes","No","Head On",273652,9]
[2,"FUL","Yes","No","Rear End",1160656,42]
[1,"PUT","Yes","No","Fixed Object",1617938,32]
[7,"CLA","Yes","Yes","Parked Vehicle",105092,4]
[6,"MRW","No","Yes","Other Object",396116,27]
[11,"COL","Yes","No","Angle",1796130,26]
[6,"DEL","No","No","Right Turn",1864824,83]
[2,"WOO","Yes","No","Pedalcycles",4246085,35]
[5,"FAI","Yes","Yes","Parked Vehicle",83076,2]
[9,"SCI","Yes","No","Other Object",176128,16]
[3,"LOR","Yes","Yes","Rear End",15453989,445]
[0,"HEN","No","No","Animal",11008,1]
[6,"FRA","Yes","Yes","Sideswipe - Passing",413144,23]
[11,"COL","No","No","Other Non-Vehicle",502809,1]
[8,"HAM","Yes","Yes","Pedestrian",14314014,46]
[2,"WOO","Yes","No","Unknown",11008,1]
[4,"STA","Yes","Yes","Unknown",478160,40]
[4,"ATB","Yes","Yes","Backing",22016,2]
[9,"HIG","Yes","No","Pedalcycles",131924,3]
[3,"CRA","Yes","No","Left Turn",1292858,17]
[7,"AUG","No","No","Pedestrian",120916,2]
[5,"FAI","Yes","Yes","Rear End",4784511,136]
[10,"WAS","No","No","Animal",10646708,480]
[11,"JEF","Yes","No","Sideswipe - Meeting",11008,1]
[6,"PIC","No","No","Unknown",986989,36]
[3,"LOR","No","No","Right Turn",2002305,73]
[8,"HAM","Yes","Yes","Sideswipe - Meeting",11008,1]
[7,"AUG","Yes","No","Sideswipe - Passing",1698381,75]
[11,"BEL","Yes","Yes","Angle",772108,26]
[9,"SCI","No","No","Pedestrian",4839181,14]
[4,"TRU","Yes","Yes","Rear End",15218759,419]
[4,"MAH","Yes","No","Angle",434988,16]
[6,"MAD","Yes","No","Fixed Object",5095818,114]
[11,"JEF","Yes","No","Backing",88064,8]
[12,"CUY","Yes","Yes","Overturning",97696,2]
[10,"HOC","Yes","No","Angle",44032,4]
[9,"SCI","Yes","No","Angle",634733,4]
[10,"ATH","No","No","Left Turn",5187613,106]
[1,"HAR","Yes","No","Angle",11008,1]
[2,"SAN","Yes","No","Rear End",11843100,347]
[10,"ATH","Yes","No","Animal",1467160,105]
[2,"SAN","Yes","No","Fixed Object",390956,12]
[3,"WAY","No","No","Rear End",26013718,555]
[4,"POR","Yes","Yes","Animal",103888,6]
[5,"MUS","No","Yes","Head On",585885,3]
[4,"ATB","Yes","No","Right Turn",2548577,97]
[11,"TUS","Yes","No","Sideswipe - Passing",110080,10]
[8,"CLE","Yes","No","Sideswipe - Meeting",1494389,71]
[2,"WOO","No","Yes","Left Turn",116100,5]
[12,"LAK","Yes","Yes","Animal",11008,1]
[2,"SEN","Yes","No","Left Turn",1833401,50]
[7,"DAR","No","No","Parked Vehicle",2502137,92]
[7,"AUG","Yes","No","Pedestrian",719013,4]
[10,"HOC","Yes","No","Rear End",59856,2]
[3,"RIC","Yes","Yes","Sideswipe - Passing",9134669,338]
[8,"HAM","No","Yes","Angle",502809,1]
[6,"MAD","Yes","No","Backing",66048,6]
[6,"UNI","Yes","No","Overturning",130720,5]
[2,"OTT","No","No","Unknown",253012,14]
[8,"CLI","No","Yes","Right Turn",22016,2]
[5,"FAI","No","No","Other Non-Collision",2048110,51]
[6,"DEL","No","No","Head On",6987977,61]
[2,"SAN","Yes","No","Rear End",670800,25]
[4,"ATB","Yes","No","Other Non-Collision",160132,9]
[8,"HAM","Yes","Yes","Rear End",267251238,9762]
[9,"JAC","Yes","No","Pedalcycles",48848,1]
[7,"MOT","No","Yes","Fixed Object",882757,12]
[2,"SEN","Yes","No","Pedalcycles",1305361,15]
[3,"ERI","Yes","No","Right Turn",22016,2]
[11,"COL","Yes","No","Pedestrian",2060084,5]
[8,"HAM","No","No","Rear End",12279742,427]
[4,"POR","Yes","Yes","Right Turn",44032,4]
[2,"SEN","Yes","No","Fixed Object",7960544,285]
[9,"LAW","Yes","No","Rear End",14148813,481]
[6,"FRA","Yes","No","Right Turn",1353124,78]
[10,"MEG","No","No","Fixed Object",38924437,644]
[2,"WOO","Yes","Yes","Fixed Object",2847222,85]
[7,"AUG","Yes","No","Animal",11008,1]
[8,"HAM","No","No","Pedalcycles",646945,3]
[10,"HOC","No","Yes","Parked Vehicle",524825,3]
[5,"MUS","No","No","Other Object",138116,7]
[4,"TRU","No","No","Pedalcycles",2382584,10]
[11,"JEF","Yes","No","Rear End",13896833,446]
[2,"SAN","No","Yes","Parked Vehicle",3765755,179]
[6,"MRW","No","Yes","Left Turn",276060,5]
[6,"PIC","Yes","No","Unknown",33024,3]
[8,"CLI","No","No","Left Turn",7530478,159]
[9,"SCI","No","Yes","Rear End",11008,1]
[12,"LAK","No","No","Right Turn",314072,14]
[2,"WIL","Yes","No","Head On",948805,18]
[1,"ALL","Yes","No","Right Turn",544896,17]
[8,"WAR","Yes","No","Other Object",77056,7]
[10,"ATH","Yes","Yes","Overturning",443416,7]
[8,"HAM","Yes","No","Right Turn",100169282,4953]
[1,"ALL","Yes","Yes","Angle",356728,11]
[3,"HUR","No","No","Head On",5933961,49]
[9,"LAW","Yes","No","Pedestrian",3141845,15]
[9,"SCI","No","No","Parked Vehicle",2349798,57]
[11,"COL","Yes","No","Other Object",44032,4]
[1,"HAN","Yes","Yes","Left Turn",160132,9]
[4,"MAH","Yes","No","Sideswipe - Passing",640925,8]
[4,"SUM","Yes","No","Overturning",2862173,11]
[2,"WIL","No","Yes","Left Turn",11008,1]
[7,"LOG","No","Yes","Other Non-Collision",231168,21]
[3,"WAY","Yes","No","Angle",44032,4]
[3,"MED","Yes","No","Other Non-Collision",11008,1]
[3,"WAY","Yes","No","Parked Vehicle",33024,3]
[9,"SCI","No","Yes","Fixed Object",11008,1]
[2,"WOO","Yes","No","Parked Vehicle",3223333,199]
[4,"TRU","No","No","Parked Vehicle",1892794,39]
[9,"HIG","Yes","No","Parked Vehicle",732204,43]
[3,"MED","Yes","No","Animal",4896258,287]
[7,"AUG","Yes","No","Unknown",22016,2]
[2,"SEN","Yes","No","Rear End",11420959,487]
[7,"CHP","No","No","Sideswipe - Passing",5518528,90]
[2,"FUL","Yes","No","Left Turn",1752905,53]
[9,"BRO","Yes","No","Animal",22016,2]
[2,"WOO","Yes","No","Pedalcycles",3150908,23]
[11,"COL","No","No","Head On",10596511,102]
[8,"BUT","Yes","No","Sideswipe - Meeting",81872,4]
[11,"COL","No","No","Train",83076,2]
[2,"FUL","Yes","No","Animal",132096,12]
[10,"MRG","No","No","Overturning",13269246,68]
[5,"KNO","Yes","No","Overturning",179568,6]
[3,"CRA","Yes","No","Right Turn",769872,34]
[7,"AUG","Yes","No","Other Non-Collision",11008,1]
[4,"ATB","Yes","Yes","Rear End",1399154,24]
[1,"PUT","No","No","Left Turn",1289140,50]
[3,"HUR","Yes","No","Left Turn",142932,4]
[5,"LIC","Yes","No","Other Object",301860,15]
[2,"HEN","Yes","No","Backing",11008,1]
[8,"HAM","Yes","Yes","Sideswipe - Passing",301860,15]
[2,"FUL","Yes","No","Other Non-Collision",48848,1]
[3,"ASD","No","No","Parked Vehicle",1500065,48]
[2,"FUL","Yes","No","Unknown",11008,1]
[3,"RIC","Yes","Yes","Angle",574877,2]
[7,"MOT","Yes","No","Other Non-Collision",149124,8]
[7,"LOG","Yes","No","Head On",998857,17]
[9,"HIG","Yes","No","Right Turn",750608,51]
[5,"LIC","No","Yes","Rear End",10117755,236]
[8,"CLI","Yes","No","Head On",2851337,19]
[9,"LAW","Yes","No","Other Object",568857,7]
[7,"CLA","Yes","Yes","Animal",431376,17]
[5,"LIC","Yes","No","Pedestrian",144136,2]
[2,"LUC","No","No","Sideswipe - Meeting",72068,1]
[1,"ALL","No","Yes","Animal",1997608,131]
[2,"HEN","Yes","No","Fixed Object",44032,4]
[6,"FRA","Yes","Yes","Animal",5440982,230]
[5,"KNO","No","No","Other Object",121088,11]
[6,"UNI","Yes","No","Head On",127108,6]
[4,"POR","Yes","No","Angle",47786868,1205]
[2,"HEN","No","No","Sideswipe - Meeting",33024,3]
[6,"DEL","No","No","Backing",1324228,101]
[3,"ASD","Yes","No","Rear End",55040,5]
[3,"ERI","No","No","Fixed Object",28999546,620]
[7,"MIA","Yes","No","Left Turn",10993354,301]
[4,"ATB","No","Yes","Rear End",5129543,110]
[8,"GRE","Yes","No","Fixed Object",67905089,1628]
[7,"SHE","No","No","Parked Vehicle",590304,28]
[3,"ERI","Yes","No","Pedalcycles",72068,1]
[8,"HAM","Yes","No","Other Object",44032,4]
[7,"MOT","Yes","No","Head On",259032,9]
[8,"HAM","No","Yes","Head On",502809,1]
[9,"ROS","Yes","No","Angle",31827887,851]
[12,"CUY","Yes","No","Backing",93633903,6057]
[5,"LIC","Yes","Yes","Other Non-Collision",942785,23]
[2,"SEN","Yes","No","Pedestrian",2755877,9]
[6,"UNI","Yes","Yes","Right Turn",70864,3]
[5,"GUE","Yes","Yes","Overturning",2587780,12]
[7,"AUG","No","Yes","Head On",11008,1]
[6,"MRW","Yes","No","Parked Vehicle",11008,1]
[6,"PIC","Yes","No","Unknown",105092,4]
[1,"WYA","No","Yes","Backing",11008,1]
[8,"CLE","Yes","Yes","Head On",883961,10]
[4,"SUM","Yes","Yes","Unknown",11008,1]
[10,"MEG","Yes","No","Left Turn",1299341,20]
[1,"ALL","Yes","Yes","Left Turn",164948,6]
[4,"SUM","Yes","No","Sideswipe - Passing",1843893,89]
[6,"FRA","Yes","No","Parked Vehicle",190419446,9184]
[11,"COL","Yes","Yes","Left Turn",55040,5]
[6,"DEL","No","No","Unknown",253184,23]
[11,"HOL","No","No","Overturning",6472665,67]
[11,"HOL","No","No","Sideswipe - Meeting",116100,5]
[9,"HIG","No","No","Sideswipe - Passing",4418548,103]
[8,"GRE","Yes","No","Angle",67099307,1668]
[1,"VAN","Yes","No","Other Object",11008,1]
[10,"NOB","No","No","Pedestrian",169764,3]
[3,"HUR","Yes","No","Head On",1048909,16]
[3,"LOR","Yes","No","Other Object",11008,1]
[5,"FAI","Yes","No","Sideswipe - Meeting",59856,2]
[1,"WYA","No","No","Angle",7783014,83]
[7,"AUG","Yes","No","Head On",430000,10]
[7,"AUG","Yes","No","Train",502809,1]
[7,"MIA","Yes","No","Other Object",215172,14]
[5,"GUE","Yes","Yes","Animal",2495376,172]
[5,"LIC","Yes","Yes","Angle",155144,3]
[7,"CLA","Yes","No","Other Non-Collision",423980,15]
[2,"SEN","No","No","Sideswipe - Passing",4557127,113]
[4,"POR","Yes","No","Rear End",83076,2]
[4,"SUM","Yes","Yes","Angle",94084,3]
[10,"GAL","Yes","No","Unknown",535833,4]
[10,"HOC","Yes","No","Left Turn",1113356,52]
[3,"CRA","No","Yes","Parked Vehicle",22016,2]
[7,"CLA","No","No","Parked Vehicle",964801,25]
[3,"MED","Yes","No","Other Object",11008,1]
[4,"POR","Yes","Yes","Animal",1888388,101]
[3,"RIC","Yes","No","Rear End",72068,1]
[11,"TUS","Yes","Yes","Unknown",297216,27]
[4,"SUM","Yes","Yes","Left Turn",2730844,103]
[2,"OTT","No","No","Overturning",5762080,49]
[6,"UNI","Yes","Yes","Head On",22016,2]
[8,"HAM","Yes","No","Backing",76150910,5618]
[8,"WAR","No","No","Left Turn",8001242,202]
[4,"POR","Yes","Yes","Unknown",44032,4]
[5,"KNO","Yes","No","Rear End",138116,7]
[6,"FAY","No","Yes","Unknown",143104,13]
[5,"FAI","Yes","No","Rear End",149124,8]
[1,"ALL","Yes","No","Pedalcycles",131924,3]
[3,"CRA","Yes","No","Fixed Object",155144,3]
[7,"CLA","Yes","No","Pedestrian",1882183,10]
[5,"GUE","Yes","No","Head On",3112671,56]
[9,"SCI","Yes","No","Pedalcycles",5147061,24]
[3,"MED","Yes","Yes","Other Non-Collision",66048,6]
[2,"LUC","No","No","Parked Vehicle",369112,19]
[7,"CLA","No","Yes","Fixed Object",14312266,495]
[7,"SHE","No","Yes","Backing",33024,3]
[4,"TRU","Yes","No","Head On",83076,2]
[10,"NOB","Yes","Yes","Angle",70864,3]
[4,"MAH","Yes","No","Head On",177160,5]
[9,"ROS","Yes","No","Unknown",33024,3]
[8,"PRE","Yes","No","Overturning",11008,1]
[1,"ALL","Yes","No","Rear End",465604,23]
[9,"SCI","Yes","No","Other Non-Collision",11008,1]
[8,"BUT","Yes","No","Sideswipe - Passing",2179981,105]
[4,"MAH","Yes","No","Overturning",4924387,35]
[3,"LOR","Yes","No","Pedalcycles",2755599,27]
[6,"MAD","No","Yes","Left Turn",169764,3]
[0,"LUC","Yes","No","Right Turn",11008,1]
[4,"ATB","Yes","No","Fixed Object",941409,16]
[7,"CLA","Yes","Yes","Head On",772849,11]
[3,"RIC","No","No","Rear End",10589604,227]
[3,"RIC","Yes","No","Pedalcycles",299280,5]
[4,"STA","Yes","Yes","Unknown",11008,1]
[6,"PIC","No","No","Other Non-Collision",7134587,170]
[3,"WAY","Yes","No","Parked Vehicle",512216,32]
[4,"STA","Yes","No","Other Non-Collision",5607875,219]
[3,"MED","Yes","No","Angle",2362751,46]
[7,"CLA","Yes","Yes","Sideswipe - Passing",2759039,82]
[5,"LIC","No","Yes","Sideswipe - Passing",8275992,311]
[7,"MOT","Yes","Yes","Sideswipe - Passing",114896,7]
[3,"CRA","Yes","No","Animal",440320,40]
[5,"KNO","Yes","No","Pedestrian",48848,1]
[1,"ALL","Yes","Yes","Unknown",191952,14]
[1,"PUT","Yes","No","Left Turn",210184,8]
[3,"RIC","Yes","No","Rear End",55127324,2104]
[9,"SCI","Yes","No","Pedestrian",11177170,54]
[4,"SUM","Yes","No","Rear End",459412,14]
[1,"ALL","No","No","Parked Vehicle",807884,43]
[2,"OTT","Yes","Yes","Left Turn",11008,1]
[5,"LIC","Yes","Yes","Parked Vehicle",318888,11]
[8,"GRE","Yes","No","Head On",72068,1]
[3,"LOR","Yes","No","Sideswipe - Meeting",72068,1]
[10,"MOE","No","No","Pedestrian",1917615,9]
[8,"BUT","Yes","Yes","Parked Vehicle",1522941,30]
[3,"WAY","Yes","No","Rear End",5331868,103]
[6,"DEL","No","Yes","Animal",1314252,89]
[11,"BEL","Yes","No","Parked Vehicle",77056,7]
[8,"BUT","Yes","No","Animal",803584,73]
[2,"OTT","No","Yes","Parked Vehicle",72068,1]
[11,"JEF","No","No","Right Turn",673949,11]
[7,"SHE","No","No","Left Turn",2536365,88]
[7,"LOG","Yes","No","Sideswipe - Passing",2358464,168]
[7,"AUG","No","Yes","Other Non-Collision",220160,20]
[5,"FAI","Yes","Yes","Right Turn",44032,4]
[5,"GUE","No","No","Left Turn",1963089,61]
[10,"WAS","Yes","No","Pedalcycles",48848,1]
[10,"ATH","Yes","Yes","Sideswipe - Passing",522192,44]
[10,"MRG","No","No","Sideswipe - Passing",1484069,41]
[8,"HAM","Yes","No","Overturning",21288085,187]
[1,"ALL","Yes","No","Right Turn",66048,6]
[3,"RIC","Yes","Yes","Other Object",33024,3]
[5,"KNO","No","No","Pedestrian",2204220,7]
[1,"HAN","No","No","Pedestrian",695793,4]
[9,"ROS","Yes","No","Rear End",240800,15]
[7,"DAR","Yes","No","Backing",1525984,118]
[4,"MAH","No","No","Pedalcycles",1845547,8]
[7,"MIA","Yes","Yes","Overturning",2271472,11]
[2,"HEN","Yes","No","Fixed Object",2608949,126]
[5,"GUE","Yes","No","Rear End",11318553,396]
[10,"MOE","Yes","No","Other Object",11008,1]
[5,"FAI","Yes","No","Right Turn",4834854,204]
[10,"NOB","Yes","Yes","Unknown",11008,1]
[6,"UNI","Yes","Yes","Left Turn",668961,5]
[5,"FAI","No","No","Animal",5797300,242]
[5,"KNO","Yes","No","Pedalcycles",1416010,11]
[7,"MIA","Yes","No","Pedestrian",2735991,21]
[7,"CLA","Yes","Yes","Right Turn",138116,7]
[7,"CLA","Yes","No","Sideswipe - Passing",81872,4]
[12,"GEA","Yes","No","Right Turn",11008,1]
[8,"PRE","Yes","No","Angle",714660,20]
[1,"PAU","No","Yes","Fixed Object",1527360,55]
[3,"ASD","No","No","Unknown",1225606,13]
[4,"TRU","No","No","Sideswipe - Meeting",22016,2]
[2,"FUL","Yes","No","Left Turn",311492,9]
[4,"STA","Yes","No","Pedestrian",2155372,6]
[7,"MOT","Yes","No","Pedalcycles",31801003,309]
[3,"ASD","Yes","Yes","Sideswipe - Passing",1410797,42]
[11,"COL","Yes","Yes","Angle",33024,3]
[7,"LOG","Yes","No","Head On",116100,5]
[10,"HOC","Yes","No","Fixed Object",5444065,105]
[5,"LIC","Yes","No","Overturning",257828,11]
[3,"ASD","No","No","Other Object",270212,19]
[2,"WOO","No","Yes","Unknown",440320,40]
[3,"WAY","Yes","No","Left Turn",391128,21]
[12,"LAK","No","No","Fixed Object",15733741,288]
[7,"MOT","Yes","No","Animal",10253370,636]
[11,"COL","Yes","Yes","Other Non-Collision",782653,14]
[6,"UNI","No","Yes","Right Turn",83076,2]
[9,"SCI","No","No","Left Turn",7060230,153]
[7,"CLA","Yes","No","Sideswipe - Passing",31393044,1324]
[12,"LAK","No","Yes","Overturning",1114785,13]
[8,"BUT","Yes","Yes","Pedestrian",1629343,5]
[4,"TRU","Yes","No","Left Turn",44032,4]
[4,"SUM","No","No","Unknown",22016,2]
[3,"HUR","No","No","Parked Vehicle",1359938,12]
[4,"STA","Yes","No","Fixed Object",6075014,171]
[3,"MED","Yes","No","Overturning",59856,2]
[3,"LOR","Yes","Yes","Overturning",1784487,8]
[3,"ERI","Yes","Yes","Head On",546841,5]
[11,"COL","No","Yes","Fixed Object",3949623,80]
[11,"JEF","Yes","No","Right Turn",2230668,126]
[7,"LOG","Yes","Yes","Other Non-Collision",11008,1]
[10,"VIN","No","No","Animal",4731019,212]
[7,"SHE","No","No","Pedestrian",574877,2]
[11,"JEF","No","Yes","Parked Vehicle",155144,3]
[7,"MIA","Yes","Yes","Overturning",537500,10]
[3,"RIC","Yes","No","Angle",70864,3]
[4,"MAH","Yes","No","Animal",341248,31]
[4,"ATB","Yes","No","Backing",2036136,167]
[6,"PIC","Yes","No","Sideswipe - Passing",4616348,168]
[10,"MOE","No","No","Parked Vehicle",1682610,31]
[3,"HUR","Yes","No","Other Non-Collision",55040,5]
[8,"CLI","No","No","Train",22016,2]
[8,"CLI","No","No","Head On",16756970,85]
[10,"HOC","No","No","Other Non-Collision",650332,39]
[8,"CLI","Yes","No","Other Non-Collision",303236,22]
[2,"FUL","No","Yes","Sideswipe - Passing",2675632,144]
[7,"MER","Yes","No","Other Object",55040,5]
[3,"CRA","Yes","No","Other Non-Collision",705769,16]
[8,"WAR","Yes","Yes","Unknown",165120,15]
[8,"PRE","Yes","No","Head On",2031770,26]
[8,"PRE","Yes","No","Train",11008,1]
[0,"CUY","Yes","No","Sideswipe - Passing",22016,2]
[2,"SAN","No","Yes","Unknown",423120,35]
[7,"MER","No","No","Rear End",8104270,158]
[2,"HEN","Yes","No","Pedestrian",1738047,8]
[9,"PIK","Yes","No","Left Turn",2711342,65]
[3,"ERI","Yes","No","Sideswipe - Passing",960157,37]
[1,"VAN","Yes","No","Right Turn",664952,39]
[1,"PAU","No","No","Pedestrian",502809,1]
[9,"JAC","Yes","Yes","Other Non-Collision",33024,3]
[6,"DEL","Yes","Yes","Right Turn",142932,4]
[1,"ALL","Yes","Yes","Other Non-Collision",341248,31]
[12,"CUY","Yes","Yes","Animal",13651495,651]
[3,"LOR","Yes","No","Left Turn",1695285,43]
[10,"ATH","Yes","No","Fixed Object",92880,5]
[3,"RIC","No","No","Right Turn",1177393,29]
[6,"DEL","No","No","Other Object",414348,21]
[7,"AUG","No","Yes","Other Object",110080,10]
[3,"ERI","Yes","No","Sideswipe - Passing",325080,15]
[12,"CUY","Yes","No","Other Non-Collision",594088,36]
[6,"UNI","No","Yes","Animal",4893559,222]
[4,"SUM","No","Yes","Right Turn",502809,1]
[5,"GUE","Yes","Yes","Parked Vehicle",70864,3]
[11,"COL","Yes","Yes","Animal",22016,2]
[6,"PIC","Yes","No","Sideswipe - Meeting",11008,1]
[5,"KNO","No","No","Fixed Object",64789944,1235]
[4,"ATB","Yes","No","Fixed Object",21724766,383]
[4,"POR","Yes","Yes","Parked Vehicle",22016,2]
[3,"WAY","Yes","No","Left Turn",2562959,42]
[2,"WOO","No","No","Animal",17329622,1375]
[2,"FUL","Yes","No","Train",11008,1]
[2,"FUL","Yes","No","Head On",668961,5]
[10,"HOC","Yes","No","Overturning",595689,6]
[9,"HIG","Yes","No","Backing",1231520,105]
[8,"WAR","Yes","Yes","Other Non-Collision",429312,39]
[6,"UNI","Yes","No","Angle",12489503,279]
[5,"FAI","Yes","Yes","Other Non-Collision",103888,6]
[4,"TRU","Yes","No","Pedalcycles",5288511,43]
[6,"PIC","Yes","No","Left Turn",1860802,25]
[7,"AUG","Yes","No","Rear End",70864,3]
[3,"HUR","No","No","Left Turn",5517906,85]
[10,"ATH","No","Yes","Animal",368080,30]
[3,"HUR","Yes","No","Other Object",99072,9]
[3,"MED","Yes","Yes","Head On",11008,1]
[4,"ATB","Yes","Yes","Overturning",11008,1]
[2,"SAN","No","No","Angle",28245777,242]
[6,"FAY","No","No","Sideswipe - Passing",3591400,77]
[8,"PRE","Yes","No","Left Turn",2058946,43]
[3,"RIC","Yes","No","Pedestrian",12626495,72]
[6,"MRW","No","No","Other Non-Collision",732204,43]
[8,"CLE","No","No","Sideswipe - Meeting",331272,19]
[7,"CLA","Yes","No","Other Object",647924,43]
[8,"WAR","Yes","Yes","Other Non-Collision",88064,8]
[1,"ALL","Yes","No","Backing",204164,13]
[7,"MOT","Yes","No","Pedalcycles",11008,1]
[12,"GEA","No","Yes","Head On",574877,2]
[5,"COS","No","No","Unknown",22016,2]
[4,"MAH","Yes","Yes","Pedestrian",144136,2]
[8,"CLE","Yes","No","Other Non-Collision",166152,4]
[4,"STA","No","Yes","Angle",48848,1]
[11,"COL","Yes","No","Pedalcycles",72068,1]
[7,"LOG","No","No","Pedalcycles",192984,3]
[7,"DAR","Yes","No","Other Object",88064,8]
[7,"CLA","No","Yes","Rear End",13868573,182]
[7,"CLA","Yes","No","Angle",128951398,2427]
[3,"LOR","Yes","No","Head On",1997079,17]
[2,"FUL","Yes","Yes","Fixed Object",180944,13]
[7,"AUG","Yes","No","Parked Vehicle",1566682,35]
[6,"MAD","Yes","No","Other Non-Collision",436192,14]
[11,"JEF","Yes","No","Animal",22016,2]
[9,"LAW","Yes","No","Overturning",1778930,21]
[6,"MRW","No","Yes","Backing",88064,8]
[1,"HAN","Yes","No","Pedestrian",72068,1]
[12,"GEA","No","No","Sideswipe - Meeting",44032,4]
[3,"MED","Yes","No","Pedalcycles",1982922,25]
[2,"WOO","Yes","No","Angle",24733972,584]
[8,"CLI","Yes","No","Pedalcycles",1451442,10]
[3,"RIC","Yes","No","Fixed Object",309084,8]
[6,"PIC","Yes","No","Animal",22016,2]
[11,"JEF","No","No","Other Object",1176758,12]
[3,"ERI","Yes","Yes","Left Turn",155144,3]
[2,"HEN","Yes","Yes","Head On",11008,1]
[2,"HEN","Yes","No","Overturning",142932,4]
[6,"FAY","Yes","Yes","Angle",502809,1]
[10,"WAS","Yes","No","Animal",22016,2]
[1,"HAN","No","No","Overturning",3726142,65]
[8,"HAM","Yes","Yes","Parked Vehicle",10101521,184]
[7,"MIA","Yes","No","Left Turn",224804,8]
[3,"MED","Yes","Yes","Right Turn",94084,3]
[4,"SUM","Yes","No","Sideswipe - Meeting",705769,16]
[1,"WYA","No","No","Rear End",4457817,64]
[8,"WAR","No","No","Right Turn",1516352,59]
[2,"LUC","No","Yes","Fixed Object",1249461,35]
[7,"CHP","Yes","No","Angle",8528475,211]
[5,"FAI","Yes","Yes","Rear End",276232,14]
[4,"ATB","Yes","No","Sideswipe - Passing",1051833,44]
[7,"SHE","No","Yes","Parked Vehicle",44032,4]
[7,"LOG","Yes","No","Parked Vehicle",88064,8]
[8,"GRE","Yes","Yes","Other Non-Collision",1153948,66]
[9,"HIG","Yes","No","Other Non-Collision",1212825,33]
[9,"BRO","No","No","Sideswipe - Passing",7927388,200]
[11,"TUS","Yes","No","Backing",5505773,419]
[7,"CLA","Yes","No","Other Non-Collision",5107395,91]
[4,"ATB","Yes","No","Sideswipe - Meeting",11008,1]
[12,"CUY","Yes","Yes","Parked Vehicle",11008,1]
[10,"MOE","No","No","Rear End",1901857,57]
[7,"DAR","Yes","No","Sideswipe - Passing",22016,2]
[7,"MIA","Yes","Yes","Left Turn",1193786,8]
[6,"MRW","No","Yes","Unknown",660136,42]
[2,"LUC","No","Yes","Left Turn",11008,1]
[2,"SEN","Yes","No","Head On",2523571,26]
[2,"SEN","Yes","No","Train",513817,2]
[7,"DAR","No","No","Backing",1377892,94]
[5,"PER","No","No","Parked Vehicle",2521110,76]
[7,"MER","Yes","No","Angle",11008,1]
[11,"TUS","Yes","No","Unknown",226180,15]
[7,"MIA","Yes","No","Rear End",8431665,393]
[3,"MED","Yes","Yes","Animal",2492677,112]
[2,"OTT","Yes","No","Head On",623725,3]
[2,"OTT","Yes","No","Train",48848,1]
[9,"PIK","Yes","No","Other Non-Collision",11008,1]
[7,"MIA","No","No","Pedestrian",2442440,12]
[8,"BUT","Yes","No","Other Object",546841,5]
[7,"AUG","No","Yes","Angle",203992,4]
[6,"UNI","Yes","No","Other Non-Collision",110080,10]
[11,"HOL","No","No","Parked Vehicle",1434189,51]
[2,"SAN","Yes","No","Sideswipe - Passing",381324,18]
[5,"FAI","Yes","Yes","Sideswipe - Passing",70864,3]
[2,"WOO","Yes","No","Sideswipe - Passing",381324,18]
[1,"ALL","Yes","Yes","Rear End",11008,1]
[4,"POR","No","Yes","Other Non-Collision",594260,45]
[7,"LOG","Yes","No","Angle",7614308,253]
[2,"SAN","Yes","No","Head On",585885,3]
[10,"WAS","Yes","No","Right Turn",699008,31]
[7,"CLA","Yes","Yes","Other Object",77056,7]
[1,"VAN","Yes","No","Pedalcycles",555732,9]
[8,"BUT","Yes","No","Pedestrian",9488712,37]
[5,"FAI","Yes","No","Angle",37809108,973]
[1,"PAU","Yes","No","Animal",11008,1]
[6,"FRA","No","No","Unknown",22016,2]
[6,"DEL","No","Yes","Unknown",143104,13]
[4,"MAH","Yes","Yes","Other Non-Collision",3065543,85]
[9,"HIG","Yes","No","Angle",6515810,251]
[7,"SHE","Yes","No","Overturning",1381954,14]
[6,"MAD","Yes","No","Rear End",72068,1]
[3,"MED","Yes","No","Rear End",2560551,46]
[1,"ALL","No","No","Overturning",7324634,58]
[1,"HAN","Yes","No","Left Turn",15097552,408]
[2,"OTT","Yes","No","Rear End",10543733,273]
[8,"BUT","Yes","No","Pedalcycles",585885,3]
[10,"MRG","No","No","Animal",1883109,96]
[1,"VAN","No","No","Left Turn",3569781,47]
[8,"CLE","Yes","Yes","Sideswipe - Meeting",11008,1]
[5,"MUS","No","No","Pedestrian",1796699,7]
[5,"COS","No","No","Animal",7247551,406]
[8,"GRE","Yes","Yes","Backing",158928,11]
[5,"KNO","Yes","No","Animal",44032,4]
[11,"BEL","No","No","Animal",6904120,342]
[6,"UNI","Yes","Yes","Sideswipe - Passing",1825886,53]
[6,"FRA","Yes","No","Rear End",11831232,431]
[2,"FUL","Yes","No","Rear End",138116,7]
[7,"CHP","Yes","No","Other Non-Collision",265224,13]
[9,"HIG","Yes","No","Right Turn",77056,7]
[10,"MRG","No","No","Unknown",105092,4]
[8,"GRE","No","No","Overturning",7687091,60]
[5,"LIC","Yes","Yes","Sideswipe - Passing",3298550,126]
[3,"WAY","Yes","No","Fixed Object",5239279,167]
[2,"WOO","No","Yes","Parked Vehicle",253012,14]
[8,"WAR","Yes","No","Backing",4897925,363]
[3,"WAY","Yes","Yes","Sideswipe - Passing",1168965,38]
[4,"MAH","No","No","Backing",1692533,89]
[6,"PIC","Yes","No","Other Object",639721,10]
[3,"ERI","Yes","No","Angle",2826807,53]
[6,"PIC","No","Yes","Head On",524825,3]
[4,"TRU","No","No","Other Non-Vehicle",11008,1]
[11,"BEL","Yes","No","Angle",350708,16]
[5,"KNO","No","No","Right Turn",1197001,35]
[5,"LIC","No","Yes","Pedestrian",574877,2]
[4,"TRU","No","No","Left Turn",6846262,142]
[3,"ERI","No","Yes","Parked Vehicle",1911595,14]
[4,"SUM","No","Yes","Fixed Object",3690432,154]
[6,"FAY","Yes","No","Overturning",1990887,13]
[3,"LOR","No","No","Unknown",469388,26]
[2,"WIL","No","Yes","Right Turn",44032,4]
[10,"ATH","No","No","Rear End",6634702,132]
[7,"LOG","Yes","Yes","Sideswipe - Passing",273824,18]
[9,"BRO","No","No","Backing",1633881,90]
[7,"AUG","No","No","Left Turn",3123110,71]
[7,"LOG","No","No","Fixed Object",41211971,848]
[11,"TUS","No","Yes","Backing",22016,2]
[1,"PAU","No","No","Overturning",6591742,44]
[9,"ROS","No","No","Pedalcycles",502809,1]
[3,"ERI","Yes","No","Angle",44392660,1026]
[9,"HIG","No","No","Angle",15480729,199]
[2,"LUC","Yes","No","Animal",390096,32]
[2,"FUL","No","Yes","Other Non-Collision",346064,28]
[8,"BUT","Yes","No","Parked Vehicle",2498472,144]
[5,"FAI","Yes","No","Fixed Object",1341706,18]
[2,"HEN","No","No","Parked Vehicle",851109,16]
[3,"CRA","No","No","Head On",2950409,28]
[3,"CRA","No","No","Train",72068,1]
[11,"BEL","No","No","Pedalcycles",11008,1]
[7,"CLA","Yes","No","Angle",179568,6]
[2,"OTT","No","Yes","Angle",48848,1]
[11,"COL","Yes","No","Animal",883101,30]
[2,"OTT","No","No","Parked Vehicle",1510504,68]
[6,"MAR","Yes","No","Left Turn",15727906,309]
[3,"ASD","Yes","No","Backing",11008,1]
[10,"MEG","No","No","Backing",848873,29]
[3,"RIC","Yes","No","Sideswipe - Passing",110080,10]
[2,"HEN","No","No","Rear End",7064411,138]
[1,"VAN","No","No","Fixed Object",22900611,461]
[2,"LUC","No","No","Rear End",8685445,152]
[8,"HAM","Yes","Yes","Left Turn",4919187,158]
[2,"FUL","No","No","Other Object",1096897,37]
[6,"DEL","No","Yes","Left Turn",387344,13]
[11,"JEF","Yes","Yes","Right Turn",44032,4]
[1,"ALL","Yes","No","Animal",33024,3]
[2,"WOO","No","No","Sideswipe - Passing",7826199,199]
[6,"UNI","Yes","No","Other Object",77056,7]
[1,"WYA","Yes","No","Backing",11008,1]
[4,"ATB","No","No","Head On",10160888,74]
[4,"ATB","No","No","Train",502809,1]
[6,"PIC","No","No","Head On",8815742,66]
[3,"WAY","No","Yes","Right Turn",72068,1]
[8,"CLI","No","No","Fixed Object",46763390,918]
[8,"HAM","Yes","No","Right Turn",3170701,135]
[4,"MAH","Yes","No","Unknown",11008,1]
[6,"UNI","No","Yes","Fixed Object",4470717,99]
[4,"POR","Yes","No","Rear End",58234213,2265]
[8,"BUT","Yes","No","Head On",1346522,15]
[8,"WAR","Yes","No","Unknown",231168,21]
[9,"ROS","No","No","Angle",21896819,312]
[5,"COS","Yes","No","Parked Vehicle",1862297,92]
[7,"MIA","Yes","Yes","Parked Vehicle",1089157,12]
[11,"CAR","No","No","Sideswipe - Passing",3179407,98]
[6,"MRW","No","No","Parked Vehicle",888552,44]
[7,"CHP","No","Yes","Other Non-Collision",11008,1]
[3,"HUR","No","No","Angle",25810005,249]
[5,"KNO","Yes","No","Parked Vehicle",1727052,94]
[4,"STA","Yes","No","Head On",37356988,475]
[4,"STA","Yes","No","Train",55040,5]
[2,"SEN","Yes","No","Parked Vehicle",2241266,68]
[8,"CLE","Yes","No","Angle",689204,33]
[10,"GAL","No","Yes","Right Turn",585885,3]
[1,"HAN","Yes","No","Parked Vehicle",4651621,315]
[3,"WAY","Yes","No","Other Non-Collision",72068,1]
[1,"ALL","No","Yes","Parked Vehicle",618909,6]
[3,"ASD","Yes","No","Animal",11008,1]
[4,"ATB","Yes","No","Sideswipe - Passing",22016,2]
[2,"SEN","Yes","No","Left Turn",3764842,115]
[6,"FRA","No","Yes","Animal",88064,8]
[1,"VAN","Yes","No","Backing",1214320,100]
[2,"WIL","No","Yes","Rear End",6608161,127]
[5,"LIC","No","No","Right Turn",4644384,100]
[2,"FUL","Yes","No","Animal",374272,34]
[12,"LAK","Yes","Yes","Backing",270212,19]
[4,"SUM","No","Yes","Rear End",1031312,44]
[6,"MAD","No","No","Unknown",320264,18]
[2,"LUC","Yes","No","Right Turn",54423355,2267]
[4,"ATB","Yes","No","Rear End",22016,2]
[7,"MIA","No","Yes","Sideswipe - Passing",634905,13]
[3,"RIC","No","No","Fixed Object",55502128,1180]
[12,"LAK","No","Yes","Other Object",667929,16]
[11,"COL","Yes","No","Fixed Object",4526789,93]
[7,"MER","No","Yes","Rear End",72068,1]
[3,"HUR","No","No","Backing",407296,37]
[9,"LAW","Yes","No","Right Turn",1404949,56]
[4,"ATB","Yes","No","Other Non-Collision",1647178,27]
[4,"STA","Yes","No","Fixed Object",11705646,267]
[2,"SAN","Yes","No","Sideswipe - Passing",1780941,50]
[5,"COS","No","Yes","Animal",11008,1]
[10,"VIN","No","No","Overturning",6044160,44]
[8,"CLE","No","No","Overturning",9936838,73]
[5,"GUE","No","Yes","Other Object",291024,23]
[12,"GEA","Yes","No","Other Non-Collision",652568,31]
[2,"WIL","Yes","No","Pedestrian",72068,1]
[12,"GEA","Yes","No","Backing",11008,1]
[9,"PIK","No","No","Angle",10450602,121]
[4,"SUM","Yes","No","Pedalcycles",362748,6]
[7,"AUG","Yes","No","Parked Vehicle",502809,1]
[10,"GAL","Yes","Yes","Left Turn",11008,1]
[11,"HOL","No","No","Other Non-Vehicle",11008,1]
[7,"AUG","Yes","No","Pedalcycles",48848,1]
[7,"SHE","Yes","No","Pedalcycles",2613871,26]
[1,"PAU","No","Yes","Other Object",33024,3]
[6,"DEL","Yes","No","Rear End",109863454,3971]
[7,"MOT","Yes","Yes","Fixed Object",677561,10]
[5,"PER","No","No","Backing",1630904,108]
[3,"WAY","Yes","Yes","Right Turn",623725,3]
[1,"VAN","Yes","No","Other Non-Collision",70864,3]
[4,"MAH","Yes","No","Backing",264192,24]
[5,"LIC","Yes","Yes","Other Non-Collision",187136,17]
[1,"HAN","No","No","Pedalcycles",83076,2]
[11,"COL","Yes","No","Sideswipe - Passing",2692991,76]
[9,"JAC","Yes","No","Rear End",66048,6]
[10,"WAS","No","Yes","Sideswipe - Passing",506024,28]
[4,"POR","Yes","Yes","Fixed Object",722056,22]
[11,"JEF","No","No","Falling From Or In Vehicle",502809,1]
[10,"NOB","Yes","No","Sideswipe - Meeting",83076,2]
[2,"OTT","Yes","No","Left Turn",83076,2]
[7,"MOT","Yes","No","Fixed Object",331103641,5863]
[2,"SEN","Yes","No","Unknown",175956,7]
[9,"ROS","Yes","Yes","Angle",799681,10]
[11,"COL","Yes","No","Overturning",860741,10]
[6,"PIC","Yes","No","Pedestrian",4361259,19]
[8,"WAR","Yes","No","Overturning",923005,8]
[3,"LOR","Yes","Yes","Backing",797392,69]
[7,"MOT","Yes","No","Left Turn",180901987,4263]
[7,"MER","Yes","No","Rear End",8970303,345]
[8,"BUT","Yes","Yes","Sideswipe - Passing",24951075,1048]
[4,"MAH","Yes","No","Right Turn",105092,4]
[2,"LUC","Yes","No","Parked Vehicle",76925216,4106]
[8,"BUT","No","Yes","Right Turn",11008,1]
[5,"GUE","No","No","Other Object",160132,9]
[5,"LIC","Yes","No","Sideswipe - Meeting",33024,3]
[4,"ATB","Yes","No","Head On",72068,1]
[9,"BRO","No","No","Left Turn",5014303,140]
[6,"MRW","Yes","No","Backing",11008,1]
[5,"LIC","Yes","No","Unknown",193156,12]
[2,"HEN","No","Yes","Overturning",216204,3]
[9,"LAW","Yes","Yes","Rear End",11008,1]
[8,"GRE","Yes","Yes","Left Turn",2770391,36]
[2,"WIL","No","Yes","Fixed Object",5096466,213]
[10,"ATH","No","No","Backing",986989,36]
[11,"TUS","No","Yes","Head On",70864,3]
[3,"ASD","Yes","No","Angle",18124779,393]
[4,"TRU","No","Yes","Unknown",66048,6]
[8,"WAR","Yes","No","Left Turn",38208360,904]
[10,"WAS","Yes","No","Head On",1573165,38]
[12,"LAK","Yes","Yes","Sideswipe - Passing",11008,1]
[7,"MER","Yes","No","Pedestrian",3381269,18]
[5,"PER","Yes","No","Sideswipe - Passing",22016,2]
[3,"RIC","Yes","No","Angle",78341929,1757]
[1,"HAR","No","No","Other Object",215172,14]
[4,"ATB","No","No","Other Non-Collision",2156986,63]
[5,"FAI","Yes","No","Right Turn",81872,4]
[12,"GEA","No","No","Pedalcycles",2310516,9]
[9,"LAW","No","Yes","Sideswipe - Passing",105092,4]
[7,"MIA","No","No","Other Object",347096,17]
[7,"SHE","Yes","No","Fixed Object",628713,9]
[1,"PUT","Yes","No","Sideswipe - Passing",11008,1]
[6,"MAD","Yes","No","Angle",11008,1]
[12,"CUY","Yes","No","Sideswipe - Meeting",160132,9]
[11,"COL","Yes","No","Parked Vehicle",33024,3]
[8,"PRE","Yes","No","Parked Vehicle",77056,7]
[10,"HOC","Yes","Yes","Rear End",1306909,36]
[4,"STA","Yes","No","Sideswipe - Passing",66481111,3286]
[10,"WAS","Yes","No","Parked Vehicle",367908,21]
[6,"FRA","Yes","No","Rear End",592540,20]
[6,"UNI","Yes","No","Right Turn",59856,2]
[7,"AUG","Yes","Yes","Parked Vehicle",81872,4]
[7,"LOG","No","No","Rear End",8968914,236]
[10,"MEG","No","No","Animal",8494181,299]
[10,"MOE","No","No","Backing",429140,30]
[3,"LOR","No","Yes","Parked Vehicle",22016,2]
[4,"ATB","Yes","No","Animal",1758184,123]
[11,"BEL","Yes","No","Other Non-Collision",1853922,50]
[4,"STA","Yes","No","Unknown",136912,9]
[6,"MAR","Yes","No","Sideswipe - Meeting",11008,1]
[10,"HOC","Yes","No","Unknown",11008,1]
[1,"HAN","Yes","Yes","Unknown",385280,35]
[3,"RIC","Yes","Yes","Other Object",776408,56]
[8,"HAM","Yes","No","Animal",16842108,1073]
[7,"MOT","Yes","No","Rear End",305716762,10983]
[1,"HAR","Yes","No","Other Object",188168,6]
[5,"MUS","No","Yes","Other Non-Collision",413316,32]
[10,"HOC","Yes","No","Right Turn",1048049,36]
[10,"GAL","No","No","Pedalcycles",502809,1]
[3,"ERI","No","Yes","Animal",2983512,229]
[3,"RIC","Yes","No","Fixed Object",4406971,116]
[1,"DEF","Yes","No","Other Object",66048,6]
[5,"MUS","Yes","Yes","Right Turn",22016,2]
[10,"ATH","No","No","Unknown",88064,8]
[12,"GEA","Yes","No","Backing",588240,50]
[6,"DEL","No","Yes","Parked Vehicle",11008,1]
[7,"LOG","Yes","No","Other Non-Collision",724001,10]
[7,"DAR","Yes","Yes","Sideswipe - Passing",739997,17]
[4,"MAH","Yes","No","Head On",22016,2]
[2,"WIL","No","Yes","Parked Vehicle",1155496,87]
[6,"DEL","Yes","No","Parked Vehicle",10503498,494]
[0,"WAY","Yes","No","Sideswipe - Passing",11008,1]
[4,"POR","Yes","Yes","Rear End",177160,5]
[9,"ROS","Yes","No","Pedalcycles",2004025,28]
[2,"OTT","No","No","Left Turn",4769481,77]
[4,"STA","No","No","Overturning",9834326,79]
[6,"UNI","Yes","Yes","Sideswipe - Passing",2564573,109]
[2,"SAN","Yes","No","Unknown",33024,3]
[6,"UNI","No","Yes","Parked Vehicle",513817,2]
[3,"WAY","No","No","Unknown",242004,13]
[3,"MED","Yes","No","Parked Vehicle",4587558,94]
[12,"GEA","Yes","No","Unknown",33024,3]
[10,"HOC","No","No","Head On",6938666,52]
[2,"WIL","Yes","No","Backing",1024776,82]
[3,"LOR","Yes","No","Angle",2074201,65]
[7,"LOG","No","No","Left Turn",5732615,91]
[5,"COS","Yes","No","Right Turn",546444,33]
[7,"MOT","Yes","No","Overturning",11008,1]
[4,"MAH","Yes","No","Fixed Object",109310335,2238]
[2,"FUL","Yes","Yes","Other Non-Collision",11008,1]
[4,"STA","Yes","Yes","Rear End",48848,1]
[3,"MED","Yes","No","Overturning",846121,10]
[1,"HAN","Yes","Yes","Backing",77056,7]
[10,"NOB","No","Yes","Overturning",155144,3]
[8,"BUT","Yes","No","Pedalcycles",5150686,40]
[6,"FRA","Yes","No","Fixed Object",3334432,51]
[11,"TUS","No","No","Pedestrian",1007285,8]
[3,"MED","No","No","Angle",57637350,869]
[8,"GRE","No","Yes","Overturning",480052,9]
[5,"FAI","No","No","Sideswipe - Meeting",513817,2]
[3,"RIC","Yes","No","Other Object",473172,34]
[10,"NOB","No","Yes","Other Non-Collision",186964,8]
[11,"HAS","No","No","Backing",660136,42]
[3,"WAY","Yes","No","Sideswipe - Passing",11008,1]
[4,"POR","Yes","No","Fixed Object",4861157,84]
[4,"POR","Yes","No","Pedalcycles",48848,1]
[7,"CLA","No","No","Left Turn",5864076,86]
[4,"SUM","Yes","No","Other Object",83076,2]
[7,"SHE","No","No","Head On",5442901,39]
[5,"PER","Yes","No","Other Non-Collision",55040,5]
[4,"TRU","Yes","No","Backing",175956,7]
[7,"AUG","No","No","Overturning",6322337,51]
[8,"WAR","Yes","No","Head On",3700329,38]
[3,"WAY","No","Yes","Overturning",199176,7]
[1,"PUT","Yes","No","Other Non-Collision",55040,5]
[6,"PIC","Yes","No","Head On",657953,4]
[2,"SEN","No","No","Other Object",424152,24]
[11,"COL","Yes","No","Animal",460960,35]
[8,"GRE","Yes","No","Pedestrian",120916,2]
[8,"HAM","No","Yes","Overturning",611513,4]
[6,"UNI","No","No","Parked Vehicle",1178769,41]
[3,"LOR","Yes","No","Pedestrian",1126534,4]
[3,"WAY","No","Yes","Angle",33024,3]
[6,"DEL","Yes","Yes","Rear End",9688218,244]
[3,"ERI","Yes","No","Head On",116100,5]
[3,"LOR","Yes","Yes","Animal",6543621,415]
[3,"LOR","Yes","Yes","Rear End",1027872,59]
[9,"ROS","Yes","Yes","Pedestrian",502809,1]
[6,"UNI","Yes","No","Sideswipe - Passing",5752514,171]
[10,"HOC","Yes","No","Overturning",48848,1]
[7,"SHE","No","Yes","Other Non-Collision",402308,31]
[8,"GRE","Yes","Yes","Head On",2231224,15]
[2,"SEN","No","No","Falling From Or In Vehicle",502809,1]
[5,"FAI","No","Yes","Fixed Object",5223217,119]
[2,"WOO","Yes","No","Animal",3185784,268]
[3,"RIC","Yes","No","Sideswipe - Passing",44032,4]
[6,"PIC","Yes","No","Angle",12367211,270]
[1,"PAU","No","Yes","Other Non-Collision",220160,20]
[10,"GAL","No","No","Rear End",6321834,116]
[11,"JEF","Yes","Yes","Angle",3129236,44]
[11,"HAS","No","No","Unknown",154112,14]
[6,"PIC","Yes","No","Sideswipe - Passing",2541697,117]
[2,"LUC","No","Yes","Other Object",66048,6]
[11,"TUS","No","No","Head On",7284730,80]
[11,"TUS","No","No","Train",72068,1]
[5,"FAI","Yes","No","Other Object",11008,1]
[11,"BEL","No","No","Right Turn",994848,46]
[6,"MRW","No","No","Backing",1404552,84]
[3,"HUR","Yes","No","Angle",1212653,24]
[8,"WAR","No","No","Rear End",12470715,391]
[4,"STA","Yes","No","Head On",1271305,23]
[3,"HUR","Yes","No","Sideswipe - Meeting",11008,1]
[10,"VIN","Yes","No","Rear End",678765,8]
[4,"POR","Yes","No","Backing",5594353,384]
[3,"HUR","Yes","No","Pedalcycles",22016,2]
[11,"BEL","Yes","Yes","Unknown",308224,28]
[2,"WOO","Yes","Yes","Backing",488996,32]
[9,"SCI","Yes","No","Right Turn",3899862,155]
[3,"MED","Yes","No","Sideswipe - Passing",3312310,146]
[3,"LOR","Yes","No","Other Non-Collision",10135948,114]
[3,"ERI","Yes","Yes","Rear End",5240708,128]
[4,"SUM","Yes","No","Sideswipe - Passing",129341450,6618]
[5,"LIC","Yes","No","Parked Vehicle",9857810,433]
[11,"BEL","Yes","No","Parked Vehicle",2836161,130]
[10,"ATH","Yes","Yes","Rear End",11008,1]
[6,"DEL","No","Yes","Sideswipe - Passing",5403367,198]
[7,"SHE","Yes","No","Sideswipe - Passing",149124,8]
[10,"MRG","Yes","No","Fixed Object",11008,1]
[7,"DAR","Yes","No","Head On",585885,3]
[9,"PIK","Yes","No","Backing",667532,44]
[11,"JEF","No","No","Pedestrian",791081,5]
[2,"WIL","No","Yes","Backing",908504,68]
[2,"LUC","Yes","No","Rear End",383695860,14517]
[10,"ATH","Yes","No","Sideswipe - Passing",3276137,152]
[7,"MOT","No","No","Sideswipe - Passing",3417111,81]
[12,"CUY","No","Yes","Sideswipe - Passing",11008,1]
[5,"GUE","No","No","Angle",4995661,92]
[7,"MOT","Yes","No","Other Non-Vehicle",72068,1]
[5,"FAI","No","No","Head On",11028853,77]
[5,"LIC","Yes","No","Backing",1452884,123]
[2,"WOO","Yes","Yes","Unknown",44032,4]
[2,"WOO","Yes","Yes","Backing",11008,1]
[8,"WAR","Yes","No","Fixed Object",4435113,91]
[7,"AUG","Yes","Yes","Backing",66048,6]
[5,"GUE","Yes","No","Backing",1067604,88]
[1,"VAN","No","No","Unknown",180944,13]
[6,"MAD","No","Yes","Rear End",21275714,276]
[6,"MAD","Yes","No","Pedalcycles",574877,2]
[6,"MAD","No","No","Sideswipe - Passing",7627023,187]
[6,"FRA","Yes","Yes","Other Non-Collision",17511189,329]
[10,"GAL","Yes","No","Animal",138116,7]
[3,"ASD","Yes","Yes","Head On",48848,1]
[6,"MRW","Yes","No","Other Non-Collision",11008,1]
[8,"GRE","No","Yes","Sideswipe - Passing",1957982,65]
[7,"MOT","Yes","No","Right Turn",49313354,1887]
[9,"JAC","Yes","No","Overturning",1276862,10]
[12,"LAK","Yes","Yes","Animal",3952904,288]
[2,"OTT","Yes","No","Right Turn",11008,1]
[4,"SUM","No","No","Animal",683528,51]
[8,"WAR","Yes","Yes","Parked Vehicle",59856,2]
[3,"LOR","Yes","Yes","Right Turn",132096,12]
[10,"MOE","Yes","No","Fixed Object",120916,2]
[2,"WOO","No","Yes","Right Turn",202788,6]
[9,"BRO","Yes","No","Rear End",546841,5]
[7,"MOT","Yes","No","Pedalcycles",672573,4]
[2,"WOO","Yes","Yes","Unknown",578436,47]
[8,"HAM","Yes","Yes","Angle",22016,2]
[4,"POR","Yes","No","Unknown",436364,23]
[6,"PIC","Yes","No","Animal",493812,29]
[10,"GAL","Yes","No","Angle",11008,1]
[8,"HAM","Yes","No","Pedalcycles",335916,7]
[6,"FRA","Yes","No","Overturning",83076,2]
[8,"PRE","Yes","No","Other Non-Collision",398352,14]
[8,"HAM","Yes","No","Overturning",48848,1]
[2,"SAN","Yes","No","Other Object",11008,1]
[7,"MIA","Yes","No","Right Turn",1192992,69]
[3,"CRA","Yes","No","Sideswipe - Passing",846240,70]
[12,"LAK","Yes","No","Head On",23317791,240]
[12,"LAK","Yes","No","Train",1552459,7]
[8,"BUT","Yes","Yes","Overturning",2841083,25]
[10,"ATH","Yes","Yes","Other Non-Collision",11008,1]
[8,"CLI","Yes","Yes","Other Non-Collision",83076,2]
[11,"TUS","Yes","No","Left Turn",14461708,367]
[7,"AUG","Yes","No","Left Turn",72068,1]
[8,"HAM","Yes","No","Parked Vehicle",4876875,244]
[5,"COS","Yes","No","Left Turn",1710077,47]
[1,"HAN","No","No","Right Turn",883101,30]
[7,"DAR","No","No","Animal",16677610,1178]
[5,"LIC","No","No","Overturning",11995149,99]
[10,"MEG","No","No","Rear End",5189505,80]
[9,"ADA","No","No","Pedalcycles",144136,2]
[3,"LOR","No","Yes","Fixed Object",5188182,87]
[11,"TUS","No","Yes","Sideswipe - Passing",3450823,120]
[12,"LAK","Yes","No","Other Non-Collision",5319815,86]
[7,"MER","No","No","Fixed Object",25191519,454]
[7,"DAR","Yes","No","Other Non-Collision",44032,4]
[9,"ADA","No","No","Parked Vehicle",1155377,27]
[3,"HUR","Yes","No","Pedestrian",3805990,23]
[5,"FAI","Yes","No","Backing",88064,8]
[3,"RIC","Yes","No","Other Non-Collision",3143975,99]
[3,"RIC","No","No","Backing",936540,65]
[9,"PIK","No","No","Other Object",149124,8]
[1,"HAR","No","No","Sideswipe - Passing",3125968,68]
[7,"MIA","Yes","Yes","Backing",125904,8]
[9,"LAW","Yes","No","Sideswipe - Meeting",83076,2]
[10,"ATH","Yes","Yes","Sideswipe - Passing",408156,17]
[11,"JEF","No","No","Sideswipe - Passing",2024546,33]
[1,"HAN","No","Yes","Angle",44032,4]
[0,"CUY","Yes","No","Left Turn",48848,1]
[8,"CLE","Yes","No","Animal",12540626,853]
[1,"ALL","No","No","Angle",33073473,354]
[1,"PAU","Yes","No","Parked Vehicle",22016,2]
[6,"FRA","Yes","Yes","Right Turn",22016,2]
[2,"WOO","Yes","No","Fixed Object",28099457,621]
[6,"PIC","Yes","No","Backing",291024,23]
[12,"GEA","Yes","No","Angle",11278133,316]
[4,"TRU","No","No","Fixed Object",62998445,1180]
[1,"PUT","No","No","Pedalcycles",574877,2]
[4,"STA","Yes","No","Left Turn",5219962,165]
[12,"CUY","Yes","No","Head On",197148706,2713]
[12,"CUY","Yes","No","Train",1827315,14]
[2,"WOO","Yes","No","Rear End",42869268,1754]
[10,"HOC","No","No","Sideswipe - Passing",4164901,72]
[10,"MOE","No","No","Head On",5508314,28]
[1,"HAR","No","No","Pedestrian",1005618,2]
[11,"COL","Yes","No","Backing",495360,45]
[7,"MOT","Yes","No","Animal",522020,35]
[10,"NOB","Yes","No","Backing",66048,6]
[3,"RIC","Yes","No","Left Turn",1988082,40]
[4,"TRU","No","Yes","Backing",11008,1]
[8,"PRE","Yes","No","Left Turn",191780,5]
[9,"JAC","Yes","No","Fixed Object",657953,4]
[5,"KNO","No","No","Left Turn",7521309,178]
[9,"LAW","No","No","Fixed Object",51132336,943]
[6,"MAD","No","Yes","Animal",1937236,102]
[2,"HEN","Yes","Yes","Other Non-Collision",11008,1]
[6,"MAD","Yes","No","Angle",5150699,127]
[2,"HEN","No","No","Left Turn",3207496,54]
[3,"ERI","Yes","No","Other Non-Collision",445996,17]
[8,"BUT","Yes","No","Other Object",94084,3]
[8,"BUT","Yes","No","Rear End",216530685,8614]
[2,"FUL","Yes","Yes","Rear End",535833,4]
[12,"CUY","No","No","Head On",44032,4]
[7,"AUG","Yes","No","Other Object",44032,4]
[4,"POR","Yes","No","Animal",663920,50]
[10,"NOB","Yes","No","Unknown",44032,4]
[4,"TRU","No","No","Rear End",12812466,277]
[5,"MUS","Yes","Yes","Other Object",446340,35]
[6,"FRA","Yes","Yes","Parked Vehicle",574877,2]
[3,"LOR","No","Yes","Rear End",3078549,23]
[11,"COL","Yes","No","Pedalcycles",144136,2]
[5,"GUE","No","Yes","Sideswipe - Passing",4922283,190]
[10,"HOC","No","Yes","Angle",72068,1]
[4,"STA","Yes","No","Backing",533200,45]
[2,"OTT","Yes","No","Right Turn",1005221,30]
[5,"FAI","Yes","Yes","Angle",657953,4]
[3,"CRA","Yes","No","Head On",701985,8]
[3,"WAY","Yes","No","Backing",533200,45]
[9,"ROS","No","No","Other Object",280016,22]
[10,"GAL","No","Yes","Animal",1345040,100]
[9,"LAW","Yes","No","Animal",11008,1]
[4,"STA","Yes","No","Sideswipe - Meeting",11008,1]
[2,"SAN","Yes","No","Pedalcycles",1090361,10]
[6,"FAY","Yes","No","Sideswipe - Passing",11008,1]
[2,"LUC","Yes","Yes","Overturning",59856,2]
[10,"HOC","Yes","Yes","Rear End",11008,1]
[8,"GRE","Yes","No","Angle",647580,25]
[12,"GEA","No","Yes","Other Object",22016,2]
[7,"CHP","No","Yes","Fixed Object",634733,4]
[5,"LIC","Yes","Yes","Pedalcycles",646945,3]
[7,"CHP","Yes","No","Parked Vehicle",11008,1]
[3,"ASD","Yes","No","Other Object",11008,1]
[9,"ROS","Yes","No","Angle",789877,7]
[9,"JAC","No","No","Sideswipe - Passing",5700861,122]
[2,"SAN","No","Yes","Fixed Object",11430459,309]
[12,"LAK","Yes","No","Pedestrian",816709,6]
[1,"DEF","Yes","Yes","Other Non-Collision",55040,5]
[8,"CLI","No","No","Other Non-Collision",2457179,67]
[3,"WAY","Yes","No","Angle",125904,8]
[2,"WIL","No","No","Angle",32400715,314]
[6,"PIC","Yes","No","Other Non-Collision",1346694,24]
[4,"POR","Yes","No","Other Object",127108,6]
[7,"MIA","Yes","Yes","Unknown",335056,27]
[3,"RIC","Yes","Yes","Parked Vehicle",1241602,20]
[6,"FAY","Yes","Yes","Pedestrian",502809,1]
[7,"MOT","Yes","No","Angle",3378067,78]
[4,"STA","Yes","No","Right Turn",561064,33]
[7,"AUG","Yes","No","Backing",445136,37]
[5,"FAI","Yes","Yes","Head On",11008,1]
[10,"ATH","Yes","Yes","Parked Vehicle",11008,1]
[8,"BUT","Yes","No","Fixed Object",127878993,2816]
[10,"HOC","Yes","Yes","Overturning",513817,2]
[5,"FAI","Yes","Yes","Left Turn",48848,1]
[12,"CUY","Yes","No","Other Object",4316446,168]
[9,"ADA","No","No","Rear End",8848395,211]
[6,"FAY","No","No","Head On",1334773,24]
[6,"FAY","No","No","Train",502809,1]
[2,"WOO","Yes","Yes","Parked Vehicle",657953,4]
[11,"COL","Yes","No","Fixed Object",727785,18]
[5,"GUE","No","No","Pedestrian",513817,2]
[12,"CUY","Yes","No","Sideswipe - Passing",13716815,839]
[1,"WYA","No","Yes","Other Non-Collision",22016,2]
[3,"CRA","Yes","Yes","Head On",83076,2]
[7,"MOT","No","Yes","Animal",44032,4]
[9,"LAW","No","No","Rear End",5017862,135]
[5,"PER","No","No","Left Turn",6190770,158]
[9,"LAW","Yes","No","Fixed Object",16353073,370]
[5,"KNO","Yes","No","Left Turn",33024,3]
[2,"OTT","Yes","Yes","Sideswipe - Passing",927993,14]
[10,"MRG","No","No","Right Turn",724001,10]
[10,"VIN","Yes","No","Right Turn",142932,4]
[4,"POR","No","No","Other Object",367908,21]
[5,"MUS","Yes","No","Unknown",110080,10]
[7,"CHP","No","No","Pedestrian",1591503,5]
[3,"WAY","Yes","No","Pedestrian",72068,1]
[7,"MER","Yes","No","Overturning",852604,13]
[9,"JAC","No","Yes","Other Non-Collision",11008,1]
[3,"RIC","Yes","Yes","Unknown",11008,1]
[10,"HOC","Yes","Yes","Other Object",77056,7]
[7,"MOT","Yes","Yes","Right Turn",142932,4]
[1,"DEF","Yes","No","Overturning",668961,5]
[5,"FAI","Yes","Yes","Fixed Object",1326345,28]
[3,"ASD","No","No","Pedestrian",3462678,14]
[5,"PER","No","No","Sideswipe - Passing",3374296,157]
[8,"PRE","No","No","Pedestrian",1319518,7]
[8,"WAR","Yes","No","Right Turn",182148,11]
[8,"HAM","Yes","No","Unknown",8837599,216]
[6,"FRA","No","No","Rear End",2557296,97]
[3,"LOR","Yes","No","Animal",2549728,206]
[12,"GEA","Yes","Yes","Sideswipe - Passing",1003845,23]
[4,"SUM","Yes","No","Head On",83076,2]
[1,"HAR","Yes","No","Sideswipe - Passing",1498173,79]
[10,"MOE","Yes","No","Backing",33024,3]
[3,"ASD","No","Yes","Backing",152736,7]
[6,"FRA","Yes","No","Animal",408156,17]
[5,"LIC","Yes","No","Angle",72068,1]
[1,"HAN","No","No","Unknown",755993,24]
[7,"LOG","Yes","No","Backing",22016,2]
[9,"SCI","Yes","No","Backing",3289328,256]
[6,"MRW","Yes","No","Angle",22016,2]
[9,"SCI","No","No","Unknown",601881,10]
[8,"CLE","Yes","No","Right Turn",10774133,589]
[12,"LAK","No","No","Backing",339872,24]
[2,"OTT","Yes","No","Fixed Object",59856,2]
[2,"WOO","No","No","Fixed Object",70093645,1335]
[2,"WIL","No","No","Other Non-Collision",2208242,60]
[7,"MIA","No","No","Head On",9417160,68]
[7,"MIA","No","No","Train",524825,3]
[2,"OTT","Yes","No","Angle",9856064,164]
[10,"WAS","Yes","Yes","Animal",449952,34]
[2,"LUC","Yes","No","Left Turn",188688958,4429]
[6,"PIC","Yes","No","Head On",2496739,27]
[8,"PRE","No","No","Sideswipe - Meeting",513817,2]
[11,"COL","Yes","No","Right Turn",507228,26]
[1,"ALL","No","No","Head On",4572991,48]
[1,"ALL","No","No","Train",11008,1]
[4,"POR","No","No","Angle",29437577,439]
[7,"MIA","Yes","No","Backing",1502936,122]
[7,"CHP","No","No","Angle",23875058,238]
[9,"SCI","Yes","No","Fixed Object",39911240,863]
[7,"LOG","Yes","No","Unknown",11008,1]
[7,"CLA","Yes","No","Other Object",153940,5]
[7,"MIA","No","Yes","Animal",33024,3]
[10,"ATH","No","No","Fixed Object",57262774,1014]
[1,"DEF","Yes","Yes","Sideswipe - Passing",1272681,35]
[7,"MOT","Yes","No","Other Object",72068,1]
[3,"RIC","Yes","No","Pedestrian",755649,6]
[2,"SEN","Yes","No","Overturning",120916,2]
[4,"MAH","Yes","No","Pedestrian",29859667,122]
[4,"STA","Yes","No","Unknown",257828,11]
[6,"MRW","Yes","No","Angle",94084,3]
[3,"ASD","Yes","No","Pedalcycles",959641,10]
[6,"FRA","Yes","No","Angle",884530098,19362]
[3,"LOR","Yes","Yes","Right Turn",59856,2]
[8,"PRE","No","No","Overturning",8123561,61]
[3,"HUR","Yes","No","Other Non-Collision",713800,40]
[4,"POR","No","No","Pedestrian",3928851,13]
[3,"CRA","Yes","Yes","Parked Vehicle",11008,1]
[5,"LIC","Yes","Yes","Other Object",132096,12]
[4,"TRU","Yes","No","Overturning",8386033,60]
[4,"ATB","No","Yes","Sideswipe - Passing",3849413,184]
[2,"WOO","Yes","No","Left Turn",14310348,292]
[4,"MAH","No","No","Unknown",44032,4]
[11,"HOL","No","No","Fixed Object",45848231,998]
[7,"CHP","Yes","No","Left Turn",11008,1]
[4,"SUM","Yes","Yes","Animal",77056,7]
[7,"MOT","Yes","No","Unknown",8766047,177]
[1,"ALL","Yes","No","Left Turn",30806300,667]
[6,"MAR","No","No","Angle",25526271,260]
[6,"DEL","No","Yes","Backing",271244,8]
[2,"WOO","No","Yes","Animal",2755440,170]
[11,"TUS","Yes","No","Parked Vehicle",5555772,329]
[2,"OTT","Yes","No","Unknown",11008,1]
[2,"SEN","Yes","No","Backing",11008,1]
[6,"FAY","Yes","No","Unknown",94084,3]
[12,"CUY","Yes","Yes","Backing",1788628,126]
[6,"DEL","Yes","No","Animal",11346536,689]
[4,"POR","Yes","No","Parked Vehicle",3288918,132]
[1,"DEF","Yes","No","Animal",5705928,461]
[9,"LAW","Yes","No","Left Turn",3754297,127]
[2,"SAN","Yes","No","Pedalcycles",120916,2]
[2,"LUC","No","No","Animal",5357337,377]
[4,"SUM","No","Yes","Overturning",739825,8]
[2,"WOO","Yes","Yes","Head On",502809,1]
[7,"MOT","Yes","Yes","Backing",1246193,54]
[9,"ROS","Yes","No","Backing",1891828,156]
[10,"ATH","Yes","No","Sideswipe - Meeting",11008,1]
[3,"MED","No","No","Other Non-Collision",3650859,107]
[6,"FRA","Yes","No","Pedestrian",373970207,2255]
[5,"FAI","Yes","Yes","Parked Vehicle",22016,2]
[6,"FAY","Yes","No","Parked Vehicle",3148394,129]
[4,"ATB","Yes","No","Backing",110080,10]
[8,"CLE","Yes","Yes","Right Turn",819289,16]
[5,"COS","Yes","No","Overturning",706801,5]
[10,"WAS","Yes","No","Pedestrian",3679345,25]
[9,"JAC","Yes","Yes","Parked Vehicle",22016,2]
[4,"TRU","Yes","No","Other Non-Collision",72068,1]
[1,"DEF","Yes","No","Pedestrian",3334829,18]
[6,"UNI","No","Yes","Rear End",5102420,112]
[5,"MUS","No","No","Pedalcycles",83076,2]
[10,"ATH","Yes","Yes","Right Turn",22016,2]
[8,"CLI","Yes","No","Pedestrian",1833335,9]
[4,"POR","Yes","Yes","Overturning",1015885,13]
[8,"HAM","Yes","No","Left Turn",7160056,194]
[4,"POR","Yes","Yes","Backing",269008,21]
[1,"VAN","Yes","No","Angle",22016,2]
[1,"ALL","Yes","No","Sideswipe - Passing",226180,15]
[2,"LUC","Yes","Yes","Overturning",5872451,63]
[10,"ATH","Yes","No","Overturning",72068,1]
[3,"CRA","Yes","Yes","Fixed Object",1066109,21]
[3,"CRA","Yes","Yes","Animal",593056,47]
[6,"MAD","Yes","No","Other Object",22016,2]
[5,"KNO","Yes","No","Fixed Object",138116,7]
[9,"SCI","No","No","Backing",1409937,62]
[2,"SAN","Yes","No","Pedestrian",120916,2]
[6,"FRA","Yes","Yes","Other Object",11008,1]
[7,"LOG","No","No","Overturning",6994619,56]
[1,"HAR","Yes","No","Other Non-Collision",119712,4]
[11,"BEL","Yes","No","Left Turn",4308071,126]
[5,"FAI","Yes","No","Overturning",116100,5]
[5,"COS","No","No","Rear End",5252629,123]
[3,"CRA","Yes","Yes","Unknown",66048,6]
[12,"CUY","Yes","No","Parked Vehicle",184155631,7377]
[10,"HOC","Yes","No","Right Turn",11008,1]
[10,"WAS","No","Yes","Fixed Object",2256918,52]
[7,"SHE","Yes","No","Backing",11008,1]
[4,"ATB","Yes","No","Rear End",15544540,582]
[1,"HAR","Yes","No","Overturning",72068,1]
[8,"HAM","Yes","No","Unknown",77056,7]
[11,"COL","Yes","No","Head On",524825,3]
[10,"MOE","No","No","Left Turn",2907184,55]
[2,"LUC","Yes","Yes","Pedalcycles",144136,2]
[7,"SHE","Yes","No","Animal",114896,7]
[11,"HOL","No","No","Unknown",323876,17]
[8,"BUT","Yes","No","Right Turn",25676875,1091]
[8,"PRE","Yes","No","Parked Vehicle",11008,1]
[3,"ERI","No","Yes","Rear End",7782273,98]
[8,"HAM","Yes","Yes","Overturning",15098426,146]
[12,"GEA","Yes","No","Fixed Object",4639171,131]
[5,"LIC","No","Yes","Head On",1204794,9]
[8,"WAR","Yes","No","Sideswipe - Passing",2984650,116]
[6,"FRA","Yes","No","Other Object",6444364,235]
[9,"PIK","Yes","No","Parked Vehicle",532856,27]
[1,"VAN","Yes","No","Head On",11008,1]
[4,"POR","Yes","Yes","Left Turn",11008,1]
[2,"SEN","Yes","No","Fixed Object",3067210,96]
[4,"TRU","Yes","No","Fixed Object",1429598,17]
[11,"HAS","No","No","Rear End",5214273,101]
[6,"FAY","Yes","Yes","Other Object",77056,7]
[6,"MAR","No","No","Other Non-Collision",1494217,62]
[4,"MAH","No","No","Other Non-Collision",2780883,75]
[3,"LOR","Yes","No","Head On",21997069,250]
[3,"LOR","Yes","No","Train",11008,1]
[6,"UNI","Yes","No","Sideswipe - Passing",1545248,101]
[9,"ROS","Yes","No","Overturning",3255537,19]
[4,"SUM","Yes","No","Head On",62762051,973]
[4,"SUM","Yes","No","Train",557849,6]
[5,"COS","No","No","Right Turn",793661,15]
[11,"BEL","No","Yes","Other Object",286036,17]
[7,"MIA","Yes","No","Fixed Object",9418919,294]
[11,"HOL","Yes","No","Angle",11008,1]
[2,"OTT","No","No","Right Turn",433956,27]
[6,"FRA","No","No","Pedalcycles",623725,3]
[1,"ALL","Yes","Yes","Pedestrian",155144,3]
[6,"UNI","Yes","Yes","Other Object",44032,4]
[3,"ERI","Yes","Yes","Fixed Object",6554153,181]
[4,"MAH","Yes","No","Pedalcycles",72068,1]
[8,"WAR","Yes","Yes","Animal",1748605,83]
[1,"PAU","No","No","Fixed Object",25228949,425]
[7,"CLA","Yes","No","Angle",5897748,133]
[2,"WOO","No","Yes","Rear End",11341747,207]
[3,"LOR","No","No","Sideswipe - Passing",8016497,229]
[6,"FAY","Yes","No","Pedalcycles",1939631,11]
[4,"MAH","No","Yes","Animal",5250697,292]
[5,"MUS","Yes","No","Backing",55040,5]
[2,"SAN","Yes","No","Angle",4922217,84]
[5,"LIC","Yes","No","Unknown",2621439,37]
[4,"ATB","Yes","No","Head On",1276862,10]
[10,"NOB","No","Yes","Sideswipe - Passing",703824,28]
[4,"ATB","Yes","No","Train",11008,1]
[9,"LAW","Yes","Yes","Pedestrian",574877,2]
[6,"MAR","Yes","No","Angle",22016,2]
[7,"CHP","No","No","Sideswipe - Meeting",22016,2]
[5,"FAI","Yes","No","Sideswipe - Passing",10518343,447]
[8,"PRE","Yes","No","Parked Vehicle",1037676,52]
[5,"PER","No","No","Head On",15200621,97]
[5,"PER","No","No","Train",11008,1]
[11,"COL","Yes","No","Unknown",237188,16]
[2,"OTT","Yes","Yes","Overturning",131924,3]
[5,"MUS","Yes","No","Unknown",11008,1]
[1,"ALL","Yes","No","Unknown",1656122,50]
[2,"WIL","No","Yes","Unknown",281048,11]
[3,"WAY","Yes","Yes","Fixed Object",55040,5]
[3,"RIC","No","No","Animal",18877781,1282]
[7,"AUG","Yes","Yes","Sideswipe - Passing",345892,19]
[4,"MAH","Yes","No","Backing",12988567,923]
[12,"GEA","Yes","Yes","Other Object",11008,1]
[1,"HAR","Yes","No","Pedestrian",3595806,15]
[11,"COL","Yes","Yes","Other Object",77056,7]
[11,"BEL","No","Yes","Animal",1507236,92]
[5,"LIC","Yes","No","Sideswipe - Meeting",72068,1]
[8,"BUT","Yes","No","Pedestrian",1391586,8]
[3,"HUR","Yes","No","Pedestrian",865557,7]
[9,"JAC","Yes","Yes","Other Object",22016,2]
[8,"HAM","Yes","Yes","Pedestrian",11008,1]
[11,"COL","Yes","No","Left Turn",197972,9]
[1,"HAN","No","No","Parked Vehicle",1294697,37]
[8,"PRE","Yes","No","Fixed Object",4967334,96]
[8,"HAM","No","Yes","Sideswipe - Passing",508432,29]
[8,"WAR","No","No","Unknown",735009,11]
[2,"SAN","Yes","Yes","Animal",528384,48]
[10,"WAS","Yes","Yes","Backing",11008,1]
[1,"PUT","No","No","Pedestrian",203992,4]
[1,"WYA","Yes","No","Pedalcycles",155144,3]
[6,"FAY","No","Yes","Backing",99072,9]
[10,"WAS","Yes","No","Animal",1812245,93]
[7,"LOG","No","Yes","Angle",3039333,16]
[12,"LAK","Yes","No","Sideswipe - Passing",30390469,1605]
[3,"MED","No","Yes","Sideswipe - Passing",6356538,282]
[11,"CAR","No","No","Head On",4287127,40]
[11,"CAR","No","No","Train",574877,2]
[3,"ERI","Yes","Yes","Parked Vehicle",22016,2]
[7,"LOG","Yes","No","Other Object",70864,3]
[4,"POR","Yes","No","Pedestrian",3303922,12]
[2,"WOO","Yes","Yes","Right Turn",22016,2]
[4,"TRU","Yes","No","Parked Vehicle",623897,12]
[6,"MRW","No","No","Angle",25918457,369]
[5,"FAI","No","Yes","Animal",1201764,78]
[8,"WAR","No","No","Pedalcycles",1879775,9]
[11,"JEF","No","Yes","Unknown",22016,2]
[4,"POR","Yes","No","Left Turn",24301180,568]
[9,"PIK","No","No","Pedestrian",3016854,6]
[1,"ALL","Yes","Yes","Other Object",209152,19]
[8,"GRE","No","No","Animal",14224546,845]
[5,"KNO","Yes","No","Right Turn",1462397,62]
[8,"BUT","Yes","No","Other Object",11008,1]
[8,"WAR","No","No","Backing",1144316,77]
[8,"GRE","No","No","Other Object",330068,21]
[7,"MOT","Yes","Yes","Pedalcycles",574877,2]
[2,"LUC","Yes","Yes","Angle",2768049,76]
[10,"GAL","Yes","No","Pedalcycles",72068,1]
[2,"LUC","No","Yes","Overturning",887573,9]
[4,"STA","Yes","Yes","Animal",269008,21]
[2,"OTT","No","No","Pedalcycles",730021,5]
[10,"GAL","Yes","No","Animal",924500,75]
[3,"ASD","No","No","Other Non-Collision",2206072,114]
[10,"VIN","No","No","Pedalcycles",502809,1]
[11,"JEF","No","Yes","Fixed Object",1193217,27]
[2,"WOO","Yes","Yes","Rear End",3418712,51]
[5,"KNO","No","No","Parked Vehicle",1250837,42]
[5,"LIC","No","No","Sideswipe - Meeting",656749,6]
[9,"JAC","Yes","No","Sideswipe - Passing",3311966,123]
[6,"MAR","Yes","No","Unknown",738396,47]
[11,"TUS","No","No","Other Non-Collision",1534637,67]
[5,"FAI","Yes","Yes","Unknown",11008,1]
[12,"LAK","Yes","No","Other Non-Collision",557849,6]
[12,"CUY","Yes","Yes","Fixed Object",788104,33]
[8,"WAR","Yes","No","Animal",231168,21]
[3,"ASD","No","Yes","Parked Vehicle",177160,5]
[3,"LOR","Yes","Yes","Sideswipe - Passing",14489188,540]
[5,"FAI","No","No","Sideswipe - Passing",7331355,181]
[8,"PRE","No","Yes","Angle",203992,4]
[9,"JAC","Yes","No","Angle",10364641,287]
[3,"MED","Yes","No","Right Turn",738621,10]
[8,"WAR","Yes","No","Other Object",92880,5]
[7,"CLA","No","No","Backing",1170341,45]
[3,"HUR","Yes","No","Right Turn",120916,2]
[2,"HEN","No","No","Head On",2751061,12]
[10,"ATH","No","No","Head On",3191500,42]
[6,"FRA","Yes","No","Pedalcycles",102094022,899]
[12,"LAK","Yes","No","Other Object",33024,3]
[6,"PIC","Yes","No","Pedalcycles",48848,1]
[11,"HAS","No","No","Overturning",8377327,77]
[4,"ATB","Yes","Yes","Angle",574877,2]
[1,"ALL","Yes","No","Fixed Object",2521335,39]
[5,"GUE","No","Yes","Head On",2105320,7]
[4,"POR","Yes","No","Head On",9462303,119]
[4,"POR","Yes","No","Train",72068,1]
[9,"HIG","Yes","No","Left Turn",138116,7]
[6,"FAY","No","Yes","Right Turn",11008,1]
[3,"CRA","No","Yes","Backing",11008,1]
[1,"PAU","No","No","Unknown",88064,8]
[8,"CLE","Yes","No","Pedestrian",94084,3]
[2,"WOO","Yes","No","Other Object",55040,5]
[3,"CRA","Yes","Yes","Unknown",33024,3]
[7,"CLA","Yes","Yes","Other Object",451328,41]
[3,"LOR","Yes","No","Sideswipe - Meeting",136912,9]
[3,"HUR","Yes","No","Pedalcycles",1530165,28]
[5,"MUS","Yes","No","Left Turn",19245782,599]
[5,"GUE","Yes","Yes","Head On",562665,3]
[9,"SCI","Yes","No","Parked Vehicle",14253495,651]
[9,"HIG","Yes","No","Rear End",1988082,45]
[4,"TRU","No","No","Head On",7073911,50]
[5,"FAI","Yes","No","Left Turn",904945,23]
[1,"ALL","Yes","No","Animal",9326012,709]
[8,"GRE","Yes","No","Head On",19788139,199]
[7,"LOG","No","No","Other Object",154112,14]
[3,"RIC","No","Yes","Backing",59856,2]
[7,"MER","No","No","Overturning",4387694,46]
[7,"AUG","Yes","Yes","Fixed Object",268836,12]
[4,"POR","Yes","Yes","Rear End",1450013,49]
[7,"CLA","Yes","Yes","Pedestrian",1580495,4]
[7,"CLA","Yes","No","Sideswipe - Passing",3002075,84]
[8,"GRE","Yes","Yes","Animal",3667781,200]
[7,"CLA","Yes","Yes","Other Non-Collision",88064,8]
[3,"LOR","No","Yes","Animal",1358284,93]
[3,"WAY","Yes","No","Backing",44032,4]
[12,"GEA","No","No","Overturning",7363387,57]
[8,"WAR","Yes","No","Sideswipe - Passing",22394295,1058]
[5,"KNO","No","No","Rear End",10888209,273]
[9,"ROS","Yes","No","Pedestrian",48848,1]
[3,"MED","No","No","Sideswipe - Meeting",66048,6]
[10,"HOC","Yes","No","Head On",502809,1]
[10,"MEG","Yes","No","Fixed Object",11008,1]
[3,"ERI","Yes","Yes","Other Object",579865,8]
[8,"HAM","Yes","No","Rear End",12038108,611]
[10,"MRG","No","No","Pedalcycles",72068,1]
[11,"BEL","Yes","No","Sideswipe - Passing",3799877,217]
[12,"GEA","Yes","Yes","Angle",11008,1]
[5,"PER","Yes","No","Pedestrian",48848,1]
[1,"PUT","No","No","Overturning",3702737,39]
[3,"CRA","No","Yes","Angle",646945,3]
[8,"CLE","Yes","No","Parked Vehicle",5524680,227]
[11,"JEF","No","Yes","Rear End",774053,9]
[3,"WAY","Yes","No","Fixed Object",3134462,95]
[10,"WAS","Yes","Yes","Fixed Object",1535497,52]
[10,"GAL","No","No","Overturning",7485679,66]
[7,"SHE","No","Yes","Head On",72068,1]
[1,"PUT","Yes","No","Angle",11008,1]
[5,"LIC","Yes","No","Backing",4828265,358]
[4,"MAH","No","No","Sideswipe - Passing",9282735,183]
[3,"WAY","Yes","Yes","Head On",1027634,4]
[9,"LAW","No","No","Unknown",44032,4]
[8,"HAM","No","No","Parked Vehicle",2459587,68]
[9,"PIK","Yes","No","Fixed Object",8070095,176]
[11,"TUS","No","Yes","Other Non-Collision",496392,34]
[6,"MAD","No","No","Left Turn",9457553,163]
[8,"HAM","No","No","Fixed Object",23162408,526]
[11,"COL","Yes","No","Right Turn",11008,1]
[3,"ERI","Yes","No","Pedestrian",8389473,45]
[7,"MOT","No","No","Other Object",11008,1]
[3,"HUR","Yes","No","Animal",4448952,364]
[11,"JEF","Yes","No","Backing",22016,2]
[7,"DAR","Yes","No","Other Object",11008,1]
[1,"HAN","No","No","Rear End",7893292,216]
[8,"PRE","Yes","No","Right Turn",22016,2]
[8,"HAM","Yes","No","Rear End",618921302,26782]
[7,"AUG","Yes","Yes","Head On",502809,1]
[5,"MUS","No","Yes","Pedestrian",1054466,3]
[1,"ALL","Yes","No","Parked Vehicle",202960,15]
[5,"FAI","Yes","Yes","Other Object",11008,1]
[1,"PAU","Yes","No","Other Non-Collision",11008,1]
[6,"PIC","Yes","No","Backing",11008,1]
[4,"MAH","No","Yes","Right Turn",197972,9]
[11,"TUS","No","No","Angle",18692538,295]
[6,"UNI","Yes","No","Pedalcycles",646945,3]
[2,"WOO","No","Yes","Fixed Object",16942252,518]
[3,"WAY","Yes","No","Other Non-Collision",154112,14]
[1,"HAN","Yes","No","Angle",573673,4]
[10,"NOB","Yes","No","Animal",11008,1]
[6,"MAR","Yes","No","Right Turn",3352452,164]
[3,"WAY","No","No","Overturning",8879289,115]
[10,"NOB","Yes","No","Pedalcycles",502809,1]
[9,"ROS","Yes","No","Rear End",29275750,1098]
[5,"LIC","Yes","Yes","Overturning",1254846,8]
[1,"ALL","Yes","No","Unknown",11008,1]
[10,"GAL","Yes","Yes","Unknown",33024,3]
[11,"CAR","No","No","Pedestrian",1330526,8]
[11,"TUS","No","No","Other Object",374100,25]
[5,"FAI","No","Yes","Unknown",33024,3]
[2,"SAN","Yes","Yes","Other Object",121088,11]
[8,"BUT","No","No","Left Turn",6124100,157]
[11,"COL","Yes","No","Unknown",11008,1]
[5,"COS","Yes","No","Angle",83076,2]
[11,"HAS","No","No","Fixed Object",31405549,549]
[7,"AUG","Yes","Yes","Overturning",48848,1]
[4,"SUM","Yes","Yes","Head On",11008,1]
[4,"TRU","Yes","No","Other Object",832480,50]
[3,"WAY","No","No","Left Turn",11830518,256]
[9,"JAC","No","No","Other Non-Collision",1165353,39]
[1,"WYA","No","No","Overturning",4126082,32]
[1,"DEF","Yes","No","Rear End",15811431,656]
[8,"CLE","Yes","No","Left Turn",33958597,829]
[1,"ALL","Yes","No","Left Turn",314072,14]
[6,"UNI","Yes","No","Other Non-Collision",94084,3]
[11,"BEL","No","No","Overturning",15717137,99]
[2,"LUC","No","Yes","Unknown",55040,5]
[9,"LAW","No","No","Left Turn",4059769,136]
[10,"NOB","No","No","Rear End",746017,12]
[3,"WAY","Yes","No","Other Object",11008,1]
[6,"DEL","Yes","Yes","Unknown",258000,20]
[5,"LIC","Yes","Yes","Overturning",1833335,9]
[6,"DEL","Yes","No","Backing",534404,43]
[7,"LOG","No","No","Unknown",121088,11]
[1,"HAN","Yes","No","Head On",6392063,92]
[9,"ADA","No","No","Left Turn",5955646,120]
[1,"DEF","No","Yes","Sideswipe - Passing",22016,2]
[8,"BUT","Yes","No","Angle",43734945,1017]
[6,"UNI","No","No","Other Non-Collision",3827212,81]
[11,"CAR","Yes","No","Angle",11008,1]
[3,"MED","No","Yes","Parked Vehicle",237016,7]
[6,"DEL","Yes","No","Unknown",22016,2]
[11,"COL","No","Yes","Unknown",22016,2]
[3,"LOR","Yes","Yes","Left Turn",11008,1]
[9,"ROS","No","No","Pedestrian",4238676,11]
[1,"HAN","No","No","Backing",1175329,51]
[2,"SEN","Yes","No","Rear End",3792587,123]
[3,"MED","Yes","Yes","Rear End",3856915,94]
[2,"HEN","No","Yes","Unknown",11008,1]
[8,"WAR","Yes","No","Right Turn",1975248,111]
[9,"JAC","Yes","No","Other Non-Collision",1179973,39]
[5,"FAI","Yes","No","Parked Vehicle",221192,9]
[5,"KNO","Yes","No","Head On",3154692,36]
[10,"GAL","No","No","Unknown",612889,11]
[1,"DEF","Yes","No","Right Turn",2164448,106]
[9,"BRO","Yes","No","Sideswipe - Passing",22016,2]
[4,"SUM","No","No","Right Turn",186964,8]
[3,"ERI","No","No","Sideswipe - Passing",1876110,61]
[1,"DEF","Yes","No","Angle",59856,2]
[5,"FAI","No","Yes","Left Turn",1171770,6]
[8,"HAM","No","No","Left Turn",6174999,114]
[12,"GEA","Yes","No","Angle",105092,4]
[1,"ALL","Yes","No","Backing",7682089,571]
[4,"ATB","Yes","Yes","Backing",11008,1]
[11,"COL","No","Yes","Backing",11008,1]
[1,"PUT","Yes","No","Unknown",22016,2]
[10,"GAL","No","No","Backing",363092,24]
[8,"WAR","Yes","Yes","Rear End",22016,2]
[7,"CHP","Yes","No","Other Object",103888,6]
[4,"POR","Yes","No","Other Non-Collision",92880,5]
[3,"WAY","Yes","No","Unknown",44032,4]
[5,"LIC","Yes","No","Animal",2368493,129]
[3,"RIC","No","Yes","Fixed Object",6612580,222]
[3,"WAY","Yes","No","Sideswipe - Passing",605268,46]
[11,"CAR","No","No","Overturning",6807205,62]
[5,"LIC","No","Yes","Angle",1982459,17]
[7,"LOG","Yes","No","Overturning",287068,6]
[4,"STA","No","Yes","Other Object",66048,6]
[1,"HAN","Yes","No","Unknown",33024,3]
[4,"MAH","Yes","No","Rear End",134427092,5130]
[2,"WOO","Yes","No","Pedalcycles",72068,1]
[3,"CRA","Yes","Yes","Other Non-Collision",309084,8]
[2,"WOO","Yes","Yes","Right Turn",242004,13]
[12,"GEA","No","No","Sideswipe - Passing",12920072,320]
[5,"LIC","Yes","Yes","Rear End",142932,4]
[3,"RIC","Yes","No","Right Turn",308052,19]
[4,"TRU","Yes","No","Sideswipe - Passing",160132,9]
[4,"SUM","Yes","No","Animal",622468,51]
[8,"CLI","No","No","Animal",11359264,715]
[6,"MAR","No","No","Sideswipe - Passing",6589638,134]
[3,"LOR","Yes","No","Overturning",2873181,12]
[5,"LIC","Yes","No","Pedalcycles",1486874,9]
[8,"PRE","Yes","No","Rear End",88064,8]
[6,"MRW","Yes","No","Animal",11008,1]
[3,"ERI","Yes","No","Angle",1177221,20]
[7,"MIA","Yes","Yes","Head On",793661,15]
[3,"ASD","Yes","No","Sideswipe - Passing",3788353,179]
[11,"COL","Yes","No","Backing",99072,9]
[7,"DAR","Yes","No","Angle",13325714,318]
[12,"CUY","Yes","Yes","Other Non-Collision",33024,3]
[8,"CLI","Yes","Yes","Sideswipe - Passing",136912,9]
[1,"WYA","Yes","No","Parked Vehicle",1195969,46]
[8,"HAM","No","Yes","Other Object",11008,1]
[5,"MUS","Yes","Yes","Pedestrian",574877,2]
[6,"FRA","No","Yes","Overturning",422604,8]
[10,"ATH","Yes","No","Left Turn",4834960,107]
[10,"WAS","No","Yes","Parked Vehicle",11008,1]
[0,"CUY","Yes","No","Angle",11008,1]
[2,"HEN","No","Yes","Fixed Object",2653431,51]
[11,"COL","No","No","Angle",19461497,335]
[10,"ATH","Yes","No","Fixed Object",1228821,40]
[3,"RIC","No","No","Parked Vehicle",1242065,28]
[6,"MRW","Yes","No","Rear End",22016,2]
[2,"HEN","No","Yes","Animal",1546624,108]
[8,"WAR","Yes","Yes","Pedestrian",1077686,3]
[4,"SUM","No","No","Rear End",2667998,102]
[3,"MED","Yes","Yes","Head On",717809,6]
[10,"MRG","No","No","Backing",357072,29]
[12,"GEA","Yes","No","Other Object",557849,6]
[6,"FRA","Yes","Yes","Unknown",11008,1]
[11,"JEF","Yes","No","Rear End",273652,9]
[7,"MIA","Yes","No","Fixed Object",359308,16]
[11,"COL","Yes","Yes","Overturning",22016,2]
[1,"PAU","Yes","No","Backing",11008,1]
[10,"HOC","No","Yes","Head On",1005618,2]
[9,"ROS","No","No","Overturning",12401188,109]
[4,"MAH","Yes","Yes","Angle",1343373,29]
[10,"HOC","Yes","Yes","Right Turn",22016,2]
[6,"UNI","Yes","Yes","Other Object",77056,7]
[0,"WIL","No","No","Animal",44032,4]
[5,"FAI","Yes","Yes","Animal",446168,26]
[7,"MER","No","No","Right Turn",552292,19]
[12,"GEA","Yes","No","Pedestrian",1591503,5]
[3,"ERI","Yes","Yes","Backing",22016,2]
[3,"ERI","No","Yes","Unknown",441352,29]
[9,"LAW","No","Yes","Other Object",22016,2]
[4,"ATB","Yes","No","Unknown",849905,18]
[12,"GEA","No","Yes","Sideswipe - Passing",592712,29]
[3,"HUR","Yes","No","Other Object",11008,1]
[3,"RIC","Yes","No","Rear End",2619216,142]
[2,"LUC","Yes","No","Backing",1521393,79]
[1,"PUT","No","No","Right Turn",762013,19]
[5,"COS","Yes","No","Fixed Object",8458921,174]
[7,"MOT","Yes","No","Right Turn",623897,12]
[2,"OTT","Yes","No","Animal",2921870,156]
[7,"MIA","Yes","Yes","Left Turn",706801,5]
[12,"LAK","Yes","No","Angle",87585646,2306]
[3,"ERI","No","Yes","Backing",99072,9]
[4,"STA","Yes","Yes","Other Non-Collision",1261448,71]
[8,"HAM","No","Yes","Other Non-Collision",11008,1]
[4,"MAH","Yes","No","Left Turn",116100,5]
[6,"FRA","Yes","No","Overturning",23972066,199]
[11,"JEF","No","Yes","Head On",11008,1]
[6,"UNI","Yes","No","Overturning",177160,5]
[7,"MOT","Yes","Yes","Parked Vehicle",70864,3]
[2,"HEN","Yes","No","Pedalcycles",816709,6]
[4,"ATB","No","Yes","Parked Vehicle",33024,3]
[2,"LUC","Yes","No","Fixed Object",235198189,5178]
[8,"CLE","Yes","Yes","Other Non-Collision",583424,53]
[4,"SUM","Yes","No","Angle",400760,15]
[4,"POR","Yes","No","Left Turn",48848,1]
[8,"WAR","Yes","Yes","Overturning",1954251,11]
[2,"SAN","Yes","Yes","Fixed Object",48848,1]
[6,"DEL","Yes","No","Other Non-Collision",22016,2]
[12,"CUY","Yes","Yes","Fixed Object",283297979,5664]
[7,"MER","No","No","Animal",12211537,927]
[2,"OTT","No","No","Fixed Object",33935431,579]
[1,"HAN","Yes","No","Parked Vehicle",253012,14]
[5,"COS","Yes","No","Backing",1077408,91]
[2,"FUL","Yes","No","Unknown",11008,1]
[4,"POR","Yes","Yes","Unknown",121088,11]
[7,"MIA","Yes","Yes","Sideswipe - Passing",10471625,395]
[8,"CLI","Yes","No","Overturning",1148550,6]
[11,"BEL","No","Yes","Rear End",4763289,78]
[7,"AUG","Yes","No","Right Turn",127108,6]
[12,"CUY","Yes","No","Head On",7009133,98]
[12,"CUY","Yes","No","Train",11008,1]
[2,"FUL","Yes","No","Backing",790856,47]
[3,"ERI","Yes","No","Sideswipe - Passing",10651484,605]
[4,"POR","Yes","No","Animal",8507332,476]
[3,"LOR","Yes","Yes","Unknown",451328,41]
[6,"FRA","Yes","No","Left Turn",774053,9]
[7,"SHE","Yes","Yes","Rear End",5129662,165]
[6,"MAD","Yes","No","Overturning",144136,2]
[9,"BRO","No","No","Fixed Object",57174273,1137]
[3,"CRA","No","No","Overturning",6827091,45]
[4,"POR","Yes","Yes","Rear End",59856,2]
[3,"LOR","Yes","No","Other Non-Collision",617705,8]
[2,"SAN","Yes","No","Backing",1214148,91]
[5,"MUS","Yes","Yes","Angle",230996,12]
[3,"HUR","No","No","Other Non-Collision",2310529,101]
[7,"AUG","No","No","Backing",445136,37]
[2,"SAN","Yes","No","Unknown",11008,1]
[9,"LAW","Yes","Yes","Sideswipe - Passing",2557693,124]
[4,"POR","No","No","Overturning",6530232,53]
[3,"HUR","Yes","No","Sideswipe - Passing",226180,15]
[10,"ATH","Yes","No","Animal",353288,21]
[7,"CLA","No","Yes","Animal",2629073,154]
[10,"WAS","Yes","No","Fixed Object",33024,3]
[3,"CRA","Yes","No","Sideswipe - Passing",1292236,87]
[2,"WIL","Yes","No","Angle",105092,4]
[10,"MEG","No","No","Unknown",66048,6]
[5,"PER","No","No","Other Non-Collision",1634397,52]
[0,"BUT","Yes","No","Left Turn",72068,1]
[2,"FUL","Yes","No","Sideswipe - Passing",356900,20]
[10,"ATH","Yes","Yes","Rear End",1961713,54]
[4,"SUM","Yes","No","Angle",25170243,751]
[1,"DEF","Yes","No","Angle",9587558,292]
[12,"GEA","Yes","No","Other Non-Collision",662941,10]
[7,"MOT","Yes","No","Right Turn",673380,35]
[2,"HEN","No","No","Other Non-Collision",581876,37]
[8,"HAM","No","No","Unknown",33024,3]
[12,"LAK","Yes","No","Sideswipe - Meeting",44032,4]
[2,"WOO","Yes","No","Angle",2195223,35]
[2,"OTT","No","No","Rear End",7634432,216]
[4,"TRU","Yes","No","Animal",163744,8]
[3,"LOR","Yes","No","Right Turn",318888,11]
[8,"HAM","Yes","Yes","Unknown",1283636,82]
[4,"POR","Yes","Yes","Parked Vehicle",72068,1]
[3,"RIC","No","No","Head On",8349569,62]
[3,"RIC","No","No","Train",502809,1]
[3,"WAY","No","No","Animal",9750217,612]
[1,"HAN","Yes","Yes","Sideswipe - Passing",22016,2]
[8,"PRE","No","No","Unknown",138116,7]
[2,"FUL","No","Yes","Overturning",442212,9]
[6,"DEL","Yes","Yes","Left Turn",177160,5]
[1,"HAN","Yes","No","Left Turn",33024,3]
[3,"MED","No","Yes","Fixed Object",10194983,332]
[7,"MIA","No","No","Angle",31729981,405]
[2,"SAN","Yes","Yes","Rear End",11008,1]
[10,"MEG","Yes","No","Sideswipe - Passing",408328,26]
[8,"PRE","Yes","No","Animal",616276,47]
[10,"MOE","Yes","No","Parked Vehicle",22016,2]
[2,"SAN","Yes","No","Other Non-Collision",72068,1]
[3,"RIC","Yes","Yes","Rear End",72068,1]
[7,"SHE","Yes","No","Left Turn",94084,3]
[10,"NOB","No","No","Right Turn",22016,2]
[8,"PRE","No","No","Backing",1306221,65]
[4,"STA","Yes","No","Animal",1343836,102]
[2,"LUC","Yes","Yes","Fixed Object",69335705,1711]
[2,"HEN","No","No","Sideswipe - Passing",2306573,89]
[7,"DAR","Yes","No","Angle",142932,4]
[11,"HAS","No","No","Animal",5510285,190]
[12,"LAK","Yes","No","Pedestrian",22890014,125]
[4,"STA","No","Yes","Overturning",623725,3]
[4,"POR","Yes","No","Sideswipe - Passing",4799541,265]
[2,"SEN","Yes","No","Unknown",70864,3]
[5,"LIC","No","No","Other Object",358104,18]
[0,"LOR","No","No","Fixed Object",11008,1]
[1,"VAN","Yes","No","Left Turn",1962917,52]
[4,"MAH","Yes","Yes","Pedalcycles",83076,2]
[8,"PRE","Yes","No","Fixed Object",1064905,23]
[7,"MIA","Yes","Yes","Other Non-Collision",407296,37]
[3,"LOR","Yes","No","Other Object",1359885,63]
[4,"ATB","Yes","Yes","Animal",412112,34]
[10,"GAL","Yes","No","Rear End",11101211,381]
[2,"HEN","Yes","No","Sideswipe - Passing",11008,1]
[1,"VAN","Yes","No","Rear End",7193490,256]
[8,"HAM","No","No","Backing",924672,84]
[6,"PIC","Yes","No","Pedalcycles",227212,4]
[2,"LUC","Yes","No","Head On",2054527,18]
[3,"CRA","Yes","Yes","Backing",22016,2]
[5,"FAI","No","No","Pedestrian",2299508,8]
[9,"ADA","Yes","No","Sideswipe - Passing",11008,1]
[8,"WAR","Yes","Yes","Head On",1219414,9]
[1,"DEF","Yes","Yes","Pedestrian",1005618,2]
[6,"PIC","Yes","No","Fixed Object",83076,2]
[6,"PIC","No","Yes","Other Non-Collision",81872,4]
[7,"LOG","Yes","No","Animal",11008,1]
[2,"SAN","Yes","No","Other Non-Collision",11008,1]
[2,"WOO","No","No","Parked Vehicle",2218787,53]
[11,"COL","Yes","No","Rear End",77056,7]
[2,"WOO","Yes","No","Unknown",374272,34]
[11,"CAR","Yes","No","Pedalcycles",48848,1]
[1,"HAR","Yes","No","Angle",3562385,45]
[9,"SCI","Yes","No","Animal",2729521,170]
[1,"HAN","No","Yes","Pedestrian",502809,1]
[3,"WAY","Yes","Yes","Rear End",169764,3]
[6,"PIC","Yes","No","Other Non-Collision",70864,3]
[10,"WAS","Yes","No","Other Object",72068,1]
[2,"LUC","Yes","No","Rear End",3763241,155]
[4,"MAH","Yes","No","Parked Vehicle",147920,10]
[2,"WOO","No","No","Backing",2656474,134]
[9,"JAC","No","No","Overturning",6986482,59]
[2,"OTT","Yes","No","Sideswipe - Passing",899957,17]
[6,"DEL","No","No","Other Non-Collision",2383973,104]
[3,"LOR","Yes","No","Fixed Object",3054257,102]
[4,"ATB","Yes","No","Sideswipe - Passing",1181177,37]
[5,"KNO","Yes","No","Right Turn",11008,1]
[12,"GEA","No","Yes","Other Non-Collision",66048,6]
[4,"SUM","Yes","Yes","Other Non-Collision",48848,1]
[9,"JAC","No","Yes","Angle",72068,1]
[1,"WYA","No","No","Right Turn",684957,12]
[3,"MED","Yes","No","Backing",4072325,288]
[12,"CUY","Yes","Yes","Animal",22016,2]
[4,"SUM","No","Yes","Left Turn",83076,2]
[8,"BUT","Yes","No","Right Turn",4285380,180]
[12,"CUY","Yes","No","Other Non-Collision",40071664,717]
[2,"OTT","Yes","No","Overturning",524825,3]
[11,"TUS","No","Yes","Parked Vehicle",524825,3]
[11,"JEF","Yes","No","Parked Vehicle",4080634,159]
[9,"HIG","Yes","No","Fixed Object",2174411,31]
[5,"FAI","Yes","No","Backing",6764403,430]
[3,"ASD","No","Yes","Head On",33024,3]
[6,"DEL","Yes","No","Other Non-Collision",2297285,108]
[2,"FUL","No","No","Pedalcycles",3523738,14]
[7,"MOT","Yes","Yes","Fixed Object",91398067,2054]
[6,"MAD","No","No","Parked Vehicle",2314710,76]
[10,"MOE","No","No","Right Turn",695965,13]
[4,"MAH","Yes","No","Fixed Object",2000294,44]
[11,"JEF","No","No","Angle",5188301,77]
[1,"ALL","Yes","No","Rear End",68321471,2394]
[3,"MED","No","Yes","Left Turn",116100,5]
[1,"WYA","Yes","No","Rear End",11008,1]
[3,"MED","No","Yes","Head On",568857,7]
[7,"MOT","Yes","No","Head On",101631476,1048]
[7,"MOT","Yes","No","Train",668961,5]
[4,"ATB","Yes","No","Head On",3276243,55]
[4,"ATB","Yes","No","Train",513817,2]
[12,"CUY","Yes","Yes","Right Turn",5835206,233]
[10,"MEG","Yes","No","Angle",1264081,30]
[2,"WOO","Yes","No","Other Non-Collision",11008,1]
[9,"SCI","No","Yes","Overturning",11008,1]
[6,"UNI","No","No","Backing",858452,69]
[7,"SHE","Yes","Yes","Pedalcycles",97696,2]
[3,"MED","Yes","No","Pedalcycles",945021,10]
[10,"WAS","Yes","Yes","Head On",11008,1]
[3,"ERI","No","Yes","Head On",746017,12]
[7,"DAR","Yes","No","Other Object",33024,3]
[9,"SCI","No","Yes","Animal",99072,9]
[7,"SHE","Yes","No","Parked Vehicle",287068,6]
[8,"HAM","Yes","Yes","Animal",6983253,424]
[11,"COL","Yes","No","Right Turn",1442617,47]
[6,"DEL","Yes","Yes","Fixed Object",6247834,209]
[6,"DEL","Yes","Yes","Fixed Object",44032,4]
[6,"MAR","Yes","No","Rear End",33492158,1104]
[5,"LIC","Yes","No","Fixed Object",37227789,776]
[2,"LUC","Yes","No","Pedalcycles",40172694,366]
[6,"UNI","Yes","Yes","Angle",1219414,9]
[3,"LOR","Yes","No","Sideswipe - Passing",802036,57]
[3,"MED","Yes","No","Other Object",11008,1]
[10,"HOC","Yes","No","Pedalcycles",767861,5]
[8,"WAR","Yes","No","Head On",17810377,189]
[8,"WAR","Yes","No","Train",48848,1]
[10,"HOC","Yes","Yes","Animal",44032,4]
[5,"COS","No","No","Left Turn",2255714,54]
[12,"LAK","No","Yes","Animal",1470428,81]
[6,"MAD","Yes","No","Sideswipe - Passing",1579873,74]
[7,"AUG","Yes","No","Right Turn",345892,19]
[6,"MAD","No","No","Fixed Object",52388056,844]
[1,"DEF","No","Yes","Other Object",11008,1]
[4,"TRU","No","Yes","Animal",1338676,87]
[7,"MIA","Yes","No","Parked Vehicle",7534738,412]
[4,"POR","Yes","No","Other Non-Collision",1050285,23]
[3,"HUR","Yes","No","Overturning",1088694,4]
[6,"UNI","No","No","Unknown",281220,20]
[11,"JEF","No","Yes","Animal",628144,28]
[7,"MIA","Yes","Yes","Rear End",6789052,191]
[11,"BEL","Yes","Yes","Backing",817053,24]
[10,"GAL","No","Yes","Fixed Object",1447433,39]
[10,"GAL","No","Yes","Rear End",1237818,12]
[4,"MAH","Yes","No","Rear End",852948,36]
[6,"FRA","No","Yes","Left Turn",48848,1]
[11,"TUS","Yes","No","Head On",8122820,71]
[12,"CUY","Yes","No","Pedestrian",8926060,61]
[6,"MAR","Yes","No","Right Turn",144136,2]
[6,"MAD","Yes","No","Fixed Object",232200,10]
[5,"KNO","No","No","Backing",1096672,74]
[8,"GRE","Yes","No","Sideswipe - Passing",125904,8]
[7,"CHP","No","No","Head On",5866881,54]
[3,"WAY","Yes","No","Angle",17520410,603]
[9,"LAW","Yes","No","Backing",1799980,140]
[7,"AUG","Yes","Yes","Overturning",767861,5]
[3,"LOR","Yes","Yes","Parked Vehicle",1852493,89]
[2,"OTT","Yes","No","Other Object",77056,7]
[9,"ROS","No","Yes","Other Non-Collision",379088,31]
[10,"GAL","No","Yes","Pedestrian",502809,1]
[11,"JEF","Yes","No","Overturning",597528,21]
[9,"SCI","Yes","No","Sideswipe - Passing",22016,2]
[1,"ALL","Yes","Yes","Sideswipe - Passing",4186136,222]
[5,"FAI","Yes","No","Left Turn",94084,3]
[4,"POR","Yes","No","Angle",11008,1]
[2,"HEN","Yes","No","Other Non-Collision",784029,21]
[11,"COL","Yes","No","Other Non-Collision",44032,4]
[4,"SUM","Yes","No","Pedestrian",83853873,481]
[6,"PIC","No","No","Overturning",8716855,83]
[2,"SAN","Yes","No","Overturning",1352542,10]
[10,"GAL","Yes","No","Right Turn",2177626,58]
[7,"AUG","No","Yes","Overturning",166152,4]
[6,"FRA","Yes","Yes","Animal",11008,1]
[4,"TRU","Yes","Yes","Sideswipe - Passing",12750162,492]
[4,"POR","Yes","Yes","Right Turn",11008,1]
[12,"CUY","No","Yes","Fixed Object",72068,1]
[10,"ATH","Yes","No","Fixed Object",16812340,285]
[4,"ATB","Yes","Yes","Other Object",55040,5]
[4,"STA","Yes","Yes","Right Turn",22016,2]
[5,"LIC","Yes","No","Rear End",39401139,1681]
[9,"BRO","No","No","Head On",8321136,93]
[9,"BRO","No","No","Train",11008,1]
[7,"CLA","Yes","Yes","Sideswipe - Passing",7569654,379]
[7,"AUG","Yes","No","Backing",99072,9]
[10,"GAL","No","No","Fixed Object",42454049,823]
[6,"MAR","Yes","No","Fixed Object",30775367,652]
[7,"MOT","Yes","No","Rear End",4965058,187]
[9,"BRO","No","No","Unknown",519440,25]
[3,"CRA","No","No","Sideswipe - Passing",1650049,41]
[1,"PAU","No","Yes","Angle",4789592,23]
[7,"SHE","Yes","Yes","Other Object",314244,23]
[0,"ASD","No","No","Fixed Object",72068,1]
[12,"GEA","No","No","Pedestrian",3116217,14]
[12,"GEA","Yes","No","Sideswipe - Passing",2723501,115]
[1,"DEF","No","No","Other Non-Collision",1533433,69]
[8,"BUT","Yes","No","Angle",2681533,89]
[1,"HAR","Yes","No","Right Turn",11008,1]
[4,"MAH","Yes","No","Animal",5650544,438]
[4,"SUM","Yes","Yes","Fixed Object",657384,23]
[9,"SCI","Yes","No","Unknown",88064,8]
[7,"MIA","Yes","No","Other Non-Collision",3075400,37]
[11,"HAS","No","No","Right Turn",1003845,23]
[11,"JEF","No","Yes","Left Turn",11008,1]
[1,"PUT","No","No","Other Object",66048,6]
[8,"PRE","No","No","Fixed Object",60190559,943]
[11,"JEF","No","Yes","Other Non-Collision",44032,4]
[10,"MOE","No","No","Unknown",44032,4]
[5,"LIC","Yes","No","Fixed Object",1658993,59]
[6,"MRW","No","Yes","Rear End",10066367,167]
[9,"HIG","Yes","No","Angle",55040,5]
[8,"WAR","Yes","Yes","Sideswipe - Passing",12216790,438]
[3,"RIC","Yes","No","Overturning",287068,6]
[5,"LIC","Yes","No","Left Turn",14518547,460]
[4,"POR","Yes","No","Fixed Object",39360297,1001]
[2,"OTT","Yes","No","Backing",22016,2]
[11,"JEF","Yes","Yes","Fixed Object",1052693,24]
[10,"WAS","Yes","No","Fixed Object",4736404,125]
[4,"POR","No","No","Pedalcycles",778869,6]
[8,"GRE","Yes","No","Sideswipe - Meeting",59856,2]
[4,"POR","Yes","No","Left Turn",513817,2]
[6,"FRA","Yes","Yes","Pedestrian",31308966,91]
[4,"STA","Yes","Yes","Sideswipe - Passing",24173410,1020]
[3,"LOR","Yes","No","Backing",863440,75]
[1,"VAN","No","No","Sideswipe - Passing",4222693,91]
[3,"ERI","No","No","Pedestrian",502809,1]
[3,"MED","Yes","Yes","Angle",105092,4]
[5,"LIC","Yes","No","Right Turn",3528567,98]
[3,"HUR","Yes","No","Other Object",99072,9]
[7,"DAR","No","No","Right Turn",940840,35]
[2,"SEN","Yes","No","Animal",341248,31]
[4,"MAH","Yes","Yes","Overturning",4345157,44]
[8,"PRE","Yes","No","Animal",77056,7]
[1,"ALL","Yes","No","Animal",99072,9]
[7,"MOT","No","Yes","Other Non-Collision",44032,4]
[8,"BUT","Yes","No","Other Object",1257029,46]
[10,"NOB","Yes","Yes","Overturning",72068,1]
[3,"ASD","No","No","Angle",35691128,383]
[5,"LIC","Yes","No","Parked Vehicle",650504,48]
[11,"JEF","Yes","Yes","Pedestrian",11008,1]
[11,"BEL","No","Yes","Angle",33024,3]
[4,"SUM","Yes","No","Parked Vehicle",11008,1]
[10,"WAS","Yes","No","Rear End",163744,8]
[6,"PIC","Yes","No","Right Turn",99072,9]
[10,"VIN","No","No","Unknown",66048,6]
[1,"PUT","Yes","No","Rear End",22016,2]
[8,"PRE","No","Yes","Overturning",1923807,13]
[6,"FRA","Yes","Yes","Sideswipe - Meeting",11008,1]
[6,"FAY","Yes","No","Backing",1894461,115]
[11,"BEL","No","No","Unknown",303236,22]
[7,"AUG","Yes","Yes","Other Non-Collision",303236,22]
[4,"MAH","Yes","No","Sideswipe - Meeting",783857,12]
[3,"RIC","Yes","Yes","Fixed Object",55040,5]
[3,"CRA","Yes","No","Parked Vehicle",22016,2]
[1,"DEF","Yes","Yes","Overturning",166152,4]
[6,"MAR","No","No","Pedestrian",1221822,5]
[3,"LOR","Yes","No","Parked Vehicle",1846301,85]
[5,"KNO","Yes","No","Parked Vehicle",77056,7]
[8,"CLI","Yes","Yes","Angle",585885,3]
[12,"GEA","Yes","No","Left Turn",1489057,47]
[9,"LAW","Yes","Yes","Overturning",1387974,9]
[6,"DEL","No","No","Angle",43266736,531]
[11,"HOL","No","No","Animal",6474014,359]
[3,"ERI","Yes","No","Overturning",502809,1]
[8,"CLE","No","No","Head On",18603972,158]
[8,"WAR","Yes","No","Head On",728817,7]
[3,"WAY","Yes","No","Right Turn",2220057,92]
[2,"WOO","Yes","No","Sideswipe - Passing",191952,14]
[2,"LUC","No","No","Pedalcycles",359136,7]
[3,"ASD","Yes","No","Sideswipe - Meeting",11008,1]
[4,"STA","Yes","No","Sideswipe - Passing",5451818,292]
[3,"ASD","Yes","No","Pedestrian",3523738,14]
[10,"WAS","No","No","Other Non-Collision",639324,38]
[10,"ATH","No","Yes","Overturning",11008,1]
[8,"CLE","Yes","No","Sideswipe - Passing",191952,14]
[12,"LAK","Yes","Yes","Left Turn",2962978,67]
[10,"GAL","Yes","No","Left Turn",155144,3]
[8,"WAR","Yes","No","Sideswipe - Meeting",11008,1]
[6,"PIC","No","Yes","Sideswipe - Passing",638120,40]
[10,"NOB","No","No","Angle",1360573,34]
[10,"GAL","Yes","No","Backing",825428,66]
[6,"PIC","Yes","No","Rear End",2556661,70]
[7,"CLA","No","No","Rear End",9914094,168]
[9,"JAC","No","Yes","Other Object",11008,1]
[7,"SHE","No","No","Angle",13029107,184]
[6,"PIC","Yes","No","Angle",348128,6]
[10,"GAL","No","Yes","Other Object",22016,2]
[6,"FRA","No","Yes","Fixed Object",2664439,52]
[2,"SAN","No","Yes","Other Non-Collision",654288,56]
[1,"HAN","Yes","No","Sideswipe - Passing",8937226,513]
[11,"COL","Yes","Yes","Unknown",11008,1]
[12,"GEA","No","Yes","Angle",752037,7]
[7,"MIA","No","Yes","Fixed Object",343312,9]
[9,"ADA","Yes","No","Other Object",48848,1]
[3,"MED","Yes","Yes","Pedestrian",11008,1]
[1,"DEF","Yes","No","Rear End",513817,2]
[2,"LUC","No","Yes","Backing",11008,1]
[2,"WIL","No","No","Other Object",243208,11]
[4,"SUM","Yes","No","Right Turn",3639573,199]
[4,"STA","Yes","No","Backing",490372,39]
[9,"ROS","Yes","No","Fixed Object",20783820,435]
[3,"RIC","No","Yes","Rear End",4949684,105]
[3,"LOR","Yes","Yes","Left Turn",163744,8]
[11,"JEF","Yes","No","Left Turn",6658160,187]
[5,"MUS","Yes","Yes","Rear End",4230737,137]
[4,"SUM","Yes","Yes","Head On",1395370,16]
[2,"WIL","No","Yes","Animal",1326636,97]
[4,"ATB","Yes","No","Parked Vehicle",92880,5]
[7,"MOT","Yes","No","Parked Vehicle",94238552,4181]
[4,"MAH","Yes","No","Pedalcycles",5887640,39]
[3,"CRA","Yes","No","Animal",11008,1]
[12,"LAK","No","No","Unknown",105092,4]
[4,"SUM","Yes","Yes","Other Non-Collision",6316449,213]
[3,"MED","Yes","Yes","Fixed Object",6855550,193]
[11,"COL","No","No","Sideswipe - Meeting",1110710,6]
[4,"MAH","Yes","No","Other Non-Collision",33024,3]
[6,"FAY","Yes","No","Right Turn",1096897,37]
[6,"MAR","No","No","Other Object",187136,17]
[3,"RIC","Yes","No","Other Non-Collision",11008,1]
[7,"LOG","Yes","No","Fixed Object",606697,7]
[1,"VAN","Yes","No","Angle",1587957,47]
[7,"LOG","Yes","No","Angle",2482754,49]
[1,"HAN","Yes","Yes","Right Turn",568857,7]
[5,"FAI","Yes","No","Other Non-Collision",739256,27]
[6,"FRA","Yes","Yes","Falling From Or In Vehicle",48848,1]
[9,"SCI","No","No","Fixed Object",86258960,1528]
[4,"MAH","No","No","Head On",7727048,62]
[8,"GRE","No","No","Right Turn",1485445,53]
[9,"JAC","Yes","No","Sideswipe - Meeting",94084,3]
[11,"COL","No","Yes","Other Non-Collision",143104,13]
[5,"COS","Yes","No","Right Turn",48848,1]
[10,"HOC","Yes","No","Fixed Object",1267693,29]
[7,"SHE","Yes","Yes","Angle",212592,9]
[8,"GRE","Yes","No","Other Object",1156925,48]
[4,"ATB","Yes","Yes","Fixed Object",1765858,42]
[7,"AUG","No","No","Fixed Object",22956921,425]
[5,"FAI","Yes","Yes","Pedestrian",502809,1]
[7,"MIA","Yes","No","Head On",1519329,31]
[10,"HOC","Yes","No","Animal",319232,29]
[7,"AUG","Yes","No","Rear End",4090385,143]
[4,"MAH","Yes","No","Other Non-Collision",94084,3]
[4,"ATB","Yes","Yes","Rear End",830760,25]
[7,"AUG","No","No","Rear End",4918327,108]
[1,"PUT","Yes","No","Pedestrian",574877,2]
[7,"AUG","Yes","No","Angle",4819255,169]
[12,"LAK","Yes","No","Angle",1618176,82]
[8,"WAR","Yes","Yes","Right Turn",138116,7]
[8,"WAR","No","Yes","Fixed Object",7461612,178]
[6,"FRA","Yes","Yes","Other Object",4524500,157]
[10,"ATH","Yes","Yes","Animal",980744,78]
[1,"PUT","Yes","No","Sideswipe - Passing",624532,29]
[4,"STA","Yes","Yes","Right Turn",11008,1]
[5,"KNO","No","No","Animal",15646748,850]
[2,"FUL","Yes","No","Other Non-Collision",160132,9]
[4,"POR","Yes","Yes","Left Turn",119712,4]
[7,"MOT","No","No","Pedestrian",1198602,5]
[6,"FAY","No","No","Other Non-Collision",498800,35]
[2,"SAN","No","No","Head On",7202964,49]
[2,"SAN","No","No","Train",11008,1]
[8,"PRE","No","No","Left Turn",6423658,139]
[7,"CHP","Yes","No","Fixed Object",11008,1]
[1,"ALL","Yes","Yes","Overturning",2718500,17]
[7,"CLA","Yes","Yes","Angle",1006081,10]
[7,"CLA","No","No","Right Turn",988021,25]
[9,"BRO","Yes","No","Parked Vehicle",11008,1]
[8,"WAR","No","Yes","Parked Vehicle",584681,5]
[10,"WAS","No","No","Sideswipe - Meeting",513817,2]
[2,"FUL","Yes","No","Backing",22016,2]
[5,"GUE","Yes","No","Angle",12746418,356]
[11,"COL","Yes","No","Animal",292228,21]
[2,"LUC","No","Yes","Right Turn",11008,1]
[7,"MIA","Yes","No","Angle",32001290,813]
[11,"COL","Yes","No","Rear End",2624482,55]
[11,"JEF","Yes","No","Sideswipe - Passing",55040,5]
[7,"SHE","Yes","No","Pedestrian",72068,1]
[11,"TUS","Yes","No","Overturning",83076,2]
[9,"SCI","No","No","Rear End",14311433,295]
[2,"LUC","Yes","No","Other Non-Collision",260236,7]
[2,"FUL","Yes","No","Other Object",11008,1]
[3,"ERI","Yes","Yes","Other Non-Collision",369284,28]
[1,"ALL","Yes","No","Right Turn",8860038,309]
[4,"STA","Yes","No","Parked Vehicle",309256,17]
[3,"WAY","No","No","Parked Vehicle",2268495,34]
[4,"TRU","Yes","Yes","Pedestrian",502809,1]
[9,"SCI","Yes","No","Pedestrian",144136,2]
[2,"SAN","No","Yes","Animal",1585840,115]
[6,"DEL","No","Yes","Fixed Object",5502558,192]
[2,"WIL","Yes","No","Other Non-Collision",766657,7]
[12,"CUY","Yes","Yes","Rear End",292165576,8880]
[6,"MAD","No","No","Head On",6321133,58]
[10,"HOC","Yes","No","Pedalcycles",72068,1]
[1,"PAU","No","Yes","Sideswipe - Passing",1241033,39]
[5,"FAI","No","Yes","Other Non-Collision",298248,16]
[2,"WOO","No","No","Left Turn",10420965,164]
[12,"CUY","Yes","Yes","Backing",22016,2]
[9,"SCI","No","No","Sideswipe - Passing",4993028,133]
[6,"UNI","No","No","Angle",24498055,273]
[2,"FUL","No","No","Animal",16633763,1205]
[9,"LAW","No","No","Pedestrian",1016626,3]
[12,"LAK","Yes","Yes","Other Non-Collision",1393769,46]
[4,"STA","Yes","Yes","Backing",209152,19]
[7,"MIA","Yes","Yes","Animal",1069668,66]
[11,"JEF","Yes","No","Animal",809260,50]
[12,"LAK","No","Yes","Fixed Object",4575068,118]
[4,"MAH","Yes","No","Unknown",33024,3]
[4,"SUM","Yes","No","Pedalcycles",5322104,32]
[5,"MUS","Yes","No","Rear End",44032,4]
[9,"ADA","No","No","Fixed Object",62069566,1102]
[3,"MED","Yes","No","Unknown",601881,10]
[12,"LAK","No","Yes","Rear End",6126442,112]
[10,"WAS","Yes","No","Other Non-Collision",409360,15]
[2,"WOO","Yes","No","Backing",22016,2]
[7,"CHP","No","Yes","Sideswipe - Passing",22016,2]
[3,"ERI","Yes","No","Other Object",994213,29]
[4,"MAH","Yes","No","Backing",881897,32]
[4,"POR","Yes","Yes","Fixed Object",94084,3]
[11,"COL","Yes","Yes","Sideswipe - Passing",642936,37]
[8,"BUT","No","No","Unknown",193156,12]
[4,"SUM","No","No","Pedalcycles",574877,2]
[8,"CLE","Yes","No","Fixed Object",88163527,2365]
[7,"AUG","Yes","No","Unknown",11008,1]
[5,"FAI","Yes","No","Fixed Object",508432,29]
[7,"MOT","Yes","Yes","Unknown",11008,1]
[2,"FUL","Yes","No","Pedestrian",72068,1]
[7,"LOG","No","Yes","Sideswipe - Passing",1402541,60]
[3,"ERI","Yes","Yes","Sideswipe - Passing",325080,15]
[3,"MED","Yes","No","Overturning",585885,3]
[7,"MOT","Yes","Yes","Overturning",83076,2]
[3,"HUR","Yes","No","Angle",2821938,102]
[10,"WAS","Yes","No","Head On",2402192,16]
[10,"WAS","No","Yes","Unknown",88064,8]
[5,"FAI","Yes","No","Pedestrian",241832,4]
[1,"PAU","No","No","Right Turn",204164,13]
[11,"COL","Yes","No","Head On",932240,30]
[11,"COL","Yes","No","Train",513817,2]
[6,"FRA","No","No","Backing",303236,22]
[7,"CHP","Yes","No","Rear End",81872,4]
[8,"BUT","Yes","No","Pedestrian",30813036,189]
[11,"HOL","No","No","Other Non-Collision",1484638,22]
[3,"LOR","Yes","Yes","Other Object",500176,42]
[8,"PRE","Yes","No","Sideswipe - Passing",2049089,91]
[3,"MED","Yes","No","Angle",11790905,297]
[4,"TRU","Yes","No","Right Turn",10787708,453]
[12,"GEA","Yes","No","Sideswipe - Passing",1438436,67]
[3,"HUR","Yes","No","Unknown",193156,12]
[3,"RIC","No","Yes","Parked Vehicle",94084,3]
[10,"MOE","No","No","Fixed Object",25902845,482]
[4,"TRU","Yes","Yes","Angle",2661687,33]
[3,"RIC","Yes","Yes","Head On",916985,13]
[8,"CLI","Yes","No","Other Object",66048,6]
[2,"SAN","No","No","Sideswipe - Passing",8536718,166]
[1,"ALL","Yes","No","Overturning",562665,3]
[4,"STA","Yes","No","Left Turn",3691332,66]
[3,"MED","Yes","Yes","Overturning",203992,4]
[3,"WAY","No","No","Other Non-Vehicle",11008,1]
[2,"HEN","No","No","Fixed Object",35549691,606]
[6,"FAY","No","Yes","Animal",2765072,169]
[11,"COL","Yes","No","Overturning",1293890,6]
[5,"GUE","Yes","Yes","Fixed Object",7860255,186]
[5,"KNO","Yes","No","Animal",1994168,141]
[7,"AUG","Yes","No","Rear End",119712,4]
[8,"WAR","Yes","No","Angle",19441320,438]
[5,"LIC","Yes","Yes","Pedestrian",1221822,5]
[7,"MIA","Yes","No","Pedestrian",6126601,39]
[9,"HIG","No","No","Animal",6260562,305]
[1,"WYA","Yes","No","Backing",1271940,110]
[7,"MIA","Yes","No","Left Turn",4172826,128]
[9,"LAW","Yes","Yes","Sideswipe - Meeting",48848,1]
[8,"HAM","Yes","No","Fixed Object",9452869,318]
[7,"AUG","Yes","No","Parked Vehicle",55040,5]
[2,"SAN","No","Yes","Backing",776580,65]
[5,"GUE","No","No","Overturning",5950248,50]
[2,"OTT","Yes","No","Pedestrian",1281678,7]
[4,"SUM","Yes","Yes","Other Object",22016,2]
[4,"STA","Yes","No","Head On",3378292,41]
[4,"STA","Yes","No","Train",33024,3]
[3,"WAY","Yes","No","Rear End",2760137,117]
[10,"WAS","Yes","Yes","Rear End",351912,14]
[3,"MED","Yes","Yes","Other Object",77056,7]
[8,"BUT","Yes","No","Unknown",1725213,74]
[5,"MUS","No","No","Overturning",13354624,98]
[3,"HUR","Yes","No","Right Turn",1230197,47]
[5,"LIC","Yes","No","Right Turn",5766115,264]
[11,"HAS","No","No","Left Turn",5028050,78]
[4,"POR","Yes","Yes","Fixed Object",3892982,110]
[7,"MER","No","No","Parked Vehicle",1154173,29]
[12,"LAK","No","No","Left Turn",1019100,40]
[6,"MRW","No","Yes","Right Turn",22016,2]
[9,"LAW","No","No","Other Object",590873,9]
[3,"MED","Yes","No","Pedestrian",83076,2]
[10,"HOC","No","Yes","Backing",11008,1]
[8,"GRE","No","Yes","Other Non-Collision",235984,18]
[7,"MIA","Yes","No","Animal",55040,5]
[4,"STA","No","Yes","Sideswipe - Passing",1627742,35]
[12,"LAK","Yes","Yes","Unknown",226180,15]
[7,"MOT","No","Yes","Unknown",22016,2]
[6,"PIC","Yes","No","Overturning",741029,6]
[7,"CLA","No","Yes","Left Turn",22016,2]
[4,"MAH","No","Yes","Backing",945312,79]
[5,"MUS","Yes","No","Overturning",3860752,46]
[11,"BEL","Yes","Yes","Right Turn",804669,16]
[6,"FRA","No","No","Right Turn",312868,16]
[12,"CUY","Yes","No","Other Object",99072,9]
[4,"ATB","No","No","Falling From Or In Vehicle",502809,1]
[2,"OTT","No","No","Backing",1490380,105]
[8,"PRE","Yes","No","Backing",44032,4]
[4,"POR","Yes","No","Animal",66048,6]
[12,"LAK","No","No","Parked Vehicle",783857,12]
[10,"HOC","Yes","No","Parked Vehicle",2104129,96]
[4,"SUM","No","Yes","Unknown",33024,3]
[2,"WOO","Yes","No","Head On",6100576,66]
[2,"WOO","Yes","No","Train",44032,4]
[11,"TUS","Yes","No","Fixed Object",24978053,722]
[1,"HAN","No","No","Fixed Object",35797860,833]
[3,"MED","Yes","Yes","Pedestrian",1005618,2]
[7,"CHP","Yes","No","Backing",33024,3]
[12,"LAK","Yes","Yes","Fixed Object",11008,1]
[2,"LUC","Yes","Yes","Animal",3348496,217]
[1,"VAN","No","No","Head On",1789475,14]
[6,"MAR","Yes","No","Animal",4877060,340]
[8,"BUT","No","No","Parked Vehicle",1055908,51]
[4,"SUM","No","Yes","Backing",33024,3]
[7,"CLA","No","Yes","Overturning",375132,14]
[5,"GUE","Yes","No","Parked Vehicle",1725385,83]
[7,"DAR","Yes","No","Right Turn",1405412,69]
[3,"CRA","Yes","No","Other Object",44032,4]
[4,"POR","Yes","No","Parked Vehicle",197972,9]
[11,"COL","Yes","No","Unknown",11008,1]
[7,"CHP","Yes","No","Rear End",551657,2]
[1,"WYA","Yes","No","Animal",1539572,124]
[8,"WAR","Yes","No","Pedalcycles",504476,7]
[2,"WOO","Yes","Yes","Animal",1275552,109]
[3,"ERI","No","No","Angle",18400482,288]
[12,"GEA","Yes","No","Pedalcycles",802089,6]
[8,"GRE","Yes","Yes","Sideswipe - Passing",12786679,494]
[4,"ATB","No","No","Sideswipe - Meeting",11008,1]
[8,"WAR","No","Yes","Overturning",777665,8]
[3,"RIC","Yes","No","Backing",859656,67]
[6,"FRA","No","Yes","Pedestrian",72068,1]
[4,"POR","No","No","Sideswipe - Passing",10088515,241]
[4,"SUM","Yes","Yes","Angle",7717614,196]
[8,"WAR","Yes","Yes","Backing",169936,12]
[8,"BUT","No","No","Fixed Object",69099352,1172]
[11,"COL","Yes","No","Right Turn",94084,3]
[2,"SEN","Yes","No","Sideswipe - Passing",33024,3]
[9,"SCI","Yes","No","Left Turn",10183975,251]
[5,"MUS","Yes","No","Animal",55040,5]
[4,"STA","Yes","No","Left Turn",466808,21]
[11,"BEL","Yes","No","Head On",3887465,55]
[10,"ATH","Yes","No","Left Turn",94084,3]
[12,"GEA","Yes","No","Parked Vehicle",149124,8]
[11,"COL","Yes","Yes","Pedestrian",48848,1]
[11,"HOL","No","No","Backing",2207157,122]
[3,"LOR","Yes","No","Left Turn",14935356,431]
[7,"DAR","No","No","Rear End",12622737,243]
[11,"TUS","Yes","Yes","Sideswipe - Passing",11008,1]
[9,"HIG","Yes","No","Pedestrian",120916,2]
[10,"HOC","Yes","No","Left Turn",22016,2]
[8,"BUT","Yes","No","Rear End",29710844,1052]
[8,"PRE","No","Yes","Sideswipe - Passing",4305319,172]
[8,"HAM","Yes","No","Backing",2384436,187]
[11,"COL","Yes","No","Overturning",816709,6]
[9,"PIK","Yes","No","Rear End",6454750,251]
[3,"WAY","Yes","No","Backing",644484,53]
[8,"CLI","No","Yes","Backing",77056,7]
[7,"MIA","Yes","No","Right Turn",114896,7]
[9,"LAW","Yes","No","Unknown",794865,13]
[2,"WOO","No","No","Unknown",435160,25]
[9,"PIK","Yes","No","Sideswipe - Passing",44032,4]
[11,"JEF","Yes","No","Unknown",127108,6]
[7,"LOG","Yes","Yes","Other Object",44032,4]
[3,"RIC","Yes","No","Unknown",11008,1]
[3,"ASD","Yes","Yes","Angle",72068,1]
[3,"LOR","No","No","Parked Vehicle",2430294,54]
[12,"LAK","No","Yes","Left Turn",22016,2]
[12,"CUY","Yes","No","Sideswipe - Passing",458809262,19509]
[6,"UNI","No","No","Head On",6742983,54]
[6,"UNI","No","No","Train",22016,2]
[6,"MAR","No","No","Overturning",2497202,35]
[3,"CRA","No","No","Pedestrian",502809,1]
[2,"OTT","Yes","No","Overturning",1292686,8]
[8,"WAR","Yes","Yes","Angle",235812,9]
[11,"CAR","No","No","Sideswipe - Meeting",33024,3]
[5,"FAI","Yes","No","Other Non-Collision",3131988,58]
[10,"WAS","No","Yes","Head On",11008,1]
[9,"ROS","No","No","Sideswipe - Meeting",44032,4]
[4,"MAH","Yes","No","Right Turn",17258745,775]
[1,"ALL","No","Yes","Sideswipe - Passing",3310021,135]
[1,"DEF","Yes","Yes","Angle",97696,2]
[2,"SEN","No","No","Sideswipe - Meeting",33024,3]
[10,"NOB","No","No","Overturning",4641844,22]
[10,"ATH","No","Yes","Unknown",11008,1]
[9,"ROS","Yes","No","Head On",11008,1]
[7,"DAR","Yes","No","Pedalcycles",1839818,17]
[9,"ADA","Yes","No","Head On",11008,1]
[9,"JAC","Yes","Yes","Sideswipe - Passing",265224,13]
[5,"FAI","Yes","No","Backing",654288,56]
[6,"MRW","No","Yes","Animal",2225164,153]
[3,"RIC","No","Yes","Animal",1749068,96]
[11,"HOL","No","No","Sideswipe - Passing",9813646,222]
[3,"WAY","No","No","Backing",1693565,78]
[5,"COS","Yes","No","Pedalcycles",1160762,5]
[11,"HAS","Yes","No","Angle",83076,2]
[1,"HAN","Yes","Yes","Animal",1030796,77]
[4,"SUM","Yes","Yes","Head On",6617714,68]
[4,"SUM","Yes","Yes","Train",59856,2]
[9,"PIK","No","No","Sideswipe - Meeting",22016,2]
[2,"SAN","Yes","No","Right Turn",2426854,64]
[4,"STA","Yes","Yes","Head On",2474432,26]
[4,"ATB","Yes","No","Parked Vehicle",3770915,129]
[11,"COL","Yes","No","Left Turn",1394801,35]
[3,"MED","Yes","Yes","Overturning",693385,8]
[5,"LIC","Yes","Yes","Right Turn",416584,13]
[10,"NOB","Yes","No","Rear End",339700,15]
[1,"VAN","Yes","No","Unknown",66048,6]
[1,"PAU","No","No","Animal",14058698,1122]
[11,"BEL","Yes","Yes","Head On",763045,8]
[3,"MED","No","No","Sideswipe - Passing",14216542,331]
[6,"FRA","Yes","Yes","Sideswipe - Passing",226303029,7136]
[4,"POR","Yes","Yes","Rear End",4640494,134]
[2,"WOO","Yes","No","Angle",966005,23]
[6,"UNI","Yes","No","Other Object",11008,1]
[4,"STA","Yes","No","Rear End",1133136,67]
[6,"MRW","No","No","Head On",6862589,85]
[1,"PUT","Yes","No","Other Non-Collision",22016,2]
[8,"HAM","Yes","Yes","Right Turn",257828,11]
[3,"LOR","Yes","Yes","Other Non-Collision",927940,65]
[3,"WAY","Yes","No","Sideswipe - Passing",1655672,59]
[8,"BUT","No","No","Backing",1834658,67]
[6,"FRA","No","No","Left Turn",3385688,48]
[9,"LAW","No","No","Overturning",10328879,93]
[10,"NOB","Yes","No","Left Turn",44032,4]
[5,"MUS","Yes","No","Right Turn",4207808,271]
[3,"RIC","No","No","Left Turn",5505363,150]
[3,"ERI","Yes","No","Pedestrian",348128,6]
[3,"WAY","Yes","No","Other Non-Collision",125904,8]
[4,"TRU","Yes","Yes","Overturning",3287820,32]
[2,"LUC","Yes","Yes","Rear End",57264028,1848]
[11,"JEF","No","No","Sideswipe - Meeting",94084,3]
[4,"SUM","No","No","Left Turn",513248,26]
[11,"COL","Yes","No","Left Turn",94084,3]
[7,"MIA","Yes","Yes","Right Turn",179568,6]
[8,"WAR","Yes","Yes","Fixed Object",11008,1]
[5,"MUS","Yes","No","Fixed Object",66048,6]
[3,"MED","Yes","No","Left Turn",13359201,384]
[6,"MAD","No","No","Other Non-Collision",5072426,100]
[2,"HEN","No","Yes","Parked Vehicle",22016,2]
[6,"UNI","Yes","No","Pedestrian",574877,2]
[2,"SEN","Yes","No","Backing",1016176,82]
[4,"SUM","Yes","Yes","Other Object",1158301,55]
[10,"WAS","No","Yes","Other Non-Collision",193156,12]
[5,"FAI","No","Yes","Head On",141728,6]
[3,"MED","Yes","Yes","Sideswipe - Passing",2147817,82]
[4,"ATB","Yes","Yes","Head On",11008,1]
[11,"COL","Yes","Yes","Fixed Object",72068,1]
[3,"ERI","Yes","No","Sideswipe - Meeting",66048,6]
[4,"MAH","Yes","No","Rear End",999029,26]
[4,"POR","No","Yes","Pedestrian",574877,2]
[4,"ATB","Yes","No","Angle",5983338,99]
[1,"HAN","Yes","No","Fixed Object",1737650,36]
[9,"HIG","Yes","No","Pedalcycles",502809,1]
[10,"GAL","No","No","Right Turn",1079525,23]
[12,"LAK","No","Yes","Unknown",176128,16]
[3,"MED","Yes","No","Fixed Object",22298439,527]
[7,"MOT","Yes","No","Parked Vehicle",1547828,106]
[12,"GEA","Yes","No","Head On",48848,1]
[11,"COL","Yes","No","Fixed Object",10179371,205]
[8,"CLE","No","No","Other Non-Collision",3714102,140]
[3,"CRA","Yes","No","Other Non-Collision",986817,27]
[4,"ATB","No","No","Sideswipe - Passing",9587122,179]
[4,"STA","No","No","Right Turn",2022085,83]
[6,"FRA","No","No","Head On",1367162,10]
[6,"FRA","No","No","Train",11008,1]
[4,"ATB","Yes","No","Pedestrian",1879775,9]
[1,"ALL","Yes","No","Parked Vehicle",187136,17]
[4,"MAH","Yes","No","Fixed Object",1162945,43]
[5,"KNO","No","No","Pedalcycles",144136,2]
[3,"HUR","Yes","No","Sideswipe - Passing",1091909,31]
[5,"GUE","Yes","Yes","Unknown",191952,14]
[2,"WOO","Yes","Yes","Animal",511012,34]
[1,"HAN","Yes","No","Angle",32865034,889]
[11,"TUS","No","No","Sideswipe - Meeting",33024,3]
[7,"CHP","No","No","Other Object",590873,9]
[6,"PIC","Yes","No","Rear End",11008,1]
[7,"CLA","Yes","No","Overturning",1247450,6]
[3,"CRA","Yes","No","Right Turn",72068,1]
[7,"CLA","No","No","Head On",3129064,35]
[7,"CLA","No","No","Train",11008,1]
[11,"JEF","Yes","No","Fixed Object",17589621,413]
[12,"LAK","Yes","Yes","Head On",1876163,15]
[2,"HEN","No","No","Backing",665296,57]
[3,"HUR","Yes","No","Fixed Object",9534212,263]
[9,"ROS","Yes","Yes","Right Turn",365328,11]
[7,"MOT","Yes","Yes","Left Turn",4374172,86]
[3,"WAY","Yes","No","Pedalcycles",2098850,21]
[9,"ROS","Yes","No","Angle",865729,16]
[10,"WAS","No","No","Sideswipe - Passing",5872107,115]
[9,"JAC","No","No","Falling From Or In Vehicle",502809,1]
[3,"ASD","No","Yes","Angle",502809,1]
[12,"CUY","No","No","Sideswipe - Passing",799853,19]
[6,"FAY","Yes","Yes","Overturning",585885,3]
[4,"TRU","No","No","Unknown",77056,7]
[11,"BEL","Yes","Yes","Parked Vehicle",248024,8]
[3,"ASD","No","No","Sideswipe - Meeting",11008,1]
[2,"WOO","Yes","No","Head On",1270101,25]
[2,"FUL","No","No","Right Turn",873588,31]
[5,"MUS","Yes","No","Parked Vehicle",10106244,570]
[11,"COL","Yes","No","Backing",22016,2]
[5,"MUS","No","Yes","Sideswipe - Meeting",11008,1]
[8,"WAR","No","Yes","Left Turn",131924,3]
[11,"JEF","Yes","No","Right Turn",11008,1]
[10,"NOB","No","Yes","Head On",502809,1]
[8,"BUT","Yes","No","Other Non-Collision",221192,9]
[2,"SEN","Yes","No","Angle",44032,4]
[6,"UNI","No","No","Sideswipe - Passing",5761524,155]
[5,"MUS","Yes","No","Rear End",43385863,1999]
[8,"CLE","Yes","No","Unknown",1912984,113]
[2,"LUC","Yes","No","Sideswipe - Passing",2835526,113]
[7,"CLA","Yes","Yes","Other Non-Collision",1170341,45]
[10,"ATH","Yes","No","Head On",2133250,31]
[2,"FUL","Yes","No","Sideswipe - Passing",581876,37]
[8,"BUT","No","No","Overturning",5348830,58]
[11,"TUS","Yes","Yes","Rear End",9654916,279]
[1,"WYA","Yes","No","Animal",44032,4]
[1,"ALL","No","No","Sideswipe - Meeting",22016,2]
[3,"HUR","Yes","No","Sideswipe - Meeting",114896,7]
[8,"CLE","Yes","Yes","Pedestrian",1077686,3]
[7,"MOT","Yes","No","Head On",908385,13]
[3,"LOR","No","No","Other Non-Collision",3484641,62]
[3,"CRA","No","No","Other Object",88064,8]
[1,"PAU","No","No","Rear End",3549498,97]
[8,"BUT","Yes","No","Right Turn",330068,21]
[10,"ATH","Yes","Yes","Overturning",142932,4]
[7,"LOG","No","No","Animal",8815477,306]
[6,"PIC","Yes","No","Parked Vehicle",132096,12]
[2,"SAN","No","No","Other Object",452188,21]
[9,"SCI","No","No","Head On",15024096,109]
[9,"SCI","No","No","Train",11008,1]
[10,"GAL","No","No","Left Turn",4299127,98]
[7,"AUG","Yes","No","Fixed Object",1445766,33]
[3,"ASD","Yes","No","Sideswipe - Passing",22016,2]
[9,"JAC","No","No","Other Object",143104,13]
[8,"PRE","No","Yes","Other Object",369284,28]
[4,"POR","No","Yes","Angle",752037,7]
[4,"TRU","Yes","No","Animal",12563555,849]
[4,"ATB","Yes","Yes","Sideswipe - Passing",218784,13]
[5,"COS","No","No","Backing",833049,31]
[6,"FRA","Yes","No","Right Turn",106258044,3818]
[8,"WAR","No","Yes","Rear End",7004277,164]
[6,"FRA","Yes","No","Animal",83076,2]
[12,"LAK","Yes","No","Other Object",402308,31]
[7,"MOT","Yes","Yes","Unknown",1946233,74]
[12,"CUY","No","No","Pedestrian",144136,2]
[10,"WAS","Yes","No","Backing",55040,5]
[3,"WAY","Yes","No","Overturning",668220,15]
[8,"CLI","Yes","No","Right Turn",1928226,43]
[1,"VAN","Yes","No","Animal",792404,63]
[4,"SUM","Yes","Yes","Sideswipe - Passing",90543145,4058]
[7,"LOG","Yes","No","Pedalcycles",1543118,12]
[11,"COL","Yes","No","Parked Vehicle",590873,9]
[4,"SUM","Yes","No","Fixed Object",8481850,175]
[3,"ASD","Yes","Yes","Other Object",121088,11]
[0,"WOO","No","No","Rear End",11008,1]
[6,"PIC","Yes","No","Fixed Object",5354612,73]
[6,"FRA","No","Yes","Unknown",11008,1]
[5,"MUS","Yes","No","Right Turn",11008,1]
[6,"MRW","No","No","Sideswipe - Passing",5778724,160]
[4,"MAH","Yes","No","Left Turn",243208,11]
[11,"TUS","Yes","Yes","Parked Vehicle",177160,5]
[8,"CLE","No","No","Pedestrian",3860117,24]
[5,"LIC","Yes","No","Fixed Object",19141630,439]
[11,"COL","No","No","Pedestrian",5940087,17]
[7,"LOG","No","Yes","Other Object",132096,12]
[8,"WAR","No","Yes","Right Turn",22016,2]
[8,"CLE","No","No","Falling From Or In Vehicle",502809,1]
[7,"MOT","Yes","Yes","Right Turn",2622418,77]
[8,"HAM","Yes","Yes","Rear End",1647416,82]
[1,"DEF","No","Yes","Other Non-Collision",55040,5]
[10,"NOB","Yes","No","Right Turn",70864,3]
[7,"AUG","Yes","No","Left Turn",33024,3]
[6,"DEL","No","No","Sideswipe - Passing",9770659,299]
[0,"CUY","No","No","Rear End",48848,1]
[3,"LOR","Yes","No","Right Turn",4906406,243]
[1,"HAR","No","No","Sideswipe - Meeting",22016,2]
[8,"WAR","Yes","Yes","Other Object",677508,56]
[8,"WAR","Yes","No","Angle",13797444,284]
[5,"KNO","Yes","No","Backing",110080,10]
[4,"POR","No","Yes","Other Object",550228,41]
[6,"MAD","Yes","No","Other Object",425356,22]
[11,"COL","Yes","No","Animal",2239546,103]
[3,"ERI","No","No","Other Non-Collision",2249297,92]
[6,"FRA","Yes","No","Head On",3533436,44]
[10,"ATH","Yes","No","Parked Vehicle",1447552,99]
[4,"POR","Yes","No","Angle",10985098,324]
[10,"NOB","No","No","Sideswipe - Meeting",152736,7]
[4,"ATB","Yes","No","Left Turn",9099965,172]
[3,"ERI","Yes","No","Other Non-Collision",4650854,81]
[6,"DEL","Yes","Yes","Animal",786212,59]
[11,"COL","Yes","No","Pedestrian",2923233,11]
[6,"UNI","No","Yes","Unknown",132096,12]
[11,"COL","No","No","Other Non-Collision",2121726,73]
[6,"MAD","Yes","No","Parked Vehicle",33024,3]
[4,"MAH","Yes","No","Other Object",94084,3]
[6,"UNI","Yes","Yes","Other Non-Collision",1462622,20]
[9,"ROS","Yes","No","Parked Vehicle",8507160,407]
[9,"LAW","Yes","No","Sideswipe - Passing",22016,2]
[4,"POR","Yes","No","Head On",2165176,9]
[3,"ERI","Yes","No","Other Object",152736,7]
[0,"CUY","Yes","No","Angle",59856,2]
[5,"FAI","Yes","No","Angle",20219633,475]
[5,"LIC","Yes","No","Backing",555044,38]
[6,"FRA","No","Yes","Rear End",2469510,66]
[1,"DEF","No","Yes","Pedestrian",72068,1]
[3,"MED","Yes","Yes","Other Object",22016,2]
[8,"CLI","No","No","Sideswipe - Passing",5856349,148]
[7,"AUG","Yes","No","Rear End",2347562,70]
[10,"VIN","No","No","Parked Vehicle",1020873,19]
[10,"VIN","No","No","Backing",313040,25]
[7,"CLA","No","Yes","Parked Vehicle",899957,17]
[4,"POR","Yes","No","Backing",416928,31]
[2,"OTT","Yes","No","Parked Vehicle",33024,3]
[11,"COL","Yes","No","Backing",33024,3]
[1,"WYA","Yes","No","Overturning",1149754,4]
[3,"RIC","Yes","No","Sideswipe - Meeting",83076,2]
[3,"MED","Yes","No","Other Non-Collision",44032,4]
[3,"CRA","No","Yes","Sideswipe - Passing",308052,19]
[8,"GRE","Yes","No","Pedestrian",12876649,84]
[10,"MEG","No","No","Left Turn",4183874,51]
[9,"ROS","No","No","Sideswipe - Passing",9788653,233]
[5,"FAI","Yes","No","Sideswipe - Passing",13838803,617]
[5,"COS","Yes","No","Rear End",6040918,252]
[6,"MAR","Yes","No","Backing",3913172,314]
[8,"CLI","No","Yes","Unknown",22016,2]
[8,"HAM","Yes","Yes","Backing",1841088,121]
[7,"MER","Yes","No","Right Turn",438944,33]
[1,"ALL","No","No","Other Non-Collision",1547484,88]
[11,"JEF","Yes","No","Fixed Object",1212653,24]
[3,"WAY","Yes","No","Head On",335916,7]
[3,"WAY","Yes","No","Train",11008,1]
[2,"LUC","No","Yes","Animal",696772,44]
[8,"BUT","Yes","No","Overturning",1886430,26]
[9,"HIG","No","No","Rear End",12529169,192]
[1,"DEF","No","No","Pedestrian",1221822,5]
[10,"NOB","Yes","No","Fixed Object",1871810,26]
[3,"RIC","Yes","No","Animal",864644,73]
[10,"WAS","No","No","Other Object",88064,8]
[12,"CUY","Yes","No","Angle",878548992,20767]
[0,"FRA","Yes","No","Angle",72068,1]
[5,"COS","Yes","No","Overturning",72068,1]
[8,"WAR","Yes","Yes","Left Turn",1293321,25]
[10,"HOC","No","No","Other Object",751005,18]
[3,"LOR","Yes","No","Backing",3365180,265]
[7,"CLA","No","Yes","Backing",99072,9]
[1,"HAN","Yes","No","Animal",330240,30]
[2,"SAN","Yes","No","Left Turn",94084,3]
[10,"GAL","Yes","No","Parked Vehicle",2518874,89]
[3,"WAY","Yes","No","Head On",22016,2]
[9,"ROS","Yes","No","Sideswipe - Passing",72068,1]
[6,"FRA","Yes","No","Fixed Object",10510947,315]
[0,"CLA","Yes","No","Backing",11008,1]
[8,"BUT","Yes","No","Sideswipe - Meeting",585885,3]
[11,"JEF","Yes","Yes","Animal",99072,9]
[10,"GAL","Yes","No","Fixed Object",9667327,182]
[11,"BEL","No","No","Parked Vehicle",1272456,72]
[5,"FAI","No","No","Angle",36356146,443]
[1,"DEF","Yes","No","Sideswipe - Meeting",22016,2]
[1,"HAN","Yes","Yes","Rear End",4507882,155]
[4,"POR","Yes","Yes","Fixed Object",8150882,237]
[7,"DAR","No","No","Head On",11837584,78]
[7,"DAR","No","No","Train",11008,1]
[1,"HAR","Yes","No","Other Object",22016,2]
[12,"LAK","Yes","Yes","Other Non-Collision",11008,1]
[11,"HAS","Yes","No","Sideswipe - Passing",48848,1]
[8,"PRE","No","No","Animal",8624808,483]
[7,"CLA","No","Yes","Unknown",264192,24]
[3,"HUR","Yes","No","Pedestrian",1606123,5]
[10,"ATH","No","No","Animal",8044374,499]
[10,"MEG","Yes","No","Other Object",77056,7]
[3,"ASD","Yes","No","Overturning",1783283,10]
[4,"SUM","Yes","Yes","Pedestrian",3602739,9]
[8,"HAM","Yes","No","Parked Vehicle",203696694,10769]
[8,"CLE","Yes","No","Overturning",72068,1]
[6,"PIC","No","No","Other Object",414348,21]
[11,"TUS","Yes","Yes","Backing",88064,8]
[2,"SEN","Yes","No","Pedalcycles",252840,5]
[4,"ATB","Yes","Yes","Sideswipe - Passing",487620,25]
[11,"JEF","Yes","No","Parked Vehicle",55040,5]
[11,"COL","Yes","No","Sideswipe - Passing",986817,27]
[9,"PIK","Yes","No","Head On",3153025,25]
[4,"STA","Yes","No","Other Object",1173900,90]
[11,"TUS","No","No","Overturning",10784798,93]
[9,"JAC","Yes","Yes","Angle",1027634,4]
[6,"FRA","Yes","Yes","Angle",18666566,286]
[9,"BRO","Yes","No","Pedestrian",131924,3]
[7,"AUG","No","Yes","Right Turn",11008,1]
[7,"DAR","Yes","No","Overturning",144136,2]
[11,"BEL","No","No","Fixed Object",48853150,1086]
[3,"MED","No","No","Pedestrian",5497134,18]
[4,"POR","No","No","Sideswipe - Meeting",22016,2]
[5,"LIC","Yes","No","Other Non-Vehicle",11008,1]
[7,"MER","Yes","No","Rear End",127108,6]
[8,"PRE","No","No","Pedalcycles",719013,4]
[7,"LOG","Yes","No","Right Turn",953568,61]
[5,"GUE","Yes","No","Other Non-Collision",860913,19]
[8,"HAM","Yes","No","Fixed Object",437197766,10171]
[7,"MIA","Yes","No","Unknown",116100,5]
[2,"LUC","No","No","Fixed Object",13124699,266]
[3,"WAY","No","Yes","Other Object",269008,21]
[10,"WAS","Yes","No","Unknown",177160,5]
[10,"NOB","No","Yes","Angle",513817,2]
[3,"LOR","Yes","No","Fixed Object",25323112,561]
[7,"SHE","Yes","No","Left Turn",5034718,182]
[1,"ALL","Yes","No","Backing",401104,33]
[7,"AUG","Yes","No","Animal",88064,8]
[2,"LUC","No","No","Backing",887917,27]
[3,"LOR","Yes","No","Unknown",77056,7]
[10,"WAS","Yes","No","Angle",12187722,392]
[9,"BRO","Yes","No","Angle",55040,5]
[5,"LIC","Yes","No","Rear End",21820569,775]
[10,"WAS","Yes","No","Right Turn",11008,1]
[2,"WIL","Yes","No","Sideswipe - Passing",11008,1]
[4,"SUM","Yes","No","Rear End",3534256,167]
[6,"PIC","Yes","No","Parked Vehicle",66048,6]
[7,"CHP","Yes","No","Head On",3030905,25]
[7,"LOG","Yes","Yes","Angle",11008,1]
[2,"SAN","Yes","No","Left Turn",7115151,108]
[10,"WAS","Yes","No","Backing",538016,42]
[2,"WIL","No","No","Head On",6763054,63]
[2,"WIL","No","No","Train",215000,5]
[4,"ATB","Yes","No","Animal",11008,1]
[3,"RIC","Yes","No","Angle",323704,8]
[3,"MED","Yes","No","Right Turn",4236704,248]
[6,"UNI","Yes","No","Pedestrian",72068,1]
[7,"SHE","No","Yes","Sideswipe - Passing",2485916,122]
[7,"SHE","Yes","Yes","Overturning",1707603,10]
[8,"CLE","Yes","No","Rear End",127113334,5351]
[8,"GRE","No","Yes","Angle",227212,4]
[3,"ASD","No","Yes","Other Non-Collision",363092,24]
[6,"MAD","Yes","No","Pedestrian",767861,5]
[7,"SHE","Yes","No","Angle",274856,7]
[4,"SUM","Yes","Yes","Left Turn",22016,2]
[4,"STA","Yes","No","Other Non-Collision",900129,26]
[5,"GUE","Yes","Yes","Left Turn",44032,4]
[2,"OTT","Yes","No","Angle",1517953,24]
[4,"POR","Yes","No","Animal",22016,2]
[6,"FAY","No","Yes","Parked Vehicle",1541451,6]
[2,"SEN","Yes","No","Backing",1584980,135]
[1,"HAR","No","No","Pedalcycles",502809,1]
[4,"SUM","Yes","No","Right Turn",648956,32]
[9,"HIG","Yes","No","Unknown",33024,3]
[7,"CLA","No","Yes","Right Turn",103888,6]
[8,"HAM","Yes","Yes","Pedalcycles",719013,4]
[5,"KNO","No","No","Unknown",191952,14]
[3,"WAY","No","No","Fixed Object",74144693,1524]
[2,"SAN","Yes","No","Fixed Object",9789288,260]
[8,"WAR","Yes","Yes","Sideswipe - Passing",2375942,85]
[7,"MOT","Yes","Yes","Backing",33024,3]
[10,"MOE","Yes","No","Unknown",11008,1]
[2,"FUL","Yes","No","Head On",213796,7]
[2,"FUL","Yes","No","Train",502809,1]
[5,"LIC","Yes","No","Pedalcycles",9611758,53]
[2,"HEN","Yes","No","Other Object",33024,3]
[3,"CRA","Yes","No","Pedestrian",719013,4]
[4,"MAH","No","Yes","Fixed Object",16183957,531]
[4,"MAH","Yes","No","Left Turn",63270548,1377]
[1,"HAR","No","No","Overturning",4941124,32]
[6,"MAD","Yes","No","Overturning",11008,1]
[5,"FAI","No","Yes","Sideswipe - Passing",4105217,74]
[9,"LAW","Yes","No","Animal",941528,71]
[3,"LOR","Yes","No","Sideswipe - Passing",32936784,1416]
[6,"UNI","Yes","No","Pedestrian",1954251,11]
[8,"CLI","Yes","No","Rear End",103888,6]
[11,"TUS","Yes","No","Other Non-Collision",1913778,52]
[8,"GRE","Yes","Yes","Angle",11008,1]
[10,"ATH","Yes","Yes","Unknown",22016,2]
[3,"LOR","No","No","Head On",13983152,81]
[3,"LOR","No","No","Train",11008,1]
[8,"HAM","Yes","No","Animal",889121,25]
[11,"HAS","No","No","Parked Vehicle",1734038,37]
[10,"ATH","Yes","No","Right Turn",11008,1]
[7,"DAR","No","No","Fixed Object",52696253,1052]
[3,"WAY","Yes","Yes","Other Object",127108,6]
[6,"FAY","No","Yes","Head On",227212,4]
[10,"WAS","Yes","Yes","Other Non-Collision",66048,6]
[10,"HOC","Yes","No","Parked Vehicle",81872,4]
[10,"VIN","No","No","Right Turn",138116,7]
[1,"ALL","Yes","No","Left Turn",141728,6]
[4,"POR","Yes","Yes","Head On",22016,2]
[4,"SUM","Yes","No","Angle",319493918,8848]
[5,"FAI","Yes","No","Rear End",1724869,61]
[12,"LAK","Yes","Yes","Sideswipe - Passing",25931674,897]
[4,"MAH","Yes","No","Angle",711789,11]
[10,"HOC","Yes","Yes","Animal",1869693,94]
[3,"HUR","Yes","No","Rear End",11549496,444]
[7,"AUG","No","No","Pedalcycles",216204,3]
[11,"TUS","Yes","No","Pedestrian",83076,2]
[10,"MEG","No","No","Sideswipe - Passing",1822102,45]
[5,"GUE","Yes","No","Fixed Object",22016,2]
[11,"COL","Yes","No","Rear End",6141591,231]
[7,"MIA","No","Yes","Other Non-Collision",22016,2]
[5,"LIC","Yes","No","Left Turn",9849607,210]
[4,"STA","No","No","Animal",17375454,933]
[3,"RIC","No","No","Unknown",165120,15]
[8,"WAR","Yes","No","Other Non-Collision",4144089,68]
[3,"MED","Yes","No","Pedestrian",1163170,6]
[10,"NOB","No","Yes","Other Object",121088,11]
[9,"BRO","Yes","No","Other Non-Collision",11008,1]
[7,"DAR","Yes","Yes","Other Object",33024,3]
[4,"POR","Yes","No","Backing",11008,1]
[6,"FRA","Yes","No","Left Turn",5882215,129]
[3,"LOR","Yes","Yes","Pedestrian",216204,3]
[8,"WAR","Yes","Yes","Parked Vehicle",221192,9]
[3,"ERI","Yes","Yes","Other Non-Collision",116100,5]
[3,"LOR","Yes","No","Pedestrian",29145946,150]
[7,"DAR","Yes","No","Angle",213796,7]
[5,"MUS","Yes","No","Backing",4508001,340]
[2,"SAN","Yes","No","Angle",318888,11]
[5,"GUE","No","Yes","Pedestrian",574877,2]
[9,"ROS","Yes","Yes","Overturning",717068,16]
[11,"COL","No","No","Other Object",375132,14]
[8,"BUT","Yes","No","Animal",7766541,515]
[4,"MAH","No","Yes","Parked Vehicle",462164,33]
[4,"MAH","Yes","No","Parked Vehicle",88064,8]
[10,"WAS","Yes","No","Left Turn",22016,2]
[10,"GAL","No","Yes","Overturning",131924,3]
[3,"ERI","Yes","No","Other Object",22016,2]
[10,"WAS","No","No","Angle",8632985,142]
[3,"ERI","Yes","No","Head On",8435979,86]
[3,"ERI","Yes","No","Train",502809,1]
[8,"WAR","No","No","Parked Vehicle",1214201,40]
[3,"MED","Yes","Yes","Other Non-Collision",99072,9]
[3,"CRA","No","No","Angle",8151213,103]
[5,"GUE","Yes","No","Rear End",125904,8]
[2,"LUC","Yes","No","Animal",13455891,901]
[4,"SUM","No","No","Backing",281220,20]
[10,"VIN","Yes","No","Animal",99072,9]
[12,"GEA","Yes","No","Other Non-Collision",22016,2]
[4,"MAH","No","Yes","Rear End",9330339,189]
[3,"WAY","Yes","No","Head On",2690464,20]
[4,"ATB","Yes","No","Pedestrian",719013,4]
[7,"AUG","No","No","Animal",13642577,1062]
[8,"WAR","No","No","Animal",10991925,605]
[5,"GUE","No","Yes","Angle",1159558,7]
[3,"CRA","Yes","Yes","Sideswipe - Passing",147920,10]
[11,"COL","Yes","No","Fixed Object",5981909,138]
[1,"ALL","Yes","No","Other Non-Collision",513817,2]
[9,"PIK","No","No","Other Non-Collision",2413372,26]
[4,"ATB","Yes","No","Angle",4854740,127]
[11,"TUS","Yes","No","Angle",1019669,21]
[6,"DEL","Yes","No","Head On",20288553,226]
[6,"DEL","Yes","No","Train",585885,3]
[11,"COL","Yes","Yes","Overturning",120916,2]
[10,"GAL","Yes","No","Rear End",487448,16]
[7,"MOT","Yes","Yes","Rear End",111415108,3384]
[5,"GUE","Yes","No","Backing",33024,3]
[10,"GAL","Yes","No","Head On",4024774,36]
[7,"AUG","Yes","No","Sideswipe - Passing",770388,61]
[11,"COL","No","Yes","Sideswipe - Passing",364296,22]
[7,"SHE","Yes","No","Fixed Object",12999192,375]
[10,"HOC","Yes","No","Rear End",3594628,201]
[5,"MUS","No","Yes","Sideswipe - Passing",4471471,176]
[9,"JAC","No","No","Angle",8801095,141]
[7,"LOG","Yes","No","Sideswipe - Passing",527868,21]
[4,"ATB","No","Yes","Other Non-Collision",733580,50]
[8,"HAM","Yes","No","Head On",181913686,2217]
[8,"HAM","Yes","No","Train",547476,22]
[4,"POR","Yes","No","Sideswipe - Passing",901161,15]
[7,"SHE","Yes","No","Parked Vehicle",5511330,331]
[3,"RIC","Yes","No","Left Turn",72068,1]
[8,"WAR","No","Yes","Backing",202960,15]
[7,"CLA","Yes","No","Sideswipe - Meeting",33024,3]
[11,"COL","Yes","No","Rear End",10098319,264]
[12,"LAK","Yes","No","Sideswipe - Passing",1529821,75]
[2,"SAN","Yes","No","Parked Vehicle",2408622,70]
[10,"HOC","No","No","Pedestrian",2204220,7]
[2,"FUL","Yes","Yes","Sideswipe - Passing",99072,9]
[1,"WYA","No","Yes","Sideswipe - Passing",253012,14]
[7,"MOT","Yes","No","Fixed Object",7073646,160]
[8,"BUT","Yes","No","Pedalcycles",11264056,103]
[2,"SAN","Yes","No","Sideswipe - Passing",33024,3]
[2,"HEN","Yes","Yes","Sideswipe - Passing",823073,19]
[6,"FRA","Yes","Yes","Fixed Object",1544494,24]
[9,"BRO","No","No","Other Non-Collision",1695801,65]
[6,"DEL","No","Yes","Other Non-Collision",292228,21]
[8,"CLI","Yes","No","Right Turn",22016,2]
[7,"MER","No","No","Unknown",1224402,15]
[7,"SHE","No","No","Other Non-Collision",419164,18]
[5,"KNO","Yes","No","Unknown",88064,8]
[2,"WIL","No","No","Sideswipe - Passing",6126045,135]
[7,"CLA","Yes","No","Pedestrian",27428420,132]
[6,"MAD","Yes","No","Animal",11008,1]
[1,"DEF","Yes","Yes","Other Object",66048,6]
[2,"FUL","Yes","No","Other Non-Collision",94084,3]
[1,"WYA","Yes","No","Unknown",44032,4]
[11,"COL","Yes","No","Parked Vehicle",33024,3]
[10,"GAL","No","No","Parked Vehicle",859709,21]
[8,"WAR","Yes","No","Other Non-Collision",199176,7]
[8,"HAM","No","No","Animal",2343037,137]
[6,"DEL","Yes","Yes","Parked Vehicle",549884,23]
[9,"LAW","No","No","Pedalcycles",72068,1]
[2,"LUC","Yes","No","Backing",33273625,2478]
[8,"WAR","Yes","No","Overturning",511872,14]
[2,"SAN","Yes","Yes","Overturning",1054466,3]
[3,"RIC","Yes","No","Other Non-Collision",33024,3]
[7,"SHE","Yes","No","Rear End",10618976,459]
[6,"DEL","Yes","No","Sideswipe - Passing",474376,32]
[6,"PIC","Yes","No","Pedestrian",385968,6]
[2,"FUL","No","No","Fixed Object",37903987,746]
[8,"CLE","Yes","No","Backing",6466565,473]
[2,"SAN","No","Yes","Sideswipe - Passing",7637991,321]
[9,"LAW","Yes","No","Pedalcycles",1139209,11]
[7,"CHP","Yes","No","Pedalcycles",502809,1]
[3,"LOR","Yes","No","Pedalcycles",1258458,7]
[2,"OTT","Yes","No","Pedestrian",1005618,2]
[6,"MAD","No","Yes","Fixed Object",19658609,499]
[1,"WYA","Yes","No","Fixed Object",11008,1]
[3,"ERI","Yes","Yes","Sideswipe - Passing",3105566,123]
[8,"WAR","No","Yes","Unknown",55040,5]
[7,"MIA","Yes","Yes","Fixed Object",5995444,195]
[2,"SAN","Yes","No","Parked Vehicle",546841,5]
[6,"FRA","Yes","No","Parked Vehicle",92880,5]
[2,"SEN","Yes","No","Animal",3443440,270]
[6,"DEL","Yes","No","Parked Vehicle",964748,71]
[4,"STA","No","No","Fixed Object",72444646,1429]
[7,"AUG","Yes","No","Overturning",802089,6]
[6,"MAD","No","Yes","Backing",187136,17]
[9,"JAC","No","No","Pedestrian",1077686,3]
[6,"FRA","Yes","Yes","Rear End",700781,10]
[9,"JAC","Yes","No","Animal",33024,3]
[5,"LIC","Yes","No","Animal",2145356,132]
[11,"TUS","No","Yes","Angle",695793,4]
[9,"BRO","Yes","No","Other Object",33024,3]
[8,"GRE","Yes","No","Other Non-Collision",4967678,114]
[6,"UNI","No","Yes","Backing",22016,2]
[8,"BUT","Yes","No","Overturning",7319540,79]
[7,"LOG","Yes","No","Pedestrian",144136,2]
[3,"RIC","Yes","Yes","Angle",1372613,24]
[3,"HUR","Yes","No","Pedestrian",120916,2]
[5,"MUS","No","No","Right Turn",785696,32]
[3,"HUR","No","No","Sideswipe - Passing",4783704,100]
[7,"MER","No","No","Backing",1500409,66]
[5,"FAI","Yes","Yes","Sideswipe - Passing",1956381,95]
[5,"MUS","Yes","No","Parked Vehicle",70864,3]
[7,"MOT","No","Yes","Sideswipe - Passing",154112,14]
[8,"WAR","Yes","Yes","Rear End",12002822,367]
[3,"ERI","No","No","Other Object",904945,23]
[3,"RIC","Yes","No","Other Object",22016,2]
[1,"HAN","No","Yes","Overturning",59856,2]
[11,"BEL","No","No","Left Turn",6645260,217]
[11,"JEF","Yes","No","Left Turn",679969,6]
[1,"HAR","Yes","No","Sideswipe - Meeting",11008,1]
[6,"MRW","No","Yes","Parked Vehicle",1082674,9]
[11,"TUS","Yes","Yes","Left Turn",55040,5]
[7,"AUG","Yes","Yes","Rear End",265224,13]
[4,"POR","No","Yes","Sideswipe - Passing",6066771,211]
[10,"HOC","No","No","Angle",6968713,78]
[4,"STA","Yes","No","Parked Vehicle",787244,48]
[8,"CLI","No","Yes","Animal",1577928,81]
[11,"COL","No","Yes","Head On",83076,2]
[5,"GUE","Yes","No","Right Turn",513817,2]
[2,"FUL","No","Yes","Other Object",473172,34]
[8,"HAM","No","No","Overturning",3354609,28]
[11,"JEF","Yes","No","Backing",2952539,117]
[2,"OTT","Yes","No","Animal",22016,2]
[10,"ATH","Yes","No","Parked Vehicle",22016,2]
[4,"SUM","No","Yes","Animal",1237024,73]
[3,"ERI","Yes","No","Animal",94084,3]
[1,"WYA","Yes","No","Right Turn",479020,20]
[7,"MIA","Yes","No","Rear End",581704,28]
[6,"DEL","Yes","No","Head On",83076,2]
[6,"DEL","Yes","No","Sideswipe - Passing",22065047,1085]
[2,"LUC","No","Yes","Rear End",1108765,18]
[5,"MUS","Yes","No","Fixed Object",41011339,1045]
[10,"GAL","Yes","Yes","Animal",390096,32]
[11,"TUS","Yes","Yes","Fixed Object",9693828,245]
[0,"TRU","No","No","Rear End",11008,1]
[4,"POR","Yes","No","Fixed Object",345720,10]
[6,"MAR","Yes","No","Pedalcycles",6290808,45]
[11,"BEL","Yes","Yes","Animal",2039232,139]
[1,"DEF","No","No","Other Object",169936,12]
[10,"MOE","Yes","No","Animal",44032,4]
[10,"MEG","No","No","Head On",8918532,42]
[10,"MEG","No","No","Train",72068,1]
[5,"FAI","No","No","Other Object",651933,9]
[4,"ATB","No","No","Pedestrian",3010384,20]
[2,"WIL","Yes","No","Sideswipe - Passing",1183360,75]
[9,"ROS","No","Yes","Other Object",716777,17]
[0,"CUY","Yes","No","Sideswipe - Passing",142932,4]
[4,"MAH","Yes","No","Unknown",5678885,62]
[10,"WAS","No","No","Pedestrian",1724631,6]
[9,"ROS","Yes","No","Left Turn",18672308,379]
[4,"STA","Yes","No","Fixed Object",1225672,54]
[6,"UNI","Yes","Yes","Other Non-Collision",22016,2]
[2,"WOO","Yes","No","Sideswipe - Passing",3030296,247]
[6,"FRA","No","No","Animal",1071269,36]
[7,"CHP","Yes","No","Sideswipe - Passing",2064053,109]
[7,"MER","No","No","Left Turn",7944456,68]
[5,"KNO","Yes","No","Backing",1965100,155]
[9,"ROS","No","Yes","Angle",563128,11]
[11,"JEF","Yes","Yes","Pedestrian",1149754,4]
[10,"MEG","No","No","Parked Vehicle",994041,20]
[8,"HAM","Yes","Yes","Overturning",551657,2]
[4,"MAH","Yes","No","Other Object",11008,1]
[4,"ATB","No","Yes","Train",502809,1]
[4,"ATB","No","Yes","Head On",1099702,5]
[8,"GRE","No","No","Pedalcycles",2404600,12]
[7,"AUG","Yes","No","Fixed Object",33024,3]
[8,"BUT","Yes","No","Angle",8369097,279]
[11,"TUS","No","No","Sideswipe - Passing",5482593,141]
[2,"WOO","No","No","Other Non-Collision",3690075,114]
[2,"FUL","Yes","No","Fixed Object",33024,3]
[3,"RIC","Yes","Yes","Animal",138116,7]
[3,"RIC","Yes","Yes","Sideswipe - Passing",11008,1]
[1,"PAU","No","Yes","Overturning",274856,7]
[1,"HAN","No","No","Left Turn",1611984,73]
[2,"FUL","Yes","No","Left Turn",59856,2]
[1,"HAN","Yes","Yes","Head On",382356,7]
[6,"PIC","Yes","No","Head On",1264650,11]
[3,"CRA","Yes","No","Angle",8979750,233]
[10,"MEG","Yes","No","Other Non-Collision",44032,4]
[2,"OTT","No","Yes","Right Turn",11008,1]
[2,"LUC","Yes","Yes","Right Turn",1837357,67]
[3,"CRA","No","Yes","Other Non-Collision",121088,11]
[9,"HIG","Yes","No","Sideswipe - Passing",11008,1]
[1,"HAR","Yes","No","Pedestrian",265052,4]
[3,"LOR","Yes","Yes","Head On",3203818,14]
[3,"CRA","Yes","No","Head On",1691038,22]
[7,"AUG","Yes","No","Overturning",192984,3]
[2,"WOO","No","Yes","Backing",484352,44]
[2,"SAN","Yes","No","Head On",22016,2]
[2,"SAN","Yes","No","Train",83076,2]
[11,"JEF","Yes","Yes","Overturning",11008,1]
[1,"PUT","Yes","No","Overturning",11008,1]
[9,"HIG","No","No","Right Turn",1419225,33]
[3,"MED","Yes","No","Pedestrian",502809,1]
[7,"AUG","Yes","No","Head On",11008,1]
[6,"PIC","No","No","Pedestrian",4480508,15]
[9,"LAW","No","No","Animal",4338859,202]
[2,"SEN","No","No","Other Non-Collision",1247225,43]
[4,"MAH","Yes","No","Angle",1311090,16]
[10,"ATH","Yes","No","Rear End",951848,36]
[7,"MOT","Yes","Yes","Animal",4049277,227]
[8,"HAM","Yes","No","Left Turn",302115008,8705]
[12,"GEA","Yes","No","Head On",937797,17]
[5,"LIC","Yes","No","Unknown",164948,6]
[1,"WYA","No","No","Pedestrian",1005618,2]
[10,"HOC","No","Yes","Other Non-Collision",11008,1]
[3,"LOR","No","Yes","Unknown",55040,5]
[7,"CLA","Yes","Yes","Angle",502809,1]
[2,"LUC","No","No","Unknown",33024,3]
[7,"AUG","Yes","Yes","Angle",816881,15]
[6,"FAY","No","No","Angle",9307966,147]
[7,"DAR","Yes","No","Pedestrian",83076,2]
[6,"FAY","Yes","No","Animal",424324,33]
[2,"WOO","Yes","No","Head On",180772,4]
[8,"GRE","No","Yes","Other Object",248196,17]
[7,"MOT","No","No","Angle",15980376,192]
[4,"STA","Yes","No","Pedestrian",45487469,288]
[2,"OTT","No","No","Animal",10545373,829]
[1,"ALL","Yes","No","Pedalcycles",8862301,61]
[3,"RIC","Yes","No","Overturning",5119210,48]
[5,"LIC","No","No","Pedestrian",2884189,13]
[1,"WYA","No","Yes","Overturning",83076,2]
[8,"CLE","Yes","No","Overturning",7306865,72]
[6,"PIC","Yes","No","Pedestrian",623725,3]
[11,"BEL","Yes","No","Rear End",11727754,429]
[5,"GUE","Yes","No","Pedalcycles",502809,1]
[4,"SUM","Yes","No","Angle",2005348,86]
[11,"COL","Yes","Yes","Sideswipe - Passing",33024,3]
[4,"ATB","Yes","No","Unknown",97696,2]
[2,"WOO","Yes","No","Animal",44032,4]
[8,"CLE","Yes","Yes","Animal",2675116,187]
[6,"MRW","No","No","Rear End",11107972,331]
[12,"CUY","Yes","Yes","Sideswipe - Meeting",81872,4]
[7,"CHP","No","Yes","Angle",11008,1]
[1,"DEF","Yes","No","Other Non-Collision",615932,29]
[11,"COL","Yes","Yes","Head On",656749,6]
[7,"MOT","Yes","No","Left Turn",837124,38]
[1,"DEF","No","No","Parked Vehicle",845089,21]
[6,"UNI","Yes","Yes","Overturning",11008,1]
[9,"SCI","No","No","Pedalcycles",1077686,3]
[7,"AUG","No","Yes","Left Turn",11008,1]
[6,"MAD","Yes","No","Backing",11008,1]
[7,"SHE","Yes","No","Other Object",191952,14]
[4,"SUM","Yes","No","Sideswipe - Passing",8717516,489]
[6,"PIC","No","Yes","Animal",143104,13]
[3,"WAY","Yes","Yes","Backing",11008,1]
[6,"FAY","No","No","Pedestrian",1270670,6]
[9,"ROS","Yes","No","Sideswipe - Meeting",11008,1]
[8,"WAR","Yes","No","Unknown",22016,2]
[7,"CHP","Yes","No","Fixed Object",6351934,161]
[9,"HIG","No","No","Parked Vehicle",2235643,40]
[4,"STA","Yes","No","Other Object",22016,2]
[8,"PRE","Yes","No","Angle",5247138,182]
[5,"FAI","Yes","No","Sideswipe - Meeting",502809,1]
[2,"WIL","Yes","No","Rear End",3578288,171]
[11,"BEL","Yes","No","Pedalcycles",11008,1]
[4,"STA","No","No","Left Turn",11992079,231]
[7,"MOT","No","No","Left Turn",2943079,62]
[10,"NOB","No","Yes","Unknown",55040,5]
[3,"LOR","Yes","No","Backing",379088,31]
[2,"SAN","Yes","No","Animal",22016,2]
[5,"FAI","Yes","No","Parked Vehicle",1811504,98]
[11,"BEL","Yes","No","Pedestrian",1988479,12]
[11,"BEL","Yes","Yes","Right Turn",11008,1]
[6,"UNI","Yes","No","Head On",2311151,31]
[9,"ROS","Yes","Yes","Backing",22016,2]
[8,"PRE","Yes","No","Right Turn",319060,20]
[11,"JEF","No","No","Overturning",8240124,69]
[8,"BUT","Yes","No","Left Turn",1685653,49]
[2,"OTT","Yes","No","Sideswipe - Passing",1375312,89]
[4,"POR","Yes","No","Other Non-Collision",2040317,77]
[6,"MAD","Yes","No","Unknown",11008,1]
[4,"TRU","Yes","No","Right Turn",188168,6]
[8,"GRE","Yes","No","Backing",5840088,456]
[8,"HAM","Yes","No","Sideswipe - Passing",367744263,19944]
[2,"SEN","Yes","No","Rear End",59856,2]
[3,"WAY","Yes","No","Animal",1917456,152]
[8,"HAM","Yes","Yes","Angle",10578702,199]
[2,"SEN","Yes","No","Overturning",1806503,10]
[4,"MAH","Yes","No","Rear End",245616,12]
[3,"WAY","Yes","No","Head On",524825,3]
[7,"MIA","Yes","Yes","Other Object",858624,78]
[11,"TUS","Yes","Yes","Sideswipe - Passing",4882961,210]
[5,"FAI","Yes","Yes","Left Turn",22016,2]
[3,"RIC","Yes","Yes","Backing",242004,13]
[5,"LIC","Yes","No","Angle",30737937,546]
[2,"WOO","Yes","No","Fixed Object",8641995,276]
[8,"CLI","No","Yes","Overturning",1912799,12]
[5,"KNO","No","No","Angle",21850922,264]
[10,"VIN","Yes","No","Sideswipe - Passing",105092,4]
[2,"WIL","No","No","Sideswipe - Meeting",11008,1]
[3,"ASD","No","No","Overturning",14782092,96]
[10,"HOC","No","No","Parked Vehicle",573276,32]
[6,"MRW","No","No","Fixed Object",48759040,894]
[12,"CUY","No","No","Animal",328864,23]
[9,"PIK","Yes","No","Pedalcycles",585885,3]
[5,"GUE","No","No","Other Non-Collision",1486014,29]
[8,"PRE","No","Yes","Rear End",8768799,131]
[3,"RIC","No","No","Overturning",9415228,92]
[7,"CLA","Yes","No","Left Turn",94084,3]
[7,"CLA","Yes","No","Parked Vehicle",40306336,1677]
[4,"SUM","Yes","No","Backing",33024,3]
[1,"ALL","Yes","No","Parked Vehicle",17965943,867]
[8,"GRE","Yes","No","Unknown",429140,30]
[5,"PER","No","No","Right Turn",1432813,44]
[2,"FUL","No","Yes","Head On",524825,3]
[8,"CLI","No","No","Right Turn",2038134,39]
[3,"HUR","No","No","Animal",17042951,1271]
[5,"FAI","No","Yes","Overturning",1114785,13]
[9,"SCI","No","No","Other Non-Collision",359308,16]
[4,"TRU","No","Yes","Parked Vehicle",144136,2]
[9,"JAC","Yes","Yes","Left Turn",11008,1]
[11,"BEL","Yes","No","Fixed Object",14751819,381]
[12,"GEA","Yes","No","Rear End",17001896,624]
[3,"MED","No","No","Animal",16254424,902]
[10,"HOC","Yes","No","Fixed Object",11008,1]
[7,"DAR","Yes","No","Fixed Object",55040,5]
[2,"SAN","No","No","Fixed Object",36868944,688]
[7,"AUG","Yes","No","Left Turn",1721826,38]
[10,"MOE","No","No","Angle",3664500,67]
[3,"MED","No","No","Unknown",972197,27]
[7,"LOG","Yes","No","Parked Vehicle",2458158,107]
[7,"CHP","Yes","No","Overturning",1148550,6]
[3,"WAY","Yes","No","Other Object",22016,2]
[8,"PRE","No","Yes","Fixed Object",4383116,104]
[4,"SUM","Yes","No","Animal",15201003,1040]
[6,"FRA","Yes","No","Head On",222965142,2437]
[6,"FRA","Yes","No","Train",622521,5]
[0,"LUC","Yes","No","Sideswipe - Passing",11008,1]
[6,"FRA","No","Yes","Sideswipe - Passing",2953055,74]
[7,"AUG","No","Yes","Parked Vehicle",585885,3]
[12,"GEA","Yes","No","Right Turn",1426793,49]
[1,"HAN","Yes","No","Pedalcycles",6976043,44]
[12,"LAK","Yes","Yes","Overturning",4038018,29]
[4,"MAH","Yes","No","Fixed Object",141728,6]
[7,"AUG","Yes","No","Rear End",2740304,153]
[7,"AUG","Yes","Yes","Sideswipe - Passing",312868,16]
[4,"SUM","No","No","Overturning",2823129,13]
[5,"COS","Yes","No","Other Object",116100,5]
[8,"WAR","Yes","No","Overturning",6075517,41]
[7,"MIA","Yes","No","Other Object",125904,8]
[8,"CLI","No","No","Overturning",3395783,40]
[4,"TRU","Yes","Yes","Head On",866933,14]
[5,"LIC","Yes","Yes","Sideswipe - Passing",6675757,219]
[10,"MOE","No","No","Other Object",66048,6]
[8,"BUT","No","No","Angle",29944991,397]
[1,"VAN","No","No","Pedalcycles",1149754,4]
[1,"HAN","No","No","Angle",28265808,329]
[2,"FUL","Yes","No","Other Object",11008,1]
[7,"LOG","Yes","No","Angle",59856,2]
[10,"HOC","Yes","Yes","Left Turn",72068,1]
[2,"LUC","Yes","No","Overturning",83076,2]
[7,"MIA","Yes","Yes","Animal",1690932,119]
[6,"DEL","No","No","Rear End",19273368,585]
[2,"SAN","Yes","No","Fixed Object",3295388,48]
[11,"TUS","Yes","No","Backing",319232,29]
[2,"WIL","No","No","Rear End",10912104,222]
[7,"CHP","Yes","No","Rear End",5684084,278]
[6,"UNI","No","No","Fixed Object",37063026,741]
[1,"ALL","No","No","Right Turn",1773545,48]
[8,"HAM","No","No","Angle",8135680,184]
[4,"ATB","Yes","Yes","Angle",11008,1]
[4,"POR","Yes","Yes","Other Object",44032,4]
[11,"HOL","Yes","No","Fixed Object",83076,2]
[5,"LIC","No","Yes","Right Turn",502809,1]
[4,"ATB","No","No","Animal",18355510,910]
[7,"LOG","Yes","No","Left Turn",2143464,93]
[10,"ATH","Yes","No","Sideswipe - Passing",279844,13]
[12,"LAK","No","Yes","Other Non-Collision",352084,23]
[3,"ERI","Yes","Yes","Fixed Object",1141789,21]
[10,"MEG","No","No","Right Turn",700781,10]
[3,"HUR","Yes","No","Pedalcycles",177160,5]
[3,"LOR","Yes","No","Pedalcycles",12514364,101]
[1,"HAN","No","No","Other Object",248196,17]
[1,"HAR","Yes","No","Right Turn",1340674,29]
[4,"POR","No","No","Unknown",453392,19]
[3,"RIC","Yes","No","Parked Vehicle",33024,3]
[9,"JAC","Yes","No","Parked Vehicle",2131133,99]
[3,"RIC","Yes","No","Left Turn",81872,4]
[10,"HOC","Yes","Yes","Other Non-Collision",55040,5]
[1,"DEF","Yes","No","Sideswipe - Passing",5693134,329]
[7,"LOG","No","Yes","Fixed Object",4138307,118]
[4,"ATB","Yes","Yes","Overturning",227212,4]
[4,"POR","Yes","Yes","Other Non-Collision",48848,1]
[0,"WOO","Yes","Yes","Sideswipe - Passing",11008,1]
[1,"HAR","Yes","No","Backing",1034580,85]
[6,"FAY","Yes","No","Pedestrian",888777,7]
[9,"ROS","Yes","No","Left Turn",105092,4]
[4,"MAH","Yes","No","Head On",27782038,348]
[4,"MAH","Yes","No","Train",166152,4]
[6,"MAD","No","No","Animal",7758497,339]
[8,"CLI","Yes","No","Left Turn",3204519,72]
[6,"DEL","No","No","Left Turn",14156567,214]
[11,"BEL","No","No","Other Non-Collision",1129921,40]
[10,"MRG","No","No","Sideswipe - Meeting",11008,1]
[4,"ATB","Yes","No","Animal",573448,41]
[2,"SEN","Yes","No","Fixed Object",618909,6]
[6,"MAD","Yes","No","Head On",1620174,24]
[9,"ROS","Yes","No","Other Object",728989,16]
[8,"CLE","No","No","Animal",12763882,825]
[1,"WYA","No","Yes","Unknown",33024,3]
[7,"AUG","Yes","No","Other Object",33024,3]
[5,"LIC","No","No","Other Non-Collision",3087387,78]
[6,"UNI","No","No","Rear End",13481625,360]
[10,"HOC","Yes","Yes","Rear End",59856,2]
[6,"MAR","Yes","No","Head On",11008,1]
[9,"JAC","Yes","No","Rear End",10148794,399]
[7,"LOG","Yes","No","Unknown",557849,6]
[3,"RIC","Yes","Yes","Rear End",11008,1]
[12,"GEA","No","Yes","Unknown",22016,2]
[7,"CLA","Yes","No","Head On",2116963,25]
[2,"SAN","No","No","Rear End",12445709,240]
[4,"MAH","Yes","No","Other Object",11008,1]
[3,"MED","Yes","Yes","Unknown",33024,3]
[2,"FUL","Yes","No","Rear End",5398445,233]
[1,"DEF","No","Yes","Fixed Object",171140,10]
[8,"CLI","No","No","Parked Vehicle",2129982,55]
[2,"LUC","Yes","No","Unknown",14908233,478]
[5,"MUS","Yes","No","Animal",4141985,288]
[3,"MED","Yes","Yes","Sideswipe - Passing",2512510,76]
[8,"HAM","No","No","Right Turn",669940,45]
[7,"MOT","Yes","No","Unknown",114896,7]
[6,"MAR","No","No","Head On",4272335,31]
[6,"MAR","No","No","Train",155144,3]
[7,"CHP","Yes","No","Parked Vehicle",3978466,178]
[3,"WAY","Yes","No","Animal",176128,16]
[2,"WIL","Yes","No","Parked Vehicle",1168965,38]
[10,"WAS","Yes","No","Rear End",6365654,199]
[11,"BEL","Yes","Yes","Left Turn",303064,13]
[7,"MIA","Yes","No","Animal",2457073,164]
[3,"WAY","Yes","Yes","Animal",44032,4]
[11,"BEL","Yes","Yes","Rear End",11454023,277]
[3,"ERI","Yes","Yes","Unknown",220160,20]
[3,"ERI","Yes","No","Sideswipe - Meeting",11008,1]
[1,"HAN","No","Yes","Other Object",88064,8]
[8,"CLE","Yes","Yes","Sideswipe - Passing",11008,1]
[3,"LOR","Yes","Yes","Fixed Object",25930378,544]
[4,"TRU","No","Yes","Pedestrian",144136,2]
[11,"BEL","Yes","Yes","Fixed Object",11500172,338]
[12,"GEA","No","No","Angle",47097163,699]
[3,"LOR","No","No","Rear End",25026133,678]
[6,"FRA","Yes","No","Sideswipe - Meeting",832308,41]
[6,"MAD","No","Yes","Unknown",729968,56]
[10,"MOE","Yes","No","Rear End",843713,14]
[3,"ERI","Yes","Yes","Parked Vehicle",72068,1]
[8,"WAR","No","No","Fixed Object",61371510,1131]
[9,"LAW","No","No","Sideswipe - Meeting",152736,7]
[0,"CLA","Yes","No","Rear End",72068,1]
[1,"VAN","No","No","Backing",577060,40]
[10,"HOC","Yes","No","Backing",11008,1]
[4,"POR","Yes","No","Fixed Object",690977,7]
[12,"LAK","No","No","Pedalcycles",192984,3]
[10,"MRG","No","No","Parked Vehicle",1501838,27]
[5,"MUS","No","No","Angle",9038111,158]
[7,"AUG","Yes","No","Pedestrian",348128,6]
[9,"JAC","Yes","No","Pedestrian",1822327,8]
[8,"WAR","Yes","No","Pedestrian",1247450,6]
[7,"MIA","Yes","No","Head On",7161406,92]
[7,"MIA","Yes","No","Train",11008,1]
[10,"WAS","No","No","Head On",9508664,61]
[10,"WAS","No","No","Train",144136,2]
[2,"LUC","Yes","No","Fixed Object",4952145,120]
[2,"OTT","Yes","Yes","Other Non-Collision",55040,5]
[6,"PIC","No","No","Angle",23693452,293]
[4,"SUM","Yes","Yes","Right Turn",33024,3]
[5,"FAI","Yes","No","Pedalcycles",83076,2]
[2,"FUL","Yes","No","Fixed Object",3386032,66]
[5,"COS","No","No","Parked Vehicle",1182209,26]
[3,"WAY","No","No","Pedalcycles",2968469,13]
[8,"CLI","No","Yes","Rear End",5317129,113]
[6,"PIC","Yes","No","Other Object",33024,3]
[5,"KNO","Yes","No","Fixed Object",11484613,230]
[3,"ASD","Yes","No","Other Non-Collision",1704626,33]
[11,"CAR","No","No","Angle",10059950,195]
[2,"SAN","No","Yes","Head On",22016,2]
[7,"DAR","Yes","Yes","Angle",860741,10]
[3,"LOR","Yes","No","Unknown",22016,2]
[12,"LAK","Yes","Yes","Fixed Object",43476615,1007]
[4,"TRU","Yes","No","Pedestrian",21739043,101]
[3,"CRA","No","Yes","Head On",33024,3]
[10,"ATH","Yes","No","Backing",974552,74]
[10,"HOC","Yes","Yes","Fixed Object",340904,13]
[2,"WIL","Yes","No","Left Turn",1229284,48]
[10,"NOB","Yes","No","Overturning",11008,1]
[3,"WAY","Yes","No","Other Object",110080,10]
[6,"FRA","Yes","Yes","Fixed Object",387344,13]
[4,"TRU","No","No","Right Turn",578092,29]
[5,"GUE","Yes","Yes","Right Turn",44032,4]
[3,"LOR","Yes","Yes","Angle",1374558,12]
[8,"HAM","Yes","Yes","Other Object",11008,1]
[4,"POR","Yes","No","Backing",44032,4]
[4,"TRU","No","Yes","Overturning",730021,5]
[7,"AUG","Yes","Yes","Angle",83076,2]
[9,"PIK","No","No","Head On",4527305,50]
[3,"WAY","No","No","Right Turn",2695055,54]
[11,"TUS","Yes","Yes","Right Turn",138116,7]
[8,"CLI","No","Yes","Fixed Object",3531438,107]
[11,"COL","Yes","No","Unknown",33024,3]
[10,"MRG","No","No","Left Turn",2708299,42]
[10,"NOB","Yes","Yes","Sideswipe - Passing",406952,19]
[4,"SUM","Yes","Yes","Unknown",1327840,95]
[8,"CLI","Yes","No","Angle",22016,2]
[7,"MER","No","Yes","Angle",72068,1]
[5,"KNO","Yes","No","Rear End",11929047,508]
[7,"SHE","No","No","Sideswipe - Passing",3347623,80]
[10,"GAL","No","No","Animal",6144912,291]
[6,"UNI","No","No","Left Turn",8113995,108]
[5,"LIC","Yes","No","Other Object",171140,10]
[6,"FRA","No","No","Fixed Object",12029496,165]
[1,"WYA","No","Yes","Other Object",22016,2]
[6,"FAY","No","Yes","Left Turn",72068,1]
[4,"TRU","No","No","Backing",2069160,100]
[2,"WOO","Yes","Yes","Pedestrian",574877,2]
[4,"STA","No","No","Pedestrian",5140869,20]
[12,"LAK","Yes","No","Head On",625564,18]
[7,"AUG","Yes","No","Other Object",94084,3]
[4,"POR","Yes","Yes","Animal",970596,57]
[3,"ERI","Yes","No","Fixed Object",11008,1]
[9,"HIG","Yes","No","Parked Vehicle",524825,3]
[3,"ERI","Yes","No","Rear End",92880,5]
[10,"GAL","Yes","Yes","Fixed Object",1390157,47]
[5,"LIC","Yes","Yes","Other Object",253012,14]
[10,"WAS","Yes","No","Left Turn",3498176,54]
[7,"DAR","Yes","No","Sideswipe - Passing",88064,8]
[9,"LAW","Yes","Yes","Other Object",182148,11]
[4,"MAH","No","No","Left Turn",8777121,149]
[10,"ATH","Yes","No","Unknown",502809,1]
[5,"COS","Yes","No","Unknown",55040,5]
[11,"TUS","Yes","No","Sideswipe - Passing",7896454,494]
[8,"WAR","Yes","No","Parked Vehicle",5639470,266]
[4,"TRU","Yes","No","Rear End",97788340,3591]
[5,"LIC","No","Yes","Other Non-Collision",566224,48]
[4,"POR","Yes","No","Right Turn",6427402,285]
[2,"SEN","Yes","No","Right Turn",653944,38]
[3,"ERI","Yes","Yes","Animal",4289336,257]
[11,"COL","No","Yes","Animal",1858288,121]
[7,"SHE","Yes","No","Head On",11008,1]
[8,"BUT","Yes","Yes","Angle",2269990,36]
[6,"DEL","Yes","No","Animal",193156,12]
[10,"MRG","No","No","Fixed Object",29248603,363]
[7,"MIA","Yes","Yes","Backing",77056,7]
[1,"VAN","No","No","Other Non-Collision",1788046,53]
[11,"BEL","Yes","No","Angle",8999649,303]
[8,"HAM","Yes","Yes","Right Turn",5937017,159]
[10,"MRG","No","No","Rear End",3311384,60]
[7,"MIA","No","No","Other Non-Collision",1869746,48]
[6,"FRA","Yes","Yes","Head On",18621741,139]
[6,"FRA","Yes","Yes","Train",72068,1]
[9,"HIG","No","No","Overturning",7080394,58]
[11,"TUS","Yes","No","Other Non-Collision",11008,1]
[10,"NOB","No","No","Other Object",22016,2]
[6,"MRW","No","No","Left Turn",9282748,195]
[7,"MOT","Yes","No","Pedestrian",11008,1]
[2,"SAN","No","No","Sideswipe - Meeting",33024,3]
[1,"HAN","Yes","No","Other Non-Collision",3417389,58]
[2,"HEN","Yes","No","Angle",5594856,129]
[9,"ROS","Yes","No","Sideswipe - Passing",160132,9]
[7,"AUG","Yes","No","Animal",308224,28]
[2,"FUL","Yes","Yes","Animal",66048,6]
[4,"ATB","No","Yes","Backing",55040,5]
[3,"CRA","No","No","Sideswipe - Meeting",744813,14]
[7,"AUG","No","No","Parked Vehicle",369112,19]
[8,"WAR","Yes","Yes","Head On",727613,9]
[9,"ADA","No","No","Right Turn",1081073,39]
[8,"PRE","No","Yes","Pedestrian",144136,2]
[2,"HEN","No","No","Animal",13751678,1097]
[10,"MEG","No","Yes","Rear End",11008,1]
[4,"STA","Yes","No","Pedalcycles",83076,2]
[2,"OTT","Yes","Yes","Angle",11008,1]
[6,"DEL","Yes","Yes","Overturning",1242634,9]
[11,"COL","Yes","No","Sideswipe - Meeting",94084,3]
[7,"MOT","Yes","No","Backing",1339073,59]
[7,"LOG","Yes","No","Right Turn",22016,2]
[6,"MAR","Yes","No","Overturning",2641616,19]
[7,"MIA","Yes","Yes","Unknown",143104,13]
[1,"PUT","Yes","No","Angle",3493532,66]
[1,"HAR","No","No","Other Non-Collision",1473405,58]
[4,"POR","Yes","No","Head On",6002245,47]
[4,"POR","Yes","No","Train",11008,1]
[11,"COL","Yes","No","Left Turn",2568582,70]
[1,"ALL","Yes","No","Overturning",4122192,51]
[10,"ATH","No","No","Right Turn",668392,24]
[7,"MOT","No","No","Head On",3248313,26]
[6,"MRW","No","Yes","Head On",1624527,8]
[4,"STA","Yes","No","Parked Vehicle",2640134,109]
[5,"LIC","Yes","Yes","Pedestrian",72068,1]
[4,"MAH","No","No","Parked Vehicle",892733,24]
[5,"LIC","Yes","No","Left Turn",710585,13]
[3,"CRA","Yes","Yes","Rear End",1131522,10]
[1,"VAN","Yes","No","Overturning",1413602,10]
[10,"WAS","No","Yes","Animal",952708,81]
[7,"AUG","Yes","Yes","Left Turn",22016,2]
[10,"ATH","No","No","Parked Vehicle",1164149,41]
[2,"WIL","No","Yes","Head On",11008,1]
[7,"MOT","Yes","Yes","Overturning",11445609,89]
[7,"AUG","Yes","Yes","Head On",72068,1]
[4,"ATB","Yes","Yes","Parked Vehicle",22016,2]
[2,"LUC","Yes","No","Parked Vehicle",1631301,80]
[5,"KNO","Yes","No","Left Turn",4665831,131]
[7,"CLA","Yes","No","Pedestrian",97696,2]
[3,"MED","No","Yes","Backing",66048,6]
[4,"TRU","Yes","No","Sideswipe - Meeting",70864,3]
[2,"WIL","Yes","No","Fixed Object",3379443,85]
[2,"FUL","No","No","Pedestrian",3020929,13]
[2,"SEN","Yes","No","Right Turn",987624,58]
[9,"HIG","Yes","No","Animal",11008,1]
[2,"HEN","Yes","Yes","Other Object",11008,1]
[3,"MED","Yes","No","Sideswipe - Passing",121088,11]
[3,"HUR","Yes","No","Sideswipe - Meeting",297044,18]
[6,"FAY","No","No","Parked Vehicle",1512674,19]
[3,"MED","Yes","Yes","Angle",651933,9]
[7,"LOG","Yes","No","Pedestrian",2014107,13]
[8,"GRE","No","No","Pedestrian",1029301,10]
[6,"FAY","Yes","No","Left Turn",5345271,83]
[7,"AUG","No","No","Right Turn",447200,15]
[2,"WOO","Yes","Yes","Sideswipe - Meeting",11008,1]
[3,"MED","No","Yes","Unknown",187136,17]
[4,"ATB","Yes","No","Overturning",921801,10]
[8,"WAR","Yes","No","Rear End",2465673,104]
[9,"LAW","Yes","Yes","Angle",4036708,58]
[4,"STA","No","No","Sideswipe - Meeting",72068,1]
[10,"WAS","Yes","Yes","Sideswipe - Passing",816881,15]
[8,"PRE","Yes","No","Angle",11008,1]
[7,"CLA","Yes","No","Overturning",6461485,47]
[1,"VAN","Yes","No","Fixed Object",5057991,201]
[4,"TRU","Yes","Yes","Sideswipe - Meeting",502809,1]
[2,"SEN","Yes","No","Parked Vehicle",11008,1]
[5,"GUE","Yes","No","Sideswipe - Passing",5120308,218]
[2,"LUC","Yes","Yes","Fixed Object",248196,17]
[1,"WYA","No","No","Other Object",187136,17]
[2,"SAN","Yes","No","Overturning",97696,2]
[6,"PIC","No","Yes","Angle",72068,1]
[9,"LAW","Yes","No","Backing",22016,2]
[4,"STA","Yes","Yes","Angle",3810303,80]
[4,"ATB","Yes","Yes","Backing",11008,1]
[4,"POR","Yes","No","Unknown",11008,1]
[3,"LOR","No","No","Fixed Object",57175888,900]
[2,"SAN","No","No","Pedestrian",2301916,9]
[5,"MUS","No","Yes","Other Object",280016,22]
[8,"PRE","No","No","Right Turn",2060150,41]
[8,"CLI","No","Yes","Left Turn",657953,4]
[7,"MER","No","Yes","Other Object",22016,2]
[4,"ATB","No","Yes","Unknown",224976,17]
[1,"HAN","Yes","No","Backing",280016,22]
[12,"CUY","No","No","Angle",729452,24]
[8,"WAR","Yes","No","Rear End",18920900,797]
[5,"MUS","No","Yes","Angle",131924,3]
[9,"PIK","Yes","No","Sideswipe - Passing",4464869,118]
[3,"CRA","Yes","No","Other Object",66048,6]
[7,"AUG","Yes","No","Angle",3538265,128]
[3,"ERI","Yes","No","Other Non-Collision",44032,4]
[3,"RIC","Yes","No","Sideswipe - Passing",21525311,1023]
[4,"SUM","Yes","No","Sideswipe - Passing",629917,7]
[8,"CLI","No","Yes","Parked Vehicle",640925,8]
[2,"SAN","Yes","Yes","Rear End",821869,21]
[11,"BEL","No","No","Backing",2192709,131]
[3,"MED","No","No","Other Object",143104,13]
[2,"SEN","Yes","No","Parked Vehicle",3497501,165]
[3,"ERI","Yes","No","Fixed Object",202788,6]
[10,"MOE","No","No","Animal",1457581,60]
[8,"GRE","No","No","Rear End",11626261,312]
[3,"CRA","Yes","No","Angle",7351889,198]
[11,"TUS","Yes","Yes","Pedalcycles",48848,1]
[2,"FUL","Yes","No","Angle",1238916,42]
[10,"HOC","No","No","Overturning",8473819,81]
[5,"LIC","No","No","Pedalcycles",789877,7]
[9,"HIG","Yes","No","Other Object",11008,1]
[2,"WOO","Yes","Yes","Rear End",16312679,549]
[10,"MOE","Yes","No","Left Turn",1099702,5]
[3,"CRA","Yes","No","Sideswipe - Meeting",579865,8]
[4,"ATB","No","No","Other Object",165120,15]
[5,"LIC","Yes","No","Head On",655545,8]
[5,"LIC","Yes","No","Train",11008,1]
[8,"GRE","No","No","Fixed Object",50837713,998]
[1,"DEF","No","No","Overturning",7114450,50]
[6,"FAY","Yes","No","Fixed Object",6470270,153]
[6,"DEL","No","Yes","Head On",81872,4]
[11,"CAR","No","No","Other Object",186964,8]
[7,"SHE","Yes","No","Unknown",154112,14]
[10,"MEG","No","Yes","Fixed Object",11008,1]
[10,"HOC","No","Yes","Sideswipe - Passing",1787874,44]
[8,"WAR","Yes","No","Fixed Object",50301800,1280]
[5,"COS","Yes","No","Rear End",22016,2]
[5,"COS","No","No","Fixed Object",40285791,630]
[7,"MOT","No","No","Sideswipe - Meeting",116100,5]
[7,"AUG","Yes","No","Pedalcycles",192984,3]
[10,"GAL","Yes","No","Fixed Object",1017261,20]
[9,"LAW","Yes","No","Unknown",11008,1]
[11,"JEF","No","Yes","Sideswipe - Passing",215172,14]
[3,"ASD","Yes","Yes","Other Non-Collision",99072,9]
[6,"UNI","No","Yes","Head On",1519435,4]
[6,"FRA","Yes","Yes","Rear End",1666680,60]
[3,"RIC","Yes","Yes","Other Non-Collision",1150336,72]
[4,"POR","Yes","No","Unknown",11008,1]
[2,"FUL","Yes","No","Parked Vehicle",590304,28]
[4,"TRU","No","Yes","Rear End",882188,31]
[10,"MEG","No","No","Other Non-Collision",1225606,13]
[1,"ALL","Yes","No","Unknown",66048,6]
[6,"MAD","Yes","No","Sideswipe - Meeting",121088,11]
[6,"FAY","No","Yes","Rear End",8572163,207]
[6,"FAY","Yes","No","Rear End",8262867,328]
[6,"PIC","No","Yes","Other Object",77056,7]
[11,"BEL","Yes","No","Sideswipe - Passing",127108,6]
[8,"BUT","No","No","Animal",9307013,486]
[1,"DEF","Yes","No","Pedalcycles",2798718,32]
[4,"MAH","No","No","Fixed Object",49991579,1006]
[2,"SAN","Yes","Yes","Fixed Object",2667191,66]
[8,"GRE","No","No","Sideswipe - Meeting",535833,4]
[4,"SUM","Yes","Yes","Backing",479364,38]
[4,"ATB","Yes","Yes","Other Non-Collision",535833,4]
[8,"CLE","Yes","Yes","Angle",1180833,19]
[11,"BEL","No","Yes","Fixed Object",6803381,187]
[3,"WAY","No","Yes","Pedestrian",502809,1]
[3,"LOR","No","No","Left Turn",11689597,226]
[1,"HAR","Yes","No","Sideswipe - Passing",77056,7]
[3,"MED","Yes","Yes","Sideswipe - Passing",48848,1]
[0,"WOO","No","No","Animal",72068,1]
[6,"FRA","Yes","No","Parked Vehicle",8787586,543]
[3,"WAY","Yes","Yes","Other Non-Collision",116100,5]
[12,"CUY","No","No","Other Object",72068,1]
[1,"ALL","Yes","No","Fixed Object",48547943,1127]
[3,"LOR","Yes","No","Angle",116340092,2691]
[10,"HOC","Yes","No","Other Non-Collision",11008,1]
[8,"WAR","Yes","No","Sideswipe - Meeting",11008,1]
[11,"COL","Yes","No","Angle",14485219,361]
[7,"LOG","Yes","No","Other Object",44032,4]
[5,"FAI","No","Yes","Parked Vehicle",524825,3]
[7,"MIA","Yes","Yes","Angle",618909,6]
[10,"VIN","No","No","Rear End",3766840,57]
[4,"MAH","No","Yes","Left Turn",237016,7]
[4,"ATB","Yes","No","Other Object",11008,1]
[7,"CHP","No","No","Other Non-Collision",2394174,79]
[8,"CLE","No","No","Other Object",259204,18]
[8,"WAR","Yes","Yes","Fixed Object",11678245,347]
[10,"ATH","No","Yes","Fixed Object",1105325,28]
[12,"CUY","Yes","Yes","Sideswipe - Passing",1201248,56]
[7,"LOG","No","Yes","Overturning",83076,2]
[4,"STA","Yes","Yes","Fixed Object",887745,18]
[5,"FAI","Yes","No","Pedestrian",4612432,18]
[9,"JAC","No","Yes","Sideswipe - Passing",77056,7]
[7,"SHE","No","Yes","Angle",502809,1]
[3,"CRA","Yes","Yes","Head On",502809,1]
[6,"PIC","Yes","No","Sideswipe - Passing",1171770,6]
[5,"GUE","No","No","Pedalcycles",502809,1]
[5,"FAI","Yes","Yes","Head On",48848,1]
[12,"GEA","No","No","Other Object",286036,17]
[7,"AUG","No","Yes","Rear End",2460738,47]
[4,"STA","Yes","No","Angle",207263449,5699]
[1,"WYA","Yes","No","Rear End",4779060,122]
[1,"HAR","Yes","No","Other Non-Collision",821869,21]
[4,"SUM","Yes","No","Other Object",3030865,158]
[4,"STA","No","No","Rear End",20189321,584]
[1,"HAN","Yes","Yes","Parked Vehicle",44032,4]
[4,"SUM","Yes","Yes","Other Non-Collision",1789713,64]
[8,"CLE","No","No","Angle",33133752,502]
[12,"LAK","No","Yes","Right Turn",11008,1]
[5,"FAI","Yes","No","Head On",10744431,117]
[10,"VIN","No","No","Left Turn",1331796,42]
[3,"CRA","Yes","No","Backing",33024,3]
[11,"JEF","Yes","No","Head On",59856,2]
[5,"PER","Yes","No","Angle",11008,1]
[4,"STA","Yes","Yes","Rear End",706973,14]
[1,"WYA","Yes","No","Left Turn",2616451,31]
[10,"GAL","Yes","Yes","Overturning",896173,9]
[6,"FAY","Yes","No","Angle",11008,1]
[6,"PIC","Yes","No","Other Non-Collision",2430572,31]
[6,"DEL","Yes","No","Backing",5118892,414]
[2,"WOO","No","No","Head On",5063416,41]
[2,"WOO","No","No","Train",131924,3]
[4,"STA","Yes","No","Animal",77056,7]
[7,"MOT","Yes","Yes","Parked Vehicle",3553851,76]
[6,"FAY","No","Yes","Fixed Object",7259009,203]
[1,"VAN","Yes","No","Parked Vehicle",1964981,100]
[7,"SHE","Yes","No","Animal",3391152,279]
[5,"PER","No","No","Angle",15228577,230]
[7,"MOT","Yes","No","Backing",23059868,1736]
[8,"WAR","Yes","No","Left Turn",639152,29]
[2,"FUL","No","No","Rear End",14362239,321]
[4,"SUM","No","No","Fixed Object",13123072,207]
[7,"MOT","Yes","No","Rear End",1503452,84]
[4,"MAH","Yes","No","Animal",44032,4]
[12,"CUY","Yes","Yes","Head On",16843790,168]
[2,"WOO","Yes","Yes","Left Turn",182148,11]
[10,"MOE","Yes","No","Fixed Object",876737,17]
[10,"VIN","No","No","Fixed Object",31116721,501]
[7,"AUG","Yes","Yes","Other Object",44032,4]
[10,"HOC","Yes","No","Backing",1490777,77]
[3,"ASD","No","Yes","Sideswipe - Passing",6719842,172]
[7,"MIA","No","No","Sideswipe - Passing",2828765,128]
[2,"WOO","Yes","Yes","Fixed Object",15848663,474]
[4,"TRU","No","Yes","Fixed Object",4114174,119]
[9,"ROS","Yes","No","Animal",3060793,194]
[3,"ASD","Yes","No","Parked Vehicle",22016,2]
[6,"DEL","No","No","Sideswipe - Meeting",77056,7]
[4,"MAH","No","Yes","Head On",1513878,17]
[5,"FAI","Yes","No","Right Turn",226180,15]
[10,"HOC","Yes","No","Pedestrian",48848,1]
[4,"SUM","No","No","Parked Vehicle",629917,7]
[3,"ERI","No","Yes","Sideswipe - Passing",10011869,358]
[11,"JEF","Yes","No","Overturning",83076,2]
[6,"FRA","No","No","Parked Vehicle",273824,18]
[2,"OTT","Yes","No","Pedalcycles",730021,5]
[5,"COS","Yes","No","Animal",963716,82]
[4,"POR","Yes","Yes","Parked Vehicle",179568,6]
[11,"JEF","Yes","Yes","Other Object",411940,25]
[10,"HOC","Yes","No","Unknown",33024,3]
[11,"BEL","No","Yes","Overturning",990257,12]
[9,"HIG","Yes","No","Sideswipe - Passing",1092888,71]
[10,"ATH","No","Yes","Rear End",259032,9]
[3,"MED","No","Yes","Other Non-Collision",758004,53]
[7,"CLA","No","No","Fixed Object",34958037,645]
[3,"WAY","Yes","No","Sideswipe - Passing",11008,1]
[1,"HAN","No","No","Animal",24718729,1783]
[12,"LAK","Yes","Yes","Parked Vehicle",3019156,34]
[2,"HEN","No","Yes","Rear End",1023281,15]
[5,"GUE","No","No","Right Turn",232200,10]
[8,"CLE","Yes","Yes","Other Object",511184,43]
[8,"BUT","Yes","Yes","Other Object",1884260,140]
[4,"ATB","No","No","Angle",33712744,428]
[4,"SUM","Yes","No","Other Non-Collision",22016,2]
[2,"FUL","Yes","No","Animal",33024,3]
[6,"DEL","No","No","Pedestrian",2038531,11]

{"sheet":"Import","index":8,"n_rows":63,"n_cols":75,"rows_kept":63,"cut":false,"hidden":true,"merged":[[0,0,0,1]]}
["Application ID:",null,{"$f":"IF('Safety Application'!A115=\"\",\"Not Assigned\",'Safety Application'!A115)","v":"202503D08-01"}]
[]
[]
["General Application Data"]
["https://extranet.dot.state.oh.us/divisions/Planning/plan/HSIP_applications/Lists/AppData/ImportView.aspx"]
["Title","Cycle","AppID","District","CountyCd","Sponsor","Project Name","PID","ProjectManager","PM_Phone","PM_Email","Applicant_Name","Applicant_Title","Applicant_Phone","ApplicationDt","RouteNbr","RouteName","Blog","Elog","FolderPath"]
[{"$f":"C7","v":"202503D08-01"},{"$f":"LEFT(C7,6)","v":"202503"},{"$f":"C1","v":"202503D08-01"},{"$f":"'Safety Application'!C10","v":8},{"$f":"LEFT('Safety Application'!H10,3)","v":"WAR"},{"$f":"IF('Safety Application'!D2=\"\",\"\",'Safety Application'!D2)","v":"ODOT"},{"$f":"IF('Safety Application'!D3=\"\",\"\",'Safety Application'!D3)","v":"WAR US 22 19.24 (Clarksville Rd)"},{"$f":"IF('Safety Application'!D4=\"\",\"\",'Safety Application'!D4)","v":"TBD"},{"$f":"IF('Safety Application'!D5=\"\",\"\",'Safety Application'!D5)","v":"Tom Mazza"},{"$f":"IF('Safety Application'!D6=\"\",\"\",'Safety Application'!D6)","v":"513-933-6591"},{"$f":"IF('Safety Application'!D7=\"\",\"\",'Safety Application'!D7)","v":"Thomas.Mazza@dot.ohio.gov"},{"$f":"IF('Safety Application'!A106=\"\",\"\",'Safety Application'!A106)","v":"Tom Mazza"},{"$f":"IF('Safety Application'!F106=\"\",\"\",'Safety Application'!F106)","v":"Traffic Studies Engineer"},{"$f":"'Safety Application'!I106","v":"513-933-6591"},{"$f":"IF('Safety Application'!I108=\"\",\"\",MONTH('Safety Application'!I108)&\"/\"&DAY('Safety Application'!I108)&\"/\"&YEAR('Safety Application'!I108))","v":"3/31/2025"},{"$f":"'Safety Application'!C11","v":"US-22"},{"$f":"'Safety Application'!H11","v":"US-22"},{"$f":"'Safety Application'!C12","v":19.239999999999998},{"$f":"'Safety Application'!H12","v":19.239999999999998},{"$f":"IF(LEFT('Safety Application'!A117,1)=\"\\\",'Safety Application'!A117,\"\\\\itcfs007.dot.state.oh.us\\odrive\"&MID('Safety Application'!A117,FIND(\"\\\",'Safety Application'!A117,1),100))","v":"\\\\itcfs007.dot.state.oh.us\\odrive\\Planning\\TED\\SAFETY\\D08\\SAFETY APPLICATIONS\\202503 Applications\\Formal\\202503D08-01 (CLI US-22 @ Cl"}]
[]
[]
["Project Priority"]
["https://extranet.dot.state.oh.us/divisions/Planning/plan/HSIP_applications/Lists/PriorityInfo/ImportView.aspx"]
["AppID","PriorityText"]
[{"$f":"C1","v":"202503D08-01"},{"$f":"IF('Safety Application'!A22=\"\",\"\",'Safety Application'!A22)","v":"Per the 2024 HSIP priority list, the US 22/Clarksville Rd intersection is ranked as rural intersection #105.  This intersection does not appear on the current SIP map."}]
[]
[]
["Application Summary of Crash Patterns and Recommended Countermeasures"]
["https://extranet.dot.state.oh.us/divisions/Planning/plan/HSIP_applications/Lists/CrashPatterns/ImportView.aspx"]
["AppID","SummaryText","RecCountermeasure"]
[{"$f":"A13","v":"202503D08-01"},{"$f":"'Safety Application'!A18","v":"From 2022-2024, there were 22 total crashes at the US 22/Clarksville Rd intersection (WAR US 22 19.24).  There were 7 crashes in 2022, 6 crashes in 2023, and 9 crashes in 2024.  There were 0 fatal crashes, 2 serious injury crashes, 13 minor injury crashes, 4 possible injury crashes, and 3 property damage only crashes.  The fatal and injury crash rate was 86.4%.  \n\nEvery crash at the US 22/Clarksville Rd intersection was an angle crash.  Crashes occurred most often in dry (86%) and daylight (77%) conditions.  The majority of crashes occurred between 2-7 PM.  Running the stop sign is NOT a major contributing factor with only 14% of crashes resulting from running a stop sign.  The most common angle crash was WB/NB with 10 occurrences.  There were 15 angle crashes involving westbound vehicles on US 22.\n\nHistorically, there have been 2-3 angle crashes at the US 22/Clarksville Rd intersection each year from 2015-2020.  However, the past 4 years have seen a significant increase in the number of angle crashes.  There have been at least 5 angle crashes each year from 2021-2024, with a peak of 9 angle crashes in 2024.  A long-term solution is needed to eliminate the potential for high severity angle crashes.\n\n"},{"$f":"'Safety Application'!A20","v":"StreetLight Data was used to create an estimated AADT and turning movement count at the intersection.  This data was used to complete a signal warrant analysis utilizing ODOT’s Traffic Signal Warrant Spreadsheet.  Based on this analysis, a traffic signal is not warranted at the US 22/Clarksville Rd intersection.  ODOT District 8 will not pursue a new traffic signal at this location because a traffic signal is not warranted and a new traffic signal is predicted to increase the number of overall crashes.\n\nAll-way stop control is not being considered at this intersection.  The 85th percentile speeds on US 22 are near 60 mph and the nearest stopped conditions on US 22 are over 8 miles away in either direction (Nelson Ave to the north and SR 123 to the south).   \n\nBased on the historical crash data and past countermeasures, the recommended countermeasure at this time is to construct a single lane modern roundabout at US 22/Clarksville Rd.  If funding is awarded to this project, a new traffic count will need to be collected.  Then, proper traffic analysis would be completed to confirm a traffic signal is unwarranted and a single lane modern roundabout would operate sufficiently in the design year."}]
[]
[]
["Application Crash Data"]
["https://extranet.dot.state.oh.us/divisions/Planning/plan/HSIP_applications/Lists/CrashData/ImportView.aspx"]
["AppID","Pred_Ex_KA","Pred_Ex_B","Pred_Ex_C","Pred_Ex_O","Exp_Ex_KA","Exp_Ex_B","Exp_Ex_C","Exp_Ex_O","PSI_KA","PSI_B","PSI_C","PSI_O","Prop_Type","Prop_KA","Prop_B","Prop_C","Prop_O","Obs_KA","Obs_B","Obs_C","Obs_O","Obs_People_K","Obs_People_A","Obs_People_B","Obs_People_C"]
[{"$f":"A19","v":"202503D08-01"},{"$f":"'Safety Application'!F26","v":9.4299999999999995E-2},{"$f":"'Safety Application'!G26","v":0.2288},{"$f":"'Safety Application'!H26","v":0.15229999999999999},{"$f":"'Safety Application'!I26","v":0.81850000000000001},{"$f":"'Safety Application'!F27","v":0.2135},{"$f":"'Safety Application'!G27","v":0.51729999999999998},{"$f":"'Safety Application'!H27","v":0.34449999999999997},{"$f":"'Safety Application'!I27","v":0.84830000000000005},{"$f":"'Safety Application'!F28","v":0.1192},{"$f":"'Safety Application'!G28","v":0.28849999999999998},{"$f":"'Safety Application'!H28","v":0.19219999999999998},{"$f":"'Safety Application'!I28","v":2.9800000000000049E-2},{"$f":"IF(ScoringCalculations!$AB$1=\"ECAT - Change in base SPF\",\"Predicted\",\"Expected\")","v":"Predicted"},{"$f":"'Safety Application'!F29","v":2.0999999999999999E-3},{"$f":"'Safety Application'!G29","v":1.84E-2},{"$f":"'Safety Application'!H29","v":2.3E-2},{"$f":"'Safety Application'!I29","v":0.59279999999999999},{"$f":"'Safety Application'!F30","v":0.66669999999999996},{"$f":"'Safety Application'!G30","v":4.3333000000000004},{"$f":"'Safety Application'!H30","v":1.3332999999999999},{"$f":"'Safety Application'!I30","v":1},{"$f":"'Safety Application'!F33","v":0},{"$f":"'Safety Application'!G33","v":1},{"$f":"'Safety Application'!H33","v":7.6666999999999996},{"$f":"'Safety Application'!I33","v":4.6666999999999996}]
[]
[]
["Application Scoring"]
["https://extranet.dot.state.oh.us/divisions/Planning/plan/HSIP_applications/Lists/AppScoring/ImportView.aspx"]
["AppID","Expected_Value","Expected_Points","ObservedFSI_Value","ObservedFSI_Points","PercPSI_Value","PercPSI_Points","RSI_Value","RSI_Points","EPDO_Value","EPDO_Points","VCRatio_Value","VCRatio_Points","BCRatio_Value","BCRatio_Points","FundRequest_Value","FundRequest_Points","LocEquity_Value","LocEquity_Points","BCRatio_Safety_Value","NetBenefit","NetPV_Project","NetPV_Safety"]
[{"$f":"A25","v":"202503D08-01"},null,null,{"$f":"'Safety Application'!H37","v":0.14000000000000001},{"$f":"'Safety Application'!I37","v":28},{"$f":"'Safety Application'!H38","v":0.3281},{"$f":"'Safety Application'!I38","v":20},{"$f":"'Safety Application'!H39","v":54875.839999999997},{"$f":"'Safety Application'!I39","v":20},{"$f":"'Safety Application'!H40","v":8.08},{"$f":"'Safety Application'!I40","v":20},null,null,{"$f":"'Safety Application'!I93","v":0.35},null,null,null,{"$f":"'Safety Application'!H41","v":0.03},{"$f":"'Safety Application'!I41","v":0},{"$f":"'Safety Application'!I94","v":0.31},{"$f":"'Safety Application'!I92","v":-1753686.75},{"$f":"'Safety Application'!E92","v":2714862},{"$f":"'Safety Application'!E93","v":961175.25}]
[]
[]
["Strategic Highway Safety Plan"]
["https://extranet.dot.state.oh.us/divisions/Planning/plan/HSIP_applications/Lists/SHSP/ImportView.aspx"]
["AppID","Functional Class","MajAADT","OhioEmpArea","OhioEmpSub","FHWAEmpArea","FHWA_ImprovCat","FHWA_ImprovSubCat"]
[{"$f":"A31","v":"202503D08-01"},{"$f":"'Safety Application'!D48","v":"5 - Major Collector Roadway"},{"$f":"'Safety Application'!D49","v":2200},{"$f":"'Safety Application'!E54","v":"Serious Crash Types"},{"$f":"'Safety Application'!E55","v":"Intersection"},{"$f":"'Safety Application'!E56","v":"Improving the design and operation of highway intersections"},{"$f":"'Safety Application'!E57","v":"Intersection traffic control"},{"$f":"'Safety Application'!E58","v":"Modify control - two-way stop to roundabout"}]
[]
[]
["Application Work Locations"]
["https://extranet.dot.state.oh.us/divisions/Planning/plan/HSIP_applications/Lists/WorkLocations/ImportView.aspx"]
["RouteID","AppID","Location ID","NLFID","Begin Logpoint","End Logpoint","startLatitude","startLongitude","endLatitude","endLongitude","Termini"]
[{"$f":"IF(D43=\"\",\"\",MID(D43,5,2)&\"-\"&IFERROR(MID(D43,7,5)*1,MID(D43,7,5))&IF(LEFT(D43,1)=\"S\",IF(RIGHT(D43,2)=\"*C\",\"\",MID(D43,13,1)),IF(RIGHT(D43,3)=\"**C\",\"\",MID(D43,12,1))))","v":"US-22"},{"$f":"IF(C43=\"\",\"\",$A$37)","v":"202503D08-01"},{"$f":"IF(D43=\"\",\"\",1)","v":1},{"$f":"IF('Safety Application'!A62=0,\"\",'Safety Application'!A62)","v":"SWARUS00022**C"},{"$f":"IF(D43=\"\",\"\",'Safety Application'!C62)","v":19.239999999999998},{"$f":"IF(D43=\"\",\"\",'Safety Application'!D62)","v":19.239999999999998},{"$f":"IF(D43=\"\",\"\",'Safety Application'!E62)","v":39.417250000000003},{"$f":"IF(D43=\"\",\"\",'Safety Application'!F62)","v":-83.998694439999994},{"$f":"IF(D43=\"\",\"\",'Safety Application'!AA62)","v":0},{"$f":"IF(D43=\"\",\"\",'Safety Application'!AB62)","v":0},{"$f":"IF(D43=\"\",\"\",'Safety Application'!G62)","v":"US 22 and Clarksville Rd"}]
[{"$f":"IF(D44=\"\",\"\",MID(D44,5,2)&\"-\"&IFERROR(MID(D44,7,5)*1,MID(D44,7,5))&IF(LEFT(D44,1)=\"S\",IF(RIGHT(D44,2)=\"*C\",\"\",MID(D44,13,1)),IF(RIGHT(D44,3)=\"**C\",\"\",MID(D44,12,1))))","v":""},{"$f":"IF(C44=\"\",\"\",$A$37)","v":""},{"$f":"IF(D44=\"\",\"\",C43+1)","v":""},{"$f":"IF('Safety Application'!A63=0,\"\",'Safety Application'!A63)","v":""},{"$f":"IF(D44=\"\",\"\",'Safety Application'!C63)","v":""},{"$f":"IF(D44=\"\",\"\",'Safety Application'!D63)","v":""},{"$f":"IF(D44=\"\",\"\",'Safety Application'!E63)","v":""},{"$f":"IF(D44=\"\",\"\",'Safety Application'!F63)","v":""},null,null,{"$f":"IF(D44=\"\",\"\",'Safety Application'!G63)","v":""}]
["","",{"$f":"IF(D45=\"\",\"\",C44+1)","v":""},{"$f":"IF('Safety Application'!A64=0,\"\",'Safety Application'!A64)","v":""},{"$f":"IF(D45=\"\",\"\",'Safety Application'!C64)","v":""},{"$f":"IF(D45=\"\",\"\",'Safety Application'!D64)","v":""},{"$f":"IF(D45=\"\",\"\",'Safety Application'!E64)","v":""},{"$f":"IF(D45=\"\",\"\",'Safety Application'!F64)","v":""},null,null,{"$f":"IF(D45=\"\",\"\",'Safety Application'!G64)","v":""}]
["","","",{"$f":"IF('Safety Application'!A65=0,\"\",'Safety Application'!A65)","v":""},{"$f":"IF(D46=\"\",\"\",'Safety Application'!C65)","v":""},{"$f":"IF(D46=\"\",\"\",'Safety Application'!D65)","v":""},{"$f":"IF(D46=\"\",\"\",'Safety Application'!E65)","v":""},{"$f":"IF(D46=\"\",\"\",'Safety Application'!F65)","v":""},null,null,{"$f":"IF(D46=\"\",\"\",'Safety Application'!G65)","v":""}]
["","","",{"$f":"IF('Safety Application'!A66=0,\"\",'Safety Application'!A66)","v":""},{"$f":"IF(D47=\"\",\"\",'Safety Application'!C66)","v":""},{"$f":"IF(D47=\"\",\"\",'Safety Application'!D66)","v":""},{"$f":"IF(D47=\"\",\"\",'Safety Application'!E66)","v":""},{"$f":"IF(D47=\"\",\"\",'Safety Application'!F66)","v":""},null,null,{"$f":"IF(D47=\"\",\"\",'Safety Application'!G66)","v":""}]
["","","",{"$f":"IF('Safety Application'!A67=0,\"\",'Safety Application'!A67)","v":""},{"$f":"IF(D48=\"\",\"\",'Safety Application'!C67)","v":""},{"$f":"IF(D48=\"\",\"\",'Safety Application'!D67)","v":""},{"$f":"IF(D48=\"\",\"\",'Safety Application'!E67)","v":""},{"$f":"IF(D48=\"\",\"\",'Safety Application'!F67)","v":""},null,null,{"$f":"IF(D48=\"\",\"\",'Safety Application'!G67)","v":""}]
["","","",{"$f":"IF('Safety Application'!A68=0,\"\",'Safety Application'!A68)","v":""},{"$f":"IF(D49=\"\",\"\",'Safety Application'!C68)","v":""},{"$f":"IF(D49=\"\",\"\",'Safety Application'!D68)","v":""},{"$f":"IF(D49=\"\",\"\",'Safety Application'!E68)","v":""},{"$f":"IF(D49=\"\",\"\",'Safety Application'!F68)","v":""},null,null,{"$f":"IF(D49=\"\",\"\",'Safety Application'!G68)","v":""}]
["","","",{"$f":"IF('Safety Application'!A69=0,\"\",'Safety Application'!A69)","v":""},{"$f":"IF(D50=\"\",\"\",'Safety Application'!C69)","v":""},{"$f":"IF(D50=\"\",\"\",'Safety Application'!D69)","v":""},{"$f":"IF(D50=\"\",\"\",'Safety Application'!E69)","v":""},{"$f":"IF(D50=\"\",\"\",'Safety Application'!F69)","v":""},null,null,{"$f":"IF(D50=\"\",\"\",'Safety Application'!G69)","v":""}]
["","","",{"$f":"IF('Safety Application'!A70=0,\"\",'Safety Application'!A70)","v":""},{"$f":"IF(D51=\"\",\"\",'Safety Application'!C70)","v":""},{"$f":"IF(D51=\"\",\"\",'Safety Application'!D70)","v":""},{"$f":"IF(D51=\"\",\"\",'Safety Application'!E70)","v":""},{"$f":"IF(D51=\"\",\"\",'Safety Application'!F70)","v":""},null,null,{"$f":"IF(D51=\"\",\"\",'Safety Application'!G70)","v":""}]
["","","",{"$f":"IF('Safety Application'!A71=0,\"\",'Safety Application'!A71)","v":""},{"$f":"IF(D52=\"\",\"\",'Safety Application'!C71)","v":""},{"$f":"IF(D52=\"\",\"\",'Safety Application'!D71)","v":""},{"$f":"IF(D52=\"\",\"\",'Safety Application'!E71)","v":""},{"$f":"IF(D52=\"\",\"\",'Safety Application'!F71)","v":""},null,null,{"$f":"IF(D52=\"\",\"\",'Safety Application'!G71)","v":""}]
[]
["Project Funding"]
["https://extranet.dot.state.oh.us/divisions/Planning/plan/HSIP_applications/Lists/Funding/ImportView.aspx"]
["AppID","FY_SafetyStudy","FY_IMS","FY_PE_Enviro","FY_PE_Design","FY_ROW","FY_Const","NewSafety_AMT_SafetyStudy","NewSafety_AMT_IMS","NewSafety_AMT_PE_Enviro","NewSafety_AMT_PE_Design","NewSafety_AMT_ROW","NewSafety_AMT_Const","PrevSafety_AMT_SafetyStudy","PrevSafety_AMT_IMS","PrevSafety_AMT_PE_Enviro","PrevSafety_AMT_PE_Design","PrevSafety_AMT_ROW","PrevSafety_AMT_Const","Sponsor_AMT_SafetyStudy","Sponsor_AMT_IMS","Sponsor_AMT_PE_Enviro","Sponsor_AMT_PE_Design","Sponsor_AMT_ROW","Sponsor_AMT_Const","Alt1_Source","Alt1_AMT_SafetyStudy","Alt1_AMT_IMS","Alt1_AMT_PE_Enviro","Alt1_AMT_PE_Design","Alt1_AMT_ROW","Alt1_AMT_Const","Alt2_Source","Alt2_AMT_SafetyStudy","Alt2_AMT_IMS","Alt2_AMT_PE_Enviro","Alt2_AMT_PE_Design","Alt2_AMT_ROW","Alt2_AMT_Const","Alt3_Source","Alt3_AMT_SafetyStudy","Alt3_AMT_IMS","Alt3_AMT_PE_Enviro","Alt3_AMT_PE_Design","Alt3_AMT_ROW","Alt3_AMT_Const","Alt4_Source","Alt4_AMT_SafetyStudy","Alt4_AMT_IMS","Alt4_AMT_PE_Enviro","Alt4_AMT_PE_Design","Alt4_AMT_ROW","Alt4_AMT_Const","Alt5_Source","Alt5_AMT_SafetyStudy","Alt5_AMT_IMS","Alt5_AMT_PE_Enviro","Alt5_AMT_PE_Design","Alt5_AMT_ROW","Alt5_AMT_Const","Alt6_Source","Alt6_AMT_SafetyStudy","Alt6_AMT_IMS","Alt6_AMT_PE_Enviro","Alt6_AMT_PE_Design","Alt6_AMT_ROW","Alt6_AMT_Const","Alt7_Source","Alt7_AMT_SafetyStudy","Alt7_AMT_IMS","Alt7_AMT_PE_Enviro","Alt7_AMT_PE_Design","Alt7_AMT_ROW","Alt7_AMT_Const","AddtlDetails"]
[{"$f":"A37","v":"202503D08-01"},{"$f":"IF('Safety Application'!D75=0,\"\",'Safety Application'!D75)","v":""},{"$f":"IF('Safety Application'!E75=0,\"\",'Safety Application'!E75)","v":""},{"$f":"IF('Safety Application'!F75=0,\"\",'Safety Application'!F75)","v":2026},{"$f":"IF('Safety Application'!G75=0,\"\",'Safety Application'!G75)","v":2028},{"$f":"IF('Safety Application'!H75=0,\"\",'Safety Application'!H75)","v":2028},{"$f":"IF('Safety Application'!I75=0,\"\",'Safety Application'!I75)","v":2029},{"$f":"IF('Safety Application'!D78=0,\"\",'Safety Application'!D78)","v":""},{"$f":"IF('Safety Application'!E78=0,\"\",'Safety Application'!E78)","v":""},{"$f":"IF('Safety Application'!F78=0,\"\",'Safety Application'!F78)","v":400000},{"$f":"IF('Safety Application'!G78=0,\"\",'Safety Application'!G78)","v":125000},{"$f":"IF('Safety Application'!H78=0,\"\",'Safety Application'!H78)","v":200000},{"$f":"IF('Safety Application'!I78=0,\"\",'Safety Application'!I78)","v":2373862},{"$f":"IF('Safety Application'!D77=0,\"\",'Safety Application'!D77)","v":""},{"$f":"IF('Safety Application'!E77=0,\"\",'Safety Application'!E77)","v":""},{"$f":"IF('Safety Application'!F77=0,\"\",'Safety Application'!F77)","v":""},{"$f":"IF('Safety Application'!G77=0,\"\",'Safety Application'!G77)","v":""},{"$f":"IF('Safety Application'!H77=0,\"\",'Safety Application'!H77)","v":""},{"$f":"IF('Safety Application'!I77=0,\"\",'Safety Application'!I77)","v":""},{"$f":"IF('Safety Application'!D79=0,\"\",'Safety Application'!D79)","v":""},{"$f":"IF('Safety Application'!E79=0,\"\",'Safety Application'!E79)","v":""},{"$f":"IF('Safety Application'!F79=0,\"\",'Safety Application'!F79)","v":""},{"$f":"IF('Safety Application'!G79=0,\"\",'Safety Application'!G79)","v":""},{"$f":"IF('Safety Application'!H79=0,\"\",'Safety Application'!H79)","v":""},{"$f":"IF('Safety Application'!I79=0,\"\",'Safety Application'!I79)","v":""},{"$f":"IF('Safety Application'!A80=0,\"\",'Safety Application'!A80)","v":""},{"$f":"IF('Safety Application'!D80=0,\"\",'Safety Application'!D80)","v":""},{"$f":"IF('Safety Application'!E80=0,\"\",'Safety Application'!E80)","v":""},{"$f":"IF('Safety Application'!F80=0,\"\",'Safety Application'!F80)","v":""},{"$f":"IF('Safety Application'!G80=0,\"\",'Safety Application'!G80)","v":""},{"$f":"IF('Safety Application'!H80=0,\"\",'Safety Application'!H80)","v":""},{"$f":"IF('Safety Application'!I80=0,\"\",'Safety Application'!I80)","v":""},{"$f":"IF('Safety Application'!A81=0,\"\",'Safety Application'!A81)","v":""},{"$f":"IF('Safety Application'!D81=0,\"\",'Safety Application'!D81)","v":""},{"$f":"IF('Safety Application'!E81=0,\"\",'Safety Application'!E81)","v":""},{"$f":"IF('Safety Application'!F81=0,\"\",'Safety Application'!F81)","v":""},{"$f":"IF('Safety Application'!G81=0,\"\",'Safety Application'!G81)","v":""},{"$f":"IF('Safety Application'!H81=0,\"\",'Safety Application'!H81)","v":""},{"$f":"IF('Safety Application'!I81=0,\"\",'Safety Application'!I81)","v":""},{"$f":"IF('Safety Application'!A82=0,\"\",'Safety Application'!A82)","v":""},{"$f":"IF('Safety Application'!D82=0,\"\",'Safety Application'!D82)","v":""},{"$f":"IF('Safety Application'!E82=0,\"\",'Safety Application'!E82)","v":""},{"$f":"IF('Safety Application'!F82=0,\"\",'Safety Application'!F82)","v":""},{"$f":"IF('Safety Application'!G82=0,\"\",'Safety Application'!G82)","v":""},{"$f":"IF('Safety Application'!H82=0,\"\",'Safety Application'!H82)","v":""},{"$f":"IF('Safety Application'!I82=0,\"\",'Safety Application'!I82)","v":""},{"$f":"IF('Safety Application'!A83=0,\"\",'Safety Application'!A83)","v":""},{"$f":"IF('Safety Application'!D83=0,\"\",'Safety Application'!D83)","v":""},{"$f":"IF('Safety Application'!E83=0,\"\",'Safety Application'!E83)","v":""},{"$f":"IF('Safety Application'!F83=0,\"\",'Safety Application'!F83)","v":""},{"$f":"IF('Safety Application'!G83=0,\"\",'Safety Application'!G83)","v":""},{"$f":"IF('Safety Application'!H83=0,\"\",'Safety Application'!H83)","v":""},{"$f":"IF('Safety Application'!I83=0,\"\",'Safety Application'!I83)","v":""},{"$f":"IF('Safety Application'!A84=0,\"\",'Safety Application'!A84)","v":""},{"$f":"IF('Safety Application'!D84=0,\"\",'Safety Application'!D84)","v":""},{"$f":"IF('Safety Application'!E84=0,\"\",'Safety Application'!E84)","v":""},{"$f":"IF('Safety Application'!F84=0,\"\",'Safety Application'!F84)","v":""},{"$f":"IF('Safety Application'!G84=0,\"\",'Safety Application'!G84)","v":""},{"$f":"IF('Safety Application'!H84=0,\"\",'Safety Application'!H84)","v":""},{"$f":"IF('Safety Application'!I84=0,\"\",'Safety Application'!I84)","v":""},{"$f":"IF('Safety Application'!A85=0,\"\",'Safety Application'!A85)","v":""},{"$f":"IF('Safety Application'!D85=0,\"\",'Safety Application'!D85)","v":""},{"$f":"IF('Safety Application'!E85=0,\"\",'Safety Application'!E85)","v":""},{"$f":"IF('Safety Application'!F85=0,\"\",'Safety Application'!F85)","v":""},{"$f":"IF('Safety Application'!G85=0,\"\",'Safety Application'!G85)","v":""},{"$f":"IF('Safety Application'!H85=0,\"\",'Safety Application'!H85)","v":""},{"$f":"IF('Safety Application'!I85=0,\"\",'Safety Application'!I85)","v":""},{"$f":"IF('Safety Application'!A86=0,\"\",'Safety Application'!A86)","v":""},{"$f":"IF('Safety Application'!D86=0,\"\",'Safety Application'!D86)","v":""},{"$f":"IF('Safety Application'!E86=0,\"\",'Safety Application'!E86)","v":""},{"$f":"IF('Safety Application'!F86=0,\"\",'Safety Application'!F86)","v":""},{"$f":"IF('Safety Application'!G86=0,\"\",'Safety Application'!G86)","v":""},{"$f":"IF('Safety Application'!H86=0,\"\",'Safety Application'!H86)","v":""},{"$f":"IF('Safety Application'!I86=0,\"\",'Safety Application'!I86)","v":""},{"$f":"IF('Safety Application'!A89=0,\"\",'Safety Application'!A89)","v":"District requesting funding be combined with the CLI US 22 RAB application (202503D08-02). Design and construction for both roundabouts to be completed as 1 project. Design consultant to be selected through the January 2026 programmatic. "}]
[]
[]
["Project Development"]
["https://extranet.dot.state.oh.us/divisions/Planning/plan/HSIP_applications/Lists/ProjectDevelopment/ImportView.aspx"]
["AppID","SafetyStudy_CompBy","SafetyStudy_CompDt","IMS_CompBy","IMS__CompDt","PE_Enviro_CompBy","PE_Enviro_CompDt","PE_Design_CompBy","PE_Design_CompDt","ROW_CompBy","ROW_CompDt"]
[{"$f":"A57","v":"202503D08-01"},{"$f":"IF('Safety Application'!E98=0,\"\",'Safety Application'!E98)","v":""},{"$f":"IF('Safety Application'!H98=\"\",\"\",MONTH('Safety Application'!H98)&\"/\"&DAY('Safety Application'!H98)&\"/\"&YEAR('Safety Application'!H98))","v":""},{"$f":"IF('Safety Application'!E99=0,\"\",'Safety Application'!E99)","v":""},{"$f":"IF('Safety Application'!H99=\"\",\"\",MONTH('Safety Application'!H99)&\"/\"&DAY('Safety Application'!H99)&\"/\"&YEAR('Safety Application'!H99))","v":""},{"$f":"IF('Safety Application'!E100=0,\"\",'Safety Application'!E100)","v":""},{"$f":"IF('Safety Application'!H100=\"\",\"\",MONTH('Safety Application'!H100)&\"/\"&DAY('Safety Application'!H100)&\"/\"&YEAR('Safety Application'!H100))","v":""},{"$f":"IF('Safety Application'!E101=0,\"\",'Safety Application'!E101)","v":""},{"$f":"IF('Safety Application'!H101=\"\",\"\",MONTH('Safety Application'!H101)&\"/\"&DAY('Safety Application'!H101)&\"/\"&YEAR('Safety Application'!H101))","v":""},{"$f":"IF('Safety Application'!E102=0,\"\",'Safety Application'!E102)","v":""},{"$f":"IF('Safety Application'!H102=\"\",\"\",MONTH('Safety Application'!H102)&\"/\"&DAY('Safety Application'!H102)&\"/\"&YEAR('Safety Application'!H102))","v":""}]