{"text_format":"1","workbook":"xlsx","n_sheets":9,"sheets":["Instructions","Safety Application","DSRTSignature","Project Scoring","ScoringCalculations","ScoringTable","RefTables","RSI_Data","Import"],"not_rendered":{"charts":0,"images":6,"macros":1,"external_links":0,"defined_names":38,"comments":1,"pivot_tables":0},"unopened":[],"bounds":{"document_bytes":16777216,"sheet_cells":100000,"rows_first":2000,"rows_last":500,"rows_between":2000,"halvings":0,"cell_chars":16384,"cell_head_chars":4096},"cells_cut":0,"cells_raw":0,"read":"whole","date_system":"1900"}

{"sheet":"Instructions","index":0,"n_rows":16,"n_cols":12,"rows_kept":16,"cut":false,"hidden":false,"merged":[[0,0,0,8],[1,0,1,8],[2,0,2,8],[5,0,5,8],[6,0,6,8],[7,0,7,8],[16,0,16,8],[3,0,3,8],[4,0,4,8],[8,0,8,8],[9,0,9,8],[11,0,11,8],[12,0,12,8],[14,0,14,8],[15,0,15,8],[13,0,13,8]]}
["Highway Safety Improvement Program",null,null,null,null,null,null,null,null,null,"Version",{"$f":"'Safety Application'!J110","v":20210621}]
["Formal Funding Application"]
["Scoring Tool Instructions"]
[]
["The instructions can be used to understand the functionality of the tool.  The tool attempts to complete as many fields as possible form information entered in the Economic Crash Analysis Tool (ECAT).  "]
[]
["The worksheets have been protected because the tool is standardized to import into the ODOT Central Office Database. Once submitted, the complete data layouts will be imported into the current database.  At this point, the district will be able to make any changes desired prior to the HSIP Program Committee Review."]
[]
[]
["I recommend starting a new application by importing data from existing ECAT Tool(s).  The import functionality will obtain information from (1) an ECAT Tool that does not have a fundamental change in Safety Performance Function (SPF) ('No' response in Cell \"K14\" on the Project Information Worksheet) or (2) an ECAT Tool that has have a fundamental change in Safety Performance Function (SPF) ('Yes' response in Cell \"K14\" on the Project Information Worksheet).  Follow the coded prompts.  Two files will be required for Item (2).  The order of import is does not matter.  Following the import process, please verify the data as assumptions have been made.  For example, it was assumed that only one route (major route) was used in the Project Element Description Table when determining project limits (All NLFIDs match in Column F).\n\nNote:  If you choose to import a new dataset, any previous information will be overridden."]
[]
[]
["At times, it will be necessary to change the font size of cells to make the text visible.  Once the tool is activated, select the cells you desire to decrease / increase the font size (selection can be contiguous or noncontiguous cells).  Once the cells have been selected, select the desired functionality."]
[]
[]
["This tool can be used to add rows of details for either work locations of funding sources.  Submitters can add up to a total of 10 work locations.  Similarly, there are a ten (10) total funding sources possible (including the three already defined).  For funding sources, we are asking that each source be individually itemized."]

{"sheet":"Safety Application","index":1,"n_rows":116,"n_cols":28,"rows_kept":116,"cut":false,"hidden":false,"merged":[[103,0,103,9],[91,0,91,3],[92,0,92,3],[91,6,91,7],[81,0,81,2],[96,0,96,3],[97,0,97,3],[98,0,98,3],[99,0,99,3],[90,0,90,9],[97,4,97,6],[97,7,97,9],[98,4,98,6],[98,7,98,9],[95,0,95,9],[91,4,91,5],[92,4,92,5],[91,8,91,9],[92,8,92,9],[92,6,92,7],[93,0,93,3],[93,4,93,5],[93,6,93,7],[93,8,93,9],[110,0,110,9],[105,5,105,7],[104,8,104,9],[105,8,105,9],[104,5,104,7],[85,0,85,2],[107,8,107,9],[106,0,106,7],[107,0,107,7],[106,8,106,9],[101,4,101,6],[101,7,101,9],[100,4,100,6],[100,7,100,9],[104,0,104,4],[105,0,105,4],[100,0,100,3],[101,0,101,3],[96,4,96,6],[96,7,96,9],[99,4,99,6],[99,7,99,9],[87,0,87,9],[88,0,88,9],[41,0,41,6],[42,0,42,6],[43,0,43,6],[72,0,72,9],[53,0,53,3],[54,0,54,3],[55,0,55,3],[56,0,56,3],[62,0,62,1],[63,0,63,1],[64,0,64,1],[65,0,65,1],[66,0,66,1],[46,0,46,9],[67,0,67,1],[68,0,68,1],[69,0,69,1],[70,0,70,1],[61,0,61,1],[59,0,59,9],[60,0,60,1],[44,0,44,7],[49,3,49,5],[50,3,50,5],[38,0,38,6],[39,0,39,6],[40,0,40,6],[17,0,17,9],[18,0,18,9],[19,0,19,9],[20,0,20,9],[21,0,21,9],[30,0,30,9],[23,0,23,9],[22,0,22,9],[32,0,32,3],[34,0,34,9],[35,0,35,6],[36,0,36,6],[37,0,37,6],[24,0,24,4],[25,0,25,4],[26,0,26,4],[27,0,27,4],[29,0,29,4],[28,0,28,4],[16,0,16,9],[15,0,15,9],[1,0,1,2],[9,7,9,9],[10,7,10,9],[8,0,8,9],[9,0,9,1],[10,0,10,1],[11,0,11,1],[9,5,9,6],[10,5,10,6],[11,5,11,6],[11,7,11,9],[9,2,9,4],[10,2,10,4],[11,2,11,4],[13,0,13,1],[12,2,12,4],[13,5,13,6],[12,7,12,9],[12,0,12,1],[12,5,12,6],[13,2,13,4],[13,7,13,9],[0,0,0,9],[6,0,6,2],[1,3,1,9],[2,3,2,9],[3,3,3,9],[4,3,4,9],[5,3,5,9],[6,3,6,9],[4,0,4,2],[5,0,5,2],[2,0,2,2],[3,0,3,2],[68,14,68,15],[69,14,69,15],[70,14,70,15],[62,10,62,11],[62,12,62,13],[63,10,63,11],[63,12,63,13],[64,10,64,11],[64,12,64,13],[65,10,65,11],[65,12,65,13],[66,10,66,11],[68,10,68,11],[68,12,68,13],[69,10,69,11],[69,12,69,13],[70,10,70,11],[70,12,70,13],[61,10,61,11],[61,12,61,13],[61,14,61,15],[62,14,62,15],[63,14,63,15],[64,14,64,15],[65,14,65,15],[66,14,66,15],[67,14,67,15],[66,12,66,13],[67,10,67,11],[67,12,67,13],[116,0,116,9],[114,0,114,2],[73,0,73,2],[76,0,76,2],[53,4,53,9],[54,4,54,9],[55,4,55,9],[56,4,56,9],[57,4,57,9],[69,6,69,9],[70,6,70,9],[74,0,74,2],[75,0,75,2],[73,9,75,9],[60,6,60,9],[61,6,61,9],[62,6,62,9],[63,6,63,9],[64,6,64,9],[65,6,65,9],[66,6,66,9],[67,6,67,9],[68,6,68,9],[83,0,83,2],[79,0,79,2],[84,0,84,2],[77,0,77,2],[78,0,78,2],[82,0,82,2],[80,0,80,2],[52,0,52,9],[47,0,47,2],[48,0,48,2],[50,0,50,2],[47,6,47,8],[48,6,48,8],[49,6,49,8],[49,0,49,2],[50,6,50,8],[47,3,47,5],[48,3,48,5]]}
["General Project Information",null,null,null,null,null,null,null,null,null,null,null,null,null,null,null,null,null,null,null,null,null,null,null,null,"Show Conditional Format:","Yes"]
["Project Sponsoring Agency",null,null,"ODOT District 12",null,null,null,null,null,null,null,null,null,null,null,null,null,null,null,null,null,null,null,null,null,"Lat Long Format:","Yes"]
["Project Name",null,null,"CUY-271-9.28 Safety Application",null,null,null,null,null,null,null,null,null,null,null,null,null,null,null,null,null,null,null,null,null,"Priority Rank Format:","Yes"]
["PID",null,null,113156]
["Applicant Name",null,null,"Brian Blayney, D12 Traffic Planning Engineer"]
["Contact Phone",null,null,"216-584-2108"]
["Contact Email",null,null,"Brian.Blayney@dot.ohio.gov"]
[]
["Location Information"]
["ODOT District",null,{"$f":"IFERROR(VLOOKUP(H10,RefTables!A:B,2,FALSE),\"\")","v":12},null,null,"County",null,{"$f":"MID(A62,2,3)","v":"CUY"}]
["Route Number",null,{"$f":"IFERROR(MID(A62,5,2)&\"-\"&MID(A62,7,5)*1&IF(LEFT(A62,1)=\"S\",IF(RIGHT(A62,2)=\"*C\",\"R\",MID(A62,13,1)),IF(RIGHT(A62,3)=\"**C\",\"\",MID(A62,12,1))),\"\")","v":"IR-271*"},null,null,"Road Name",null,"Interstate Route 271"]
["Begin Logpoint",null,{"$f":"IF(C62=\"\",\"\",C62)","v":9.36},null,null,"End Logpoint",null,{"$f":"IF(D62=\"\",\"\",D62)","v":11.29}]
["Begin Latitude",null,41.470931,null,null,"Begin Longitude",null,-81.488960000000006]
["End Latitude",null,41.503459999999997,null,null,"End Longitude",null,-81.476894000000001]
[]
["Project Description"]
["Summary of Crash Patterns"]
["A total of 296 crashes were found to occur in the northbound direction during the years 2017, 2018 and 2019, including 6 serious injury crashes and 103 total injury crashes (approximately 35% of the total).  285 of the crashes (96%l) were either rear-end, sideswipe - passing or fixed object crashes and these crash types include all 6 serious injury crashes. The rear-end crashes are mainly occurring in the area of the Cedar Road / Brainard Road exit ramp from I-271 NB.  These rear-ends are occurring due to the back up occurring during the peak hours at the I-271 NB / Cedar Road / Brainard Road ramp intersection.  The queue from this signal extends onto the I-271 NB mainline and causes rear-end crashes to occur on the ramp and freeway mainline.  A previous improvement project at the ramp terminal intersection did improve operations, but not significantly enough to eliminate the traffic queue.  The next step to attempt to mitigate this crash pattern would be to provide more storage spacing for exiting traffic to prevent motorists from queuing onto the I-271 mainline.  \n\nThe sideswipe - passing crashes appear to be occurring for two reasons.  The first is due to the typical lane changes that occur along a busy freeway segment.  The second reason appears to be due to the ramps between the I-271 NB Local and Express lanes.  Traffic in the express lanes that wish to exit onto Cedar Road / Brainard Road have approximately 3,000 feet to make the 3 necessary lanes changes to exit.  These lane changes can be difficult, especially during the peak hours.  This section is essentially one large weave section with traffic entering the local lanes on the left side, making three lane changes and exiting onto Cedar Road / Brainard Road on the right side.  While this is occurring, other traffic is also moving into the left lane to position themselves to be able to enter the express lanes via a ramp that exists north of the Cedar Road / Brainard Road interchange.  The most cost effective strategy to mitigate these sideswipe - passing crashes would be to find a way to increase the weaving distance between the two ramps discussed above.  "]
["Summary of Recommended Countermeasures"]
["The improvement plan that is being investigated would be to switch the location of the express lane ramps that exist today. Additionally, a ramp exists approximately 7,800 feet south of the interchange that allows traffic to enter the express lanes from the local lanes.  Reversing these ramps would provide I-271 NB traffic an additional 3,000’ to make the required 3 lane changes to exit I-271. Additionally, this change would increase the distance for I-271 NB traffic entering from Chagrin Boulevard to make the lane changes to access the express lanes.\n\nThe improvement plan that is being investigated is to lengthen the exit ramp and provide a second lane for traffic to exit I-271 NB.  This configuration would create one exit lane with approximately 3,600 feet of storage before the ramp split and a second with approximately 2,000 feet of storage for a combined total of nearly 5,600 feet, which is quadruple the distance provided today.  This improvement project would significantly reduce the likelihood and frequency of I-271 NB traffic queueing onto the I-271 mainline, which is frequently occurring and creates operational and safety issues along the interstate. There are two possible geometric concerns with this proposed improvement plan which was  investigated to ensure this improvement is feasible.  The first is the need to add a fifth travel lane under the Cedar Road bridge over I-271.  The geometric evaluation of the existing bridge found that five (5) 12’ travel lanes can fit under the existing bridge with 18’ of shoulder-width.  To achieve this width underneath the bridge, a concrete d-wall integral to the bridge piers would need to be constructed as part of the improvement project.  The proposed geometric layout of the improvement proposes to provide a 10’ inside shoulder width and an 8’ outside shoulder width. "]
["Project Priority Information"]
["The following segment rankings were found on I-271 within the safety improvement area according to the 2018 HSIP Safety Priority Rankings:\n\n- Urban Freeway Segments #12, #62, #350, #458, #833 and #1173\n- Urban Ramp Segments #98 and #359"]
["Crash Data"]
["Crash Totals"]
["(average per year)",null,null,null,null,"Fatal & Serious Injury  (KA)","Visible Injury (B)","Non-Visible (C)","Property Damage Only (O)","Total"]
["Existing Conditions: Predicted Crash Frequency",null,null,null,null,{"$f":"IF(ScoringCalculations!D43=0,\"\",ScoringCalculations!D43)","v":1.946},{"$f":"IF(ScoringCalculations!E43=0,\"\",ScoringCalculations!E43)","v":6.6798000000000002},{"$f":"IF(ScoringCalculations!F43=0,\"\",ScoringCalculations!F43)","v":9.0298999999999996},{"$f":"IF(ScoringCalculations!G43=0,\"\",ScoringCalculations!G43)","v":48.850199999999994},{"$f":"ROUND(SUM(F26:I26),2)","v":66.510000000000005}]
["Existing Conditions: Expected Crash Frequency",null,null,null,null,{"$f":"IF(ScoringCalculations!D44=0,\"\",ScoringCalculations!D44)","v":2.1027},{"$f":"IF(ScoringCalculations!E44=0,\"\",ScoringCalculations!E44)","v":7.2898000000000005},{"$f":"IF(ScoringCalculations!F44=0,\"\",ScoringCalculations!F44)","v":10.046100000000001},{"$f":"IF(ScoringCalculations!G44=0,\"\",ScoringCalculations!G44)","v":55.385999999999989},{"$f":"ROUND(SUM(F27:I27),2)","v":74.819999999999993}]
["Potential for Safety Improvement",null,null,null,null,{"$f":"IF(ScoringCalculations!D45=0,\"\",ScoringCalculations!D45)","v":0.15670000000000006},{"$f":"IF(ScoringCalculations!E45=0,\"\",ScoringCalculations!E45)","v":0.61000000000000032},{"$f":"IF(ScoringCalculations!F45=0,\"\",ScoringCalculations!F45)","v":1.0162000000000013},{"$f":"IF(ScoringCalculations!G45=0,\"\",ScoringCalculations!G45)","v":6.5357999999999947},8.32]
[{"$f":"\"Proposed Conditions: \"&IF('Project Scoring'!H7=\"ECAT - Change in base SPF\",\"Predicted\",\"Expected\")&\" Crash Frequency\"","v":"Proposed Conditions: Expected Crash Frequency"},null,null,null,null,{"$f":"IF(ScoringCalculations!D46=0,\"\",ScoringCalculations!D46)","v":1.7834999999999999},{"$f":"IF(ScoringCalculations!E46=0,\"\",ScoringCalculations!E46)","v":5.9057000000000013},{"$f":"IF(ScoringCalculations!F46=0,\"\",ScoringCalculations!F46)","v":7.8929000000000009},{"$f":"IF(ScoringCalculations!G46=0,\"\",ScoringCalculations!G46)","v":43.176400000000001},58.76]
["Observed Crashes",null,null,null,null,{"$f":"IF(ScoringCalculations!D47=\"\",\"\",ScoringCalculations!D47)","v":0},{"$f":"IF(ScoringCalculations!E47=\"\",\"\",ScoringCalculations!E47)","v":13},{"$f":"IF(ScoringCalculations!F47=\"\",\"\",ScoringCalculations!F47)","v":19.333300000000001},{"$f":"IF(ScoringCalculations!G47=\"\",\"\",ScoringCalculations!G47)","v":66.333299999999994},98.67]
["Observed People Injury Totals"]
[null,null,null,null,null,"Fatal Injury  (K)","Serious Injury  (A)","Visible Injury (B)","Non-Visible (C)","Total"]
["Observed People Injury Totals",null,null,null,null,{"$f":"IF(ScoringCalculations!D53=\"\",\"\",ScoringCalculations!D53)","v":0},{"$f":"IF(ScoringCalculations!E53=\"\",\"\",ScoringCalculations!E53)","v":2},{"$f":"IF(ScoringCalculations!F53=\"\",\"\",ScoringCalculations!F53)","v":17},{"$f":"IF(ScoringCalculations!G53=\"\",\"\",ScoringCalculations!G53)","v":29.666699999999999},{"$f":"ROUND(SUM(F33:I33),2)","v":48.67}]
[]
["Application Scoring"]
["Category",null,null,null,null,null,null,"Scoring Value","Points Awarded","Points Possible"]
["Ratio of Observed Fatal and Serious Injuries to Observed Total Crashes",null,null,null,null,null,null,{"$f":"IF(J30=0,\"\",ROUND(SUM(F33:G33)/J30,2))","v":0.02},{"$f":"IFERROR(VLOOKUP(H37,ScoringTable!AA:AB,2,TRUE),\"\")","v":4},{"$f":"MAX(ScoringTable!AB:AB)","v":30}]
["Percentage of the Potential for Safety Improvement to Total Expected Crashes",null,null,null,null,null,null,{"$f":"IF(J27=0,\"\",IF(J28<0,0,IFERROR(ROUND(J28/J27,4),0)))","v":0.11119999999999999},{"$f":"IFERROR(VLOOKUP(H38,ScoringTable!AC:AD,2,TRUE),\"\")","v":8},{"$f":"MAX(ScoringTable!AD:AD)","v":20}]
["Relative Severity Index",null,null,null,null,null,null,{"$f":"IF(ScoringCalculations!B36=0,\"\",ScoringCalculations!B36)","v":33528.28},{"$f":"IFERROR(VLOOKUP(H39,ScoringTable!AE:AF,2,TRUE),\"\")","v":12},{"$f":"MAX(ScoringTable!AF:AF)","v":20}]
["Equivalent Property Damage Only Index",null,null,null,null,null,null,{"$f":"IF(J27= 0,IF(J30=0,\"\",ROUND((F30*ScoringCalculations!D48+G30*ScoringCalculations!E48+H30*ScoringCalculations!F48+I30*ScoringCalculations!G48)/J30,2)),ROUND((F30*ScoringCalculations!D48+G30*ScoringCalculations!E48+H30*ScoringCalculations!F48+I30*ScoringCalculations!G48)/J30,2))","v":2.7},{"$f":"IFERROR(VLOOKUP(H40,ScoringTable!AG:AH,2,TRUE),\"\")","v":8},{"$f":"MAX(ScoringTable!AH:AH)","v":20}]
["Location Equity Measure",null,null,null,null,null,null,6.9000000000000006E-2,{"$f":"IF(H41=0,\"\",IFERROR(VLOOKUP(H41,ScoringTable!AI:AJ,2,TRUE),\"\"))","v":0},{"$f":"MAX(ScoringTable!AJ:AJ)","v":10}]
[null,null,null,null,null,null,null,null,{"$f":"IFERROR(VLOOKUP(H42,ScoringTable!AM:AN,2,TRUE),\"\")","v":""}]
[null,null,null,null,null,null,null,null,{"$f":"IFERROR(IF(H43<0,0,VLOOKUP(H43,ScoringTable!AO:AP,2,TRUE)),\"\")","v":""}]
[null,null,null,null,null,null,null,null,{"$f":"IFERROR(VLOOKUP(H44,ScoringTable!AQ:AR,2,TRUE),\"\")","v":""}]
["Total",null,null,null,null,null,null,null,{"$f":"IF(SUM(I37:I44)=0,\"\",SUM(I37:I44))","v":32},{"$f":"SUM(J37:J44)","v":100}]
[]
["Safety Key Metrics"]
["Functional Class",null,null,"1 - Interstates",null,null,"Active Transportation Need",null,null,3]
["Major Route AADT",null,null,128000,null,null,"Active Transportation Demand",null,null,3]
["Maximum Posted Speed Limit",null,null,65,null,null,"Bicycle Level of traffic stress (if available)"]
[null,null,null,null,null,null,"TOAST Score (if available)",null,null,46.5]
[]
["Strategic Highway Safety Plan"]
["Ohio Emphasis Area",null,null,null,"Serious Crash Types"]
["Ohio Emphasis Area Subcategory",null,null,null,"Intersection"]
["FHWA Emphasis Area",null,null,null,"Other"]
["FHWA Improvement Category",null,null,null,"Interchange design"]
["FHWA Improvement Subcategory",null,null,null,"Interchange design - other"]
[]
["Work Locations"]
["NLFID",null,"Begin Logpoint","End \nLogpoint","Begin \nLatitude","Begin Longitude","Location Termini\n(i.e. from Street 1 to Street 2)",null,null,null,null,null,null,null,null,null,null,null,null,null,null,null,null,null,null,null,"EndLatitude","EndLongitude"]
["SCUYIR00271**C\t",null,9.36,11.29,{"$f":"C13","v":41.470931},{"$f":"H13","v":-81.488960000000006},"Approx. 1.5 miles south of Cedar/Brainard to Cedar/Brainard",null,null,null,{"$f":"IF(OR(E62=\"\",F62=\"\"),\"\",HYPERLINK(CONCATENATE(\"http://maps.google.com/maps?q=\",+E62,\",+\",+F62,\"+(Begin Project)&iwloc=A&hl=en\"),\"Google Map\"))","v":"Google Map"},null,{"$f":"IF(OR(E62=\"\",F62=\"\"),\"\",HYPERLINK(CONCATENATE(\"http://bing.com/maps/default.aspx?rtop=1~0&rtp=pos.\",E62,\"_\",F62,\"_\",\"Begin Project\"),\"Bing Maps\"))","v":"Bing Maps"},null,{"$f":"IF(A62=\"\",\"\",IF(OR(MID(A62,5,2)=\"IR\",MID(A62,5,2)=\"SR\",MID(A62,5,2)=\"US\"),IF(RIGHT(A62,1)=\"C\",HYPERLINK(\"http://pathweb.pathwayservices.com/ohiopublic/?nlfid='\"&A62&\"'&logpoint=\"&C62,\"Pathway Images\"),\"Not Available\"),\"Not Available\"))","v":"Not Available"}]
[null,null,null,null,null,null,null,null,null,null,{"$f":"IF(OR(E63=\"\",F63=\"\"),\"\",HYPERLINK(CONCATENATE(\"http://maps.google.com/maps?q=\",+E63,\",+\",+F63,\"+(Begin Project)&iwloc=A&hl=en\"),\"Google Map\"))","v":""},null,{"$f":"IF(OR(E63=\"\",F63=\"\"),\"\",HYPERLINK(CONCATENATE(\"http://bing.com/maps/default.aspx?rtop=1~0&rtp=pos.\",E63,\"_\",F63,\"_\",\"Begin Project\"),\"Bing Maps\"))","v":""},null,""]
[null,null,null,null,null,null,null,null,null,null,"",null,"",null,""]
[null,null,null,null,null,null,null,null,null,null,"",null,"",null,""]
[null,null,null,null,null,null,null,null,null,null,"",null,"",null,""]
[null,null,null,null,null,null,null,null,null,null,"",null,"",null,""]
[null,null,null,null,null,null,null,null,null,null,"",null,"",null,""]
[null,null,null,null,null,null,null,null,null,null,"",null,"",null,""]
[null,null,null,null,null,null,null,null,null,null,"",null,"",null,""]
[null,null,null,null,null,null,null,null,null,null,"",null,"",null,""]
[]
["Project Funding"]
["Project Phase",null,null,"Safety Study","Interchange Mod. Study","PE - Environmental","PE - Detailed Design","Right of Way /Utilities","Construction","Total"]
["Fiscal Year",null,null,2022,2015,2023,2024,null,2025]
["Project Phase Completed",null,null,null,null,null,null,null,"N/A"]
["Previous Safety",null,null,0,0,0,0,0,0,{"$f":"SUM(D77:I77)","v":0}]
["New Safety",null,null,0,0,0,0,0,2300000,{"$f":"SUM(D78:I78)","v":2300000}]
["Sponsor Funding",null,null,0,0,470000,234000,0,{"$f":"3889640-2300000","v":1589640},2293640]
[null,null,null,null,null,null,null,null,null,0]
[null,null,null,null,null,null,null,null,null,0]
[null,null,null,null,null,null,null,null,null,0]
[null,null,null,null,null,null,null,null,null,0]
[null,null,null,null,null,null,null,null,null,0]
[null,null,null,null,null,null,null,null,null,0]
[null,null,null,null,null,null,null,null,null,0]
[null,null,"Total",{"$f":"SUM(D77:D86)","v":0},{"$f":"SUM(E77:E86)","v":0},470000,234000,0,3889640,4593640]
["Additional Funding Detail"]
["ODOT District 12 has been interested in implementing these improvements for over 5 years, as evidenced by the approved IMS from June 22nd, 2015.  ODOT District 12 is requesting construction funding only for this improvement and will use district allocation to cover the approximately $2.3 million in funds not requested from the safety committee.  "]
[]
["Safety Economic Analysis Results"]
["Net Present Value of Project",null,null,null,{"$f":"IF(ScoringCalculations!D58=0,\"\",ScoringCalculations!D58)","v":4206640},null,"Net Benefit",null,{"$f":"IF(ScoringCalculations!D60=0,\"\",ScoringCalculations!D60)","v":-1924279.55}]
["Net Present Value of Safety Benefits",null,null,null,{"$f":"IF(ScoringCalculations!D59=0,\"\",ScoringCalculations!D59)","v":2282360.4500000002},null,"Benefit / \nTotal Project Cost Ratio",null,{"$f":"IF(ScoringCalculations!D61=\"Unable to calculate\",\"\",ROUND(ScoringCalculations!D61,2))","v":0.54}]
[null,null,null,null,null,null,"Benefit / Safety Funding Request Ratio",null,{"$f":"IF(E93=\"\",\"\",IF(J78=0,\"Please complete project funding table\",ROUND(E93/J78,2)))","v":0.99}]
[]
["Project Development"]
["Project Phase",null,null,null,"Completed by",null,null,"Completion Date"]
["Safety Study",null,null,null,"GPD Group",null,null,"2021-08-01"]
["Interchange Modification Study",null,null,null,"Parsons Brinckerhoff",null,null,"2015-06-22"]
["PE-Environmental"]
["PE-Detailed Design"]
["Right of Way / Utilities"]
[]
["Applicant Information"]
["Name",null,null,null,null,"Title",null,null,"Phone Number"]
["John Picuri, P.E.",null,null,null,null,"District 12 Deputy Director",null,null,{"$f":"IF(D6=\"\",\"\",D6)","v":"216-584-2108"}]
["Signature",null,null,null,null,null,null,null,"Date"]
[null,null,null,null,null,null,null,null," "]
[]
[null,null,null,null,null,null,null,null,"Version:",20210621]
["The following information should be included in submission of the safety project application:\n1. An electronic copy of the Safety Engineering Study\n2. All Excel Analysis Files\n      May include Crash Analysis Module (CAM) Tool, Economic Crash Analysis Tool (ECAT), HSIP Application and Scoring Tool.\n3. Benefit-Cost Results (Economic Analysis)\n4. DSRT approval signatures"]
[]
["ODOT Use Only:"]
["Application ID:"]
[]
["Document Library on Odrive:"]

{"sheet":"DSRTSignature","index":2,"n_rows":47,"n_cols":27,"rows_kept":47,"cut":false,"hidden":true,"merged":[[31,0,31,9],[32,0,32,4],[32,5,32,7],[33,0,33,4],[33,5,33,7],[16,0,16,9],[27,0,27,4],[27,5,27,7],[28,0,28,4],[28,5,28,7],[23,5,23,7],[24,0,24,7],[19,0,19,7],[19,8,19,9],[20,0,20,7],[20,8,20,9],[18,0,18,4],[18,5,18,7],[21,0,21,9],[22,0,22,4],[22,5,22,7],[30,0,30,7],[24,8,24,9],[25,0,25,7],[29,8,29,9],[29,0,29,7],[30,8,30,9],[25,8,25,9],[26,0,26,9],[40,0,40,7],[40,8,40,9],[35,0,35,7],[36,0,36,9],[34,0,34,7],[34,8,34,9],[35,8,35,9],[39,8,39,9],[37,0,37,4],[37,5,37,7],[38,0,38,4],[38,5,38,7],[39,0,39,7],[46,0,46,9],[41,0,41,9],[42,0,42,4],[42,5,42,7],[43,0,43,4],[43,5,43,7],[44,0,44,7],[44,8,44,9],[45,0,45,7],[45,8,45,9],[23,0,23,4],[8,0,8,9],[9,0,9,9],[4,0,4,2],[4,3,4,9],[5,0,5,2],[5,3,5,9],[6,0,6,2],[6,3,6,9],[10,0,10,9],[11,0,11,9],[12,0,12,9],[17,0,17,4],[17,5,17,7],[13,0,13,9],[14,0,14,9],[3,0,3,2],[3,3,3,9],[0,0,0,9],[1,0,1,2],[1,3,1,9],[2,0,2,2],[2,3,2,9]]}
["General Project Information",null,null,null,null,null,null,null,null,null,null,null,null,null,null,null,null,null,null,null,null,null,null,null,null,"Show Conditional Format:","Yes"]
["Project Sponsoring Agency",null,null,null,null,null,null,null,null,null,null,null,null,null,null,null,null,null,null,null,null,null,null,null,null,"Lat Long Format:","Yes"]
["Project Name",null,null,"","","","","","","",null,null,null,null,null,null,null,null,null,null,null,null,null,null,null,"Priority Rank Format:","Yes"]
["PID",null,null,"","","","","","",""]
["Project Manager"]
["Contact Phone"]
["Contact Email"]
[]
["Project Description"]
["Summary of Crash Patterns"]
[]
["Summary of Recommended Countermeasures","Summary of Recommended Countermeasures","Summary of Recommended Countermeasures","Summary of Recommended Countermeasures","Summary of Recommended Countermeasures","Summary of Recommended Countermeasures","Summary of Recommended Countermeasures","Summary of Recommended Countermeasures","Summary of Recommended Countermeasures","Summary of Recommended Countermeasures"]
[]
["Project Priority Information","Project Priority Information","Project Priority Information","Project Priority Information","Project Priority Information","Project Priority Information","Project Priority Information","Project Priority Information","Project Priority Information","Project Priority Information"]
[]
[]
["District Safety Review Team Signatures"]
["Name",null,null,null,null,"Title",null,null,"Approve","Disapprove"]
[null,null,null,null,null,"Planning & Engineering Administrator",null,null,"¨","¨"]
["Signature",null,null,null,null,null,null,null,"Date"]
[]
["Comments:"]
["Name",null,null,null,null,"Title",null,null,"Approve","Disapprove"]
[null,null,null,null,null,"Highway Management Adminstrator",null,null,"¨","¨"]
["Signature",null,null,null,null,null,null,null,"Date"]
[]
["Comments:"]
["Name",null,null,null,null,"Title",null,null,"Approve","Disapprove"]
[null,null,null,null,null,"Design Engineer",null,null,"¨","¨"]
["Signature",null,null,null,null,null,null,null,"Date"]
[]
["Comments:"]
["Name",null,null,null,null,"Title",null,null,"Approve","Disapprove"]
[null,null,null,null,null,"Planning Manager",null,null,"¨","¨"]
["Signature",null,null,null,null,null,null,null,"Date"]
[]
["Comments:"]
["Name",null,null,null,null,"Title",null,null,"Approve","Disapprove"]
[null,null,null,null,null,"Traffic Engineer",null,null,"¨","¨"]
["Signature",null,null,null,null,null,null,null,"Date"]
[]
["Comments:"]
["Name",null,null,null,null,"Title",null,null,"Approve","Disapprove"]
[null,null,null,null,null,"Other",null,null,"¨","¨"]
["Signature",null,null,null,null,null,null,null,"Date"]
[]
["Comments:"]

{"sheet":"Project Scoring","index":3,"n_rows":16,"n_cols":9,"rows_kept":16,"cut":false,"hidden":true,"merged":[[8,1,8,6],[15,1,15,7],[12,1,12,6],[13,1,13,6],[10,1,10,6],[9,1,9,6],[11,1,11,6],[0,0,0,9],[1,0,1,9],[2,0,2,1],[2,2,2,4],[2,5,2,6],[2,7,2,9],[3,0,3,1],[3,2,3,4],[3,5,3,6],[3,7,3,9],[4,0,4,1],[4,2,4,4],[4,5,4,6],[4,7,4,9],[5,0,5,1],[5,2,5,4],[5,5,5,6],[5,7,5,9],[6,0,6,1],[6,2,6,4],[6,5,6,6],[6,7,6,9]]}
["Project Scoring Summary"]
["General Project Information"]
["Project Name",null,null,null,null,"Contact Email"]
["Project Description",null,null,null,null,"Contact Phone"]
["Reference Number",null,null,null,null,"Date Performed"]
["Analyst",null,null,null,null,"Analysis Year"]
["Agency/Company",null,null,null,null,"Analysis Type Performed"]
[]
[null,"Category",null,null,null,null,null,"Value","Points Awarded"]
[null,{"$f":"'Safety Application'!A37","v":"Ratio of Observed Fatal and Serious Injuries to Observed Total Crashes"},null,null,null,null,null,{"$f":"IF('Safety Application'!H37=\"\",\"\",'Safety Application'!H37)","v":0.02},{"$f":"IF('Safety Application'!I37=\"\",\"\",'Safety Application'!I37)","v":4}]
[null,{"$f":"'Safety Application'!A38","v":"Percentage of the Potential for Safety Improvement to Total Expected Crashes"},null,null,null,null,null,{"$f":"IF('Safety Application'!H38=\"\",\"\",'Safety Application'!H38)","v":0.11119999999999999},{"$f":"IF('Safety Application'!I38=\"\",\"\",'Safety Application'!I38)","v":8}]
[null,{"$f":"'Safety Application'!A39","v":"Relative Severity Index"},null,null,null,null,null,{"$f":"IF('Safety Application'!H39=\"\",\"\",'Safety Application'!H39)","v":33528.28},{"$f":"IF('Safety Application'!I39=\"\",\"\",'Safety Application'!I39)","v":12}]
[null,{"$f":"'Safety Application'!A40","v":"Equivalent Property Damage Only Index"},null,null,null,null,null,{"$f":"IF('Safety Application'!H40=\"\",\"\",'Safety Application'!H40)","v":2.7},{"$f":"IF('Safety Application'!I40=\"\",\"\",'Safety Application'!I40)","v":8}]
[null,{"$f":"'Safety Application'!A41","v":"Location Equity Measure"},null,null,null,null,null,{"$f":"IF('Safety Application'!H41=\"\",\"\",'Safety Application'!H41)","v":6.9000000000000006E-2},{"$f":"IF('Safety Application'!I41=\"\",\"\",'Safety Application'!I41)","v":0}]
[]
[null,"Safety Application Score",null,null,null,null,null,null,{"$f":"SUM(I10:I14)","v":32}]

{"sheet":"ScoringCalculations","index":4,"n_rows":61,"n_cols":56,"rows_kept":61,"cut":false,"hidden":false,"merged":[[4,0,4,1],[4,2,4,4],[4,5,4,6],[4,7,4,9],[5,0,5,1],[5,2,5,4],[5,5,5,6],[5,7,5,9],[2,0,2,1],[2,2,2,4],[2,5,2,6],[2,7,2,9],[3,0,3,1],[3,2,3,4],[3,5,3,6],[3,7,3,9],[0,0,0,9],[1,0,1,1],[1,2,1,4],[1,5,1,6],[1,7,1,9],[50,26,50,28],[40,26,40,33],[41,26,41,28],[42,26,42,28],[43,26,43,28],[44,26,44,28],[45,26,45,28],[47,26,47,33],[48,26,48,28],[49,26,49,28],[55,0,55,7],[57,3,57,4],[58,3,58,4],[59,3,59,4],[60,3,60,4],[50,0,50,7],[51,0,51,2],[52,0,52,2],[41,0,41,2],[42,0,42,2],[43,0,43,2],[44,0,44,2],[46,0,46,2],[45,0,45,2],[48,0,48,2],[47,0,47,2],[40,0,40,7],[35,1,35,2],[39,0,39,7],[7,0,7,3],[12,0,12,3]]}
["Project Scoring Summary",null,null,null,null,null,null,null,null,null,null,null,null,null,null,null,null,null,null,null,null,null,null,null,null,null,"HSM Analysis Type:","ECAT - Change in base SPF"]
["Project Name",null,"CUY-271 Safety Application",null,null,"Contact Email",null,"cdeibel@gpdgroup.com"]
["Project Description",null,"Interstate Safety Improvement",null,null,"Contact Phone",null,3305722495]
["Reference Number",null,2020089.15,null,null,"Date Performed",null,"2021-07-13"]
["Analyst",null,"Curtis J. Deibel, PE, RSP",null,null,"Analysis Year",null,2021]
["Agency/Company",null,"GPD Group",null,null,"Analysis Type Performed",null,""]
[]
["Relative Severity Index Calculation",null,null,null,null,null,null,null,null,null,null,null,null,null,null,null,null,null,null,null,null,null,null,null,null,null,null,null,null,null,null,null,null,null,"All Sites"]
["ODOT District","STW",null,null,null,null,null,null,null,null,null,null,null,null,null,null,null,null,null,null,null,null,null,null,null,null,"NLFID:",null,null,null,"FindTruck",0,null,null,"HSM Elements Only",null,null,null,null,null,null,null,null,null,null,null,null,null,null,null,null,null,"Crash Costs (2020)"]
["Urban Area","No",null,null,null,null,null,null,null,null,null,null,null,null,null,null,null,null,null,null,null,null,null,null,null,null,"Blog:",null,null,null,"FindVC",0,null,null,"Observed Elements Only",null,null,null,null,null,null,null,null,null,null,null,null,null,null,null,null,null,"KA","B","C","O"]
["Freeway","Yes",null,null,null,null,null,null,null,null,null,null,null,null,null,null,null,null,null,null,null,null,null,null,null,null,"Elog:",null,null,null,null,null,null,null,null,null,null,null,null,null,null,null,null,null,null,null,null,null,null,null,null,null,422724.59664051601,54138.598441999406,47325.157738782807,8080.3483509805219]
[null,null,null,null,null,null,null,null,null,null,null,null,null,null,null,null,null,null,null,null,null,null,null,null,null,null,"WAADT:",null,null,null,null,null,null,null,null,null,null,null,null,null,null,null,null,null,null,null,null,null,null,null,null,null,{"$f":"ROUND(BA11/$BD$11,2)","v":52.32},{"$f":"ROUND(BB11/$BD$11,2)","v":6.7},{"$f":"ROUND(BC11/$BD$11,2)","v":5.86},{"$f":"ROUND(BD11/$BD$11,2)","v":1}]
["Fill in the Number of Crashes by Crash Type",null,null,null,null,null,null,null,null,null,null,null,null,null,null,null,null,null,null,null,null,null,null,null,null,null,"WAADTT:"]
["Crash Type","Number of Crashes","Crash Type Severity Calc","RSI Multiplier",null,null,null,null,null,null,null,null,null,null,null,null,null,null,null,null,null,null,null,null,null,null,"WVCRatio:"]
["Unknown",0.16320000000000001,{"$f":"IF(OR($B$9=\"\",$B$10=\"\",$B$11=\"\"),\"\",B15*D15)","v":1780.1856},{"$f":"IFERROR(ROUND(IF($B$9=\"STW\",SUMIFS(RSI_Data!$F:$F,RSI_Data!$C:$C,$B$10,RSI_Data!$D:$D,$B$11,RSI_Data!$E:$E,$A15)/SUMIFS(RSI_Data!$G:$G,RSI_Data!$C:$C,$B$10,RSI_Data!$D:$D,$B$11,RSI_Data!$E:$E,$A15),SUMIFS(RSI_Data!$F:$F,RSI_Data!$C:$C,$B$10,RSI_Data!$D:$D,$B$11,RSI_Data!$A:$A,$B$9,RSI_Data!$E:$E,$A15)/SUMIFS(RSI_Data!$G:$G,RSI_Data!$C:$C,$B$10,RSI_Data!$D:$D,$B$11,RSI_Data!$A:$A,$B$9,RSI_Data!$E:$E,$A15)),0),0)","v":10908},null,null,null,null,null,null,null,null,null,null,null,null,null,null,null,null,null,null,null,null,null,null,"TotalLength:"]
["Head On",0.13269999999999998,{"$f":"IF(OR($B$9=\"\",$B$10=\"\",$B$11=\"\"),\"\",B16*D16)","v":11901.464899999999},{"$f":"IFERROR(ROUND(IF($B$9=\"STW\",SUMIFS(RSI_Data!$F:$F,RSI_Data!$C:$C,$B$10,RSI_Data!$D:$D,$B$11,RSI_Data!$E:$E,$A16)/SUMIFS(RSI_Data!$G:$G,RSI_Data!$C:$C,$B$10,RSI_Data!$D:$D,$B$11,RSI_Data!$E:$E,$A16),SUMIFS(RSI_Data!$F:$F,RSI_Data!$C:$C,$B$10,RSI_Data!$D:$D,$B$11,RSI_Data!$A:$A,$B$9,RSI_Data!$E:$E,$A16)/SUMIFS(RSI_Data!$G:$G,RSI_Data!$C:$C,$B$10,RSI_Data!$D:$D,$B$11,RSI_Data!$A:$A,$B$9,RSI_Data!$E:$E,$A16)),0),0)","v":89687},null,null,null,null,null,null,null,null,null,null,null,null,null,null,null,null,null,null,null,null,null,null,"Functional Class:",null,{"$f":"IFERROR(VLOOKUP(AB16,RefTables!E27:F34,2,FALSE),\"Other\")","v":"Other"}]
["Rear End",36.445599999999999,1428339.5096,{"$f":"IFERROR(ROUND(IF($B$9=\"STW\",SUMIFS(RSI_Data!$F:$F,RSI_Data!$C:$C,$B$10,RSI_Data!$D:$D,$B$11,RSI_Data!$E:$E,$A17)/SUMIFS(RSI_Data!$G:$G,RSI_Data!$C:$C,$B$10,RSI_Data!$D:$D,$B$11,RSI_Data!$E:$E,$A17),SUMIFS(RSI_Data!$F:$F,RSI_Data!$C:$C,$B$10,RSI_Data!$D:$D,$B$11,RSI_Data!$A:$A,$B$9,RSI_Data!$E:$E,$A17)/SUMIFS(RSI_Data!$G:$G,RSI_Data!$C:$C,$B$10,RSI_Data!$D:$D,$B$11,RSI_Data!$A:$A,$B$9,RSI_Data!$E:$E,$A17)),0),0)","v":39191},null,null,null,null,null,null,null,null,null,null,null,null,null,null,null,null,null,null,null,null,null,null,"Truck %:",{"$f":"IFERROR(ROUND(AB13/AB12,4),\"\")","v":""}]
["Backing",0.54520000000000002,6208.1923999999999,{"$f":"IFERROR(ROUND(IF($B$9=\"STW\",SUMIFS(RSI_Data!$F:$F,RSI_Data!$C:$C,$B$10,RSI_Data!$D:$D,$B$11,RSI_Data!$E:$E,$A18)/SUMIFS(RSI_Data!$G:$G,RSI_Data!$C:$C,$B$10,RSI_Data!$D:$D,$B$11,RSI_Data!$E:$E,$A18),SUMIFS(RSI_Data!$F:$F,RSI_Data!$C:$C,$B$10,RSI_Data!$D:$D,$B$11,RSI_Data!$A:$A,$B$9,RSI_Data!$E:$E,$A18)/SUMIFS(RSI_Data!$G:$G,RSI_Data!$C:$C,$B$10,RSI_Data!$D:$D,$B$11,RSI_Data!$A:$A,$B$9,RSI_Data!$E:$E,$A18)),0),0)","v":11387}]
["Sideswipe - Meeting",0.57769999999999999,179006.6997,{"$f":"IFERROR(ROUND(IF($B$9=\"STW\",SUMIFS(RSI_Data!$F:$F,RSI_Data!$C:$C,$B$10,RSI_Data!$D:$D,$B$11,RSI_Data!$E:$E,$A19)/SUMIFS(RSI_Data!$G:$G,RSI_Data!$C:$C,$B$10,RSI_Data!$D:$D,$B$11,RSI_Data!$E:$E,$A19),SUMIFS(RSI_Data!$F:$F,RSI_Data!$C:$C,$B$10,RSI_Data!$D:$D,$B$11,RSI_Data!$A:$A,$B$9,RSI_Data!$E:$E,$A19)/SUMIFS(RSI_Data!$G:$G,RSI_Data!$C:$C,$B$10,RSI_Data!$D:$D,$B$11,RSI_Data!$A:$A,$B$9,RSI_Data!$E:$E,$A19)),0),0)","v":309861}]
["Sideswipe - Passing",22.367499999999996,493024.43499999994,{"$f":"IFERROR(ROUND(IF($B$9=\"STW\",SUMIFS(RSI_Data!$F:$F,RSI_Data!$C:$C,$B$10,RSI_Data!$D:$D,$B$11,RSI_Data!$E:$E,$A20)/SUMIFS(RSI_Data!$G:$G,RSI_Data!$C:$C,$B$10,RSI_Data!$D:$D,$B$11,RSI_Data!$E:$E,$A20),SUMIFS(RSI_Data!$F:$F,RSI_Data!$C:$C,$B$10,RSI_Data!$D:$D,$B$11,RSI_Data!$A:$A,$B$9,RSI_Data!$E:$E,$A20)/SUMIFS(RSI_Data!$G:$G,RSI_Data!$C:$C,$B$10,RSI_Data!$D:$D,$B$11,RSI_Data!$A:$A,$B$9,RSI_Data!$E:$E,$A20)),0),0)","v":22042}]
["Angle",2.0807000000000002,123955.62180000001,{"$f":"IFERROR(ROUND(IF($B$9=\"STW\",SUMIFS(RSI_Data!$F:$F,RSI_Data!$C:$C,$B$10,RSI_Data!$D:$D,$B$11,RSI_Data!$E:$E,$A21)/SUMIFS(RSI_Data!$G:$G,RSI_Data!$C:$C,$B$10,RSI_Data!$D:$D,$B$11,RSI_Data!$E:$E,$A21),SUMIFS(RSI_Data!$F:$F,RSI_Data!$C:$C,$B$10,RSI_Data!$D:$D,$B$11,RSI_Data!$A:$A,$B$9,RSI_Data!$E:$E,$A21)/SUMIFS(RSI_Data!$G:$G,RSI_Data!$C:$C,$B$10,RSI_Data!$D:$D,$B$11,RSI_Data!$A:$A,$B$9,RSI_Data!$E:$E,$A21)),0),0)","v":59574}]
["Parked Vehicle",0.56259999999999999,14572.465200000001,{"$f":"IFERROR(ROUND(IF($B$9=\"STW\",SUMIFS(RSI_Data!$F:$F,RSI_Data!$C:$C,$B$10,RSI_Data!$D:$D,$B$11,RSI_Data!$E:$E,$A22)/SUMIFS(RSI_Data!$G:$G,RSI_Data!$C:$C,$B$10,RSI_Data!$D:$D,$B$11,RSI_Data!$E:$E,$A22),SUMIFS(RSI_Data!$F:$F,RSI_Data!$C:$C,$B$10,RSI_Data!$D:$D,$B$11,RSI_Data!$A:$A,$B$9,RSI_Data!$E:$E,$A22)/SUMIFS(RSI_Data!$G:$G,RSI_Data!$C:$C,$B$10,RSI_Data!$D:$D,$B$11,RSI_Data!$A:$A,$B$9,RSI_Data!$E:$E,$A22)),0),0)","v":25902}]
["Pedestrian",8.8200000000000001E-2,21843.0828,{"$f":"IFERROR(ROUND(IF($B$9=\"STW\",SUMIFS(RSI_Data!$F:$F,RSI_Data!$C:$C,$B$10,RSI_Data!$D:$D,$B$11,RSI_Data!$E:$E,$A23)/SUMIFS(RSI_Data!$G:$G,RSI_Data!$C:$C,$B$10,RSI_Data!$D:$D,$B$11,RSI_Data!$E:$E,$A23),SUMIFS(RSI_Data!$F:$F,RSI_Data!$C:$C,$B$10,RSI_Data!$D:$D,$B$11,RSI_Data!$A:$A,$B$9,RSI_Data!$E:$E,$A23)/SUMIFS(RSI_Data!$G:$G,RSI_Data!$C:$C,$B$10,RSI_Data!$D:$D,$B$11,RSI_Data!$A:$A,$B$9,RSI_Data!$E:$E,$A23)),0),0)","v":247654}]
["Animal",5.225200000000001,63266.721600000012,{"$f":"IFERROR(ROUND(IF($B$9=\"STW\",SUMIFS(RSI_Data!$F:$F,RSI_Data!$C:$C,$B$10,RSI_Data!$D:$D,$B$11,RSI_Data!$E:$E,$A24)/SUMIFS(RSI_Data!$G:$G,RSI_Data!$C:$C,$B$10,RSI_Data!$D:$D,$B$11,RSI_Data!$E:$E,$A24),SUMIFS(RSI_Data!$F:$F,RSI_Data!$C:$C,$B$10,RSI_Data!$D:$D,$B$11,RSI_Data!$A:$A,$B$9,RSI_Data!$E:$E,$A24)/SUMIFS(RSI_Data!$G:$G,RSI_Data!$C:$C,$B$10,RSI_Data!$D:$D,$B$11,RSI_Data!$A:$A,$B$9,RSI_Data!$E:$E,$A24)),0),0)","v":12108}]
["Train",0,0,{"$f":"IFERROR(ROUND(IF($B$9=\"STW\",SUMIFS(RSI_Data!$F:$F,RSI_Data!$C:$C,$B$10,RSI_Data!$D:$D,$B$11,RSI_Data!$E:$E,$A25)/SUMIFS(RSI_Data!$G:$G,RSI_Data!$C:$C,$B$10,RSI_Data!$D:$D,$B$11,RSI_Data!$E:$E,$A25),SUMIFS(RSI_Data!$F:$F,RSI_Data!$C:$C,$B$10,RSI_Data!$D:$D,$B$11,RSI_Data!$A:$A,$B$9,RSI_Data!$E:$E,$A25)/SUMIFS(RSI_Data!$G:$G,RSI_Data!$C:$C,$B$10,RSI_Data!$D:$D,$B$11,RSI_Data!$A:$A,$B$9,RSI_Data!$E:$E,$A25)),0),0)","v":0}]
["Pedalcycles",8.0100000000000005E-2,1433.0691000000002,{"$f":"IFERROR(ROUND(IF($B$9=\"STW\",SUMIFS(RSI_Data!$F:$F,RSI_Data!$C:$C,$B$10,RSI_Data!$D:$D,$B$11,RSI_Data!$E:$E,$A26)/SUMIFS(RSI_Data!$G:$G,RSI_Data!$C:$C,$B$10,RSI_Data!$D:$D,$B$11,RSI_Data!$E:$E,$A26),SUMIFS(RSI_Data!$F:$F,RSI_Data!$C:$C,$B$10,RSI_Data!$D:$D,$B$11,RSI_Data!$A:$A,$B$9,RSI_Data!$E:$E,$A26)/SUMIFS(RSI_Data!$G:$G,RSI_Data!$C:$C,$B$10,RSI_Data!$D:$D,$B$11,RSI_Data!$A:$A,$B$9,RSI_Data!$E:$E,$A26)),0),0)","v":17891}]
["Other Non-Vehicle",0,0,{"$f":"IFERROR(ROUND(IF($B$9=\"STW\",SUMIFS(RSI_Data!$F:$F,RSI_Data!$C:$C,$B$10,RSI_Data!$D:$D,$B$11,RSI_Data!$E:$E,$A27)/SUMIFS(RSI_Data!$G:$G,RSI_Data!$C:$C,$B$10,RSI_Data!$D:$D,$B$11,RSI_Data!$E:$E,$A27),SUMIFS(RSI_Data!$F:$F,RSI_Data!$C:$C,$B$10,RSI_Data!$D:$D,$B$11,RSI_Data!$A:$A,$B$9,RSI_Data!$E:$E,$A27)/SUMIFS(RSI_Data!$G:$G,RSI_Data!$C:$C,$B$10,RSI_Data!$D:$D,$B$11,RSI_Data!$A:$A,$B$9,RSI_Data!$E:$E,$A27)),0),0)","v":0}]
["Fixed Object",8.1473999999999993,247526.15939999997,{"$f":"IFERROR(ROUND(IF($B$9=\"STW\",SUMIFS(RSI_Data!$F:$F,RSI_Data!$C:$C,$B$10,RSI_Data!$D:$D,$B$11,RSI_Data!$E:$E,$A28)/SUMIFS(RSI_Data!$G:$G,RSI_Data!$C:$C,$B$10,RSI_Data!$D:$D,$B$11,RSI_Data!$E:$E,$A28),SUMIFS(RSI_Data!$F:$F,RSI_Data!$C:$C,$B$10,RSI_Data!$D:$D,$B$11,RSI_Data!$A:$A,$B$9,RSI_Data!$E:$E,$A28)/SUMIFS(RSI_Data!$G:$G,RSI_Data!$C:$C,$B$10,RSI_Data!$D:$D,$B$11,RSI_Data!$A:$A,$B$9,RSI_Data!$E:$E,$A28)),0),0)","v":30381}]
["Other Object",1.0254000000000001,10480.6134,{"$f":"IFERROR(ROUND(IF($B$9=\"STW\",SUMIFS(RSI_Data!$F:$F,RSI_Data!$C:$C,$B$10,RSI_Data!$D:$D,$B$11,RSI_Data!$E:$E,$A29)/SUMIFS(RSI_Data!$G:$G,RSI_Data!$C:$C,$B$10,RSI_Data!$D:$D,$B$11,RSI_Data!$E:$E,$A29),SUMIFS(RSI_Data!$F:$F,RSI_Data!$C:$C,$B$10,RSI_Data!$D:$D,$B$11,RSI_Data!$A:$A,$B$9,RSI_Data!$E:$E,$A29)/SUMIFS(RSI_Data!$G:$G,RSI_Data!$C:$C,$B$10,RSI_Data!$D:$D,$B$11,RSI_Data!$A:$A,$B$9,RSI_Data!$E:$E,$A29)),0),0)","v":10221}]
["Overturning",0.40360000000000001,32932.145600000003,{"$f":"IFERROR(ROUND(IF($B$9=\"STW\",SUMIFS(RSI_Data!$F:$F,RSI_Data!$C:$C,$B$10,RSI_Data!$D:$D,$B$11,RSI_Data!$E:$E,$A30)/SUMIFS(RSI_Data!$G:$G,RSI_Data!$C:$C,$B$10,RSI_Data!$D:$D,$B$11,RSI_Data!$E:$E,$A30),SUMIFS(RSI_Data!$F:$F,RSI_Data!$C:$C,$B$10,RSI_Data!$D:$D,$B$11,RSI_Data!$A:$A,$B$9,RSI_Data!$E:$E,$A30)/SUMIFS(RSI_Data!$G:$G,RSI_Data!$C:$C,$B$10,RSI_Data!$D:$D,$B$11,RSI_Data!$A:$A,$B$9,RSI_Data!$E:$E,$A30)),0),0)","v":81596}]
["Other Non-Collision",1.4935,18721.022499999999,{"$f":"IFERROR(ROUND(IF($B$9=\"STW\",SUMIFS(RSI_Data!$F:$F,RSI_Data!$C:$C,$B$10,RSI_Data!$D:$D,$B$11,RSI_Data!$E:$E,$A31)/SUMIFS(RSI_Data!$G:$G,RSI_Data!$C:$C,$B$10,RSI_Data!$D:$D,$B$11,RSI_Data!$E:$E,$A31),SUMIFS(RSI_Data!$F:$F,RSI_Data!$C:$C,$B$10,RSI_Data!$D:$D,$B$11,RSI_Data!$A:$A,$B$9,RSI_Data!$E:$E,$A31)/SUMIFS(RSI_Data!$G:$G,RSI_Data!$C:$C,$B$10,RSI_Data!$D:$D,$B$11,RSI_Data!$A:$A,$B$9,RSI_Data!$E:$E,$A31)),0),0)","v":12535}]
["Left Turn",0.71120000000000005,28940.861600000004,{"$f":"IFERROR(ROUND(IF($B$9=\"STW\",SUMIFS(RSI_Data!$F:$F,RSI_Data!$C:$C,$B$10,RSI_Data!$D:$D,$B$11,RSI_Data!$E:$E,$A32)/SUMIFS(RSI_Data!$G:$G,RSI_Data!$C:$C,$B$10,RSI_Data!$D:$D,$B$11,RSI_Data!$E:$E,$A32),SUMIFS(RSI_Data!$F:$F,RSI_Data!$C:$C,$B$10,RSI_Data!$D:$D,$B$11,RSI_Data!$A:$A,$B$9,RSI_Data!$E:$E,$A32)/SUMIFS(RSI_Data!$G:$G,RSI_Data!$C:$C,$B$10,RSI_Data!$D:$D,$B$11,RSI_Data!$A:$A,$B$9,RSI_Data!$E:$E,$A32)),0),0)","v":40693}]
["Right Turn",0,0,{"$f":"IFERROR(ROUND(IF($B$9=\"STW\",SUMIFS(RSI_Data!$F:$F,RSI_Data!$C:$C,$B$10,RSI_Data!$D:$D,$B$11,RSI_Data!$E:$E,$A33)/SUMIFS(RSI_Data!$G:$G,RSI_Data!$C:$C,$B$10,RSI_Data!$D:$D,$B$11,RSI_Data!$E:$E,$A33),SUMIFS(RSI_Data!$F:$F,RSI_Data!$C:$C,$B$10,RSI_Data!$D:$D,$B$11,RSI_Data!$A:$A,$B$9,RSI_Data!$E:$E,$A33)/SUMIFS(RSI_Data!$G:$G,RSI_Data!$C:$C,$B$10,RSI_Data!$D:$D,$B$11,RSI_Data!$A:$A,$B$9,RSI_Data!$E:$E,$A33)),0),0)","v":27216}]
["Totals",{"$f":"SUM(B15:B33)","v":80.049800000000019},{"$f":"SUM(C15:C33)","v":2683932.2501999992}]
[]
["RSI Value = ",{"$f":"IFERROR(ROUND(C34/B34,2),0)","v":33528.28}]
[]
[]
[]
["All Sites"]
["Crash Frequencies Per Year Summary Results",null,null,null,null,null,null,null,null,null,null,null,null,null,null,null,null,null,null,null,null,null,null,null,null,null,"Project EB Method Summary Results (Without Animal Crashes)"]
[null,null,null,"KA","B","C","O","Total",null,null,null,null,null,null,null,null,null,null,null,null,null,null,null,null,null,null,null,null,null,"KA","B","C","O","Total"]
["Existing Conditions: Predicted Crash Frequency",null,null,{"$f":"IF($AH$43+$AH$50=0,\"\",IF($A$40=$AI$10,AD50,IF($A$40=$AI$9,AD43,AD43+AD50)))","v":1.946},{"$f":"IF($AH$43+$AH$50=0,\"\",IF($A$40=$AI$10,AE50,IF($A$40=$AI$9,AE43,AE43+AE50)))","v":6.6798000000000002},9.0298999999999996,48.850199999999994,{"$f":"ROUND(SUM(D43:G43),2)","v":66.510000000000005},null,null,null,null,null,null,null,null,null,null,null,null,null,null,null,null,null,null,"Existing Conditions: Predicted Crash Frequency",null,null,1.946,6.6798000000000002,9.0298999999999996,48.850199999999994,66.505899999999997]
["Existing Conditions: Expected Crash Frequency",null,null,{"$f":"IF($AH$44+$AH$50=0,\"\",IF($A$41=$AI$10,AD50,IF($A$41=$AI$9,AD44,AD44+AD50)))","v":2.1027},{"$f":"IF($AH$44+$AH$50=0,\"\",IF($A$41=$AI$10,AE50,IF($A$41=$AI$9,AE44,AE44+AE50)))","v":7.2898000000000005},10.046100000000001,55.385999999999989,74.819999999999993,null,null,null,null,null,null,null,null,null,null,null,null,null,null,null,null,null,null,"Existing Conditions: Expected Crash Frequency",null,null,2.1027,7.2898000000000005,10.046100000000001,55.385999999999989,74.82459999999999]
["Potential for Safety Improvement",null,null,{"$f":"IF($AH$43+$AH$50=0,\"\",D44-D43)","v":0.15670000000000006},{"$f":"IF($AH$43+$AH$50=0,\"\",E44-E43)","v":0.61000000000000032},1.0162000000000013,6.5357999999999947,8.32,null,null,null,null,null,null,null,null,null,null,null,null,null,null,null,null,null,null,"Potential for Safety Improvement",null,null,0.15670000000000006,0.61000000000000032,1.0162000000000013,6.5357999999999947,8.3186999999999927]
[{"$f":"\"Proposed Conditions: \"&IF('Project Scoring'!$H$7=\"ECAT - Change in base SPF\",\"Predicted\",\"Expected\")&\" Crash Frequency\"","v":"Proposed Conditions: Expected Crash Frequency"},null,null,{"$f":"IF($AH$46+$AH$51=0,\"\",IF($A$43=$AI$10,AD51,IF($A$43=$AI$9,AD46,AD46+AD51)))","v":1.7834999999999999},{"$f":"IF($AH$46+$AH$51=0,\"\",IF($A$43=$AI$10,AE51,IF($A$43=$AI$9,AE46,AE46+AE51)))","v":5.9057000000000013},7.8929000000000009,43.176400000000001,58.76,null,null,null,null,null,null,null,null,null,null,null,null,null,null,null,null,null,null,{"$f":"\"Proposed Conditions: \"&IF('Project Scoring'!$H$7=\"ECAT - Change in base SPF\",\"Predicted\",\"Expected\")&\" Crash Frequency\"","v":"Proposed Conditions: Expected Crash Frequency"},null,null,1.7834999999999999,5.9057000000000013,7.8929000000000009,43.176400000000001,58.758500000000005]
["Observed Crashes",null,null,0,13,19.333300000000001,66.333299999999994,98.67]
["Equivalent Property Damage Only Factor",null,null,{"$f":"BA12","v":52.32},{"$f":"BB12","v":6.7},5.86,1,null,null,null,null,null,null,null,null,null,null,null,null,null,null,null,null,null,null,null,"Project EB Method Summary Results (Without Animal Crashes)"]
["Equivalent Property Damage Only Value",null,null,{"$f":"IF($H$44=0,D48*D47,D44*D48)","v":110.01326400000001},{"$f":"IF($H$44=0,E48*E47,E44*E48)","v":48.841660000000005},58.870146000000005,55.385999999999989,{"$f":"ROUND(SUM(D49:G49),2)","v":273.11},null,null,null,null,null,null,null,null,null,null,null,null,null,null,null,null,null,null,null,null,null,"KA","B","C","O","Total"]
[null,null,null,null,null,null,null,null,null,null,null,null,null,null,null,null,null,null,null,null,null,null,null,null,null,null,"Existing Conditions Observed Crashes",null,null,0,0,0,0,0]
["People Injuries Per Year Summary Results ",null,null,null,null,null,null,null,null,null,null,null,null,null,null,null,null,null,null,null,null,null,null,null,null,null,"Proposed Conditions Observed Crashes",null,null,0,0,0,0,0]
[null,null,null,"K","A","B","C","Total"]
["Observed Totals",null,null,0,2,17,29.666699999999999,{"$f":"ROUND(SUM(D53:G53),2)","v":48.67}]
[]
[]
["Benefit - Cost Ratio Calculations"]
[]
[null,null,"Net Present Value of Project",4206640]
[null,null,"Net Present Value of Safety Benefits",2282360.4500000002]
[null,null,"Net Benefit",-1924279.55]
[null,null,"Benefit / Cost Ratio",0.54256139031239359]

{"sheet":"ScoringTable","index":5,"n_rows":26,"n_cols":36,"rows_kept":26,"cut":false,"hidden":false,"merged":[[0,0,0,9],[0,26,0,35],[1,26,1,27],[1,28,1,29],[1,30,1,31],[1,32,1,33],[1,34,1,35],[1,0,1,9],[25,9,26,9],[23,9,24,9],[2,6,2,7],[2,8,2,9],[2,0,2,1],[2,2,2,3],[2,4,2,5]]}
["ODOT Highway Safety Improvement Program (HSIP)",null,null,null,null,null,null,null,null,null,null,null,null,null,null,null,null,null,null,null,null,null,null,null,null,null,"Safety Criteria"]
["Formal Funding Application Scoring Criteria",null,null,null,null,null,null,null,null,null,null,null,null,null,null,null,null,null,null,null,null,null,null,null,null,null,"Ratio of Observed Fatal and Serious Injuries to Observed Total Crashes",null,"Percentage of the Potential for Safety Improvement to Total Expected Crashes",null,"Relative Severity Index",null,"Equivalent Property Damage Only Index",null,"Location Equity Measure"]
[{"$f":"AA2","v":"Ratio of Observed Fatal and Serious Injuries to Observed Total Crashes"},null,{"$f":"AC2","v":"Percentage of the Potential for Safety Improvement to Total Expected Crashes"},null,{"$f":"AE2","v":"Relative Severity Index"},null,{"$f":"AG2","v":"Equivalent Property Damage Only Index"},null,{"$f":"AI2","v":"Location Equity Measure"},null,null,null,null,null,null,null,null,null,null,null,null,null,null,null,null,null,"Value","Points","Value","Points","Value","Points","Value","Points","Value","Points"]
["Value","Points","Value","Points","Value","Points","Value","Points","Value","Points",null,null,null,null,null,null,null,null,null,null,null,null,null,null,null,null,0,0,0,0,0,0,0,0,0,0]
[{"$f":"\"< \"&TEXT(AA5,\"#0.00\")","v":"< 0.01"},{"$f":"IF(AB4=\"\",\"\",AB4)","v":0},{"$f":"\"< \"&AC5*100&\"%\"","v":"< 2.5%"},{"$f":"IF(AD4=\"\",\"\",AD4)","v":0},{"$f":"\"< \"&TEXT(AE5,\"00,000\")","v":"< 20,000"},{"$f":"IF(AF4=\"\",\"\",AF4)","v":0},{"$f":"\"< \"&TEXT(AG5,\"#0.00\")","v":"< 1.00"},{"$f":"IF(AH4=\"\",\"\",AH4)","v":0},{"$f":"\"< \"&AI5*100&\"%\"","v":"< 10%"},{"$f":"IF(AJ4=\"\",\"\",AJ4)","v":0},null,null,null,null,null,null,null,null,null,null,null,null,null,null,null,null,0.01,2,2.5000000000000001E-2,2,20000,2,1,2,0.1,2]
[{"$f":"TEXT(AA5,\"#0.00\")&\"-\"&TEXT(AA6-0.001,\"#0.000\")","v":"0.01-0.019"},{"$f":"IF(AB5=\"\",\"\",AB5)","v":2},{"$f":"AC5*100&\"%\"&\"-\"&(AC6-0.0001)*100&\"%\"","v":"2.5%-4.99%"},2,{"$f":"TEXT(AE5,\"00,000\")&\"-\"&TEXT(AE6-0.01,\"00,000.00\")","v":"20,000-22,499.99"},2,{"$f":"TEXT(AG5,\"#0.00\")&\"-\"&TEXT(AG6-0.001,\"#0.000\")","v":"1.00-1.499"},2,{"$f":"AI5*100&\"%\"&\"-\"&(AI6-0.0001)*100&\"%\"","v":"10%-14.99%"},2,null,null,null,null,null,null,null,null,null,null,null,null,null,null,null,null,{"$f":"AA5+0.01","v":0.02},4,{"$f":"AC5+0.025","v":0.05},4,{"$f":"AE5+2500","v":22500},4,{"$f":"AG5+0.5","v":1.5},4,{"$f":"AI5+0.05","v":0.15000000000000002},4]
[{"$f":"TEXT(AA6,\"#0.00\")&\"-\"&TEXT(AA7-0.001,\"#0.000\")","v":"0.02-0.029"},4,{"$f":"AC6*100&\"%\"&\"-\"&(AC7-0.0001)*100&\"%\"","v":"5%-7.49%"},4,{"$f":"TEXT(AE6,\"00,000\")&\"-\"&TEXT(AE7-0.01,\"00,000.00\")","v":"22,500-24,999.99"},4,{"$f":"TEXT(AG6,\"#0.00\")&\"-\"&TEXT(AG7-0.001,\"#0.000\")","v":"1.50-1.999"},4,{"$f":"AI6*100&\"%\"&\"-\"&(AI7-0.0001)*100&\"%\"","v":"15%-19.99%"},4,null,null,null,null,null,null,null,null,null,null,null,null,null,null,null,null,{"$f":"AA6+0.01","v":0.03},6,{"$f":"AC6+0.025","v":7.5000000000000011E-2},6,{"$f":"AE6+2500","v":25000},6,{"$f":"AG6+0.5","v":2},6,{"$f":"AI6+0.05","v":0.2},6]
["0.03-0.039",6,"7.5%-9.99%",6,"25,000-27,499.99",6,"2.00-2.499",6,"20%-24.99%",6,null,null,null,null,null,null,null,null,null,null,null,null,null,null,null,null,0.04,8,0.1,8,27500,8,2.5,8,0.25,8]
["0.04-0.049",8,"10%-12.49%",8,"27,500-29,999.99",8,"2.50-2.999",8,"25%-29.99%",8,null,null,null,null,null,null,null,null,null,null,null,null,null,null,null,null,0.05,10,0.125,10,30000,10,3,10,0.3,10]
["0.05-0.059",10,"12.5%-14.99%",10,"30,000-32,499.99",10,"3.00-3.499",10,{"$f":"\"≥ \"&AI9*100&\"%\"","v":"≥ 30%"},10,null,null,null,null,null,null,null,null,null,null,null,null,null,null,null,null,6.0000000000000005E-2,12,0.15,12,32500,12,3.5,12]
["0.06-0.069",12,"15%-17.49%",12,"32,500-34,999.99",12,"3.50-3.999",12,null,"",null,null,null,null,null,null,null,null,null,null,null,null,null,null,null,null,7.0000000000000007E-2,14,0.17499999999999999,14,35000,14,4,14]
["0.07-0.079",14,"17.5%-19.99%",14,"35,000-37,499.99",14,"4.00-4.499",14,null,"",null,null,null,null,null,null,null,null,null,null,null,null,null,null,null,null,0.08,16,0.19999999999999998,16,37500,16,4.5,16]
["0.08-0.089",16,"20%-22.49%",16,"37,500-39,999.99",16,"4.50-4.999",16,null,"",null,null,null,null,null,null,null,null,null,null,null,null,null,null,null,null,0.09,18,0.22499999999999998,18,40000,18,5,18]
["0.09-0.099",18,"22.5%-24.99%",18,"40,000-42,499.99",18,"5.00-5.499",18,null,"",null,null,null,null,null,null,null,null,null,null,null,null,null,null,null,null,9.9999999999999992E-2,20,0.24999999999999997,20,42500,20,5.5,20]
["0.10-0.109",20,{"$f":"\"≥ \"&AC14*100&\"%\"","v":"≥ 25%"},20,{"$f":"\"≥ \"&TEXT(AE14,\"00,000\")","v":"≥ 42,500"},20,{"$f":"\"≥ \"&TEXT(AG14,\"#0.00\")","v":"≥ 5.50"},20,null,"",null,null,null,null,null,null,null,null,null,null,null,null,null,null,null,null,0.10999999999999999,22]
["0.11-0.119",22,null,"",null,"",null,"",null,"",null,null,null,null,null,null,null,null,null,null,null,null,null,null,null,null,0.11999999999999998,24]
["0.12-0.129",24,null,"",null,"",null,"",null,"",null,null,null,null,null,null,null,null,null,null,null,null,null,null,null,null,0.12999999999999998,26]
["0.13-0.139",26,null,"",null,"",null,"",null,"",null,null,null,null,null,null,null,null,null,null,null,null,null,null,null,null,0.13999999999999999,28]
["0.14-0.149",28,null,"",null,"",null,"",null,"",null,null,null,null,null,null,null,null,null,null,null,null,null,null,null,null,0.15,30]
[{"$f":"\"≥ \"&TEXT(AA19,\"#0.00\")","v":"≥ 0.15"},30,null,"",null,"",null,"",null,""]
[]
[]
[]
[null,null,null,null,null,null,null,null,null,"Total Points"]
[]
[null,null,null,null,null,null,null,null,null,{"$f":"SUM(MAX(AB4:AB1000),MAX(AD4:AD1000),MAX(AF4:AF1000),MAX(AH4:AH1000),MAX(AJ4:AJ1000),MAX(AL4:AL1000),MAX(AN4:AN1000),MAX(AP4:AP1000),MAX(AR4:AR1000))","v":100}]

{"sheet":"RefTables","index":6,"n_rows":93,"n_cols":19,"rows_kept":93,"cut":false,"hidden":true,"merged":[]}
["County Code","District Number",null,"Ohio SHSP Emphasis Area",null,"FHWA SHSP Emphasis Area",null,"Improvement Type","Access management","Advanced technology and ITS","Alignment","Interchange design","Intersection geometry",null,null,null,null,null,"MPH"]
[{"$f":"LEFT(C2,3)","v":"ADA"},9,"ADA - Adams","Serious Crash Types",null,"Creating more effective processes and safety management systems",null,"Access management",null,null,"Alignment - other","Acceleration / deceleration / merge lane",null,null,null,null,null,null,5]
[{"$f":"LEFT(C3,3)","v":"ALL"},1,"ALL - Allen","High Risk Drivers and Behaviors",null,"Curbing aggressive driving",null,"Advanced technology and ITS","Access management - other","AdvancedtechnologyandITS","Horizontal curve realignment","Convert at-grade intersection to interchange","Auxiliary lanes - add acceleration lane",null,null,null,null,null,{"$f":"S2+5","v":10}]
["ASD",3,"ASD - Ashland","Special Vehicles and Roadway Users",null,"Designing safer work zones",null,"Alignment","Change in access - close or restrict existing access","Advanced technology and ITS - other","Horizontal and vertical alignment","Extend existing lane on ramp","Auxiliary lanes - add auxiliary through lane",null,null,null,null,null,{"$f":"S3+5","v":15}]
["ATB",4,"ATB - Ashtabula","Data",null,"Enhancing emergency medical capabilities to increase survivability",null,"Animal-related","Change in access - miscellaneous/unspecified","Congestion detection / traffic monitoring system","Vertical alignment or elevation change","Improve intersection radius at ramp terminus","Auxiliary lanes - add left-turn lane",null,null,null,null,null,20]
["ATH",10,"ATH - Athens",null,null,"Ensuring drivers are licensed and fully competent",null,"Interchange design","Grassed median - extend existing","Dynamic message signs",null,"Installation of new lane on ramp","Auxiliary lanes - add right-turn lane",null,null,null,null,null,25]
["AUG",7,"AUG - Auglaize",null,null,"Ensuring safer bicycle travel",null,"Intersection geometry","Median crossover - close crossover","Over height vehicle detection","Roadside","Interchange design - other","Auxiliary lanes - add right-turn lane (free-flow)",null,null,null,null,null,30]
["BEL",11,"BEL - Belmont","Data",null,"Improving information and decision support systems",null,"Intersection traffic control","Median crossover - directional crossover",null,null,"Ramp closure","Auxiliary lanes - add slip lane",null,null,null,null,null,35]
["BRO",9,"BRO - Brown","Timely Data",null,"Improving motorcycle safety and increasing motorcycle awareness",null,"Lighting","Median crossover - relocate existing",null,"Barrier end treatments (crash cushions, terminals)","Ramp metering","Auxiliary lanes - add two-way left-turn lane",null,null,null,null,null,40]
["BUT",8,"BUT - Butler","Reliable Data",null,"Improving the design and operation of highway intersections",null,"Miscellaneous","Median crossover - unspecified",null,"Barrier transitions",null,"Auxiliary lanes - extend acceleration/deceleration lane",null,null,null,null,null,45]
["CAR",11,"CAR - Carroll","Comprehensive Data",null,"Increasing driver safety awareness",null,"Non-infrastructure ","Raised island - install new",null,"Barrier - cable",null,"Auxiliary lanes - extend existing left-turn lane",null,null,null,null,null,50]
["CHP",7,"CHP - Champaign","Integrated Data and Analysis Systems",null,"Increasing safety enhancements in vehicles",null,"Parking","Raised island - modify existing",null,"Barrier - concrete",null,"Auxiliary lanes - extend existing right-turn lane",null,null,null,null,null,{"$f":"S11+5","v":55}]
["CLA",7,"CLA - Clark",null,null,"Increasing seat belt use and improving airbag effectiveness",null,"Pedestrians and bicyclists","Raised island - remove existing",null,"Barrier- metal",null,"Auxiliary lanes - miscellaneous/other/unspecified",null,null,null,null,null,60]
["CLE",8,"CLE - Clermont","SeriousCrashTypes",null,"Instituting graduated licensing for younger drivers",null,"Railroad grade crossings","Raised island - unspecified",null,"Barrier - other",null,"Auxiliary lanes - modify acceleration lane",null,null,null,null,null,65]
["CLI",8,"CLI - Clinton","Roadway Departure",null,"Keeping drivers alert",null,"Roadside",null,null,"Barrier - removal",null,"Auxiliary lanes - modify auxiliary through lane",null,null,null,null,null,70]
["COL",11,"COL - Columbiana","Intersection",null,"Keeping vehicles in the roadway",null,"Roadway",null,null,"Curb or curb and gutter",null,"Auxiliary lanes - modify free-flow turn  lane"]
["COS",5,"COS - Coshocton","Highway Railroad Crossing",null,"Making truck travel safer",null,"Roadway delineation",null,null,"Drainage improvements",null,"Auxiliary lanes - modify left-turn lane offset"]
["CRA",3,"CRA - Crawford",null,null,"Making walking and street crossing easier",null,"Roadway signs and traffic control",null,null,"Fencing",null,"Auxiliary lanes - modify right-turn lane offset"]
["CUY",12,"CUY - Cuyahoga",null,null,"Minimizing the consequences of leaving the road",null,"Shoulder treatments",null,null,"Removal of roadside objects (trees, poles, etc.)",null,"Auxiliary lanes - modify turn lane storage"]
["DAR",7,"DAR - Darke","HighRiskDriversandBehaviors",null,"Reducing head-on and across-median crashes",null,"Speed management",null,null,"Roadside grading",null,"Auxiliary lanes - modify turn lane taper"]
["DEF",1,"DEF - Defiance","Impaired Drivers",null,"Reducing impaired driving",null,"Work Zone",null,null,"Roadside - other",null,"Auxiliary lanes - modify two-way left-turn lane"]
["DEL",6,"DEL - Delaware","Seat Belt",null,"Reducing vehicle-train crashes",null,null,null,null,null,null,"Intersection geometrics - miscellaneous/other/unspecified"]
["ERI",3,"ERI - Erie","Speed",null,"Sustaining proficiency in older drivers",null,null,null,null,null,null,"Intersection geometrics - modify intersection corner radius"]
["FAI",5,"FAI - Fairfield","Young Drivers",null,"Other",null,"Animal-related","Intersection traffic control","Lighting","Roadway",null,"Intersection geometrics - modify skew angle"]
["FAY",6,"FAY - Fayette","Older Drivers",null,null,null,null,null,null,null,null,"Intersection geometrics - realignment to align offset cross streets"]
["FRA",6,"FRA - Franklin","Distracted Drivers",null,"Functional Class",null,null,"Intersection flashers - add \"when flashing\" warning sign-mounted","Continuous roadway lighting","Install / remove / modify passing zone",null,"Intersection geometrics - realignment to increase cross street offset"]
["FUL",2,"FUL - Fulton",null,1,"1 - Interstates",null,null,"Intersection flashers - add advance emergency vehicle warning sign-mounted","Intersection lighting","Pavement surface - high friction surface",null,"Intersection geometrics - re-assign existing lane use"]
["GAL",10,"GAL - Gallia","SpecialVehiclesandRoadwayUsers",2,"2 - Other Freeways or Expressways",null,null,"Intersection flashers - add advance heavy vehicle warning sign-mounted","Lighting - other","Pavement surface - miscellaneous",null,"Intersection geometry - other"]
["GEA",12,"GEA - Geauga","Bicycle Riders",3,"3 - Other Principal Arterial Roadway",null,null,"Intersection flashers - add advance intersection warning sign-mounted","Site lighting - horizontal curve ","Roadway narrowing (road diet, roadway reconfiguration)",null,"Splitter island - install on one or more approaches"]
["GRE",8,"GRE - Greene","Pedestrians",4,"4 - Minor Arterial Roadway",null,null,"Intersection flashers - add miscellaneous/other/unspecified","Site lighting - intersection","Roadway - other",null,"Splitter island - remove from one or more approaches"]
["GUE",5,"GUE - Guernsey","Commercial Vehicles",5,"5 - Major Collector Roadway",null,null,"Intersection flashers - add overhead (actuated)","Site lighting - interchange","Roadway - restripe to revise separation between opposing lanes and/or shoulder widths ",null,"Splitter island - unspecified"]
["HAM",8,"HAM - Hamilton","Motorcycles",6,"6 - Minor Collector Roadway",null,null,"Intersection flashers - add overhead (continuous)","Site lighting - pedestrian crosswalk","Roadway widening - add lane(s) along segment",null,"Through lanes - add additional through lane"]
["HAN",1,"HAN - Hancock",null,7,"7 - Local Roadway",null,null,"Intersection flashers - add stop sign-mounted",null,"Roadway widening - curve "]
["HAR",1,"HAR - Hardin",null,99,"99 - Other Roadway",null,null,"Intersection flashers - modify existing",null,"Roadway widening - travel lanes"]
["HAS",11,"HAS - Harrison",null,null,null,null,null,"Intersection flashers - remove existing","Parking","Rumble strips - center"]
["HEN",2,"HEN - Henry",null,null,null,null,null,"Intersection signing - add basic advance warning",null,"Rumble strips - edge or shoulder"]
["HIG",9,"HIG - Highland",null,null,null,null,null,"Intersection signing - add enhanced advance warning (double-up and/or oversize)","Modify parking","Rumble strips - transverse"]
["HOC",10,"HOC - Hocking",null,null,null,null,null,"Intersection signing - add enhanced regulatory sign (double-up and/or oversize)","Parking - other","Rumble strips - unspecified or other"]
["HOL",11,"HOL - Holmes",null,null,null,null,null,"Intersection signing - miscellaneous/other/unspecified","Remove parking","Superelevation / cross slope"]
["HUR",3,"HUR - Huron",null,null,null,null,null,"Intersection signing - relocate existing regulatory sign","Restrict parking"]
["JAC",9,"JAC - Jackson",null,null,null,null,null,"Intersection traffic control - other","Truck parking facilities"]
["JEF",11,"JEF - Jefferson",null,null,null,null,null,"Modify control - all-way stop to roundabout"]
["KNO",5,"KNO - Knox",null,null,null,null,null,"Modify control - modifications to roundabout","Pedestrians and bicyclists","Roadway delineation"]
["LAK",12,"LAK - Lake",null,null,null,null,null,"Modify control - no control to roundabout"]
["LAW",9,"LAW - Lawrence",null,null,null,null,null,"Modify control - no control to two-way stop","Crosswalk","Improve retroreflectivity"]
["LIC",5,"LIC - Licking",null,null,null,null,null,"Modify control - remove right-turn yield","Install new \"smart\" crosswalk","Longitudinal pavement markings - new"]
["LOG",7,"LOG - Logan",null,null,null,null,null,"Modify control - reverse priority of stop condition","Install new crosswalk","Longitudinal pavement markings - remarking"]
["LOR",3,"LOR - Lorain",null,null,null,null,null,"Modify control - traffic signal to roundabout","Install sidewalk","Delineators post-mounted or on barrier "]
["LUC",2,"LUC - Lucas",null,null,null,null,null,"Modify control - two-way stop to all-way stop","Medians and pedestrian refuge areas","Raised pavement markers"]
["MAD",6,"MAD - Madison",null,null,null,null,null,"Modify control - two-way stop to signal operation","Miscellaneous pedestrians and bicyclists","Roadway delineation - other"]
["MAH",4,"MAH - Mahoning",null,null,null,null,null,"Modify control - two-way stop to roundabout","Modify existing crosswalk"]
["MAR",6,"MAR - Marion",null,null,null,null,null,"Modify control - two-way yield to two-way stop","Pedestrian beacons"]
["MED",3,"MED - Medina",null,null,null,null,null,"Pavement Markings - add advance signal ahead","Pedestrian bridge","Roadway signs and traffic control"]
["MEG",10,"MEG - Meigs",null,null,null,null,null,"Pavement markings - add advance stop ahead","Pedestrian signal"]
["MER",7,"MER - Mercer",null,null,null,null,null,"Pavement markings - add dashed edge line along mainline","Pedestrian signal - audible device","Curve-related warning signs and flashers"]
["MIA",7,"MIA - Miami",null,null,null,null,null,"Pavement markings - add lane use symbols","Pedestrian signal - Pedestrian Hybrid Beacon","Sign sheeting - upgrade or replacement"]
["MOE",10,"MOE - Monroe",null,null,null,null,null,"Pavement markings - add stop line","Pedestrian signal - install new at intersection","Roadway signs and traffic control - other"]
["MOT",7,"MOT - Montgomery",null,null,null,null,null,"Pavement markings - add yield line","Pedestrian signal - install new at non-intersection location","Roadway signs (including post) - new or updated"]
["MRG",10,"MRG - Morgan",null,null,null,null,null,"Pavement markings - miscellaneous/other/unspecified","Pedestrian signal - modify existing"]
["MRW",6,"MRW - Morrow",null,null,null,null,null,"Pavement markings - refresh existing pavement markings","Pedestrian signal - remove existing"]
["MUS",5,"MUS - Muskingum",null,null,null,null,null,"Modify traffic signal - add additional signal heads","Pedestrian warning signs - add/modify flashers"]
["NOB",10,"NOB - Noble",null,null,null,null,null,"Modify traffic signal - add backplates","Pedestrian warning signs - overhead"]
["OTT",2,"OTT - Ottawa",null,null,null,null,null,"Modify traffic signal - add backplates with retroreflective borders"]
["PAU",1,"PAU - Paulding",null,null,null,null,null,"Modify traffic signal - add closed loop system","Railroad grade crossings"]
["PER",5,"PER - Perry",null,null,null,null,null,"Modify traffic signal - add emergency vehicle preemption"]
["PIC",6,"PIC - Pickaway",null,null,null,null,null,"Modify traffic signal - add flashing yellow arrow","Grade separation"]
[{"$f":"LEFT(C67,3)","v":"PIK"},9,"PIK - Pike",null,null,null,null,null,"Modify traffic signal - add long vehicle detection","Model enforcement activity"]
["POR",4,"POR - Portage",null,null,null,null,null,"Modify traffic signal - add railroad preemption","Protective devices"]
["PRE",8,"PRE - Preble",null,null,null,null,null,"Modify traffic signal - add wireless system","Railroad grade crossing gates"]
["PUT",1,"PUT - Putnam",null,null,null,null,null,"Modify traffic signal - miscellaneous/other/unspecified","Railroad grade crossing signing"]
["RIC",3,"RIC - Richland",null,null,null,null,null,"Modify traffic signal - modernization/replacement","Railroad grade crossings - other","Speed management"]
["ROS",9,"ROS - Ross",null,null,null,null,null,"Modify traffic signal - modify signal mounting (spanwire to mast arm)","Surface treatment"]
["SAN",2,"SAN - Sandusky",null,null,null,null,null,"Modify traffic signal - remove existing signal","Upgrade railroad crossing signal","Modify speed limit"]
["SCI",9,"SCI - Scioto",null,null,null,null,null,"Modify traffic signal - replace existing indications (incandescent-to-LED and/or 8-to-12 inch dia.)","Widen crossing for additional lane","Radar speed signs"]
["SEN",2,"SEN - Seneca",null,null,null,null,null,"Modify traffic signal timing - left-turn phasing (permissive to protected/permissive)",null,"Speed detection system / truck warning"]
["SHE",7,"SHE - Shelby",null,null,null,null,null,"Modify traffic signal timing - left-turn phasing (permissive to protected-only)",null,"Speed management - other"]
["STA",4,"STA - Stark",null,null,null,null,null,"Modify traffic signal timing - adjust clearance interval (yellow change and/or all-red)",null,"Traffic calming feature"]
["SUM",4,"SUM - Summit",null,null,null,null,null,"Modify traffic signal timing - general retiming"]
["TRU",4,"TRU - Trumbull",null,null,null,null,null,"Modify traffic signal timing - signal coordination"]
["TUS",11,"TUS - Tuscarawas",null,null,null,null,null,"Systemic improvements - signal-controlled"]
["UNI",6,"UNI - Union",null,null,null,null,null,"Systemic improvements - stop-controlled","Miscellaneous"]
["VAN",1,"VAN - Van Wert"]
["VIN",10,"VIN - Vinton"]
["WAR",8,"WAR - Warren"]
["WAS",10,"WAS - Washington",null,null,null,null,"Non-infrastructure ","Shoulder treatments","Work Zone"]
["WAY",3,"WAY - Wayne",null,null,null,null,"Educational efforts","Widen shoulder – paved or other"]
["WIL",2,"WIL - Williams",null,null,null,null,"Enforcement","Pave existing shoulders"]
["WOO",2,"WOO - Wood",null,null,null,null,"Data/traffic records","Shoulder grading"]
["WYA",1,"WYA - Wyandot",null,null,null,null,"Non-infrastructure - other","Shoulder treatments - other"]
[null,null,null,null,null,null,null,"Outreach"]
[null,null,null,null,null,null,null,"Road safety audits"]
[null,null,null,null,null,null,null,"Training and workforce development"]
[null,null,null,null,null,null,null,"Transportation safety planning"]

{"sheet":"RSI_Data","index":7,"n_rows":7308,"n_cols":10,"rows_kept":7308,"cut":false,"hidden":true,"merged":[]}
[null,null,null,null,{"$f":"F1/G1","v":28684.981329948852},{"$f":"SUBTOTAL(9,F3:F86584)","v":41586195108},{"$f":"SUBTOTAL(9,G3:G86584)","v":1449755}]
["DISTRICT_NBR","NLF_COUNTY_CD","URBAN_AREA","FREEWAY_IND","CRASH_TYPE_CD","CRASH_COST_NBR","Crash_Count",null,null,"Select "]
[8,"HAM","No","Yes","Unknown",8080,1,null,null,"--CRASH_YR,"]
[2,"FUL","No","No","Parked Vehicle",1543230,55,null,null,"DISTRICT_NBR,"]
[9,"JAC","No","No","Fixed Object",38575962,923,null,null,"NLF_COUNTY_CD,"]
[6,"FRA","Yes","Yes","Parked Vehicle",54139,1]
[8,"BUT","No","Yes","Left Turn",86459,5,null,null,"--CASE WHEN ODOT_MAINTAINED_HWY_IND = 'Y' THEN 'Yes'"]
[3,"HUR","Yes","No","Animal",24240,3,null,null,"--ELSE 'No' END AS ODOT_MAINTAINED_HWY_IND,"]
[11,"TUS","Yes","Yes","Head On",3163158,16]
[6,"PIC","No","No","Pedalcycles",1088889,7,null,null,"CASE WHEN AREA_CODE = 99999 THEN 'No'"]
[1,"DEF","Yes","No","Left Turn",3250546,113,null,null,"ELSE 'Yes' END AS URBAN_AREA,"]
[10,"ATH","No","No","Other Object",121200,15]
[4,"POR","Yes","No","Right Turn",1346596,105,null,null,"--CASE WHEN FUNCTIONAL_CLASS_CD = 1 THEN 'Interstate Route'"]
[8,"CLI","Yes","No","Backing",468640,58,null,null,"--WHEN FUNCTIONAL_CLASS_CD = 2 THEN 'Other Freeways or Expressways'"]
[7,"LOG","Yes","No","Rear End",2640047,82,null,null,"--WHEN FUNCTIONAL_CLASS_CD = 3 THEN 'Other Principal Arterial Roads'"]
[6,"UNI","Yes","Yes","Overturning",196114,4,null,null,"--WHEN FUNCTIONAL_CLASS_CD = 4 THEN 'Minor Arterial Roads'"]
[4,"POR","No","Yes","Overturning",797305,14,null,null,"--WHEN FUNCTIONAL_CLASS_CD = 5 THEN 'Major Collector Roads'"]
[6,"UNI","Yes","No","Pedalcycles",882609,14,null,null,"--WHEN FUNCTIONAL_CLASS_CD = 6 THEN 'Minor Collector Roads'"]
[2,"HEN","Yes","Yes","Rear End",722613,17,null,null,"--WHEN FUNCTIONAL_CLASS_CD = 7 THEN 'Local Roads' END AS FUNCTIONAL_CLASS_CD,"]
[11,"JEF","No","No","Rear End",4241433,129]
[10,"HOC","No","No","Animal",4812406,199,null,null,"CASE WHEN FREEWAY_IND = 'N' THEN 'No'"]
[7,"AUG","Yes","No","Fixed Object",3300668,123,null,null,"WHEN FREEWAY_IND = 'Y' THEN 'Yes' END AS FREEWAY_IND,"]
[9,"PIK","Yes","No","Right Turn",8080,1]
[4,"ATB","Yes","No","Other Object",32320,4,null,null,"CASE WHEN CRASH_TYPE_CD = 0 THEN 'Unknown'"]
[7,"MIA","Yes","No","Head On",8080,1,null,null,"WHEN CRASH_TYPE_CD = 1 THEN 'Head On'"]
[2,"WIL","No","No","Pedalcycles",1276255,4,null,null,"WHEN CRASH_TYPE_CD = 2 THEN 'Rear End'"]
[10,"HOC","Yes","No","Animal",8080,1,null,null,"WHEN CRASH_TYPE_CD = 3 THEN 'Backing'"]
[7,"DAR","Yes","No","Left Turn",8080,1,null,null,"WHEN CRASH_TYPE_CD = 4 THEN 'Sideswipe - Meeting'"]
[10,"MEG","Yes","No","Overturning",232716,6,null,null,"WHEN CRASH_TYPE_CD = 5 THEN 'Sideswipe - Passing'"]
[9,"ROS","Yes","Yes","Rear End",5152006,160,null,null,"WHEN CRASH_TYPE_CD = 6 THEN 'Angle'"]
[3,"HUR","Yes","No","Fixed Object",1926821,52,null,null,"WHEN CRASH_TYPE_CD = 7 THEN 'Parked Vehicle'"]
[1,"VAN","Yes","No","Fixed Object",1750216,35,null,null,"WHEN CRASH_TYPE_CD = 8 THEN 'Pedestrian'"]
[8,"WAR","Yes","No","Unknown",71565,4,null,null,"WHEN CRASH_TYPE_CD = 9 THEN 'Animal'"]
[2,"LUC","Yes","No","Other Object",8080,1,null,null,"WHEN CRASH_TYPE_CD = 10 THEN 'Train'"]
[4,"SUM","Yes","No","Rear End",278113410,14540,null,null,"WHEN CRASH_TYPE_CD = 11 THEN 'Pedalcycles'"]
[5,"GUE","Yes","No","Sideswipe - Passing",8080,1,null,null,"WHEN CRASH_TYPE_CD = 12 THEN 'Other Non-Vehicle'"]
[2,"WOO","Yes","Yes","Right Turn",16160,2,null,null,"WHEN CRASH_TYPE_CD = 13 THEN 'Fixed Object'"]
[2,"FUL","Yes","No","Other Object",24240,3,null,null,"WHEN CRASH_TYPE_CD = 14 THEN 'Other Object'"]
[10,"MOE","Yes","No","Other Non-Collision",8080,1,null,null,"WHEN CRASH_TYPE_CD = 15 THEN 'Falling From Or In Vehicle'"]
[11,"TUS","No","No","Other Non-Vehicle",54139,1,null,null,"WHEN CRASH_TYPE_CD = 16 THEN 'Overturning'"]
[11,"TUS","No","Yes","Pedestrian",422725,1,null,null,"WHEN CRASH_TYPE_CD = 17 THEN 'Other Non-Collision'"]
[7,"MOT","Yes","No","Pedestrian",966647,13,null,null,"WHEN CRASH_TYPE_CD = 18 THEN 'Left Turn'"]
[1,"HAN","Yes","Yes","Other Object",393610,39,null,null,"WHEN CRASH_TYPE_CD = 19 THEN 'Right Turn' END AS CRASH_TYPE_CD,"]
[3,"CRA","No","No","Backing",750429,31]
[12,"CUY","Yes","Yes","Other Non-Collision",9985150,340,null,null,"sum(CASE WHEN CRASH_SEVERITY_CD = '1' THEN 422725"]
[4,"TRU","No","No","Angle",16473193,367,null,null,"WHEN CRASH_SEVERITY_CD = '2' THEN 422725"]
[10,"GAL","No","No","Pedestrian",1015947,6,null,null,"WHEN CRASH_SEVERITY_CD = '3' THEN 54139"]
[9,"JAC","Yes","No","Unknown",56560,7,null,null,"WHEN CRASH_SEVERITY_CD = '4' THEN 47325"]
[1,"HAN","No","Yes","Rear End",3389841,54,null,null,"ELSE 8080 END ) AS CRASH_COST_NBR -- 2020 VALUES"]
[11,"CAR","Yes","Yes","Rear End",8080,1]
[9,"JAC","No","No","Rear End",5008317,112,null,null,",count(DOCUMENT_NBR) as Crash_Count"]
[4,"POR","No","No","Right Turn",1527516,67]
[3,"WAY","No","Yes","Animal",902312,80,null,null,"From warehouse.dbo.oh1_cr_crash_details"]
[11,"COL","Yes","Yes","Parked Vehicle",47325,1,null,null,"where CRASH_YR BETWEEN 2016 AND 2020"]
[8,"WAR","No","No","Sideswipe - Meeting",845450,2,null,null,"Group by  --CRASH_YR,"]
[8,"GRE","Yes","Yes","Rear End",1708587,93,null,null,"DISTRICT_NBR,"]
[11,"COL","Yes","No","Angle",4242699,130,null,null,"NLF_COUNTY_CD,"]
[11,"COL","Yes","No","Sideswipe - Passing",164838,9,null,null,"AREA_CODE,"]
[8,"HAM","No","Yes","Animal",288570,26,null,null,"--ODOT_MAINTAINED_HWY_IND,"]
[2,"LUC","Yes","No","Pedestrian",1660403,11,null,null,"--FUNCTIONAL_CLASS_CD,"]
[12,"GEA","Yes","No","Unknown",16160,2,null,null,"FREEWAY_IND,"]
[3,"ERI","Yes","Yes","Pedestrian",47325,1,null,null,"CRASH_TYPE_CD"]
[8,"WAR","Yes","Yes","Backing",72720,9]
[3,"HUR","Yes","No","Parked Vehicle",78379,4]
[4,"STA","Yes","No","Pedalcycles",20755616,180]
[9,"SCI","No","No","Angle",15303659,253]
[5,"MUS","Yes","Yes","Fixed Object",143019,12]
[4,"ATB","Yes","No","Other Non-Collision",834578,26]
[9,"LAW","Yes","No","Sideswipe - Passing",3966095,225]
[4,"MAH","Yes","Yes","Fixed Object",904988,25]
[11,"JEF","No","Yes","Angle",478130,3]
[2,"HEN","No","Yes","Other Non-Collision",118779,9]
[4,"MAH","Yes","No","Angle",2113700,50]
[7,"MOT","Yes","No","Fixed Object",6287778,132]
[6,"UNI","No","No","Overturning",5770101,58]
[2,"SAN","Yes","No","Rear End",134939,11]
[6,"MAD","Yes","No","Rear End",233982,7]
[4,"SUM","Yes","No","Pedalcycles",21662123,254]
[11,"TUS","Yes","No","Other Object",364528,24]
[11,"COL","Yes","Yes","Unknown",8080,1]
[11,"COL","Yes","No","Right Turn",1126721,59]
[1,"HAR","Yes","No","Backing",16160,2]
[10,"HOC","Yes","No","Parked Vehicle",16160,2]
[8,"HAM","No","Yes","Parked Vehicle",133784,6]
[7,"DAR","Yes","Yes","Right Turn",47325,1]
[5,"MUS","No","Yes","Parked Vehicle",140598,6]
[1,"HAN","No","No","Other Non-Collision",1078806,101]
[8,"BUT","Yes","No","Backing",11899551,994]
[1,"PUT","No","No","Animal",6194596,705]
[10,"MOE","Yes","No","Angle",109544,3]
[8,"HAM","Yes","No","Other Non-Collision",24581883,846]
[11,"JEF","Yes","Yes","Parked Vehicle",48480,6]
[4,"STA","Yes","Yes","Left Turn",124438,4]
[8,"GRE","Yes","Yes","Sideswipe - Meeting",8080,1]
[4,"ATB","Yes","No","Rear End",2710903,95]
[2,"SAN","Yes","Yes","Backing",102619,7]
[7,"MIA","Yes","Yes","Parked Vehicle",1360966,43]
[2,"SAN","Yes","No","Left Turn",545637,31]
[2,"SAN","Yes","Yes","Unknown",16160,2]
[5,"MUS","No","Yes","Overturning",1874316,17]
[8,"GRE","Yes","No","Right Turn",6764211,418]
[10,"GAL","No","No","Sideswipe - Passing",2230393,71]
[9,"SCI","Yes","No","Other Non-Collision",786098,20]
[1,"HAN","No","Yes","Fixed Object",3809516,137]
[12,"LAK","Yes","Yes","Pedalcycles",54139,1]
[3,"MED","No","No","Left Turn",12959102,298]
[4,"SUM","Yes","No","Unknown",152365,14]
[10,"MOE","No","No","Overturning",6300287,78]
[5,"MUS","Yes","No","Angle",36012906,1230]
[1,"HAN","Yes","Yes","Angle",16160,2]
[11,"BEL","No","Yes","Head On",580749,10]
[1,"WYA","No","Yes","Fixed Object",592405,22]
[4,"MAH","Yes","Yes","Rear End",263175,18]
[2,"LUC","No","Yes","Head On",422725,1]
[10,"HOC","No","No","Rear End",4952763,133]
[1,"VAN","Yes","No","Head On",275648,13]
[6,"MAD","No","No","Pedestrian",3702352,16]
[7,"CHP","Yes","No","Sideswipe - Passing",16160,2]
[1,"PUT","Yes","No","Left Turn",8080,1]
[7,"LOG","Yes","No","Fixed Object",6563913,144]
[10,"ATH","Yes","No","Sideswipe - Meeting",54139,1]
[3,"LOR","Yes","No","Rear End",915229,59]
[4,"STA","No","No","Backing",1167686,112]
[7,"CLA","Yes","Yes","Sideswipe - Meeting",422725,1]
[1,"ALL","Yes","No","Pedestrian",101464,2]
[2,"WOO","Yes","No","Animal",1323516,141]
[4,"ATB","Yes","Yes","Other Non-Collision",62219,2]
[11,"JEF","Yes","No","Animal",16160,2]
[2,"HEN","Yes","Yes","Fixed Object",873712,30]
[5,"FAI","Yes","No","Angle",1051918,66]
[10,"WAS","Yes","No","Other Non-Collision",88880,11]
[3,"LOR","Yes","No","Left Turn",32347624,939]
[5,"MUS","Yes","Yes","Rear End",283728,14]
[3,"MED","Yes","No","Backing",676299,78]
[5,"MUS","No","Yes","Left Turn",54139,1]
[9,"PIK","Yes","No","Overturning",397665,11]
[12,"CUY","No","No","Fixed Object",8331996,162]
[7,"SHE","Yes","No","Animal",32320,4]
[12,"CUY","Yes","No","Right Turn",8938859,435]
[1,"ALL","No","No","Other Non-Vehicle",8080,1]
[10,"VIN","No","No","Sideswipe - Passing",1989857,37]
[7,"LOG","Yes","No","Backing",1960008,175]
[11,"BEL","No","No","Sideswipe - Passing",3629638,154]
[9,"ROS","Yes","Yes","Fixed Object",5837612,146]
[5,"LIC","Yes","Yes","Rear End",8390607,319]
[11,"BEL","Yes","Yes","Other Object",328970,31]
[3,"LOR","Yes","Yes","Parked Vehicle",664787,9]
[3,"MED","No","No","Overturning",5656496,75]
[11,"COL","Yes","No","Sideswipe - Passing",2480023,172]
[4,"STA","Yes","Yes","Head On",55405,2]
[1,"DEF","Yes","No","Head On",1464624,25]
[1,"DEF","Yes","No","Train",430805,2]
[8,"PRE","No","Yes","Animal",1041977,73]
[7,"MOT","Yes","No","Sideswipe - Passing",113120645,6224]
[3,"WAY","Yes","No","Parked Vehicle",133784,6]
[2,"SAN","Yes","No","Right Turn",252563,15]
[10,"NOB","No","No","Head On",1285936,24]
[6,"UNI","No","No","Other Object",143019,12]
[3,"HUR","Yes","No","Overturning",70299,3]
[2,"OTT","No","No","Other Non-Collision",3968510,84]
[10,"MEG","No","No","Sideswipe - Meeting",961808,5]
[7,"CLA","Yes","No","Animal",4535952,384]
[6,"FRA","Yes","Yes","Parked Vehicle",11865786,237]
[6,"FRA","Yes","No","Other Non-Collision",8080,1]
[10,"WAS","Yes","No","Sideswipe - Passing",1183841,80]
[2,"WIL","Yes","No","Fixed Object",94539,6]
[6,"DEL","Yes","Yes","Other Non-Collision",326549,25]
[6,"MAD","Yes","No","Animal",239979,24]
[7,"MIA","No","No","Fixed Object",33133611,946]
[6,"UNI","No","Yes","Angle",556509,7]
[6,"MAR","No","No","Right Turn",1090379,30]
[3,"RIC","Yes","No","Sideswipe - Passing",918954,47]
[8,"BUT","Yes","No","Backing",878410,99]
[3,"HUR","No","No","Overturning",8265493,75]
[1,"DEF","No","No","Pedalcycles",1009133,6]
[8,"CLI","No","Yes","Sideswipe - Passing",3148901,104]
[1,"HAN","Yes","No","Angle",1054821,37]
[10,"ATH","No","Yes","Other Non-Collision",55405,2]
[3,"HUR","Yes","No","Right Turn",102619,7]
[7,"DAR","No","No","Other Non-Collision",714051,51]
[10,"WAS","No","No","Overturning",12183359,116]
[5,"KNO","Yes","No","Angle",79645,5]
[3,"ERI","No","Yes","Sideswipe - Meeting",47325,1]
[7,"AUG","Yes","No","Head On",594488,6]
[8,"BUT","Yes","Yes","Left Turn",1617584,30]
[1,"HAN","Yes","Yes","Overturning",8080,1]
[4,"TRU","Yes","No","Overturning",8080,1]
[2,"FUL","No","Yes","Animal",1088041,107]
[2,"HEN","Yes","No","Rear End",164949,5]
[10,"WAS","Yes","No","Right Turn",1562595,99]
[10,"MRG","No","No","Angle",5290226,93]
[3,"MED","Yes","No","Angle",31763856,1107]
[10,"ATH","No","Yes","Angle",8080,1]
[11,"TUS","No","Yes","Other Object",330125,36]
[6,"MRW","Yes","No","Fixed Object",32320,4]
[8,"GRE","Yes","No","Left Turn",305436,15]
[4,"MAH","Yes","No","Sideswipe - Passing",105040,13]
[4,"SUM","Yes","No","Backing",2484948,267]
[5,"GUE","Yes","No","Pedestrian",1525242,8]
[4,"ATB","No","No","Left Turn",8235896,148]
[4,"POR","Yes","No","Sideswipe - Meeting",1355900,9]
[3,"HUR","Yes","No","Backing",145440,18]
[8,"BUT","Yes","No","Left Turn",16359513,396]
[11,"CAR","Yes","No","Left Turn",8080,1]
[7,"MIA","Yes","Yes","Head On",70299,3]
[7,"MOT","Yes","No","Animal",571259,65]
[6,"MAD","No","No","Sideswipe - Meeting",78379,4]
[4,"STA","Yes","No","Rear End",200992303,9603]
[3,"ERI","Yes","No","Animal",217005,22]
[8,"BUT","Yes","No","Animal",307857,21]
[1,"ALL","Yes","No","Sideswipe - Passing",16696031,1020]
[8,"CLE","No","No","Fixed Object",87180721,1988]
[8,"CLI","Yes","No","Animal",1657472,127]
[3,"WAY","Yes","No","Overturning",563323,7]
[1,"ALL","Yes","Yes","Right Turn",63485,3]
[1,"WYA","Yes","No","Other Object",56560,7]
[3,"HUR","Yes","No","Rear End",2194611,56]
[1,"PAU","No","Yes","Parked Vehicle",8080,1]
[11,"JEF","No","No","Pedalcycles",47325,1]
[3,"LOR","Yes","No","Overturning",3681422,43]
[7,"CHP","No","No","Rear End",7353248,236]
[1,"DEF","No","No","Animal",14089709,1570]
[1,"WYA","Yes","Yes","Rear End",62219,2]
[12,"CUY","Yes","Yes","Pedestrian",774442,8]
[10,"GAL","Yes","No","Parked Vehicle",8080,1]
[12,"GEA","Yes","No","Overturning",70299,3]
[7,"CLA","Yes","No","Pedalcycles",7964744,87]
[9,"PIK","Yes","No","Animal",55405,2]
[2,"WIL","No","Yes","Other Object",168525,16]
[1,"PUT","No","No","Rear End",3832001,110]
[2,"OTT","Yes","No","Backing",1311525,111]
[7,"MER","Yes","No","Animal",1296149,145]
[1,"ALL","Yes","Yes","Rear End",5104680,103]
[5,"MUS","No","Yes","Fixed Object",8141136,263]
[6,"FRA","No","No","Other Object",16160,2]
[6,"UNI","Yes","Yes","Animal",350678,32]
[3,"ERI","Yes","No","Pedalcycles",163683,4]
[2,"SAN","Yes","Yes","Angle",54139,1]
[6,"DEL","No","Yes","Angle",187923,7]
[1,"VAN","Yes","No","Right Turn",47325,1]
[8,"BUT","Yes","No","Rear End",2669202,112]
[7,"SHE","Yes","No","Pedalcycles",47325,1]
[2,"SAN","No","No","Animal",10814730,1031]
[3,"MED","Yes","Yes","Backing",24240,3]
[9,"JAC","Yes","Yes","Right Turn",430805,2]
[12,"CUY","Yes","Yes","Angle",12246805,417]
[11,"COL","Yes","No","Fixed Object",7988503,238]
[7,"LOG","Yes","No","Overturning",1070086,7]
[3,"RIC","Yes","No","Animal",233165,24]
[11,"JEF","No","No","Animal",2813233,103]
[9,"SCI","No","Yes","Head On",422725,1]
[7,"LOG","Yes","No","Left Turn",682659,26]
[6,"DEL","No","Yes","Right Turn",94539,6]
[10,"NOB","Yes","Yes","Parked Vehicle",476864,2]
[7,"MOT","No","No","Pedalcycles",493024,4]
[3,"ASD","No","Yes","Fixed Object",4507969,230]
[8,"GRE","No","Yes","Unknown",56560,7]
[6,"PIC","Yes","No","Parked Vehicle",56560,7]
[2,"OTT","Yes","No","Sideswipe - Passing",48480,6]
[10,"MOE","Yes","No","Sideswipe - Passing",205349,10]
[3,"WAY","Yes","Yes","Angle",62219,2]
[5,"COS","Yes","No","Backing",24240,3]
[6,"MAR","Yes","No","Fixed Object",134939,11]
[10,"ATH","Yes","No","Angle",11168056,320]
[2,"WIL","No","Yes","Overturning",663521,8]
[8,"GRE","Yes","No","Backing",215850,17]
[5,"FAI","Yes","Yes","Sideswipe - Passing",269989,18]
[11,"CAR","No","No","Pedalcycles",517375,3]
[8,"GRE","Yes","Yes","Overturning",961808,5]
[1,"ALL","Yes","No","Head On",10076886,190]
[1,"ALL","Yes","No","Train",78379,4]
[5,"KNO","Yes","No","Sideswipe - Passing",24240,3]
[7,"DAR","Yes","No","Parked Vehicle",72720,9]
[7,"AUG","Yes","No","Unknown",56560,7]
[3,"LOR","Yes","No","Unknown",1926821,52]
[4,"POR","Yes","Yes","Other Non-Collision",151099,13]
[9,"HIG","No","No","Other Non-Vehicle",422725,1]
[5,"LIC","No","No","Animal",12762658,628]
[9,"ROS","No","No","Right Turn",1664538,62]
[5,"GUE","No","Yes","Unknown",88880,11]
[1,"HAR","Yes","No","Animal",870219,102]
[9,"BRO","No","No","Pedestrian",4372798,20]
[5,"FAI","Yes","No","Overturning",2621989,24]
[11,"TUS","No","No","Left Turn",6345492,170]
[7,"MIA","Yes","No","Sideswipe - Passing",1565911,137]
[5,"GUE","Yes","No","Other Object",48480,6]
[6,"UNI","Yes","No","Left Turn",194737,7]
[10,"WAS","Yes","No","Parked Vehicle",16160,2]
[10,"MEG","No","No","Other Object",48480,6]
[7,"MER","No","No","Sideswipe - Passing",3841388,97]
[2,"OTT","Yes","No","Backing",56560,7]
[3,"ASD","Yes","Yes","Rear End",1091756,27]
[2,"FUL","Yes","No","Angle",95805,7]
[4,"POR","Yes","Yes","Left Turn",47325,1]
[2,"SAN","Yes","No","Right Turn",8080,1]
[5,"LIC","Yes","No","Head On",9064099,124]
[7,"MOT","Yes","No","Sideswipe - Meeting",3438806,29]
[6,"MAD","No","No","Pedalcycles",2323367,9]
[7,"MOT","Yes","Yes","Head On",5915693,57]
[6,"DEL","Yes","No","Pedestrian",11087610,90]
[4,"ATB","Yes","No","Rear End",2514421,126]
[8,"CLI","Yes","No","Animal",16160,2]
[7,"AUG","Yes","No","Sideswipe - Passing",135050,7]
[7,"MER","Yes","No","Parked Vehicle",1605751,128]
[12,"CUY","Yes","Yes","Overturning",17299203,198]
[4,"POR","Yes","No","Angle",183530,13]
[2,"SAN","Yes","Yes","Overturning",422725,1]
[8,"WAR","Yes","No","Fixed Object",12583378,322]
[8,"WAR","Yes","No","Rear End",13952422,532]
[4,"ATB","Yes","No","Right Turn",128125,11]
[4,"POR","Yes","No","Other Object",922192,36]
[12,"GEA","Yes","No","Parked Vehicle",362218,14]
[12,"CUY","Yes","No","Right Turn",102278604,5079]
[1,"DEF","Yes","Yes","Rear End",134939,11]
[11,"CAR","No","No","Unknown",56560,7]
[12,"LAK","Yes","No","Left Turn",42346514,1331]
[10,"GAL","Yes","No","Pedestrian",1947967,9]
[9,"PIK","Yes","No","Parked Vehicle",16160,2]
[3,"ASD","Yes","No","Right Turn",877028,68]
[4,"SUM","Yes","Yes","Animal",2770643,235]
[7,"SHE","Yes","No","Parked Vehicle",105040,13]
[4,"STA","Yes","No","Angle",1401436,59]
[7,"SHE","Yes","No","Other Non-Collision",974730,18]
[10,"NOB","Yes","No","Head On",587674,6]
[9,"LAW","Yes","Yes","Backing",48480,6]
[6,"PIC","Yes","No","Rear End",14314973,477]
[7,"CHP","No","No","Animal",5169857,246]
[5,"FAI","No","No","Left Turn",8220178,182]
[3,"RIC","Yes","No","Angle",101464,2]
[5,"LIC","Yes","Yes","Right Turn",63485,3]
[4,"ATB","Yes","No","Pedalcycles",8080,1]
[6,"UNI","Yes","No","Parked Vehicle",16160,2]
[4,"STA","No","Yes","Parked Vehicle",16160,2]
[8,"BUT","No","No","Other Non-Collision",1980362,58]
[11,"TUS","No","No","Fixed Object",74888366,1753]
[7,"CLA","Yes","Yes","Overturning",54139,1]
[6,"MAR","Yes","No","Train",187923,7]
[6,"MAR","Yes","No","Head On",4638020,71]
[2,"HEN","Yes","Yes","Angle",47325,1]
[11,"TUS","Yes","No","Animal",80800,10]
[3,"WAY","Yes","Yes","Right Turn",32320,4]
[11,"TUS","No","No","Parked Vehicle",1785627,81]
[10,"ATH","Yes","Yes","Animal",322045,35]
[4,"ATB","Yes","No","Fixed Object",5408931,170]
[4,"MAH","Yes","No","Parked Vehicle",13274736,650]
[8,"HAM","No","No","Other Non-Collision",636154,12]
[4,"SUM","No","No","Head On",582015,11]
[4,"SUM","Yes","No","Right Turn",32461286,2011]
[4,"SUM","No","Yes","Head On",62219,2]
[4,"SUM","Yes","Yes","Pedestrian",4570776,20]
[11,"BEL","No","Yes","Left Turn",71565,4]
[5,"GUE","Yes","Yes","Other Non-Collision",317203,23]
[6,"PIC","Yes","No","Right Turn",129280,16]
[10,"MOE","No","No","Sideswipe - Passing",1598746,53]
[2,"OTT","Yes","No","Right Turn",16160,2]
[3,"WAY","No","No","Other Object",651721,53]
[8,"GRE","Yes","Yes","Pedestrian",47325,1]
[1,"WYA","No","No","Sideswipe - Passing",4657537,96]
[3,"MED","No","No","Right Turn",2220787,96]
[11,"BEL","Yes","No","Animal",8080,1]
[7,"SHE","Yes","Yes","Parked Vehicle",263881,5]
[9,"ROS","No","Yes","Left Turn",16160,2]
[9,"JAC","No","No","Head On",4201594,55]
[9,"LAW","Yes","No","Pedestrian",54139,1]
[7,"CLA","No","Yes","Other Object",377339,41]
[2,"WOO","Yes","No","Other Non-Collision",873601,34]
[1,"VAN","Yes","No","Sideswipe - Meeting",54139,1]
[5,"MUS","No","No","Sideswipe - Passing",2867594,96]
[5,"GUE","Yes","Yes","Other Non-Collision",8080,1]
[9,"ROS","Yes","No","Sideswipe - Passing",7867073,511]
[2,"LUC","No","No","Head On",3740220,19]
[2,"LUC","No","No","Train",8080,1]
[6,"DEL","No","Yes","Overturning",1282360,13]
[8,"BUT","No","Yes","Other Non-Collision",48480,6]
[5,"MUS","No","Yes","Right Turn",54139,1]
[8,"HAM","Yes","No","Other Object",2610569,189]
[4,"MAH","Yes","No","Left Turn",63485,3]
[4,"ATB","No","No","Right Turn",1148094,42]
[3,"ERI","Yes","No","Left Turn",637309,17]
[3,"MED","Yes","Yes","Animal",8080,1]
[11,"COL","No","No","Pedalcycles",1124225,8]
[9,"HIG","Yes","No","Backing",32320,4]
[6,"DEL","Yes","Yes","Sideswipe - Meeting",422725,1]
[7,"AUG","Yes","Yes","Fixed Object",4038213,122]
[3,"ERI","Yes","No","Pedalcycles",2997832,34]
[11,"BEL","Yes","Yes","Overturning",509184,6]
[8,"PRE","Yes","No","Other Object",32320,4]
[9,"PIK","Yes","No","Fixed Object",8080,1]
[9,"ROS","No","Yes","Parked Vehicle",446965,4]
[5,"GUE","No","Yes","Left Turn",430805,2]
[3,"LOR","No","No","Angle",33586443,573]
[11,"CAR","Yes","No","Backing",8080,1]
[8,"PRE","No","No","Sideswipe - Passing",4711042,151]
[11,"CAR","Yes","No","Parked Vehicle",8080,1]
[5,"LIC","Yes","Yes","Animal",750058,62]
[9,"ROS","No","No","Parked Vehicle",2042359,68]
[9,"ROS","Yes","Yes","Left Turn",94539,6]
[5,"PER","No","No","Pedestrian",2401746,13]
[4,"SUM","Yes","No","Left Turn",10132743,353]
[7,"AUG","Yes","No","Left Turn",891138,33]
[11,"BEL","Yes","No","Unknown",8080,1]
[8,"WAR","Yes","Yes","Sideswipe - Passing",206504,15]
[2,"OTT","No","Yes","Fixed Object",5106100,115]
[7,"MIA","Yes","Yes","Backing",40400,5]
[11,"COL","Yes","No","Pedestrian",54139,1]
[3,"WAY","Yes","Yes","Rear End",1482385,46]
[2,"WOO","Yes","No","Fixed Object",1107694,37]
[1,"DEF","Yes","Yes","Backing",16160,2]
[9,"ROS","No","Yes","Overturning",827204,12]
[4,"SUM","Yes","Yes","Sideswipe - Passing",505237,26]
[5,"LIC","No","Yes","Fixed Object",12055914,405]
[6,"FRA","No","No","Pedestrian",1056458,7]
[3,"ERI","Yes","No","Backing",274720,34]
[6,"FRA","Yes","No","Rear End",752181780,33375]
[9,"HIG","Yes","No","Other Non-Collision",16160,2]
[7,"AUG","Yes","No","Other Non-Collision",40400,5]
[7,"LOG","Yes","Yes","Overturning",54139,1]
[1,"VAN","No","No","Angle",17439925,133]
[4,"STA","Yes","No","Angle",15220333,584]
[3,"RIC","Yes","No","Rear End",284994,15]
[3,"CRA","No","Yes","Overturning",861610,4]
[8,"BUT","Yes","No","Parked Vehicle",11478900,508]
[2,"SAN","No","No","Backing",1738416,80]
[3,"CRA","Yes","Yes","Sideswipe - Passing",511605,12]
[4,"POR","No","Yes","Unknown",40400,5]
[6,"FAY","No","No","Sideswipe - Meeting",8080,1]
[5,"LIC","Yes","No","Sideswipe - Passing",445217,38]
[1,"DEF","Yes","Yes","Fixed Object",1716741,26]
[7,"MOT","No","No","Unknown",8080,1]
[4,"ATB","Yes","No","Backing",269878,22]
[8,"CLI","Yes","Yes","Rear End",95805,7]
[8,"BUT","Yes","No","Unknown",1714431,16]
[3,"WAY","Yes","No","Left Turn",16160,2]
[9,"ADA","No","No","Other Non-Collision",2349657,49]
[3,"MED","No","Yes","Angle",95805,7]
[5,"GUE","Yes","Yes","Sideswipe - Passing",2618793,133]
[5,"FAI","Yes","No","Angle",266302,11]
[4,"POR","Yes","Yes","Other Non-Collision",63485,3]
[7,"MIA","Yes","Yes","Animal",8080,1]
[7,"DAR","Yes","No","Pedalcycles",476864,2]
[8,"PRE","No","Yes","Unknown",40400,5]
[9,"HIG","No","No","Fixed Object",62037615,1169]
[6,"MRW","No","Yes","Pedestrian",899589,3]
[2,"SEN","Yes","No","Other Object",80800,10]
[3,"MED","Yes","No","Other Object",197158,13]
[9,"LAW","Yes","Yes","Right Turn",152365,14]
[7,"SHE","Yes","No","Unknown",8080,1]
[2,"OTT","No","No","Head On",6237660,43]
[5,"FAI","No","No","Overturning",9942838,94]
[8,"BUT","No","Yes","Parked Vehicle",166104,10]
[4,"SUM","Yes","No","Backing",30198993,2964]
[6,"DEL","No","No","Overturning",3996913,51]
[3,"LOR","Yes","No","Sideswipe - Passing",6199923,368]
[8,"PRE","No","Yes","Backing",24240,3]
[7,"MIA","No","No","Overturning",6069543,60]
[3,"CRA","Yes","No","Overturning",632467,5]
[12,"LAK","Yes","No","Unknown",175339,16]
[8,"PRE","Yes","No","Sideswipe - Passing",275648,13]
[12,"GEA","No","Yes","Rear End",1592860,32]
[10,"NOB","No","Yes","Rear End",1309132,18]
[2,"WOO","Yes","Yes","Head On",1102406,11]
[9,"LAW","Yes","Yes","Parked Vehicle",125704,5]
[4,"MAH","Yes","Yes","Fixed Object",23967125,696]
[1,"WYA","Yes","No","Head On",133784,6]
[3,"MED","Yes","No","Animal",24240,3]
[12,"GEA","Yes","Yes","Animal",335784,31]
[4,"POR","Yes","No","Sideswipe - Meeting",422725,1]
[4,"STA","No","No","Other Non-Vehicle",8080,1]
[8,"CLE","No","Yes","Overturning",438885,3]
[8,"WAR","Yes","No","Angle",55304688,1707]
[6,"MAD","Yes","No","Other Non-Collision",8080,1]
[10,"NOB","Yes","Yes","Rear End",118890,5]
[10,"WAS","Yes","No","Rear End",13396412,679]
[6,"FAY","Yes","No","Left Turn",8080,1]
[4,"TRU","Yes","Yes","Sideswipe - Passing",446965,4]
[9,"JAC","Yes","Yes","Rear End",149944,8]
[4,"POR","No","No","Rear End",18073905,596]
[3,"RIC","No","No","Angle",21083580,322]
[4,"STA","Yes","No","Overturning",594488,6]
[7,"AUG","Yes","Yes","Right Turn",54139,1]
[5,"PER","No","No","Sideswipe - Meeting",471205,7]
[11,"TUS","Yes","No","Pedalcycles",3868190,45]
[1,"DEF","Yes","No","Parked Vehicle",16160,2]
[4,"POR","Yes","No","Pedalcycles",163683,4]
[3,"ERI","Yes","Yes","Left Turn",8080,1]
[4,"STA","Yes","No","Right Turn",17179212,1094]
[7,"CLA","No","No","Overturning",3520758,40]
[8,"CLE","Yes","No","Parked Vehicle",137360,17]
[8,"GRE","Yes","Yes","Right Turn",118779,9]
[8,"WAR","No","Yes","Other Non-Collision",177760,22]
[6,"MAD","Yes","No","Backing",895725,106]
[9,"PIK","No","No","Pedalcycles",422725,1]
[7,"CLA","Yes","Yes","Rear End",666388,28]
[8,"BUT","Yes","No","Pedestrian",2935724,28]
[4,"POR","Yes","No","Other Object",78379,4]
[3,"CRA","Yes","No","Sideswipe - Passing",47325,1]
[1,"WYA","Yes","No","Pedestrian",155603,3]
[1,"DEF","Yes","No","Parked Vehicle",1636465,79]
[3,"RIC","Yes","No","Unknown",236403,13]
[2,"FUL","Yes","No","Sideswipe - Passing",63485,3]
[6,"UNI","Yes","Yes","Rear End",1778478,63]
[1,"HAN","Yes","Yes","Pedestrian",422725,1]
[8,"CLE","Yes","No","Other Non-Collision",3946661,283]
[4,"ATB","No","No","Parked Vehicle",2343438,40]
[3,"CRA","Yes","No","Pedestrian",2414776,18]
[11,"BEL","Yes","No","Right Turn",1902172,99]
[8,"CLE","Yes","No","Other Object",566417,53]
[12,"CUY","Yes","Yes","Other Object",120045,10]
[9,"HIG","Yes","No","Head On",86459,5]
[6,"MAR","No","No","Rear End",8755349,240]
[4,"ATB","Yes","No","Head On",636154,12]
[4,"ATB","Yes","No","Train",422725,1]
[3,"HUR","Yes","No","Left Turn",16160,2]
[1,"HAN","Yes","Yes","Overturning",827204,12]
[8,"WAR","Yes","No","Other Non-Vehicle",47325,1]
[8,"BUT","No","Yes","Fixed Object",1165185,27]
[3,"RIC","No","No","Pedestrian",1477917,7]
[11,"CAR","No","No","Parked Vehicle",876244,32]
[4,"SUM","Yes","Yes","Angle",16160,2]
[10,"WAS","Yes","Yes","Fixed Object",40400,5]
[2,"SAN","Yes","No","Other Object",237558,18]
[7,"MOT","Yes","No","Angle",352234259,9799]
[4,"POR","Yes","Yes","Angle",86459,5]
[3,"ASD","Yes","Yes","Overturning",853530,3]
[3,"MED","Yes","No","Backing",96960,12]
[4,"POR","Yes","Yes","Angle",63485,3]
[8,"GRE","Yes","No","Animal",6077030,557]
[1,"PUT","Yes","No","Backing",121200,15]
[10,"ATH","No","No","Sideswipe - Meeting",70299,3]
[3,"MED","Yes","No","Parked Vehicle",109544,3]
[2,"WOO","No","No","Pedalcycles",1435431,14]
[4,"POR","No","No","Backing",973988,80]
[9,"PIK","No","No","Rear End",4709920,93]
[3,"WAY","Yes","No","Overturning",594488,6]
[3,"RIC","Yes","No","Fixed Object",105040,13]
[8,"GRE","No","No","Backing",943867,90]
[2,"WIL","Yes","No","Overturning",539083,4]
[1,"VAN","Yes","No","Backing",16160,2]
[2,"HEN","Yes","No","Unknown",113120,14]
[5,"MUS","Yes","No","Sideswipe - Passing",12337414,893]
[1,"VAN","Yes","No","Fixed Object",24240,3]
[1,"VAN","No","No","Overturning",6563162,55]
[12,"GEA","Yes","No","Other Object",8080,1]
[9,"SCI","Yes","No","Left Turn",8080,1]
[6,"MAD","Yes","No","Left Turn",756534,40]
[1,"ALL","No","Yes","Sideswipe - Meeting",422725,1]
[1,"WYA","Yes","No","Sideswipe - Passing",1136776,52]
[6,"UNI","No","Yes","Sideswipe - Passing",1471743,100]
[3,"MED","No","No","Fixed Object",67862499,1577]
[5,"MUS","Yes","Yes","Parked Vehicle",126970,6]
[9,"LAW","No","No","Backing",805014,46]
[8,"GRE","Yes","No","Pedalcycles",9829379,84]
[2,"OTT","No","Yes","Rear End",1471438,25]
[3,"CRA","Yes","No","Unknown",78379,4]
[11,"BEL","No","No","Angle",8519996,244]
[6,"UNI","Yes","No","Parked Vehicle",362445,40]
[12,"CUY","No","No","Overturning",250142,9]
[8,"WAR","Yes","No","Other Non-Collision",517264,7]
[1,"WYA","No","No","Parked Vehicle",968251,36]
[10,"NOB","No","Yes","Animal",1470477,99]
[3,"MED","Yes","No","Head On",7725403,126]
[4,"STA","No","Yes","Right Turn",95805,7]
[5,"FAI","Yes","Yes","Left Turn",16160,2]
[2,"WIL","No","Yes","Pedestrian",422725,1]
[2,"SEN","No","No","Rear End",8123478,200]
[4,"SUM","Yes","Yes","Backing",80800,10]
[12,"GEA","No","No","Parked Vehicle",1931771,56]
[5,"KNO","Yes","No","Sideswipe - Passing",2269799,203]
[11,"BEL","No","Yes","Backing",184685,18]
[4,"STA","Yes","No","Other Non-Collision",24240,3]
[9,"ROS","No","No","Rear End",13777294,352]
[4,"SUM","No","No","Pedestrian",280041,7]
[11,"COL","Yes","No","Pedalcycles",953728,4]
[2,"OTT","Yes","Yes","Unknown",8080,1]
[6,"DEL","Yes","Yes","Other Non-Collision",517375,3]
[3,"ERI","Yes","No","Backing",24240,3]
[4,"SUM","Yes","Yes","Parked Vehicle",95805,7]
[3,"WAY","Yes","No","Right Turn",62219,2]
[6,"FAY","Yes","Yes","Backing",8080,1]
[6,"FRA","Yes","Yes","Overturning",15058158,195]
[4,"TRU","No","Yes","Head On",517264,7]
[5,"MUS","No","No","Animal",5242931,492]
[3,"RIC","No","No","Sideswipe - Passing",5012342,141]
[8,"BUT","Yes","No","Fixed Object",5818958,180]
[12,"GEA","Yes","Yes","Rear End",873823,26]
[8,"GRE","No","No","Unknown",248170,21]
[7,"SHE","Yes","Yes","Left Turn",524189,3]
[5,"FAI","No","No","Unknown",102619,7]
[3,"WAY","Yes","No","Head On",3955250,49]
[3,"MED","Yes","No","Rear End",861796,45]
[3,"WAY","Yes","No","Sideswipe - Meeting",117624,4]
[6,"MAR","No","No","Parked Vehicle",970223,24]
[5,"FAI","Yes","No","Sideswipe - Passing",32320,4]
[7,"MER","No","Yes","Animal",32320,4]
[2,"FUL","Yes","No","Pedestrian",422725,1]
[6,"MRW","Yes","No","Fixed Object",8080,1]
[11,"JEF","Yes","No","Right Turn",16160,2]
[7,"MIA","No","Yes","Angle",8080,1]
[10,"WAS","Yes","No","Sideswipe - Meeting",54139,1]
[6,"MRW","Yes","No","Animal",24240,3]
[12,"CUY","Yes","No","Pedalcycles",81473479,1063]
[8,"CLI","Yes","Yes","Fixed Object",1114173,19]
[4,"POR","Yes","No","Pedestrian",11434152,97]
[5,"LIC","Yes","No","Angle",1042348,42]
[3,"ERI","No","No","Overturning",3415607,31]
[10,"ATH","Yes","Yes","Head On",71565,4]
[3,"ASD","No","No","Fixed Object",54193091,1173]
[2,"WOO","Yes","Yes","Other Object",96960,12]
[11,"TUS","Yes","No","Angle",21440244,900]
[6,"FRA","Yes","No","Fixed Object",330805375,9569]
[5,"GUE","No","No","Backing",651832,49]
[3,"LOR","Yes","Yes","Other Object",1404765,169]
[10,"WAS","Yes","No","Angle",7138289,134]
[10,"ATH","No","No","Pedestrian",1055192,6]
[4,"POR","Yes","No","Rear End",26027847,1207]
[4,"SUM","No","No","Other Object",8080,1]
[8,"CLE","Yes","Yes","Parked Vehicle",619994,10]
[1,"PAU","No","Yes","Unknown",24240,3]
[11,"JEF","Yes","No","Pedestrian",54139,1]
[11,"COL","Yes","No","Backing",498650,52]
[7,"MER","No","No","Head On",2622213,46]
[12,"LAK","Yes","Yes","Other Object",339360,42]
[4,"SUM","Yes","No","Head On",3588895,93]
[4,"SUM","Yes","No","Train",16160,2]
[10,"MOE","Yes","No","Angle",683479,13]
[3,"LOR","Yes","No","Left Turn",590095,12]
[10,"VIN","No","No","Angle",6788956,69]
[10,"NOB","Yes","Yes","Animal",514810,54]
[2,"SAN","Yes","No","Animal",320779,34]
[3,"WAY","Yes","Yes","Animal",692121,58]
[10,"NOB","No","Yes","Fixed Object",2366598,83]
[10,"WAS","Yes","No","Pedalcycles",958083,17]
[11,"HOL","No","No","Pedestrian",3087086,18]
[3,"LOR","Yes","Yes","Backing",527765,14]
[8,"WAR","Yes","Yes","Rear End",5680926,236]
[6,"PIC","Yes","No","Fixed Object",1145673,36]
[4,"SUM","No","Yes","Sideswipe - Passing",3216037,163]
[11,"BEL","No","Yes","Unknown",110699,8]
[1,"HAR","Yes","No","Left Turn",588829,11]
[3,"MED","Yes","No","Animal",409770,41]
[12,"GEA","No","Yes","Fixed Object",938463,34]
[5,"COS","Yes","No","Sideswipe - Passing",1763922,84]
[11,"HAS","No","No","Other Non-Collision",1994364,31]
[8,"CLE","No","No","Right Turn",2070621,96]
[10,"NOB","Yes","No","Parked Vehicle",8080,1]
[3,"HUR","Yes","No","Left Turn",769827,22]
[11,"HAS","Yes","No","Right Turn",16160,2]
[4,"MAH","No","No","Angle",24453583,436]
[3,"CRA","Yes","No","Pedalcycles",318020,6]
[3,"LOR","Yes","No","Head On",125704,5]
[4,"STA","Yes","No","Backing",15996978,1620]
[8,"BUT","Yes","No","Pedalcycles",1153415,15]
[3,"MED","Yes","Yes","Overturning",8080,1]
[11,"COL","Yes","No","Rear End",8721281,327]
[3,"HUR","Yes","No","Fixed Object",2798001,80]
[1,"ALL","Yes","Yes","Backing",86459,5]
[4,"POR","Yes","Yes","Sideswipe - Passing",321596,17]
[10,"HOC","Yes","No","Head On",385192,16]
[2,"LUC","Yes","Yes","Other Non-Collision",40400,5]
[7,"MOT","Yes","No","Other Object",3767142,114]
[7,"LOG","Yes","Yes","Unknown",8080,1]
[6,"PIC","No","Yes","Overturning",101464,2]
[4,"POR","Yes","Yes","Sideswipe - Passing",3691970,182]
[8,"HAM","Yes","No","Other Non-Collision",834467,30]
[7,"CLA","Yes","No","Unknown",40400,5]
[4,"SUM","Yes","Yes","Animal",95805,7]
[8,"WAR","Yes","Yes","Other Object",589840,73]
[4,"STA","Yes","Yes","Overturning",1985572,35]
[6,"PIC","No","No","Backing",876806,76]
[3,"HUR","Yes","No","Backing",129280,16]
[3,"CRA","No","No","Animal",8563138,863]
[8,"CLE","No","No","Rear End",19446504,747]
[2,"WOO","Yes","No","Overturning",101464,2]
[8,"WAR","No","No","Other Object",129280,16]
[1,"HAN","Yes","No","Sideswipe - Passing",182264,12]
[5,"PER","Yes","No","Backing",32320,4]
[4,"ATB","No","No","Overturning",6165718,62]
[8,"CLE","Yes","No","Rear End",764168,27]
[8,"WAR","Yes","Yes","Other Non-Collision",512389,48]
[10,"HOC","No","No","Right Turn",487811,23]
[5,"MUS","Yes","Yes","Head On",455045,5]
[6,"FRA","No","Yes","Other Non-Collision",110699,8]
[9,"SCI","No","Yes","Sideswipe - Passing",62219,2]
[4,"TRU","Yes","Yes","Right Turn",244594,10]
[8,"HAM","Yes","Yes","Fixed Object",9476031,254]
[2,"SAN","Yes","No","Unknown",8080,1]
[10,"WAS","No","No","Unknown",103885,8]
[5,"COS","Yes","No","Head On",723768,22]
[7,"SHE","Yes","No","Angle",8080,1]
[10,"GAL","Yes","No","Other Object",32320,4]
[11,"JEF","Yes","No","Other Object",8080,1]
[6,"MAD","Yes","No","Fixed Object",94539,6]
[5,"LIC","No","No","Parked Vehicle",2051705,70]
[4,"STA","Yes","Yes","Other Non-Collision",16160,2]
[2,"SAN","Yes","No","Head On",1749172,26]
[2,"SAN","Yes","No","Train",478130,3]
[7,"MOT","No","No","Right Turn",479620,26]
[1,"WYA","Yes","Yes","Fixed Object",70299,3]
[4,"TRU","Yes","Yes","Unknown",102619,7]
[8,"CLE","Yes","Yes","Left Turn",182375,8]
[11,"TUS","Yes","No","Pedestrian",6640051,36]
[2,"WOO","No","No","Other Object",461488,36]
[11,"JEF","Yes","No","Other Non-Collision",1005413,52]
[9,"ROS","Yes","No","Animal",32320,4]
[11,"COL","Yes","Yes","Left Turn",8080,1]
[10,"HOC","No","No","Backing",458956,34]
[6,"MRW","No","No","Right Turn",2001624,45]
[3,"CRA","No","No","Right Turn",220243,11]
[4,"SUM","Yes","Yes","Rear End",18705773,786]
[10,"GAL","No","Yes","Head On",8080,1]
[7,"MIA","No","No","Rear End",8966782,328]
[6,"FAY","No","Yes","Other Non-Collision",322045,35]
[5,"COS","No","No","Other Non-Collision",990070,33]
[9,"BRO","No","No","Angle",30550457,484]
[6,"FRA","Yes","Yes","Unknown",1902096,80]
[9,"SCI","Yes","No","Parked Vehicle",160445,15]
[4,"POR","Yes","Yes","Overturning",78379,4]
[7,"LOG","No","No","Sideswipe - Passing",3934439,110]
[1,"HAN","Yes","No","Rear End",237669,14]
[10,"ATH","No","Yes","Sideswipe - Passing",235137,12]
[8,"WAR","Yes","Yes","Right Turn",196003,8]
[5,"MUS","No","No","Rear End",10248904,273]
[4,"MAH","No","Yes","Other Object",738518,80]
[7,"LOG","No","Yes","Unknown",16160,2]
[2,"HEN","No","No","Pedestrian",430805,2]
[5,"LIC","Yes","No","Head On",3902447,60]
[5,"FAI","No","Yes","Other Object",48480,6]
[6,"PIC","Yes","No","Sideswipe - Passing",16160,2]
[6,"PIC","Yes","No","Left Turn",242062,8]
[8,"CLE","Yes","No","Right Turn",48480,6]
[4,"STA","Yes","Yes","Other Object",422725,1]
[7,"SHE","Yes","Yes","Head On",956149,10]
[12,"LAK","No","No","Sideswipe - Meeting",8080,1]
[10,"VIN","No","No","Other Object",32320,4]
[3,"MED","Yes","No","Sideswipe - Passing",8159702,487]
[3,"LOR","Yes","No","Overturning",54139,1]
[9,"PIK","No","No","Fixed Object",39805816,902]
[8,"BUT","Yes","Yes","Overturning",54139,1]
[1,"HAN","No","Yes","Left Turn",70299,3]
[6,"PIC","Yes","No","Overturning",478130,3]
[5,"LIC","Yes","Yes","Fixed Object",9010564,265]
[2,"HEN","Yes","No","Left Turn",725591,33]
[7,"MIA","Yes","No","Fixed Object",17100588,566]
[4,"MAH","Yes","No","Head On",125704,5]
[9,"BRO","No","No","Pedalcycles",1002319,6]
[9,"SCI","Yes","No","Sideswipe - Meeting",55405,2]
[6,"MAD","Yes","No","Unknown",133784,6]
[10,"NOB","No","No","Left Turn",471651,21]
[8,"WAR","Yes","Yes","Animal",852566,73]
[7,"CLA","No","No","Other Non-Collision",873341,61]
[3,"MED","Yes","Yes","Unknown",48480,6]
[12,"CUY","Yes","No","Animal",2608292,126]
[6,"MAD","No","Yes","Head On",1078166,8]
[7,"MOT","Yes","Yes","Other Non-Collision",737618,14]
[3,"HUR","Yes","No","Rear End",3508587,116]
[3,"CRA","No","No","Pedalcycles",47325,1]
[12,"GEA","No","No","Left Turn",12172599,249]
[8,"CLE","Yes","No","Backing",177760,22]
[9,"SCI","No","No","Overturning",11369410,105]
[6,"FAY","Yes","Yes","Animal",96960,12]
[7,"MOT","No","Yes","Angle",126859,10]
[3,"WAY","Yes","No","Parked Vehicle",2076023,122]
[8,"HAM","Yes","No","Pedestrian",243259687,2116]
[3,"LOR","Yes","Yes","Sideswipe - Passing",581533,46]
[4,"TRU","Yes","No","Sideswipe - Passing",23808931,1293]
[9,"SCI","No","No","Sideswipe - Meeting",478130,3]
[10,"WAS","Yes","No","Other Object",24240,3]
[8,"WAR","Yes","Yes","Angle",1315946,18]
[8,"WAR","Yes","No","Animal",738518,80]
[2,"LUC","Yes","No","Angle",3867340,115]
[7,"MIA","Yes","Yes","Fixed Object",9319240,299]
[2,"FUL","Yes","No","Angle",7151097,147]
[3,"MED","Yes","Yes","Other Non-Collision",661549,20]
[6,"PIC","Yes","No","Pedalcycles",278775,6]
[5,"LIC","No","No","Unknown",259488,11]
[3,"HUR","No","No","Pedestrian",2590489,7]
[5,"GUE","Yes","No","Unknown",78379,4]
[7,"LOG","No","No","Head On",4672910,58]
[4,"POR","No","Yes","Parked Vehicle",380688,26]
[7,"MOT","Yes","No","Backing",328859,35]
[3,"LOR","Yes","No","Pedestrian",1431858,7]
[5,"LIC","Yes","Yes","Animal",665909,67]
[7,"MOT","Yes","No","Sideswipe - Passing",924724,38]
[11,"COL","No","No","Right Turn",2005422,48]
[5,"GUE","Yes","Yes","Other Object",169680,21]
[11,"HOL","No","No","Other Object",950490,15]
[4,"POR","No","Yes","Right Turn",32320,4]
[7,"CLA","Yes","Yes","Unknown",72720,9]
[9,"JAC","Yes","No","Animal",1857613,190]
[10,"GAL","Yes","No","Rear End",32320,4]
[4,"STA","No","No","Sideswipe - Passing",8555781,263]
[9,"HIG","Yes","No","Angle",922303,32]
[7,"MOT","Yes","No","Unknown",16160,2]
[11,"BEL","Yes","No","Animal",562024,59]
[11,"COL","Yes","Yes","Fixed Object",2465306,61]
[3,"ERI","Yes","No","Left Turn",915749,5]
[3,"LOR","Yes","No","Head On",2523686,75]
[3,"LOR","Yes","No","Train",54139,1]
[7,"CLA","No","Yes","Other Non-Collision",563179,64]
[6,"DEL","Yes","No","Pedestrian",1095703,7]
[6,"FAY","Yes","No","Parked Vehicle",24240,3]
[2,"WOO","Yes","No","Left Turn",171763,5]
[3,"ERI","No","Yes","Other Non-Collision",803269,84]
[7,"CHP","Yes","No","Animal",615008,55]
[7,"AUG","Yes","No","Animal",652059,75]
[10,"MEG","Yes","No","Parked Vehicle",614224,19]
[1,"ALL","Yes","Yes","Other Non-Collision",8080,1]
[3,"ERI","Yes","No","Right Turn",164838,9]
[1,"DEF","Yes","Yes","Head On",422725,1]
[8,"CLI","No","No","Other Object",210080,26]
[7,"MIA","Yes","No","Pedalcycles",3957665,47]
[6,"FRA","Yes","No","Backing",50699169,4730]
[8,"CLI","Yes","No","Unknown",8080,1]
[11,"TUS","No","Yes","Fixed Object",9697727,224]
[2,"WIL","Yes","No","Other Object",32320,4]
[5,"FAI","No","No","Right Turn",1794971,53]
[11,"BEL","Yes","Yes","Overturning",8080,1]
[4,"MAH","No","Yes","Sideswipe - Passing",5587704,284]
[9,"JAC","No","Yes","Animal",129280,16]
[10,"ATH","Yes","No","Pedalcycles",802964,9]
[2,"WOO","Yes","No","Right Turn",24240,3]
[7,"SHE","Yes","Yes","Overturning",109544,3]
[11,"TUS","No","No","Right Turn",712674,54]
[4,"POR","Yes","Yes","Angle",55405,2]
[2,"WOO","Yes","Yes","Sideswipe - Passing",1978279,74]
[4,"MAH","Yes","No","Sideswipe - Passing",192765,19]
[12,"GEA","Yes","No","Backing",609460,56]
[1,"VAN","Yes","No","Pedalcycles",163683,4]
[5,"LIC","No","No","Backing",1651924,128]
[3,"LOR","Yes","Yes","Other Non-Collision",202000,25]
[12,"LAK","Yes","Yes","Pedestrian",845450,2]
[6,"PIC","Yes","No","Rear End",6009821,222]
[7,"CLA","No","Yes","Head On",547163,5]
[3,"CRA","Yes","Yes","Other Non-Collision",158024,9]
[2,"WOO","Yes","No","Pedestrian",7882941,53]
[11,"JEF","Yes","Yes","Fixed Object",13048960,285]
[2,"SAN","Yes","Yes","Parked Vehicle",101464,2]
[4,"POR","Yes","No","Pedestrian",101464,2]
[6,"FRA","No","Yes","Other Object",243217,13]
[6,"FRA","Yes","Yes","Right Turn",5611972,200]
[5,"MUS","Yes","Yes","Other Non-Collision",311544,28]
[12,"CUY","No","No","Right Turn",40400,5]
[9,"SCI","Yes","Yes","Overturning",422725,1]
[5,"GUE","No","Yes","Overturning",1123294,25]
[4,"STA","Yes","No","Overturning",6585050,89]
[5,"FAI","No","Yes","Pedestrian",54139,1]
[2,"OTT","Yes","No","Rear End",1511838,30]
[1,"ALL","Yes","No","Other Object",8080,1]
[8,"GRE","Yes","Yes","Fixed Object",2202804,83]
[6,"UNI","Yes","No","Backing",64640,8]
[7,"CLA","Yes","No","Rear End",58514704,2245]
[8,"PRE","No","No","Other Object",207659,20]
[6,"FRA","Yes","No","Head On",917015,6]
[4,"POR","Yes","No","Sideswipe - Passing",294229,21]
[3,"MED","Yes","No","Backing",1475175,168]
[9,"HIG","Yes","No","Animal",609349,60]
[11,"COL","Yes","No","Sideswipe - Meeting",422725,1]
[2,"LUC","Yes","Yes","Sideswipe - Passing",898958,61]
[8,"HAM","No","Yes","Fixed Object",2950325,109]
[6,"FRA","Yes","No","Other Object",401241,22]
[11,"TUS","No","Yes","Rear End",4253571,106]
[10,"ATH","Yes","No","Pedestrian",4132223,31]
[12,"LAK","Yes","No","Right Turn",11540760,696]
[7,"SHE","Yes","No","Sideswipe - Passing",4809545,326]
[2,"SAN","Yes","No","Fixed Object",56560,7]
[7,"CHP","No","Yes","Animal",8080,1]
[4,"SUM","Yes","No","Unknown",8080,1]
[7,"MOT","Yes","No","Sideswipe - Passing",1190882,106]
[7,"AUG","No","Yes","Backing",72720,9]
[12,"LAK","No","Yes","Angle",78379,4]
[4,"SUM","Yes","Yes","Other Object",64640,8]
[1,"ALL","Yes","Yes","Animal",904622,90]
[12,"CUY","Yes","Yes","Rear End",21329167,973]
[7,"SHE","Yes","No","Overturning",54139,1]
[2,"WOO","Yes","No","Sideswipe - Meeting",430805,2]
[3,"WAY","No","No","Angle",51751994,741]
[1,"WYA","Yes","No","Angle",16160,2]
[6,"FRA","Yes","No","Unknown",7004446,298]
[2,"WOO","Yes","No","Rear End",21044401,844]
[8,"BUT","Yes","No","Backing",804424,89]
[6,"MRW","Yes","No","Left Turn",8080,1]
[9,"ADA","No","No","Overturning",10422161,83]
[7,"AUG","Yes","No","Other Non-Collision",148678,7]
[12,"CUY","Yes","Yes","Angle",2546439,59]
[1,"HAR","Yes","No","Unknown",103885,8]
[6,"MAD","No","Yes","Sideswipe - Passing",11939902,462]
[1,"VAN","Yes","No","Pedestrian",1695739,12]
[4,"POR","Yes","Yes","Other Object",137360,17]
[2,"LUC","Yes","No","Sideswipe - Meeting",1104678,40]
[2,"OTT","Yes","No","Parked Vehicle",8080,1]
[3,"HUR","Yes","No","Rear End",87725,6]
[7,"SHE","Yes","No","Pedestrian",2503169,30]
[11,"TUS","Yes","Yes","Animal",16160,2]
[2,"OTT","No","Yes","Left Turn",62219,2]
[7,"MOT","Yes","Yes","Pedestrian",5922989,22]
[8,"PRE","Yes","No","Right Turn",70299,3]
[2,"SAN","Yes","No","Parked Vehicle",24240,3]
[2,"FUL","No","No","Backing",1563379,135]
[4,"STA","No","No","Parked Vehicle",1537571,60]
[6,"DEL","Yes","Yes","Pedestrian",1690900,4]
[4,"SUM","Yes","Yes","Backing",465175,43]
[3,"HUR","Yes","No","Fixed Object",102619,7]
[3,"RIC","Yes","No","Head On",8080,1]
[9,"HIG","Yes","No","Pedestrian",1721356,12]
[7,"AUG","No","No","Head On",4360103,33]
[4,"SUM","No","Yes","Other Object",215739,21]
[7,"AUG","Yes","No","Fixed Object",2921024,106]
[6,"FRA","Yes","No","Animal",10820328,848]
[8,"WAR","No","No","Sideswipe - Passing",6309156,149]
[2,"SEN","Yes","No","Head On",181109,7]
[7,"DAR","Yes","No","Rear End",94539,6]
[1,"ALL","Yes","No","Head On",611914,9]
[11,"JEF","Yes","Yes","Parked Vehicle",8080,1]
[7,"MER","Yes","No","Backing",48480,6]
[7,"AUG","Yes","Yes","Left Turn",54139,1]
[5,"LIC","No","No","Left Turn",12542902,298]
[8,"CLE","Yes","Yes","Fixed Object",12531299,565]
[3,"WAY","Yes","Yes","Overturning",24240,3]
[8,"BUT","Yes","Yes","Rear End",140598,6]
[9,"ADA","No","No","Head On",5252504,63]
[11,"BEL","Yes","Yes","Sideswipe - Passing",6231196,359]
[6,"FRA","No","Yes","Angle",47325,1]
[4,"TRU","Yes","Yes","Animal",4983214,425]
[8,"WAR","Yes","Yes","Animal",206504,15]
[6,"UNI","Yes","No","Right Turn",860757,70]
[2,"WIL","No","Yes","Sideswipe - Passing",1263264,93]
[5,"GUE","Yes","No","Sideswipe - Meeting",1268175,3]
[5,"GUE","Yes","No","Overturning",357154,10]
[7,"MIA","Yes","Yes","Rear End",8202303,218]
[11,"JEF","Yes","Yes","Left Turn",1354969,26]
[10,"HOC","Yes","Yes","Sideswipe - Passing",430434,33]
[8,"GRE","No","Yes","Right Turn",8080,1]
[7,"MER","No","No","Pedestrian",3229770,12]
[12,"LAK","Yes","No","Pedalcycles",12763615,119]
[5,"KNO","Yes","No","Other Non-Collision",573824,14]
[3,"CRA","Yes","No","Right Turn",472806,26]
[5,"KNO","Yes","No","Other Object",32320,4]
[2,"WOO","No","Yes","Other Non-Collision",1272053,85]
[3,"ASD","No","No","Animal",13756113,1054]
[10,"MEG","No","Yes","Sideswipe - Passing",8080,1]
[11,"TUS","Yes","No","Head On",16160,2]
[7,"DAR","Yes","Yes","Overturning",101464,2]
[3,"LOR","No","No","Other Object",242400,30]
[9,"JAC","No","No","Pedalcycles",476864,2]
[7,"AUG","No","Yes","Animal",1015432,94]
[10,"WAS","Yes","Yes","Rear End",16160,2]
[2,"WIL","No","No","Animal",17672741,1782]
[7,"CLA","Yes","No","Animal",573342,49]
[4,"ATB","Yes","No","Pedestrian",5223087,30]
[1,"PAU","No","Yes","Rear End",844630,15]
[10,"WAS","Yes","No","Angle",16160,2]
[11,"TUS","No","No","Animal",12706018,999]
[4,"SUM","Yes","No","Parked Vehicle",931278,65]
[3,"LOR","No","No","Pedalcycles",4246983,19]
[9,"HIG","Yes","No","Parked Vehicle",522552,33]
[4,"MAH","Yes","Yes","Left Turn",804679,28]
[7,"CLA","No","No","Angle",13149185,225]
[8,"BUT","Yes","No","Fixed Object",35570324,842]
[3,"LOR","Yes","Yes","Fixed Object",12146803,329]
[4,"STA","Yes","No","Sideswipe - Meeting",16160,2]
[6,"PIC","No","No","Rear End",14458099,368]
[2,"LUC","Yes","Yes","Sideswipe - Passing",39109795,2220]
[7,"LOG","Yes","No","Animal",864333,81]
[7,"CLA","Yes","No","Pedalcycles",217822,5]
[8,"PRE","Yes","No","Backing",80800,10]
[9,"ROS","Yes","Yes","Parked Vehicle",869690,5]
[8,"HAM","No","No","Head On",3298875,55]
[8,"HAM","No","No","Train",8080,1]
[7,"AUG","Yes","No","Parked Vehicle",730438,79]
[3,"MED","Yes","Yes","Overturning",47325,1]
[8,"HAM","Yes","Yes","Head On",9387822,114]
[8,"HAM","Yes","Yes","Train",8080,1]
[7,"CLA","Yes","Yes","Backing",111965,9]
[5,"FAI","Yes","No","Other Object",152365,14]
[4,"ATB","Yes","No","Overturning",969888,6]
[7,"CLA","Yes","No","Animal",32320,4]
[11,"COL","Yes","Yes","Fixed Object",298622,15]
[6,"PIC","Yes","No","Fixed Object",4052620,124]
[5,"FAI","Yes","No","Pedalcycles",1118677,9]
[6,"PIC","Yes","No","Rear End",1262924,41]
[6,"UNI","Yes","Yes","Backing",16160,2]
[1,"PAU","No","No","Backing",558337,52]
[5,"FAI","No","Yes","Angle",63485,3]
[12,"CUY","No","No","Parked Vehicle",80800,10]
[3,"WAY","Yes","No","Fixed Object",13396322,418]
[3,"RIC","No","No","Other Object",533053,40]
[3,"WAY","Yes","No","Pedestrian",108278,2]
[11,"CAR","No","No","Fixed Object",35620044,745]
[6,"FRA","Yes","Yes","Other Non-Collision",520131,27]
[12,"LAK","Yes","Yes","Rear End",4176725,197]
[11,"TUS","Yes","No","Rear End",29207441,1470]
[4,"SUM","Yes","No","Overturning",8899742,106]
[6,"PIC","Yes","No","Angle",487365,9]
[1,"ALL","Yes","No","Angle",125704,5]
[2,"SAN","Yes","Yes","Other Non-Collision",118779,9]
[3,"RIC","No","No","Other Non-Collision",519203,48]
[9,"PIK","No","Yes","Rear End",8080,1]
[6,"MAR","No","Yes","Fixed Object",133784,6]
[4,"STA","Yes","Yes","Sideswipe - Passing",446965,4]
[1,"HAR","Yes","No","Fixed Object",179843,6]
[3,"LOR","No","Yes","Other Non-Collision",535845,15]
[2,"SAN","No","No","Pedalcycles",953728,4]
[12,"CUY","No","No","Left Turn",1107805,33]
[8,"PRE","No","No","Head On",8326076,81]
[10,"MRG","No","No","Other Non-Collision",3126891,32]
[8,"WAR","Yes","Yes","Sideswipe - Passing",8087122,443]
[5,"FAI","Yes","Yes","Animal",145440,18]
[3,"RIC","Yes","Yes","Animal",47325,1]
[3,"RIC","Yes","Yes","Sideswipe - Passing",8080,1]
[9,"JAC","Yes","No","Pedalcycles",209742,4]
[1,"HAN","Yes","No","Rear End",31571167,1817]
[10,"WAS","Yes","Yes","Backing",8080,1]
[10,"GAL","Yes","No","Sideswipe - Passing",1524018,105]
[4,"SUM","Yes","No","Fixed Object",23459552,752]
[1,"DEF","No","No","Right Turn",456757,20]
[6,"DEL","Yes","No","Angle",68963583,1770]
[8,"GRE","Yes","Yes","Other Object",498539,56]
[7,"LOG","No","Yes","Animal",1182691,109]
[1,"PAU","Yes","No","Angle",8080,1]
[4,"SUM","Yes","No","Overturning",8080,1]
[6,"DEL","Yes","Yes","Sideswipe - Passing",567010,14]
[11,"HAS","No","No","Sideswipe - Meeting",1292415,6]
[2,"WIL","Yes","No","Pedalcycles",455045,5]
[4,"SUM","No","No","Sideswipe - Passing",550368,47]
[9,"HIG","No","No","Other Non-Collision",1209496,61]
[12,"CUY","Yes","Yes","Pedalcycles",1342604,23]
[4,"SUM","No","Yes","Other Non-Collision",276803,18]
[12,"GEA","No","No","Fixed Object",69766417,1776]
[6,"PIC","Yes","No","Parked Vehicle",388768,27]
[8,"WAR","Yes","No","Other Non-Collision",498312,30]
[7,"MOT","No","No","Overturning",2223726,18]
[8,"CLE","No","No","Pedalcycles",1492811,8]
[4,"MAH","No","Yes","Overturning",1375633,18]
[5,"COS","No","No","Head On",3446775,34]
[1,"PAU","No","Yes","Animal",601269,59]
[12,"GEA","Yes","No","Fixed Object",13338941,368]
[10,"GAL","No","Yes","Parked Vehicle",110699,8]
[6,"UNI","Yes","No","Fixed Object",6755152,189]
[9,"SCI","Yes","No","Sideswipe - Passing",9414207,531]
[1,"ALL","No","No","Animal",11056187,980]
[6,"DEL","Yes","Yes","Head On",273227,7]
[2,"HEN","Yes","Yes","Right Turn",54139,1]
[3,"CRA","Yes","No","Pedalcycles",257067,5]
[8,"HAM","Yes","No","Sideswipe - Passing",5836550,349]
[5,"FAI","Yes","No","Backing",880604,79]
[7,"AUG","Yes","Yes","Overturning",1508971,10]
[7,"MIA","Yes","Yes","Right Turn",16160,2]
[6,"MAR","Yes","No","Parked Vehicle",48480,6]
[1,"PUT","Yes","No","Animal",218160,27]
[1,"HAN","No","Yes","Backing",48480,6]
[10,"HOC","Yes","No","Backing",8080,1]
[2,"SAN","No","No","Overturning",7139068,79]
[2,"OTT","Yes","Yes","Animal",830858,72]
[6,"PIC","Yes","No","Angle",2309700,54]
[8,"WAR","Yes","No","Sideswipe - Meeting",156758,8]
[8,"CLI","Yes","No","Sideswipe - Passing",62219,2]
[8,"WAR","Yes","No","Rear End",87863714,4865]
[3,"ERI","Yes","No","Rear End",1548369,104]
[3,"ERI","No","Yes","Other Object",1088379,129]
[3,"ASD","Yes","Yes","Fixed Object",1208452,52]
[3,"LOR","Yes","Yes","Unknown",48480,6]
[3,"RIC","No","Yes","Head On",8080,1]
[8,"BUT","Yes","Yes","Pedalcycles",47325,1]
[4,"STA","No","Yes","Fixed Object",3345123,100]
[5,"GUE","No","No","Animal",5712089,466]
[9,"BRO","No","No","Rear End",14905887,502]
[2,"WIL","Yes","No","Right Turn",40400,5]
[1,"DEF","No","No","Rear End",6190890,161]
[6,"FRA","No","Yes","Head On",24240,3]
[11,"CAR","No","No","Right Turn",779508,42]
[2,"FUL","No","Yes","Fixed Object",6289868,180]
[7,"LOG","Yes","No","Right Turn",56560,7]
[5,"FAI","Yes","No","Other Non-Collision",16160,2]
[1,"HAN","No","No","Sideswipe - Passing",2930597,134]
[3,"WAY","Yes","No","Animal",16160,2]
[8,"CLE","Yes","Yes","Backing",56560,7]
[9,"LAW","No","No","Parked Vehicle",1993655,40]
[9,"ROS","Yes","No","Overturning",116358,3]
[4,"ATB","Yes","No","Other Object",730582,22]
[9,"BRO","No","No","Overturning",5983678,72]
[7,"SHE","No","Yes","Animal",1779600,121]
[7,"AUG","Yes","No","Angle",1196685,44]
[9,"ROS","No","Yes","Fixed Object",5289967,176]
[5,"FAI","Yes","Yes","Backing",8080,1]
[3,"MED","Yes","No","Pedestrian",5615315,38]
[3,"WAY","No","Yes","Unknown",16160,2]
[3,"CRA","Yes","No","Backing",800959,74]
[3,"WAY","Yes","No","Right Turn",245749,15]
[6,"UNI","Yes","No","Fixed Object",1292379,55]
[4,"POR","Yes","Yes","Sideswipe - Passing",1752601,90]
[2,"WOO","Yes","No","Parked Vehicle",174184,11]
[10,"ATH","Yes","No","Pedalcycles",422725,1]
[1,"HAN","Yes","No","Animal",3657703,417]
[8,"BUT","Yes","Yes","Backing",239979,24]
[4,"POR","No","Yes","Left Turn",532269,4]
[7,"SHE","Yes","Yes","Fixed Object",4263744,159]
[8,"HAM","No","Yes","Backing",16160,2]
[6,"UNI","Yes","No","Other Non-Collision",54139,1]
[10,"GAL","Yes","No","Head On",430805,2]
[7,"MIA","Yes","No","Other Non-Collision",933175,8]
[2,"SEN","Yes","No","Other Non-Collision",110699,8]
[7,"MOT","Yes","Yes","Pedestrian",845450,2]
[8,"BUT","Yes","No","Overturning",47325,1]
[8,"BUT","No","Yes","Backing",40400,5]
[3,"WAY","No","Yes","Backing",105040,13]
[1,"HAR","No","No","Animal",9470774,920]
[1,"DEF","No","No","Left Turn",2373783,52]
[11,"HAS","No","No","Other Object",598064,17]
[11,"HAS","Yes","No","Overturning",422725,1]
[7,"AUG","Yes","Yes","Other Object",24240,3]
[11,"JEF","No","No","Left Turn",1277260,58]
[10,"MOE","Yes","No","Overturning",438885,3]
[3,"HUR","Yes","No","Head On",8080,1]
[5,"FAI","No","No","Fixed Object",74254098,1314]
[4,"MAH","Yes","No","Pedestrian",94650,2]
[3,"CRA","Yes","Yes","Fixed Object",8080,1]
[11,"COL","Yes","No","Parked Vehicle",859491,69]
[6,"FRA","Yes","No","Pedestrian",54139,1]
[8,"GRE","Yes","No","Right Turn",166104,10]
[2,"HEN","No","No","Right Turn",230855,14]
[6,"UNI","Yes","No","Parked Vehicle",1612563,98]
[3,"HUR","No","No","Pedalcycles",524189,3]
[6,"UNI","Yes","No","Rear End",1221709,83]
[4,"TRU","No","No","Other Object",411742,29]
[3,"LOR","Yes","No","Pedalcycles",224636,5]
[7,"SHE","No","Yes","Unknown",32320,4]
[10,"NOB","No","No","Backing",96960,12]
[12,"GEA","No","Yes","Parked Vehicle",422725,1]
[5,"FAI","Yes","No","Other Object",16160,2]
[11,"JEF","Yes","Yes","Sideswipe - Passing",4193077,191]
[3,"HUR","Yes","No","Parked Vehicle",1663275,65]
[3,"MED","Yes","Yes","Angle",16160,2]
[3,"HUR","Yes","No","Animal",1684917,172]
[5,"LIC","Yes","Yes","Sideswipe - Passing",64640,8]
[5,"LIC","Yes","No","Sideswipe - Passing",3632059,160]
[7,"MOT","Yes","Yes","Falling From Or In Vehicle",422725,1]
[8,"GRE","Yes","Yes","Rear End",12192192,432]
[10,"NOB","No","Yes","Parked Vehicle",861610,4]
[2,"SEN","Yes","No","Backing",8080,1]
[3,"WAY","Yes","No","Pedalcycles",54139,1]
[3,"LOR","Yes","No","Right Turn",640885,28]
[4,"SUM","Yes","Yes","Rear End",97458513,4155]
[4,"SUM","Yes","No","Unknown",79645,5]
[7,"MIA","No","No","Animal",8360969,986]
[3,"ERI","Yes","No","Rear End",1102259,64]
[3,"WAY","Yes","No","Sideswipe - Passing",3592337,229]
[1,"VAN","No","No","Other Object",161600,20]
[7,"SHE","No","Yes","Other Object",336939,36]
[2,"OTT","No","No","Sideswipe - Meeting",16160,2]
[8,"GRE","Yes","Yes","Parked Vehicle",8080,1]
[5,"COS","Yes","No","Other Non-Collision",541504,10]
[2,"LUC","Yes","Yes","Left Turn",1627490,46]
[9,"ROS","No","Yes","Rear End",2717046,85]
[3,"LOR","Yes","Yes","Sideswipe - Passing",7844196,320]
[12,"LAK","Yes","No","Rear End",135413791,6521]
[7,"LOG","Yes","No","Other Object",8080,1]
[8,"CLE","No","No","Backing",2470004,130]
[8,"WAR","Yes","Yes","Rear End",1631512,71]
[7,"AUG","No","No","Other Non-Collision",1121771,55]
[4,"SUM","Yes","No","Other Non-Collision",1677125,57]
[1,"HAR","Yes","No","Right Turn",479285,8]
[4,"ATB","Yes","Yes","Pedestrian",54139,1]
[4,"MAH","Yes","Yes","Parked Vehicle",994574,23]
[11,"COL","Yes","No","Backing",661405,77]
[4,"TRU","Yes","No","Unknown",1161498,20]
[2,"OTT","No","Yes","Animal",226240,28]
[3,"WAY","Yes","Yes","Overturning",438885,3]
[11,"HOL","Yes","No","Animal",8080,1]
[4,"ATB","No","Yes","Angle",334180,8]
[10,"GAL","Yes","No","Overturning",547163,5]
[10,"HOC","Yes","No","Left Turn",16160,2]
[7,"CLA","Yes","No","Backing",102619,7]
[7,"DAR","Yes","No","Fixed Object",3265667,140]
[7,"MOT","No","No","Backing",322045,35]
[4,"ATB","No","Yes","Overturning",4044390,33]
[7,"AUG","Yes","Yes","Angle",8080,1]
[5,"FAI","Yes","No","Unknown",40400,5]
[1,"DEF","Yes","No","Fixed Object",126859,10]
[5,"FAI","Yes","No","Pedestrian",9380218,70]
[9,"HIG","Yes","No","Other Object",8080,1]
[3,"ERI","Yes","No","Fixed Object",964304,56]
[6,"MRW","Yes","No","Sideswipe - Passing",8080,1]
[1,"HAN","Yes","Yes","Right Turn",63485,3]
[10,"ATH","Yes","No","Other Object",32320,4]
[3,"HUR","Yes","No","Right Turn",395693,23]
[4,"STA","Yes","Yes","Parked Vehicle",422725,1]
[10,"ATH","No","No","Sideswipe - Passing",1281285,87]
[6,"FRA","Yes","No","Sideswipe - Passing",279177751,17714]
[4,"STA","Yes","Yes","Overturning",47325,1]
[2,"HEN","Yes","No","Backing",861095,92]
[7,"DAR","Yes","No","Right Turn",55405,2]
[7,"CLA","Yes","Yes","Fixed Object",1333114,78]
[2,"SEN","No","No","Pedalcycles",1063272,7]
[11,"JEF","Yes","Yes","Other Non-Collision",358758,33]
[8,"BUT","No","No","Head On",14312509,121]
[8,"BUT","No","No","Train",524189,3]
[12,"LAK","Yes","No","Parked Vehicle",7098016,340]
[8,"HAM","No","No","Other Object",48480,6]
[5,"MUS","Yes","Yes","Fixed Object",5335207,163]
[7,"CLA","Yes","No","Left Turn",27597439,633]
[6,"MAR","Yes","No","Animal",16160,2]
[11,"JEF","Yes","Yes","Overturning",47325,1]
[11,"CAR","Yes","No","Fixed Object",24240,3]
[8,"GRE","No","Yes","Left Turn",62219,2]
[1,"HAN","Yes","Yes","Angle",16160,2]
[11,"TUS","Yes","No","Sideswipe - Meeting",24240,3]
[3,"LOR","Yes","Yes","Left Turn",24240,3]
[5,"FAI","Yes","Yes","Right Turn",32320,4]
[4,"POR","Yes","No","Sideswipe - Passing",11661034,762]
[6,"MRW","No","Yes","Overturning",1100431,19]
[3,"LOR","Yes","Yes","Other Non-Collision",63485,3]
[4,"STA","Yes","Yes","Pedestrian",907669,4]
[9,"ROS","No","No","Animal",10477679,1025]
[7,"DAR","Yes","No","Parked Vehicle",1861217,114]
[9,"BRO","No","No","Sideswipe - Meeting",1861397,8]
[11,"HOL","Yes","No","Backing",24240,3]
[1,"DEF","Yes","Yes","Unknown",8080,1]
[7,"LOG","No","No","Backing",355520,44]
[4,"ATB","Yes","Yes","Animal",202000,25]
[4,"MAH","Yes","Yes","Unknown",102619,7]
[4,"ATB","Yes","No","Right Turn",248170,21]
[3,"MED","Yes","No","Overturning",54139,1]
[4,"STA","Yes","Yes","Fixed Object",1713949,51]
[2,"SEN","Yes","No","Other Non-Collision",180998,11]
[11,"COL","No","No","Parked Vehicle",1754127,64]
[6,"UNI","Yes","No","Left Turn",3836059,86]
[10,"WAS","No","No","Right Turn",898063,29]
[5,"PER","No","No","Fixed Object",74803354,1175]
[12,"LAK","Yes","Yes","Right Turn",160445,15]
[4,"SUM","No","Yes","Parked Vehicle",164949,5]
[6,"PIC","No","Yes","Pedestrian",47325,1]
[6,"FRA","Yes","Yes","Rear End",388032255,14116]
[11,"BEL","No","No","Sideswipe - Meeting",220243,11]
[3,"ERI","No","Yes","Angle",179843,6]
[5,"LIC","No","Yes","Pedalcycles",8080,1]
[4,"TRU","Yes","No","Parked Vehicle",6942040,338]
[4,"STA","Yes","No","Sideswipe - Passing",533053,40]
[10,"NOB","Yes","No","Backing",8080,1]
[7,"MIA","No","Yes","Rear End",776752,18]
[1,"ALL","Yes","No","Pedalcycles",8080,1]
[11,"JEF","No","Yes","Right Turn",62219,2]
[3,"WAY","Yes","No","Angle",5545764,120]
[8,"CLI","No","No","Pedestrian",1887014,8]
[11,"JEF","Yes","No","Sideswipe - Passing",8080,1]
[8,"CLI","Yes","No","Sideswipe - Passing",3332135,193]
[4,"ATB","Yes","No","Angle",17646909,500]
[7,"AUG","Yes","Yes","Rear End",624611,26]
[1,"ALL","No","Yes","Rear End",3810594,67]
[7,"LOG","No","No","Parked Vehicle",1008540,45]
[11,"COL","No","No","Unknown",94539,6]
[9,"JAC","No","No","Unknown",32320,4]
[3,"MED","No","No","Rear End",30922989,939]
[4,"ATB","Yes","No","Sideswipe - Passing",71565,4]
[3,"ASD","Yes","No","Angle",54139,1]
[2,"HEN","Yes","No","Animal",858563,90]
[2,"OTT","No","Yes","Backing",40400,5]
[8,"BUT","Yes","No","Sideswipe - Passing",1822305,102]
[4,"TRU","Yes","No","Backing",8579848,811]
[6,"PIC","No","No","Right Turn",1051134,30]
[5,"KNO","No","No","Head On",10288937,91]
[8,"HAM","Yes","No","Head On",1787708,35]
[3,"ERI","Yes","No","Parked Vehicle",87725,6]
[6,"UNI","No","Yes","Other Non-Collision",207659,20]
[8,"BUT","Yes","No","Fixed Object",5067412,125]
[3,"CRA","No","No","Fixed Object",25018851,574]
[11,"BEL","Yes","Yes","Other Non-Collision",368104,35]
[2,"SEN","No","No","Overturning",8020190,74]
[7,"MOT","Yes","No","Other Non-Collision",1080698,10]
[10,"MEG","Yes","No","Right Turn",143130,8]
[1,"PUT","Yes","No","Animal",63485,3]
[6,"UNI","Yes","No","Rear End",460444,27]
[2,"LUC","No","No","Sideswipe - Passing",3039690,89]
[3,"ERI","Yes","No","Fixed Object",935111,45]
[11,"HAS","Yes","No","Parked Vehicle",16160,2]
[1,"DEF","Yes","Yes","Parked Vehicle",54139,1]
[3,"RIC","Yes","Yes","Unknown",56560,7]
[4,"STA","Yes","No","Pedestrian",3019651,31]
[1,"HAN","Yes","No","Pedestrian",5438450,48]
[9,"PIK","No","No","Overturning",5005935,61]
[12,"LAK","Yes","No","Backing",9089082,953]
[5,"FAI","Yes","No","Pedalcycles",4608492,42]
[4,"ATB","Yes","Yes","Fixed Object",1603361,39]
[5,"KNO","Yes","No","Overturning",422725,1]
[5,"COS","Yes","No","Angle",6638533,239]
[8,"WAR","Yes","Yes","Parked Vehicle",164838,9]
[6,"UNI","Yes","No","Sideswipe - Passing",129280,16]
[7,"LOG","Yes","Yes","Rear End",159290,10]
[3,"LOR","Yes","Yes","Pedestrian",171763,5]
[8,"PRE","No","Yes","Left Turn",47325,1]
[7,"CLA","No","Yes","Sideswipe - Passing",8009671,418]
[9,"JAC","Yes","No","Left Turn",2807344,78]
[5,"COS","Yes","No","Parked Vehicle",70299,3]
[8,"GRE","No","No","Parked Vehicle",1413097,105]
[12,"GEA","No","No","Animal",12153343,946]
[12,"CUY","Yes","No","Sideswipe - Meeting",9776634,326]
[3,"ERI","Yes","Yes","Overturning",430805,2]
[9,"LAW","Yes","Yes","Animal",1019119,101]
[7,"CLA","Yes","No","Left Turn",3389844,58]
[7,"SHE","Yes","No","Left Turn",118890,5]
[1,"HAR","No","No","Backing",376184,36]
[8,"BUT","No","Yes","Animal",8080,1]
[5,"KNO","Yes","No","Pedestrian",1805951,21]
[5,"LIC","Yes","Yes","Rear End",5080404,149]
[3,"ASD","Yes","No","Backing",886490,100]
[3,"WAY","No","No","Other Non-Collision",1015094,72]
[3,"ERI","Yes","Yes","Other Object",395920,49]
[9,"JAC","Yes","No","Fixed Object",10248874,273]
[4,"MAH","Yes","No","Pedestrian",54139,1]
[7,"DAR","Yes","No","Head On",1062452,20]
[10,"GAL","No","Yes","Backing",16160,2]
[2,"FUL","Yes","Yes","Other Object",16160,2]
[8,"PRE","Yes","No","Head On",63485,3]
[10,"GAL","No","No","Other Object",175339,16]
[10,"HOC","Yes","Yes","Fixed Object",8080,1]
[1,"DEF","Yes","No","Unknown",16160,2]
[4,"STA","Yes","Yes","Unknown",8080,1]
[5,"FAI","Yes","No","Fixed Object",16034031,438]
[8,"WAR","Yes","No","Fixed Object",17045282,462]
[2,"SAN","Yes","No","Parked Vehicle",190344,13]
[5,"FAI","Yes","No","Rear End",21282763,1230]
[10,"WAS","Yes","No","Overturning",94539,6]
[10,"WAS","Yes","No","Pedestrian",940100,4]
[3,"WAY","Yes","No","Angle",2601140,104]
[1,"PAU","No","No","Sideswipe - Passing",2917484,46]
[5,"GUE","Yes","Yes","Angle",493024,4]
[12,"GEA","Yes","No","Left Turn",5177738,134]
[6,"MAR","Yes","No","Left Turn",86459,5]
[3,"LOR","No","No","Sideswipe - Meeting",463125,6]
[11,"HOL","Yes","No","Left Turn",8080,1]
[5,"MUS","Yes","Yes","Backing",16160,2]
[11,"BEL","Yes","Yes","Pedestrian",953728,4]
[10,"HOC","No","No","Fixed Object",44951932,924]
[7,"MIA","Yes","No","Angle",9184636,363]
[5,"MUS","Yes","Yes","Unknown",88880,11]
[4,"SUM","Yes","Yes","Right Turn",167370,11]
[7,"CHP","Yes","No","Head On",55405,2]
[2,"WOO","Yes","No","Angle",22205027,793]
[11,"JEF","Yes","Yes","Animal",1853248,109]
[12,"CUY","Yes","No","Rear End",868522946,38397]
[1,"PUT","Yes","No","Right Turn",16160,2]
[5,"COS","Yes","Yes","Fixed Object",8080,1]
[5,"KNO","Yes","No","Sideswipe - Meeting",430805,2]
[9,"ROS","No","No","Unknown",87725,6]
[2,"SAN","Yes","No","Angle",13033501,375]
[3,"RIC","Yes","Yes","Right Turn",62219,2]
[4,"TRU","Yes","Yes","Angle",47325,1]
[8,"HAM","No","Yes","Left Turn",205238,14]
[6,"FRA","Yes","No","Other Non-Vehicle",101464,2]
[6,"MAD","No","No","Angle",23572576,358]
[1,"ALL","Yes","No","Sideswipe - Passing",403773,24]
[7,"MOT","Yes","Yes","Sideswipe - Passing",252674,11]
[7,"AUG","Yes","Yes","Rear End",134939,11]
[9,"ROS","No","No","Backing",766107,68]
[8,"WAR","Yes","No","Left Turn",6105439,214]
[5,"FAI","Yes","No","Left Turn",8054786,224]
[1,"DEF","Yes","Yes","Fixed Object",8080,1]
[8,"PRE","No","Yes","Parked Vehicle",587563,10]
[3,"ASD","Yes","No","Unknown",24240,3]
[2,"FUL","Yes","No","Pedestrian",1690900,4]
[4,"MAH","Yes","No","Overturning",16160,2]
[11,"BEL","No","Yes","Parked Vehicle",103885,8]
[3,"CRA","Yes","No","Left Turn",976442,33]
[7,"LOG","Yes","No","Rear End",7931443,478]
[7,"CHP","No","No","Right Turn",317203,23]
[6,"FAY","No","Yes","Pedestrian",430805,2]
[8,"GRE","Yes","Yes","Overturning",4206918,32]
[11,"CAR","No","No","Animal",3000896,137]
[10,"VIN","Yes","No","Backing",40400,5]
[7,"CLA","Yes","No","Fixed Object",934330,13]
[11,"JEF","Yes","No","Parked Vehicle",111965,9]
[10,"WAS","No","Yes","Other Object",96960,12]
[6,"MAD","No","No","Other Object",325394,20]
[5,"GUE","Yes","No","Head On",54139,1]
[11,"HAS","Yes","No","Sideswipe - Meeting",8080,1]
[3,"HUR","Yes","No","Head On",1848104,26]
[8,"GRE","No","No","Left Turn",5802722,159]
[11,"TUS","Yes","Yes","Overturning",8080,1]
[2,"LUC","No","Yes","Sideswipe - Passing",328859,35]
[1,"HAR","No","No","Right Turn",40400,5]
[3,"WAY","No","Yes","Parked Vehicle",159179,14]
[11,"COL","Yes","No","Head On",2437712,39]
[10,"GAL","No","Yes","Unknown",8080,1]
[7,"CLA","Yes","No","Rear End",87725,6]
[3,"HUR","Yes","No","Left Turn",2194278,68]
[1,"ALL","No","Yes","Right Turn",438885,3]
[1,"PAU","No","Yes","Right Turn",47325,1]
[7,"SHE","Yes","Yes","Unknown",103885,8]
[10,"GAL","No","No","Angle",5772261,117]
[2,"HEN","No","No","Other Object",96960,12]
[7,"LOG","Yes","No","Fixed Object",6387463,251]
[1,"DEF","Yes","Yes","Rear End",63485,3]
[6,"PIC","Yes","No","Animal",619512,45]
[3,"CRA","No","No","Rear End",3131805,85]
[7,"AUG","Yes","No","Angle",260643,16]
[7,"MIA","No","No","Pedalcycles",704032,9]
[8,"BUT","Yes","No","Sideswipe - Meeting",16160,2]
[1,"HAR","Yes","No","Pedalcycles",578328,4]
[5,"COS","Yes","Yes","Rear End",8080,1]
[10,"ATH","Yes","No","Other Non-Collision",583170,16]
[6,"DEL","Yes","No","Other Object",8080,1]
[6,"MRW","No","No","Sideswipe - Meeting",430805,2]
[1,"WYA","No","No","Animal",9335245,952]
[6,"DEL","No","No","Fixed Object",41330010,980]
[5,"FAI","Yes","No","Other Non-Collision",32320,4]
[7,"SHE","No","Yes","Right Turn",8080,1]
[7,"AUG","No","Yes","Fixed Object",3671115,115]
[12,"LAK","No","No","Other Non-Collision",274382,12]
[2,"WOO","No","No","Sideswipe - Meeting",1268175,3]
[2,"FUL","No","No","Left Turn",6526523,128]
[7,"MIA","No","Yes","Right Turn",8080,1]
[7,"SHE","No","No","Pedalcycles",476864,2]
[12,"CUY","Yes","No","Overturning",4757059,53]
[2,"HEN","No","No","Angle",21671225,220]
[4,"SUM","Yes","Yes","Rear End",8721405,452]
[11,"COL","No","Yes","Other Object",64640,8]
[2,"WOO","Yes","Yes","Parked Vehicle",679681,10]
[2,"LUC","No","No","Other Object",72720,9]
[5,"FAI","Yes","Yes","Animal",16160,2]
[9,"LAW","No","No","Other Non-Collision",159179,14]
[7,"SHE","Yes","No","Head On",16160,2]
[1,"WYA","No","Yes","Pedalcycles",8080,1]
[4,"SUM","Yes","Yes","Pedalcycles",63485,3]
[4,"SUM","Yes","No","Fixed Object",206259855,5962]
[9,"HIG","Yes","No","Sideswipe - Meeting",16160,2]
[4,"ATB","Yes","Yes","Other Object",8080,1]
[11,"BEL","No","No","Head On",11501931,114]
[3,"CRA","No","No","Unknown",556509,7]
[4,"MAH","Yes","No","Rear End",1483316,29]
[7,"SHE","Yes","Yes","Pedalcycles",94650,2]
[3,"WAY","Yes","No","Right Turn",230744,18]
[3,"HUR","Yes","No","Sideswipe - Passing",1143557,105]
[12,"GEA","Yes","No","Animal",949864,107]
[7,"AUG","Yes","Yes","Unknown",24240,3]
[4,"SUM","Yes","No","Animal",2937827,205]
[5,"COS","No","No","Other Object",511605,12]
[2,"OTT","Yes","No","Fixed Object",2457824,55]
[10,"WAS","Yes","No","Left Turn",4256665,152]
[7,"DAR","No","No","Sideswipe - Meeting",869690,5]
[10,"WAS","No","No","Backing",580267,45]
[3,"LOR","Yes","Yes","Overturning",2801943,26]
[4,"ATB","Yes","No","Fixed Object",6223027,128]
[6,"DEL","Yes","No","Right Turn",6532198,395]
[6,"MRW","No","Yes","Other Non-Collision",507885,58]
[7,"MIA","No","Yes","Other Object",8080,1]
[8,"GRE","Yes","Yes","Right Turn",158024,9]
[7,"CLA","Yes","No","Backing",604845,70]
[8,"BUT","Yes","No","Unknown",24240,3]
[6,"MAD","No","Yes","Pedestrian",1268175,3]
[9,"SCI","No","Yes","Angle",593222,5]
[7,"AUG","Yes","No","Pedalcycles",313738,8]
[1,"ALL","No","No","Backing",913968,92]
[7,"AUG","No","Yes","Unknown",24240,3]
[4,"ATB","Yes","Yes","Rear End",80800,10]
[3,"ERI","Yes","No","Right Turn",94539,6]
[4,"SUM","Yes","Yes","Unknown",64640,8]
[5,"PER","No","No","Other Object",268723,17]
[8,"CLE","Yes","Yes","Rear End",40400,5]
[7,"MIA","Yes","Yes","Sideswipe - Passing",3254354,184]
[6,"FAY","No","No","Other Object",686944,28]
[3,"LOR","Yes","No","Rear End",5258986,245]
[11,"COL","Yes","No","Other Non-Collision",1254511,52]
[8,"GRE","Yes","No","Rear End",2595481,109]
[9,"SCI","Yes","No","Pedalcycles",8080,1]
[3,"ERI","Yes","No","Head On",304281,10]
[1,"ALL","No","Yes","Other Object",105040,13]
[8,"WAR","Yes","No","Backing",1501609,151]
[8,"WAR","Yes","No","Pedestrian",7271809,50]
[8,"BUT","Yes","No","Other Non-Collision",1197391,31]
[2,"WOO","Yes","No","Overturning",3392744,25]
[2,"HEN","Yes","Yes","Overturning",109544,3]
[9,"JAC","No","Yes","Fixed Object",103885,8]
[7,"LOG","No","Yes","Rear End",1092800,36]
[11,"COL","Yes","No","Right Turn",552005,17]
[7,"LOG","Yes","No","Parked Vehicle",229478,17]
[6,"MAR","Yes","No","Angle",36926544,963]
[8,"GRE","Yes","Yes","Backing",16160,2]
[1,"HAN","Yes","No","Head On",484944,3]
[11,"JEF","No","No","Parked Vehicle",914001,39]
[6,"MAD","No","No","Overturning",6522651,54]
[9,"SCI","Yes","No","Head On",9732874,98]
[9,"SCI","Yes","No","Train",54139,1]
[3,"ASD","No","Yes","Other Object",436320,54]
[6,"MAR","Yes","No","Parked Vehicle",5021030,262]
[7,"MIA","Yes","No","Overturning",672867,10]
[12,"LAK","No","No","Head On",1653367,19]
[10,"HOC","No","Yes","Animal",460560,57]
[3,"MED","Yes","No","Left Turn",152365,14]
[1,"HAN","Yes","No","Parked Vehicle",16160,2]
[3,"ERI","Yes","Yes","Rear End",62219,2]
[5,"LIC","No","Yes","Backing",80800,10]
[3,"WAY","Yes","Yes","Left Turn",125704,5]
[1,"PAU","No","Yes","Head On",24240,3]
[5,"FAI","No","No","Other Non-Vehicle",422725,1]
[2,"FUL","No","No","Sideswipe - Passing",3471874,118]
[2,"FUL","No","No","Unknown",430805,2]
[1,"PAU","No","No","Left Turn",1237196,45]
[9,"ROS","No","Yes","Right Turn",517264,7]
[8,"WAR","Yes","No","Other Object",452142,34]
[6,"MAR","Yes","No","Other Non-Collision",16160,2]
[4,"STA","No","No","Unknown",72720,9]
[4,"STA","Yes","No","Other Object",111965,9]
[6,"FAY","No","Yes","Sideswipe - Passing",3203118,154]
[11,"JEF","Yes","Yes","Other Non-Collision",8080,1]
[5,"LIC","Yes","Yes","Unknown",72720,9]
[2,"HEN","Yes","No","Right Turn",234320,29]
[9,"HIG","Yes","No","Rear End",8681231,499]
[7,"SHE","Yes","Yes","Backing",16160,2]
[2,"OTT","Yes","No","Head On",1215748,17]
[2,"OTT","Yes","No","Train",8080,1]
[7,"LOG","Yes","No","Unknown",16160,2]
[3,"ASD","Yes","Yes","Right Turn",109544,3]
[11,"COL","Yes","No","Pedestrian",54139,1]
[10,"ATH","Yes","Yes","Angle",320552,8]
[6,"FAY","Yes","Yes","Other Non-Collision",16160,2]
[9,"HIG","No","No","Left Turn",5569335,143]
[2,"WIL","No","No","Fixed Object",38842037,908]
[7,"DAR","Yes","No","Backing",24240,3]
[10,"WAS","Yes","Yes","Other Object",24240,3]
[1,"VAN","Yes","No","Rear End",299888,16]
[5,"GUE","No","Yes","Animal",2955923,244]
[11,"BEL","Yes","No","Overturning",1581093,24]
[7,"AUG","Yes","Yes","Head On",8080,1]
[1,"ALL","No","No","Unknown",183419,17]
[3,"ERI","Yes","No","Right Turn",3036754,171]
[7,"AUG","Yes","No","Unknown",16160,2]
[9,"LAW","No","No","Sideswipe - Passing",1525206,57]
[9,"ROS","Yes","No","Backing",16160,2]
[1,"HAN","No","Yes","Sideswipe - Passing",2994301,125]
[4,"MAH","Yes","No","Pedestrian",54139,1]
[11,"BEL","Yes","No","Head On",8080,1]
[7,"CHP","No","Yes","Overturning",422725,1]
[7,"MOT","No","Yes","Overturning",858369,11]
[6,"FAY","Yes","Yes","Sideswipe - Passing",189078,12]
[8,"BUT","Yes","No","Sideswipe - Passing",47999302,2757]
[12,"CUY","Yes","No","Parked Vehicle",53432509,3199]
[9,"ADA","Yes","No","Backing",16160,2]
[8,"GRE","Yes","No","Parked Vehicle",175339,16]
[10,"VIN","No","No","Other Non-Collision",309123,22]
[11,"JEF","Yes","No","Sideswipe - Passing",3673437,280]
[9,"JAC","Yes","No","Angle",8080,1]
[3,"ERI","No","No","Left Turn",5452083,82]
[6,"UNI","Yes","Yes","Left Turn",8080,1]
[3,"ASD","No","No","Left Turn",7781779,122]
[5,"LIC","No","No","Rear End",25411864,845]
[11,"JEF","Yes","No","Head On",16160,2]
[11,"JEF","Yes","Yes","Backing",8080,1]
[1,"HAR","Yes","No","Left Turn",1013044,35]
[7,"DAR","Yes","No","Other Non-Collision",156758,8]
[9,"BRO","Yes","No","Right Turn",16160,2]
[9,"HIG","No","No","Unknown",78379,4]
[11,"JEF","Yes","Yes","Rear End",5759266,146]
[5,"MUS","Yes","No","Sideswipe - Passing",589984,16]
[2,"SEN","No","No","Backing",520580,45]
[4,"ATB","Yes","No","Left Turn",2054719,37]
[4,"SUM","Yes","Yes","Overturning",8080,1]
[8,"CLI","Yes","No","Fixed Object",54139,1]
[4,"POR","Yes","Yes","Head On",493024,4]
[8,"GRE","No","No","Sideswipe - Passing",3573673,138]
[3,"LOR","No","Yes","Other Object",217005,22]
[6,"FAY","Yes","No","Fixed Object",493024,4]
[10,"HOC","No","Yes","Rear End",1098124,13]
[4,"POR","Yes","No","Unknown",110699,8]
[4,"SUM","Yes","Yes","Overturning",2519927,27]
[10,"ATH","Yes","No","Other Non-Collision",132518,5]
[2,"HEN","Yes","No","Rear End",3766957,186]
[8,"BUT","Yes","Yes","Fixed Object",126970,6]
[4,"STA","Yes","Yes","Rear End",33096319,1246]
[10,"MRG","No","No","Other Object",32320,4]
[12,"CUY","Yes","No","Unknown",4438304,230]
[8,"WAR","Yes","Yes","Other Object",64640,8]
[6,"UNI","Yes","No","Head On",54139,1]
[6,"FRA","Yes","Yes","Angle",1259015,42]
[4,"POR","Yes","Yes","Sideswipe - Passing",40400,5]
[8,"WAR","Yes","Yes","Unknown",56560,7]
[6,"PIC","Yes","No","Head On",1119943,10]
[12,"LAK","Yes","Yes","Overturning",641813,7]
[4,"POR","No","Yes","Backing",239979,24]
[3,"ASD","No","Yes","Pedestrian",430805,2]
[6,"FAY","Yes","Yes","Animal",8080,1]
[12,"LAK","Yes","No","Animal",145440,18]
[8,"PRE","Yes","No","Other Non-Collision",63485,3]
[3,"MED","Yes","Yes","Rear End",1106877,54]
[4,"MAH","Yes","No","Animal",353099,38]
[3,"HUR","No","No","Fixed Object",50591617,902]
[3,"WAY","Yes","No","Fixed Object",126970,6]
[3,"LOR","Yes","Yes","Head On",821656,13]
[1,"PUT","Yes","No","Backing",24240,3]
[3,"WAY","No","Yes","Sideswipe - Passing",2652750,107]
[4,"TRU","No","Yes","Angle",220243,11]
[4,"ATB","No","No","Rear End",15336237,339]
[8,"HAM","Yes","Yes","Left Turn",213318,15]
[3,"HUR","No","No","Sideswipe - Meeting",503525,11]
[2,"SEN","Yes","No","Animal",16160,2]
[2,"WOO","No","Yes","Pedestrian",1799178,6]
[11,"HOL","No","No","Right Turn",1130408,66]
[4,"STA","Yes","No","Head On",643079,8]
[5,"LIC","Yes","No","Other Non-Collision",3473730,76]
[2,"WOO","Yes","No","Fixed Object",213429,11]
[1,"HAR","Yes","No","Rear End",652054,41]
[10,"ATH","No","Yes","Other Object",16160,2]
[7,"SHE","No","Yes","Fixed Object",4506064,110]
[2,"WOO","Yes","Yes","Sideswipe - Passing",10052442,497]
[4,"POR","Yes","No","Overturning",54139,1]
[9,"JAC","No","No","Backing",434827,27]
[5,"GUE","No","No","Head On",4283325,48]
[10,"MEG","No","No","Overturning",3356030,53]
[6,"UNI","No","Yes","Other Object",105040,13]
[11,"COL","Yes","No","Parked Vehicle",1463807,42]
[5,"MUS","No","No","Fixed Object",55916244,1370]
[10,"ATH","Yes","No","Left Turn",779879,11]
[10,"MEG","Yes","No","Rear End",1947928,54]
[6,"MRW","No","No","Other Object",136205,12]
[11,"HAS","Yes","No","Unknown",8080,1]
[7,"AUG","Yes","Yes","Pedestrian",422725,1]
[4,"MAH","Yes","No","Other Object",477648,38]
[11,"HAS","No","No","Pedestrian",1322314,4]
[2,"OTT","No","Yes","Unknown",32320,4]
[4,"POR","No","No","Head On",8357237,102]
[4,"POR","No","No","Train",8080,1]
[9,"PIK","No","No","Backing",1064167,39]
[5,"LIC","Yes","No","Parked Vehicle",2194500,60]
[11,"TUS","No","No","Pedalcycles",3371745,15]
[3,"ASD","Yes","Yes","Animal",280379,29]
[9,"ROS","Yes","No","Fixed Object",174184,11]
[12,"LAK","Yes","No","Backing",665909,67]
[3,"RIC","Yes","No","Other Non-Collision",596909,12]
[4,"STA","No","Yes","Pedalcycles",55405,2]
[2,"WIL","Yes","No","Angle",4812243,176]
[2,"LUC","No","Yes","Parked Vehicle",162417,3]
[8,"PRE","Yes","No","Rear End",494290,5]
[1,"VAN","Yes","No","Other Object",56560,7]
[3,"ASD","No","No","Backing",1027905,89]
[9,"LAW","Yes","Yes","Rear End",16148831,568]
[3,"ERI","Yes","Yes","Animal",878443,46]
[12,"GEA","Yes","No","Overturning",86459,5]
[4,"MAH","Yes","No","Right Turn",55405,2]
[8,"GRE","Yes","Yes","Angle",1075374,33]
[2,"SEN","No","No","Unknown",533424,9]
[3,"ERI","Yes","Yes","Right Turn",16160,2]
[6,"FAY","Yes","No","Sideswipe - Passing",2479461,128]
[5,"LIC","Yes","No","Pedalcycles",701500,7]
[8,"HAM","Yes","Yes","Parked Vehicle",140598,6]
[12,"GEA","No","No","Other Non-Vehicle",163683,4]
[2,"FUL","No","Yes","Unknown",16160,2]
[1,"PUT","Yes","No","Parked Vehicle",118779,9]
[9,"LAW","Yes","Yes","Left Turn",916195,19]
[9,"ROS","Yes","Yes","Head On",189189,8]
[7,"MIA","Yes","No","Other Non-Collision",8080,1]
[2,"FUL","Yes","No","Parked Vehicle",48480,6]
[2,"WOO","Yes","No","Unknown",88880,11]
[1,"VAN","Yes","No","Parked Vehicle",24240,3]
[7,"MIA","Yes","No","Rear End",20089506,1194]
[7,"SHE","Yes","Yes","Sideswipe - Passing",3615342,148]
[9,"PIK","No","No","Unknown",172918,10]
[1,"HAN","No","Yes","Head On",547163,5]
[3,"RIC","Yes","No","Other Object",32320,4]
[11,"BEL","Yes","No","Left Turn",125704,5]
[2,"WIL","Yes","No","Parked Vehicle",16160,2]
[3,"CRA","Yes","No","Fixed Object",5447283,168]
[4,"POR","Yes","No","Overturning",2289407,31]
[3,"RIC","Yes","No","Parked Vehicle",8310826,409]
[4,"POR","Yes","No","Backing",768528,74]
[3,"ASD","No","No","Right Turn",1061746,33]
[8,"BUT","Yes","Yes","Rear End",34107942,1238]
[9,"LAW","No","Yes","Fixed Object",124438,4]
[5,"FAI","No","Yes","Right Turn",78379,4]
[3,"WAY","Yes","No","Pedestrian",265147,6]
[2,"OTT","Yes","Yes","Parked Vehicle",484944,3]
[2,"LUC","Yes","No","Sideswipe - Passing",147927623,8679]
[9,"JAC","No","Yes","Overturning",8080,1]
[4,"MAH","Yes","No","Other Non-Collision",2898310,77]
[4,"ATB","Yes","No","Sideswipe - Meeting",8080,1]
[3,"ERI","No","No","Backing",670302,61]
[6,"PIC","Yes","No","Other Non-Collision",8080,1]
[7,"DAR","Yes","No","Animal",955745,94]
[3,"CRA","Yes","Yes","Overturning",476864,2]
[11,"COL","Yes","No","Angle",148678,7]
[10,"ATH","Yes","No","Backing",129280,16]
[10,"GAL","Yes","Yes","Other Object",32320,4]
[3,"RIC","No","No","Pedalcycles",1438672,7]
[3,"ERI","Yes","Yes","Unknown",8080,1]
[3,"MED","Yes","No","Right Turn",723624,79]
[9,"BRO","Yes","No","Unknown",16160,2]
[7,"MER","Yes","No","Sideswipe - Passing",2284388,129]
[1,"DEF","Yes","No","Fixed Object",8661755,263]
[12,"CUY","Yes","No","Pedalcycles",12344122,156]
[8,"GRE","No","No","Angle",19016133,351]
[12,"CUY","Yes","No","Backing",30199876,2580]
[8,"BUT","Yes","No","Parked Vehicle",32455599,1989]
[7,"SHE","Yes","No","Right Turn",24240,3]
[10,"MEG","Yes","No","Backing",145440,18]
[7,"MOT","Yes","Yes","Other Object",24240,3]
[3,"LOR","Yes","No","Fixed Object",2058295,48]
[1,"VAN","No","No","Sideswipe - Meeting",422725,1]
[6,"PIC","Yes","No","Overturning",493024,4]
[5,"GUE","Yes","Yes","Fixed Object",8080,1]
[7,"AUG","Yes","No","Overturning",54139,1]
[7,"DAR","Yes","No","Parked Vehicle",95805,7]
[2,"LUC","Yes","No","Head On",64578467,988]
[2,"LUC","Yes","No","Train",2219111,32]
[4,"SUM","Yes","No","Rear End",43835887,2323]
[5,"MUS","No","Yes","Rear End",5157553,103]
[2,"OTT","Yes","No","Left Turn",2823837,68]
[1,"HAR","Yes","No","Parked Vehicle",210080,26]
[8,"PRE","Yes","No","Pedestrian",54139,1]
[3,"WAY","No","No","Head On",15617994,143]
[1,"ALL","No","Yes","Fixed Object",6889531,186]
[6,"MRW","No","No","Animal",7796433,800]
[5,"MUS","Yes","No","Pedestrian",7327214,52]
[3,"WAY","Yes","No","Left Turn",7196157,240]
[1,"PUT","No","No","Unknown",16160,2]
[8,"BUT","No","No","Pedestrian",3305244,15]
[8,"CLE","Yes","Yes","Fixed Object",24240,3]
[7,"CLA","No","Yes","Pedestrian",953728,4]
[4,"ATB","Yes","No","Pedalcycles",524189,3]
[4,"STA","Yes","Yes","Angle",8080,1]
[5,"LIC","Yes","No","Other Object",8080,1]
[9,"JAC","No","No","Right Turn",660394,15]
[10,"ATH","Yes","Yes","Fixed Object",1611554,66]
[4,"POR","Yes","No","Fixed Object",11668149,263]
[4,"MAH","Yes","No","Angle",129563699,3990]
[5,"LIC","Yes","No","Other Non-Collision",290653,10]
[3,"LOR","Yes","No","Parked Vehicle",17485731,877]
[6,"FRA","Yes","No","Sideswipe - Passing",221509,12]
[3,"MED","No","No","Parked Vehicle",3505867,43]
[2,"WOO","No","No","Angle",43684526,577]
[7,"MIA","Yes","No","Backing",105040,13]
[5,"PER","Yes","No","Rear End",8080,1]
[3,"WAY","Yes","No","Rear End",16121617,927]
[10,"WAS","No","No","Parked Vehicle",788743,48]
[4,"SUM","Yes","No","Left Turn",8080,1]
[3,"LOR","Yes","No","Parked Vehicle",183419,17]
[12,"CUY","Yes","Yes","Sideswipe - Passing",176397173,7470]
[11,"COL","Yes","Yes","Rear End",8080,1]
[6,"MAR","No","Yes","Overturning",8080,1]
[3,"ERI","No","No","Unknown",198424,14]
[5,"KNO","Yes","No","Angle",12885418,416]
[11,"TUS","Yes","No","Left Turn",283728,14]
[8,"WAR","Yes","No","Other Object",16160,2]
[4,"MAH","Yes","Yes","Rear End",15624884,497]
[6,"FAY","No","Yes","Angle",227168,7]
[5,"PER","No","No","Overturning",8110447,82]
[8,"CLE","Yes","Yes","Rear End",23927013,887]
[6,"PIC","No","No","Fixed Object",59304105,1259]
[5,"FAI","Yes","No","Head On",8080,1]
[12,"LAK","Yes","Yes","Angle",1322611,41]
[9,"LAW","Yes","No","Parked Vehicle",3282949,200]
[2,"LUC","Yes","Yes","Backing",613853,50]
[3,"ASD","No","Yes","Rear End",2688898,57]
[2,"WOO","Yes","No","Head On",102619,7]
[5,"MUS","No","No","Unknown",110699,8]
[5,"GUE","Yes","No","Left Turn",3048329,130]
[7,"MIA","Yes","Yes","Fixed Object",259377,15]
[10,"MEG","Yes","No","Unknown",8080,1]
[4,"SUM","No","No","Angle",2699845,78]
[9,"BRO","Yes","No","Backing",80800,10]
[4,"MAH","Yes","Yes","Right Turn",784832,19]
[3,"MED","Yes","No","Unknown",438885,3]
[6,"UNI","Yes","No","Left Turn",158024,9]
[3,"WAY","No","No","Falling From Or In Vehicle",422725,1]
[8,"GRE","No","No","Other Non-Collision",1448320,80]
[1,"WYA","No","No","Left Turn",925430,25]
[10,"GAL","Yes","No","Angle",124438,4]
[3,"ERI","Yes","No","Backing",4114826,372]
[6,"PIC","Yes","No","Left Turn",1914234,57]
[11,"COL","No","No","Backing",1259915,108]
[3,"MED","Yes","No","Left Turn",729427,17]
[3,"LOR","Yes","No","Pedestrian",2650733,17]
[5,"FAI","Yes","No","Animal",1915434,164]
[5,"FAI","Yes","Yes","Other Non-Collision",32320,4]
[9,"BRO","Yes","Yes","Sideswipe - Passing",47325,1]
[4,"MAH","No","No","Other Object",113120,14]
[8,"WAR","No","Yes","Pedestrian",422725,1]
[10,"WAS","No","No","Fixed Object",52741794,1108]
[7,"MIA","Yes","Yes","Pedestrian",101464,2]
[12,"GEA","Yes","No","Animal",1972332,193]
[7,"CLA","Yes","Yes","Rear End",6405812,199]
[9,"SCI","Yes","No","Overturning",2737081,26]
[2,"HEN","Yes","Yes","Left Turn",8080,1]
[12,"GEA","No","No","Rear End",28983702,899]
[4,"POR","Yes","No","Head On",109544,3]
[10,"VIN","Yes","No","Fixed Object",1745374,23]
[11,"COL","Yes","No","Other Non-Collision",32320,4]
[6,"PIC","No","Yes","Sideswipe - Meeting",422725,1]
[2,"HEN","Yes","No","Left Turn",54139,1]
[2,"OTT","Yes","No","Fixed Object",5760910,180]
[1,"WYA","No","No","Fixed Object",17925549,436]
[9,"ROS","No","Yes","Animal",1694969,161]
[3,"MED","Yes","Yes","Fixed Object",2210064,97]
[6,"FRA","Yes","Yes","Unknown",8080,1]
[6,"DEL","No","No","Animal",8514416,729]
[8,"BUT","Yes","No","Backing",2324498,218]
[10,"HOC","Yes","No","Sideswipe - Passing",8080,1]
[9,"ROS","Yes","No","Sideswipe - Meeting",438885,3]
[1,"HAR","Yes","No","Backing",215739,21]
[1,"PUT","No","No","Fixed Object",20905025,458]
[6,"UNI","Yes","Yes","Rear End",2314615,81]
[6,"DEL","No","No","Pedalcycles",2370692,10]
[4,"SUM","Yes","Yes","Left Turn",765545,24]
[9,"LAW","No","Yes","Rear End",197380,5]
[3,"ERI","Yes","Yes","Right Turn",54139,1]
[11,"COL","Yes","Yes","Animal",265485,28]
[7,"MER","Yes","No","Parked Vehicle",8080,1]
[10,"NOB","Yes","Yes","Head On",422725,1]
[4,"SUM","Yes","No","Backing",900229,96]
[10,"HOC","Yes","Yes","Left Turn",8080,1]
[5,"FAI","Yes","No","Fixed Object",19362509,567]
[11,"TUS","Yes","Yes","Other Object",977824,64]
[3,"LOR","Yes","No","Animal",5376380,480]
[10,"HOC","Yes","No","Angle",3539492,142]
[4,"POR","No","Yes","Fixed Object",12915992,427]
[1,"ALL","No","Yes","Unknown",64640,8]
[5,"LIC","No","Yes","Animal",2602602,214]
[11,"BEL","No","No","Pedestrian",3552297,12]
[7,"LOG","Yes","No","Backing",233165,24]
[9,"JAC","Yes","No","Backing",994657,106]
[8,"HAM","Yes","Yes","Other Non-Collision",9993711,332]
[4,"SUM","Yes","No","Animal",56560,7]
[6,"FAY","No","No","Unknown",501104,5]
[8,"CLE","Yes","Yes","Sideswipe - Passing",13321489,482]
[4,"SUM","Yes","No","Other Non-Collision",1990788,20]
[1,"HAN","Yes","No","Other Object",256139,26]
[7,"MER","Yes","No","Fixed Object",6081611,165]
[3,"RIC","Yes","No","Parked Vehicle",830074,36]
[8,"WAR","Yes","Yes","Fixed Object",409432,19]
[2,"FUL","No","Yes","Parked Vehicle",1017213,7]
[5,"PER","No","No","Unknown",72720,9]
[6,"PIC","Yes","No","Animal",113120,14]
[4,"SUM","No","No","Sideswipe - Meeting",430805,2]
[3,"WAY","Yes","No","Pedalcycles",380239,8]
[11,"CAR","Yes","No","Sideswipe - Passing",8080,1]
[6,"FRA","No","No","Sideswipe - Meeting",8080,1]
[4,"STA","Yes","Yes","Pedalcycles",524189,3]
[3,"MED","Yes","Yes","Head On",493024,4]
[5,"GUE","Yes","No","Animal",1550684,148]
[3,"HUR","No","No","Right Turn",1410485,24]
[5,"FAI","No","No","Rear End",21305435,508]
[7,"CLA","Yes","No","Head On",10459911,165]
[7,"CLA","Yes","No","Train",132518,5]
[3,"ERI","Yes","Yes","Angle",16160,2]
[7,"MER","Yes","No","Left Turn",3608334,69]
[10,"NOB","No","No","Other Non-Collision",245749,15]
[8,"WAR","Yes","Yes","Left Turn",47325,1]
[4,"POR","No","Yes","Rear End",4850371,152]
[6,"UNI","No","Yes","Overturning",1026559,9]
[1,"HAN","No","Yes","Other Non-Collision",343864,32]
[7,"AUG","Yes","No","Animal",1128923,77]
[9,"JAC","Yes","No","Left Turn",24240,3]
[10,"MOE","No","No","Other Non-Collision",167259,15]
[7,"AUG","Yes","No","Pedalcycles",155603,3]
[2,"WOO","No","No","Overturning",12300610,121]
[3,"CRA","No","No","Parked Vehicle",636154,12]
[12,"GEA","No","No","Right Turn",2362205,89]
[7,"AUG","Yes","Yes","Unknown",8080,1]
[2,"SAN","Yes","No","Backing",64640,8]
[2,"WOO","Yes","No","Right Turn",64640,8]
[5,"MUS","Yes","No","Other Non-Collision",588347,46]
[4,"TRU","Yes","Yes","Fixed Object",19516590,656]
[5,"KNO","No","No","Sideswipe - Passing",5443485,165]
[4,"ATB","Yes","No","Left Turn",1882845,36]
[4,"ATB","No","Yes","Right Turn",455045,5]
[4,"STA","Yes","Yes","Right Turn",1088407,42]
[7,"CLA","Yes","No","Fixed Object",6580334,232]
[4,"STA","Yes","No","Other Object",56560,7]
[2,"OTT","No","Yes","Head On",430805,2]
[8,"WAR","Yes","No","Parked Vehicle",1188494,47]
[9,"ROS","Yes","No","Parked Vehicle",8080,1]
[2,"WOO","No","Yes","Sideswipe - Passing",13572531,557]
[6,"FAY","Yes","No","Backing",16160,2]
[9,"JAC","No","No","Left Turn",4204796,93]
[6,"MAD","No","Yes","Overturning",1549371,15]
[9,"SCI","No","No","Other Object",286038,24]
[11,"CAR","No","No","Backing",1445420,113]
[12,"GEA","Yes","Yes","Fixed Object",456757,20]
[8,"BUT","No","No","Sideswipe - Passing",5114109,188]
[6,"UNI","Yes","Yes","Left Turn",54139,1]
[12,"GEA","No","Yes","Right Turn",8080,1]
[8,"GRE","Yes","Yes","Sideswipe - Meeting",422725,1]
[12,"LAK","No","No","Other Object",102619,7]
[9,"HIG","Yes","No","Unknown",16160,2]
[8,"CLE","Yes","No","Sideswipe - Passing",21221069,1330]
[4,"MAH","Yes","No","Other Non-Collision",430805,2]
[8,"GRE","Yes","No","Parked Vehicle",11314906,739]
[3,"RIC","Yes","Yes","Animal",3441767,313]
[3,"MED","No","Yes","Rear End",6303938,134]
[2,"SAN","Yes","No","Head On",988580,10]
[5,"FAI","Yes","Yes","Overturning",156869,4]
[1,"ALL","Yes","No","Angle",2193791,69]
[4,"POR","Yes","Yes","Pedestrian",422725,1]
[4,"POR","Yes","No","Right Turn",86459,5]
[11,"COL","No","Yes","Right Turn",8080,1]
[2,"WOO","Yes","Yes","Fixed Object",1602322,64]
[10,"GAL","No","No","Other Non-Collision",606144,18]
[7,"AUG","Yes","No","Right Turn",208925,21]
[4,"STA","Yes","No","Angle",7319775,257]
[7,"MER","No","Yes","Other Non-Collision",55405,2]
[6,"DEL","Yes","No","Right Turn",164838,9]
[7,"LOG","No","Yes","Head On",8080,1]
[1,"VAN","Yes","No","Right Turn",24240,3]
[9,"HIG","No","No","Head On",4976150,63]
[7,"MOT","Yes","No","Pedestrian",112025930,768]
[7,"SHE","No","No","Animal",9056503,893]
[11,"COL","Yes","No","Overturning",555243,6]
[7,"AUG","Yes","No","Backing",859829,91]
[3,"RIC","Yes","No","Fixed Object",267568,12]
[1,"HAR","No","No","Unknown",63485,3]
[7,"LOG","Yes","No","Pedalcycles",430805,2]
[2,"LUC","Yes","No","Pedestrian",89886664,655]
[4,"TRU","Yes","Yes","Parked Vehicle",557775,8]
[5,"LIC","Yes","Yes","Backing",8080,1]
[5,"GUE","No","Yes","Backing",190344,13]
[7,"CLA","Yes","No","Parked Vehicle",1476471,112]
[12,"CUY","Yes","No","Left Turn",14058398,562]
[10,"WAS","Yes","No","Overturning",1032107,8]
[12,"LAK","No","No","Angle",4344315,113]
[2,"WIL","No","No","Right Turn",675512,38]
[4,"ATB","Yes","Yes","Fixed Object",557664,12]
[8,"CLE","No","Yes","Right Turn",8080,1]
[6,"MRW","No","No","Overturning",6211780,66]
[11,"COL","Yes","No","Train",845450,2]
[11,"COL","Yes","No","Head On",1505844,17]
[2,"WOO","Yes","Yes","Left Turn",174184,11]
[2,"HEN","No","No","Pedalcycles",1007867,5]
[12,"CUY","No","No","Pedalcycles",1342047,13]
[11,"TUS","No","No","Rear End",12806106,399]
[2,"OTT","No","No","Pedestrian",1477917,7]
[10,"ATH","Yes","Yes","Unknown",16160,2]
[2,"SAN","No","Yes","Overturning",710846,9]
[12,"GEA","No","Yes","Overturning",547163,5]
[9,"ROS","Yes","No","Backing",40400,5]
[1,"HAN","Yes","No","Overturning",155603,3]
[8,"WAR","Yes","No","Pedalcycles",585142,4]
[12,"CUY","Yes","No","Fixed Object",422759064,8962]
[11,"HAS","No","No","Head On",5582554,54]
[6,"FRA","Yes","No","Pedalcycles",4554239,41]
[2,"FUL","No","Yes","Rear End",4269697,48]
[11,"TUS","Yes","Yes","Angle",1401250,18]
[9,"PIK","Yes","No","Right Turn",641331,42]
[6,"MAR","No","No","Animal",9868469,874]
[3,"ERI","Yes","No","Overturning",860901,13]
[10,"GAL","Yes","No","Angle",5706508,202]
[2,"FUL","Yes","No","Backing",200845,20]
[4,"POR","No","No","Fixed Object",65517062,1620]
[6,"FRA","No","Yes","Parked Vehicle",24240,3]
[11,"JEF","Yes","No","Angle",80800,10]
[2,"SAN","Yes","Yes","Right Turn",8080,1]
[3,"RIC","No","Yes","Sideswipe - Passing",2770933,151]
[2,"LUC","Yes","No","Other Non-Collision",9996353,217]
[5,"MUS","No","No","Backing",910054,59]
[7,"DAR","Yes","No","Rear End",9043435,328]
[10,"NOB","No","No","Fixed Object",12187345,247]
[2,"OTT","Yes","No","Unknown",16160,2]
[3,"MED","Yes","No","Left Turn",4914563,116]
[6,"MAD","No","Yes","Other Non-Collision",832013,77]
[1,"WYA","No","No","Unknown",94539,6]
[1,"HAN","Yes","Yes","Sideswipe - Passing",5652084,319]
[4,"STA","Yes","Yes","Animal",16160,2]
[9,"HIG","Yes","No","Animal",48480,6]
[5,"GUE","No","Yes","Right Turn",79645,5]
[2,"WOO","Yes","No","Rear End",980575,54]
[5,"FAI","No","No","Parked Vehicle",1567916,72]
[3,"MED","Yes","Yes","Animal",327704,30]
[8,"CLE","Yes","No","Animal",64640,8]
[2,"FUL","No","Yes","Right Turn",54139,1]
[10,"HOC","No","Yes","Other Object",64640,8]
[5,"LIC","Yes","Yes","Fixed Object",3246005,59]
[4,"POR","No","No","Animal",9598733,765]
[4,"STA","Yes","No","Rear End",13592900,795]
[3,"WAY","No","Yes","Left Turn",62219,2]
[2,"LUC","No","No","Angle",19672134,233]
[7,"MOT","No","Yes","Other Object",55405,2]
[8,"HAM","Yes","No","Angle",524189107,18517]
[6,"FRA","No","No","Sideswipe - Passing",1325370,69]
[10,"NOB","No","No","Parked Vehicle",80800,10]
[6,"FRA","Yes","No","Pedestrian",12697779,121]
[7,"CLA","No","No","Sideswipe - Passing",3494510,98]
[9,"HIG","Yes","No","Pedestrian",422725,1]
[8,"CLE","No","Yes","Animal",16160,2]
[1,"HAR","Yes","No","Rear End",16160,2]
[7,"MER","No","No","Other Object",198424,14]
[8,"BUT","Yes","No","Rear End",5319833,284]
[7,"CHP","Yes","No","Head On",8080,1]
[7,"AUG","Yes","No","Sideswipe - Passing",238824,19]
[11,"CAR","No","No","Rear End",7841134,304]
[2,"WIL","Yes","No","Animal",1543280,191]
[11,"JEF","Yes","No","Other Object",557775,8]
[6,"FRA","Yes","No","Angle",21600310,851]
[7,"CLA","Yes","Yes","Overturning",101464,2]
[4,"ATB","Yes","Yes","Other Object",8080,1]
[10,"NOB","Yes","Yes","Fixed Object",886185,25]
[10,"GAL","No","Yes","Other Non-Collision",48480,6]
[5,"PER","No","No","Rear End",11012477,309]
[3,"WAY","Yes","No","Other Non-Collision",306702,16]
[2,"WIL","Yes","Yes","Fixed Object",430805,2]
[2,"SAN","No","Yes","Other Object",1278834,138]
[1,"WYA","No","No","Backing",379760,47]
[3,"ASD","Yes","No","Animal",1998098,170]
[3,"RIC","Yes","No","Animal",7081000,718]
[2,"HEN","No","Yes","Sideswipe - Passing",2401486,40]
[3,"ASD","No","No","Pedalcycles",742011,8]
[4,"SUM","No","No","Other Non-Collision",636154,12]
[3,"MED","Yes","Yes","Parked Vehicle",94539,6]
[3,"ERI","No","No","Sideswipe - Meeting",479285,8]
[5,"KNO","No","No","Other Non-Collision",408504,40]
[10,"WAS","Yes","No","Fixed Object",9510510,261]
[4,"SUM","Yes","Yes","Other Object",1801613,197]
[2,"WOO","No","No","Pedestrian",1595541,11]
[3,"WAY","No","Yes","Other Non-Collision",239979,24]
[4,"SUM","Yes","Yes","Fixed Object",12946040,320]
[4,"STA","No","Yes","Rear End",4602236,165]
[6,"MRW","No","Yes","Sideswipe - Passing",4869819,279]
[1,"VAN","No","No","Rear End",8199625,104]
[2,"SAN","Yes","No","Other Object",8080,1]
[6,"UNI","Yes","No","Fixed Object",1189871,44]
[1,"HAR","No","No","Left Turn",957044,42]
[10,"WAS","No","No","Left Turn",5065329,141]
[10,"ATH","No","No","Overturning",7164577,87]
[7,"MER","No","No","Other Non-Collision",2433584,52]
[8,"BUT","Yes","No","Left Turn",90713575,2038]
[5,"COS","No","No","Sideswipe - Passing",2868076,61]
[2,"OTT","Yes","No","Parked Vehicle",779846,64]
[9,"BRO","Yes","No","Parked Vehicle",525344,8]
[3,"MED","No","Yes","Overturning",1010288,11]
[11,"COL","No","No","Overturning",12682599,125]
[10,"VIN","Yes","No","Left Turn",101464,2]
[2,"OTT","No","No","Sideswipe - Passing",3636823,123]
[10,"GAL","Yes","No","Other Object",8080,1]
[4,"ATB","Yes","No","Overturning",2049320,15]
[3,"RIC","Yes","No","Pedalcycles",3492233,35]
[5,"LIC","Yes","Yes","Angle",70299,3]
[9,"ROS","No","Yes","Unknown",16160,2]
[1,"ALL","No","Yes","Pedestrian",422725,1]
[3,"CRA","Yes","No","Angle",109544,3]
[12,"LAK","No","Yes","Backing",71565,4]
[6,"FRA","Yes","Yes","Pedalcycles",311095,10]
[8,"BUT","No","Yes","Rear End",2067345,126]
[7,"SHE","No","No","Backing",672834,63]
[7,"MOT","Yes","Yes","Angle",8080,1]
[9,"HIG","Yes","No","Fixed Object",438885,3]
[10,"HOC","No","No","Left Turn",2760800,109]
[3,"LOR","No","No","Overturning",6811592,49]
[5,"LIC","Yes","Yes","Left Turn",517264,7]
[2,"SEN","Yes","No","Angle",8080,1]
[6,"DEL","No","No","Parked Vehicle",1943092,50]
[4,"STA","Yes","No","Pedestrian",853530,3]
[11,"COL","Yes","No","Rear End",1881727,95]
[8,"BUT","Yes","No","Unknown",16160,2]
[9,"JAC","Yes","Yes","Fixed Object",1174195,37]
[12,"LAK","Yes","Yes","Other Object",16160,2]
[2,"WOO","Yes","Yes","Other Non-Collision",64640,8]
[7,"CHP","No","No","Unknown",550850,12]
[8,"BUT","No","Yes","Sideswipe - Passing",392344,38]
[2,"WOO","Yes","No","Rear End",947100,45]
[2,"HEN","Yes","No","Parked Vehicle",102619,7]
[3,"ERI","No","No","Animal",6168863,675]
[8,"CLE","No","No","Parked Vehicle",2056098,64]
[12,"LAK","Yes","No","Fixed Object",62136087,1762]
[4,"POR","Yes","Yes","Other Object",16160,2]
[5,"MUS","Yes","No","Head On",10077852,150]
[7,"CLA","No","No","Pedalcycles",1007867,5]
[9,"PIK","No","No","Animal",6168029,503]
[3,"ASD","Yes","Yes","Parked Vehicle",16160,2]
[8,"CLI","No","No","Angle",15696598,282]
[8,"WAR","No","Yes","Other Object",258560,32]
[1,"HAN","Yes","No","Left Turn",16160,2]
[3,"RIC","Yes","No","Unknown",54139,1]
[5,"LIC","No","No","Head On",12818362,101]
[5,"LIC","No","No","Train",54139,1]
[11,"COL","Yes","No","Pedalcycles",422725,1]
[11,"COL","Yes","No","Other Object",40400,5]
[7,"MIA","No","Yes","Overturning",70299,3]
[2,"WOO","Yes","No","Animal",96960,12]
[9,"JAC","Yes","No","Head On",430805,2]
[3,"RIC","Yes","No","Backing",16160,2]
[8,"CLE","No","Yes","Rear End",2262786,90]
[7,"MIA","Yes","No","Parked Vehicle",568165,19]
[1,"ALL","Yes","Yes","Head On",717660,9]
[1,"DEF","No","Yes","Rear End",78379,4]
[11,"HOL","No","No","Rear End",22807702,679]
[11,"TUS","Yes","No","Overturning",2846625,29]
[7,"CLA","Yes","No","Right Turn",371342,24]
[7,"MOT","Yes","No","Overturning",12227630,139]
[2,"SAN","No","No","Unknown",16160,2]
[7,"MIA","Yes","No","Angle",674022,15]
[3,"MED","Yes","Yes","Sideswipe - Passing",3158211,155]
[7,"SHE","No","No","Overturning",6132806,71]
[12,"GEA","Yes","No","Pedalcycles",8080,1]
[8,"HAM","Yes","Yes","Other Non-Collision",731959,19]
[12,"CUY","No","No","Backing",145440,18]
[1,"HAN","Yes","No","Fixed Object",16895593,793]
[8,"WAR","Yes","Yes","Fixed Object",7398600,275]
[3,"ASD","Yes","No","Rear End",11185326,421]
[8,"CLI","Yes","No","Rear End",7004364,328]
[3,"CRA","No","Yes","Animal",956789,103]
[8,"BUT","Yes","Yes","Right Turn",841392,26]
[4,"SUM","Yes","Yes","Right Turn",1894950,66]
[3,"LOR","Yes","No","Backing",11563701,1069]
[11,"HAS","Yes","No","Fixed Object",16160,2]
[6,"UNI","No","No","Right Turn",688767,39]
[2,"FUL","No","No","Other Non-Collision",1034046,49]
[1,"VAN","Yes","No","Backing",185840,23]
[6,"MAR","No","Yes","Unknown",16160,2]
[6,"PIC","Yes","No","Other Non-Collision",94539,6]
[2,"SAN","Yes","No","Left Turn",16160,2]
[6,"FRA","No","No","Other Non-Collision",125704,5]
[5,"COS","No","No","Pedestrian",571514,4]
[3,"HUR","Yes","No","Head On",40400,5]
[9,"BRO","Yes","No","Rear End",1309356,40]
[1,"PUT","No","No","Head On",1261696,21]
[1,"PUT","No","No","Train",16160,2]
[1,"HAN","No","No","Sideswipe - Meeting",877770,6]
[3,"ERI","No","No","Rear End",8967219,330]
[12,"GEA","Yes","No","Animal",56560,7]
[4,"MAH","Yes","No","Sideswipe - Passing",31953702,1911]
[10,"NOB","Yes","No","Sideswipe - Passing",72720,9]
[1,"DEF","Yes","No","Animal",48480,6]
[7,"AUG","Yes","Yes","Left Turn",54139,1]
[5,"COS","No","No","Sideswipe - Meeting",845450,2]
[11,"COL","Yes","No","Angle",1553579,81]
[9,"LAW","Yes","No","Right Turn",8080,1]
[2,"FUL","Yes","No","Pedalcycles",70299,3]
[4,"MAH","Yes","No","Backing",16160,2]
[2,"SAN","Yes","No","Rear End",4085013,143]
[11,"JEF","Yes","Yes","Head On",648627,7]
[10,"ATH","Yes","Yes","Other Object",24240,3]
[3,"CRA","Yes","No","Sideswipe - Meeting",16160,2]
[3,"ERI","Yes","No","Parked Vehicle",567010,14]
[5,"LIC","Yes","No","Overturning",71565,4]
[2,"LUC","Yes","Yes","Parked Vehicle",1295282,26]
[9,"ADA","No","No","Other Object",160445,15]
[3,"MED","Yes","No","Sideswipe - Passing",249325,26]
[5,"MUS","Yes","Yes","Animal",948709,102]
[2,"OTT","Yes","No","Left Turn",407011,13]
[5,"LIC","No","Yes","Parked Vehicle",238824,19]
[6,"FRA","Yes","No","Sideswipe - Passing",11459826,811]
[9,"HIG","Yes","No","Rear End",297467,10]
[2,"SAN","Yes","Yes","Head On",8080,1]
[7,"MOT","No","Yes","Right Turn",526610,9]
[10,"ATH","Yes","No","Parked Vehicle",1242298,30]
[4,"TRU","Yes","No","Fixed Object",82437451,2238]
[3,"HUR","Yes","No","Backing",2025914,184]
[7,"AUG","Yes","No","Head On",47325,1]
[11,"COL","No","No","Fixed Object",66252641,1736]
[4,"MAH","Yes","No","Head On",181109,7]
[4,"MAH","Yes","No","Train",470050,2]
[7,"MIA","Yes","Yes","Other Object",288459,30]
[10,"HOC","Yes","Yes","Head On",54139,1]
[10,"ATH","Yes","No","Angle",1365470,33]
[7,"CLA","No","No","Sideswipe - Meeting",438885,3]
[9,"ROS","Yes","No","Fixed Object",1464624,25]
[5,"FAI","Yes","Yes","Overturning",963074,6]
[2,"HEN","Yes","No","Overturning",422725,1]
[4,"ATB","No","Yes","Animal",3821076,312]
[1,"HAR","Yes","No","Parked Vehicle",1216759,79]
[3,"ERI","Yes","No","Fixed Object",23500622,597]
[7,"MOT","Yes","No","Other Object",533535,5]
[3,"HUR","Yes","No","Other Non-Collision",24240,3]
[9,"LAW","Yes","Yes","Head On",556509,7]
[2,"LUC","No","No","Overturning",1884928,20]
[4,"STA","Yes","No","Animal",1140208,120]
[8,"BUT","Yes","Yes","Head On",651048,13]
[11,"JEF","Yes","No","Left Turn",71565,4]
[5,"MUS","No","Yes","Unknown",56560,7]
[8,"WAR","Yes","No","Train",422725,1]
[8,"WAR","Yes","No","Head On",4353583,66]
[3,"CRA","Yes","Yes","Overturning",8080,1]
[7,"DAR","Yes","No","Animal",80800,10]
[8,"CLI","No","No","Pedalcycles",666164,6]
[8,"WAR","Yes","No","Pedalcycles",2844761,33]
[7,"CLA","Yes","No","Rear End",7004281,245]
[7,"AUG","Yes","No","Angle",531003,3]
[5,"LIC","Yes","Yes","Head On",1464178,11]
[12,"GEA","Yes","No","Head On",4723920,36]
[7,"CLA","No","No","Pedestrian",1698980,5]
[3,"ERI","Yes","No","Parked Vehicle",8716811,519]
[3,"RIC","Yes","No","Sideswipe - Meeting",54139,1]
[9,"JAC","Yes","No","Other Non-Collision",16160,2]
[7,"DAR","No","No","Other Object",385419,42]
[10,"GAL","Yes","No","Left Turn",62219,2]
[6,"UNI","Yes","Yes","Rear End",309234,18]
[8,"WAR","No","Yes","Head On",446965,4]
[3,"CRA","No","Yes","Fixed Object",1766711,55]
[5,"FAI","Yes","Yes","Backing",8080,1]
[2,"SEN","No","No","Animal",14548247,1503]
[10,"ATH","Yes","No","Right Turn",150055,4]
[9,"BRO","No","No","Right Turn",844819,60]
[4,"SUM","Yes","No","Parked Vehicle",43086916,3011]
[4,"POR","No","No","Left Turn",9130191,256]
[8,"WAR","No","No","Pedestrian",2603408,16]
[1,"WYA","No","Yes","Rear End",148678,7]
[9,"JAC","Yes","Yes","Backing",8080,1]
[8,"GRE","Yes","Yes","Pedalcycles",54139,1]
[8,"WAR","Yes","No","Overturning",8080,1]
[4,"ATB","Yes","No","Fixed Object",62219,2]
[1,"PAU","No","No","Head On",2525478,30]
[3,"MED","Yes","Yes","Rear End",621706,25]
[3,"HUR","Yes","No","Unknown",94539,6]
[7,"AUG","No","No","Angle",22194743,213]
[11,"JEF","No","No","Fixed Object",32959632,820]
[8,"GRE","Yes","No","Fixed Object",1051472,52]
[6,"UNI","Yes","Yes","Parked Vehicle",32320,4]
[5,"FAI","No","Yes","Rear End",2974898,100]
[9,"PIK","No","No","Right Turn",540795,19]
[10,"MEG","Yes","No","Fixed Object",4397226,94]
[6,"MAD","No","No","Rear End",16133466,391]
[7,"CLA","No","No","Other Object",614224,19]
[3,"LOR","No","Yes","Sideswipe - Passing",1520813,63]
[9,"LAW","Yes","No","Rear End",8080,1]
[2,"FUL","No","Yes","Backing",16160,2]
[3,"HUR","Yes","No","Other Non-Collision",1696077,34]
[12,"CUY","Yes","No","Fixed Object",106321564,2731]
[3,"HUR","Yes","No","Backing",530970,56]
[9,"SCI","Yes","No","Backing",72720,9]
[3,"MED","No","Yes","Right Turn",16160,2]
[9,"ROS","No","No","Left Turn",8122142,188]
[6,"UNI","Yes","Yes","Right Turn",8080,1]
[9,"BRO","Yes","No","Left Turn",196003,8]
[12,"CUY","No","Yes","Rear End",141864,7]
[7,"AUG","Yes","No","Parked Vehicle",1550906,140]
[2,"SEN","Yes","No","Angle",11351362,450]
[7,"AUG","Yes","Yes","Animal",476382,37]
[7,"MIA","No","No","Unknown",79645,5]
[9,"JAC","No","No","Parked Vehicle",1222451,21]
[3,"MED","Yes","Yes","Backing",24240,3]
[12,"LAK","Yes","Yes","Rear End",24406085,858]
[10,"GAL","No","Yes","Sideswipe - Passing",682437,34]
[6,"DEL","Yes","Yes","Angle",1496498,15]
[3,"ASD","Yes","No","Left Turn",5291713,112]
[3,"RIC","Yes","No","Head On",10134409,153]
[3,"RIC","Yes","No","Train",55405,2]
[4,"POR","Yes","No","Rear End",803970,37]
[5,"LIC","Yes","No","Pedestrian",8276992,72]
[8,"WAR","No","Yes","Sideswipe - Passing",3226873,188]
[12,"GEA","No","Yes","Left Turn",54139,1]
[7,"CLA","Yes","No","Other Non-Collision",8080,1]
[6,"FAY","Yes","No","Other Non-Collision",603834,8]
[8,"WAR","Yes","No","Left Turn",7389547,193]
[10,"ATH","Yes","No","Head On",899589,3]
[5,"MUS","No","No","Other Non-Collision",985566,43]
[3,"MED","Yes","No","Sideswipe - Meeting",94650,2]
[10,"HOC","Yes","No","Sideswipe - Passing",2458013,100]
[5,"LIC","Yes","No","Angle",37479623,1168]
[2,"SEN","No","No","Left Turn",4306149,99]
[4,"STA","No","Yes","Backing",24240,3]
[10,"WAS","No","No","Pedalcycles",578328,4]
[6,"UNI","Yes","Yes","Fixed Object",3384598,130]
[1,"HAN","No","Yes","Parked Vehicle",56560,7]
[8,"HAM","Yes","No","Angle",6984364,282]
[4,"SUM","Yes","Yes","Sideswipe - Meeting",422725,1]
[9,"ROS","Yes","Yes","Sideswipe - Passing",4441764,154]
[10,"HOC","No","Yes","Unknown",24240,3]
[8,"WAR","Yes","No","Right Turn",780663,47]
[6,"MAD","Yes","No","Sideswipe - Passing",63485,3]
[2,"WIL","No","No","Backing",1258170,146]
[1,"HAN","Yes","No","Other Non-Collision",32320,4]
[8,"GRE","Yes","No","Left Turn",29969822,809]
[7,"AUG","Yes","Yes","Fixed Object",600485,23]
[10,"HOC","Yes","No","Pedestrian",1352770,12]
[12,"CUY","Yes","No","Rear End",39684135,1851]
[10,"GAL","Yes","No","Fixed Object",8080,1]
[2,"WIL","Yes","No","Left Turn",8080,1]
[4,"TRU","Yes","No","Other Non-Collision",8236531,207]
[6,"MRW","No","No","Unknown",48480,6]
[8,"GRE","Yes","No","Other Non-Vehicle",47325,1]
[1,"HAN","Yes","No","Fixed Object",48480,6]
[1,"HAR","Yes","No","Animal",80800,10]
[3,"RIC","No","Yes","Other Object",517120,64]
[1,"VAN","Yes","No","Parked Vehicle",121200,15]
[2,"WIL","No","No","Unknown",48480,6]
[3,"HUR","Yes","No","Parked Vehicle",16160,2]
[4,"POR","Yes","No","Pedestrian",155603,3]
[4,"MAH","Yes","Yes","Sideswipe - Passing",174184,11]
[11,"HAS","Yes","No","Backing",71565,4]
[3,"WAY","Yes","No","Backing",32320,4]
[8,"WAR","Yes","Yes","Overturning",430805,2]
[3,"LOR","Yes","No","Sideswipe - Passing",120045,10]
[1,"ALL","Yes","No","Other Object",418667,25]
[9,"ADA","No","No","Angle",8727799,207]
[3,"LOR","Yes","No","Other Non-Collision",3015970,32]
[2,"FUL","Yes","No","Right Turn",235248,8]
[6,"DEL","Yes","No","Fixed Object",2162742,100]
[7,"MER","No","No","Pedalcycles",517375,3]
[2,"SAN","Yes","No","Animal",2011582,227]
[1,"HAN","Yes","No","Right Turn",70299,3]
[4,"TRU","Yes","Yes","Other Non-Collision",746598,81]
[4,"POR","Yes","No","Parked Vehicle",587563,10]
[11,"COL","Yes","No","Fixed Object",340399,17]
[4,"STA","No","No","Pedalcycles",250253,5]
[8,"CLE","No","Yes","Other Non-Collision",8080,1]
[11,"COL","Yes","No","Other Non-Collision",102619,7]
[6,"FRA","Yes","Yes","Overturning",593222,5]
[5,"LIC","Yes","No","Overturning",4413087,29]
[11,"JEF","Yes","No","Pedalcycles",899589,3]
[8,"WAR","Yes","No","Parked Vehicle",1000909,62]
[4,"POR","Yes","No","Rear End",450987,29]
[11,"COL","Yes","No","Left Turn",597355,26]
[6,"MAR","Yes","No","Pedestrian",7548986,41]
[9,"ROS","No","Yes","Head On",869690,5]
[11,"COL","No","Yes","Rear End",514023,14]
[11,"HOL","No","No","Left Turn",6695093,246]
[6,"DEL","Yes","No","Rear End",1376157,81]
[3,"MED","Yes","Yes","Other Object",88880,11]
[9,"ADA","No","No","Animal",7196078,535]
[10,"MEG","Yes","No","Overturning",8080,1]
[11,"JEF","Yes","No","Unknown",8080,1]
[11,"JEF","Yes","No","Angle",158024,9]
[2,"OTT","No","Yes","Other Object",242400,30]
[2,"LUC","Yes","Yes","Rear End",3195701,125]
[2,"LUC","No","No","Left Turn",2464635,51]
[3,"LOR","Yes","No","Parked Vehicle",1413097,105]
[1,"ALL","Yes","No","Rear End",643974,40]
[2,"SAN","Yes","No","Animal",153520,19]
[2,"WIL","No","No","Parked Vehicle",732183,41]
[7,"MIA","No","No","Left Turn",3580374,112]
[3,"ASD","No","Yes","Unknown",64640,8]
[10,"VIN","Yes","No","Head On",116358,3]
[4,"STA","Yes","No","Parked Vehicle",21092203,1437]
[1,"HAR","No","No","Head On",5520222,26]
[1,"HAR","No","No","Train",430805,2]
[6,"PIC","No","No","Parked Vehicle",1953482,61]
[8,"WAR","No","No","Other Non-Collision",1252688,41]
[11,"JEF","No","No","Unknown",40400,5]
[1,"WYA","Yes","No","Angle",3654912,98]
[10,"HOC","No","No","Unknown",94539,6]
[7,"SHE","Yes","No","Head On",1100991,33]
[4,"MAH","No","Yes","Other Non-Collision",1344100,54]
[7,"MOT","Yes","Yes","Other Object",3194672,218]
[7,"MIA","Yes","No","Parked Vehicle",8885815,496]
[4,"ATB","No","No","Other Non-Vehicle",54139,1]
[5,"COS","Yes","No","Sideswipe - Passing",8080,1]
[11,"TUS","No","Yes","Unknown",48480,6]
[8,"WAR","Yes","Yes","Angle",62219,2]
[11,"COL","No","No","Rear End",12572348,357]
[9,"ROS","Yes","No","Pedestrian",5780264,43]
[7,"CLA","Yes","Yes","Unknown",16160,2]
[4,"MAH","Yes","No","Right Turn",24240,3]
[1,"HAR","Yes","No","Fixed Object",606701,28]
[3,"HUR","No","No","Rear End",10680755,175]
[7,"CHP","No","No","Overturning",4133827,54]
[11,"JEF","Yes","No","Angle",16007244,527]
[9,"ROS","No","No","Head On",6152427,110]
[4,"TRU","No","Yes","Sideswipe - Passing",1051807,70]
[3,"HUR","Yes","No","Parked Vehicle",819573,29]
[10,"GAL","Yes","Yes","Rear End",16160,2]
[7,"MIA","Yes","No","Backing",2855589,338]
[8,"BUT","Yes","No","Right Turn",622044,47]
[11,"TUS","Yes","Yes","Pedestrian",108278,2]
[4,"ATB","No","No","Fixed Object",85864598,1606]
[3,"HUR","Yes","No","Angle",11130366,320]
[4,"STA","Yes","No","Fixed Object",134997211,4278]
[3,"LOR","No","Yes","Angle",24240,3]
[3,"WAY","Yes","Yes","Rear End",78379,4]
[5,"LIC","No","Yes","Overturning",2753352,24]
[6,"MAD","Yes","No","Right Turn",445328,34]
[7,"DAR","Yes","No","Fixed Object",745587,19]
[4,"ATB","Yes","No","Parked Vehicle",540349,5]
[8,"HAM","Yes","No","Sideswipe - Meeting",2749519,44]
[6,"UNI","No","No","Pedalcycles",1062006,6]
[9,"PIK","No","No","Parked Vehicle",261798,21]
[4,"STA","Yes","No","Overturning",171763,5]
[1,"DEF","Yes","No","Head On",8080,1]
[3,"WAY","Yes","No","Rear End",158024,9]
[6,"DEL","No","Yes","Other Object",366949,30]
[5,"LIC","No","No","Fixed Object",78241093,1847]
[2,"WIL","No","Yes","Angle",8080,1]
[6,"MAR","Yes","No","Other Non-Collision",928635,67]
[3,"WAY","No","Yes","Head On",478130,3]
[10,"MOE","No","No","Sideswipe - Meeting",16160,2]
[10,"NOB","Yes","No","Other Object",16160,2]
[7,"MIA","Yes","No","Overturning",1065804,9]
[12,"CUY","No","No","Rear End",1952735,89]
[7,"LOG","Yes","No","Other Non-Collision",313516,16]
[8,"CLE","No","No","Left Turn",13467554,434]
[11,"COL","Yes","No","Angle",5642428,208]
[12,"LAK","No","No","Overturning",825938,11]
[10,"ATH","Yes","No","Overturning",1665840,14]
[6,"UNI","No","No","Animal",8768324,711]
[8,"WAR","Yes","No","Sideswipe - Passing",1233958,56]
[4,"TRU","Yes","No","Rear End",175339,16]
[5,"MUS","Yes","No","Angle",260643,16]
[1,"ALL","Yes","No","Angle",75577687,1993]
[7,"MIA","Yes","Yes","Train",54139,1]
[7,"MIA","Yes","Yes","Head On",47325,1]
[3,"ERI","Yes","No","Angle",463125,6]
[11,"BEL","Yes","No","Rear End",166104,10]
[3,"RIC","Yes","No","Angle",3461262,115]
[9,"SCI","Yes","No","Unknown",8080,1]
[9,"LAW","Yes","Yes","Fixed Object",2585799,115]
[10,"WAS","Yes","No","Sideswipe - Passing",63485,3]
[6,"FRA","Yes","Yes","Sideswipe - Passing",4729294,288]
[1,"HAR","Yes","No","Fixed Object",4573723,119]
[8,"WAR","No","No","Angle",21906323,416]
[12,"LAK","Yes","No","Unknown",86459,5]
[12,"LAK","No","No","Pedestrian",899589,3]
[1,"ALL","No","No","Left Turn",6668502,109]
[7,"CLA","Yes","Yes","Left Turn",132518,5]
[3,"CRA","Yes","No","Backing",1438124,148]
[8,"GRE","No","Yes","Animal",1128774,100]
[7,"MIA","Yes","No","Unknown",133784,6]
[12,"CUY","Yes","No","Animal",15681853,772]
[4,"ATB","Yes","No","Animal",614080,76]
[8,"CLI","No","Yes","Other Non-Collision",312699,33]
[2,"OTT","No","No","Angle",17638646,184]
[8,"BUT","Yes","Yes","Fixed Object",20182447,557]
[9,"SCI","Yes","Yes","Fixed Object",54139,1]
[12,"LAK","Yes","Yes","Right Turn",457912,25]
[1,"PUT","No","No","Parked Vehicle",324128,19]
[3,"ASD","Yes","No","Parked Vehicle",853832,74]
[10,"WAS","Yes","No","Backing",1053860,111]
[4,"POR","Yes","No","Overturning",470050,2]
[4,"MAH","Yes","Yes","Backing",381843,31]
[7,"SHE","No","Yes","Overturning",1235035,12]
[5,"MUS","Yes","No","Sideswipe - Meeting",63485,3]
[8,"CLI","No","Yes","Other Object",199579,19]
[6,"FRA","Yes","No","Other Non-Collision",27900071,779]
[6,"MAR","Yes","No","Other Object",754005,42]
[5,"FAI","Yes","No","Head On",87725,6]
[4,"SUM","No","Yes","Angle",611914,9]
[1,"ALL","No","No","Rear End",12464924,263]
[4,"STA","Yes","Yes","Sideswipe - Passing",812759,29]
[1,"PAU","No","No","Other Non-Collision",862394,40]
[8,"HAM","Yes","No","Pedestrian",3433255,26]
[9,"ROS","Yes","No","Right Turn",478130,3]
[7,"DAR","Yes","Yes","Parked Vehicle",54139,1]
[6,"MRW","No","No","Pedalcycles",743277,9]
[11,"TUS","Yes","Yes","Overturning",2057400,16]
[8,"CLI","No","Yes","Angle",71565,4]
[10,"NOB","Yes","No","Other Non-Collision",8080,1]
[7,"SHE","Yes","No","Other Object",8080,1]
[3,"ERI","Yes","No","Rear End",36751655,1649]
[6,"FAY","No","Yes","Other Object",490459,55]
[1,"PUT","Yes","No","Rear End",47325,1]
[8,"PRE","Yes","No","Left Turn",8080,1]
[12,"LAK","Yes","No","Right Turn",584882,31]
[10,"HOC","Yes","Yes","Sideswipe - Passing",54139,1]
[1,"PAU","No","Yes","Left Turn",8080,1]
[7,"CLA","Yes","Yes","Backing",24240,3]
[6,"FAY","Yes","No","Other Object",438885,3]
[5,"FAI","No","No","Pedalcycles",1009133,6]
[7,"CHP","No","No","Left Turn",4403110,85]
[3,"MED","Yes","No","Parked Vehicle",833201,29]
[6,"FAY","Yes","No","Angle",12573803,403]
[7,"AUG","Yes","No","Backing",772215,81]
[7,"MER","Yes","No","Head On",1904329,15]
[12,"GEA","No","Yes","Animal",664754,62]
[11,"HOL","No","No","Angle",17520281,437]
[5,"FAI","No","No","Backing",2104470,78]
[8,"HAM","No","Yes","Right Turn",175450,12]
[3,"ERI","Yes","No","Animal",331280,41]
[1,"DEF","No","No","Head On",2790068,26]
[1,"DEF","No","No","Train",8080,1]
[3,"LOR","Yes","Yes","Animal",2061245,151]
[4,"SUM","Yes","No","Parked Vehicle",1561440,94]
[1,"PAU","No","No","Parked Vehicle",464726,25]
[10,"WAS","Yes","Yes","Overturning",124438,4]
[6,"FRA","Yes","No","Overturning",1682000,16]
[6,"UNI","Yes","No","Right Turn",144285,13]
[11,"JEF","Yes","Yes","Right Turn",8080,1]
[8,"WAR","Yes","No","Backing",1461724,58]
[2,"WOO","Yes","No","Other Object",254984,21]
[2,"WIL","No","Yes","Other Non-Collision",361290,35]
[3,"WAY","Yes","No","Animal",682069,69]
[9,"PIK","Yes","No","Other Non-Collision",174184,11]
[11,"HOL","No","No","Pedalcycles",6327468,33]
[4,"POR","Yes","Yes","Pedestrian",54139,1]
[8,"CLI","Yes","No","Fixed Object",5942650,129]
[3,"LOR","Yes","No","Angle",21897401,776]
[10,"HOC","Yes","No","Other Object",24240,3]
[1,"DEF","No","Yes","Animal",40400,5]
[6,"FRA","Yes","Yes","Fixed Object",192190687,4848]
[10,"WAS","Yes","Yes","Animal",8080,1]
[2,"LUC","Yes","No","Other Object",3458024,126]
[9,"BRO","Yes","No","Fixed Object",2088529,64]
[3,"CRA","No","Yes","Rear End",703921,13]
[10,"WAS","Yes","No","Animal",589840,73]
[10,"ATH","No","No","Pedalcycles",476864,2]
[5,"MUS","Yes","Yes","Sideswipe - Passing",3683406,186]
[3,"MED","No","No","Pedalcycles",3544217,11]
[1,"HAR","Yes","No","Overturning",16160,2]
[6,"UNI","Yes","Yes","Parked Vehicle",8080,1]
[4,"MAH","Yes","Yes","Animal",3379659,307]
[3,"RIC","Yes","No","Backing",48480,6]
[5,"FAI","Yes","No","Rear End",39240617,1764]
[12,"GEA","Yes","No","Rear End",197269,9]
[7,"AUG","Yes","Yes","Other Object",40400,5]
[4,"MAH","Yes","Yes","Other Non-Collision",101464,2]
[8,"CLI","No","No","Rear End",11169799,391]
[7,"LOG","Yes","Yes","Fixed Object",491387,34]
[3,"MED","Yes","No","Fixed Object",2394896,62]
[9,"JAC","Yes","No","Right Turn",886634,43]
[6,"MAR","No","No","Pedalcycles",1322314,4]
[1,"DEF","Yes","No","Sideswipe - Passing",47325,1]
[12,"GEA","Yes","No","Right Turn",936826,64]
[1,"PUT","Yes","No","Overturning",54139,1]
[12,"CUY","Yes","Yes","Right Turn",740823,56]
[6,"MAD","No","Yes","Other Object",1212144,93]
[8,"BUT","Yes","No","Other Non-Collision",3557289,114]
[5,"GUE","No","No","Unknown",430805,2]
[7,"SHE","Yes","Yes","Other Non-Collision",210080,26]
[7,"CHP","No","No","Backing",880975,48]
[11,"BEL","Yes","No","Other Object",56560,7]
[7,"MIA","Yes","No","Sideswipe - Passing",137360,17]
[8,"GRE","Yes","Yes","Left Turn",250142,9]
[12,"CUY","Yes","No","Unknown",23489286,1015]
[4,"SUM","Yes","No","Right Turn",8080,1]
[8,"CLI","Yes","Yes","Animal",427902,31]
[11,"COL","Yes","No","Other Non-Collision",63485,3]
[3,"MED","Yes","Yes","Backing",16160,2]
[3,"ERI","Yes","No","Sideswipe - Meeting",1444780,20]
[10,"WAS","No","Yes","Overturning",87725,6]
[8,"GRE","No","Yes","Backing",16160,2]
[4,"STA","Yes","No","Left Turn",75215403,2274]
[4,"POR","Yes","No","Parked Vehicle",207659,20]
[10,"NOB","Yes","No","Angle",362218,14]
[2,"HEN","Yes","No","Unknown",16160,2]
[6,"PIC","No","No","Left Turn",6576494,131]
[8,"GRE","Yes","No","Overturning",4300637,51]
[9,"LAW","Yes","No","Other Non-Collision",152365,14]
[10,"WAS","Yes","No","Parked Vehicle",2400378,167]
[8,"CLE","No","Yes","Fixed Object",900262,43]
[4,"SUM","Yes","Yes","Parked Vehicle",1004629,16]
[9,"HIG","Yes","No","Pedalcycles",54139,1]
[7,"CLA","No","Yes","Angle",164838,9]
[7,"MIA","No","No","Parked Vehicle",2128821,77]
[4,"SUM","Yes","No","Left Turn",97767703,3335]
[2,"LUC","No","No","Pedestrian",1532056,8]
[8,"BUT","Yes","No","Animal",1323882,76]
[6,"MAR","No","No","Fixed Object",37451023,808]
[4,"ATB","Yes","No","Angle",126859,10]
[6,"PIC","Yes","No","Backing",153520,19]
[9,"JAC","Yes","No","Head On",3055215,32]
[9,"JAC","Yes","No","Train",54139,1]
[1,"PAU","No","No","Angle",10842654,123]
[6,"UNI","Yes","Yes","Fixed Object",486656,18]
[5,"FAI","Yes","No","Animal",891922,69]
[3,"RIC","Yes","No","Animal",16160,2]
[2,"SAN","Yes","No","Other Non-Collision",724923,27]
[2,"SEN","No","No","Parked Vehicle",307857,21]
[6,"DEL","Yes","No","Sideswipe - Meeting",511605,12]
[3,"RIC","Yes","No","Backing",4938277,483]
[2,"WOO","Yes","Yes","Backing",125704,5]
[6,"UNI","Yes","Yes","Fixed Object",16160,2]
[2,"WOO","No","Yes","Overturning",2632376,31]
[4,"POR","Yes","No","Sideswipe - Passing",16160,2]
[8,"BUT","Yes","No","Parked Vehicle",3415248,217]
[5,"LIC","Yes","Yes","Unknown",8080,1]
[2,"HEN","No","No","Overturning",5242449,70]
[8,"CLI","Yes","No","Parked Vehicle",3032654,97]
[3,"ASD","No","Yes","Animal",877255,94]
[3,"MED","No","Yes","Animal",2428418,203]
[9,"SCI","Yes","No","Angle",38784978,1057]
[7,"CHP","Yes","No","Right Turn",1204543,53]
[10,"ATH","No","No","Angle",10435823,143]
[9,"BRO","Yes","Yes","Other Non-Collision",8080,1]
[8,"PRE","No","No","Angle",17389126,301]
[4,"TRU","Yes","Yes","Left Turn",2765451,46]
[3,"WAY","Yes","Yes","Fixed Object",1571265,57]
[4,"SUM","Yes","Yes","Fixed Object",21167230,734]
[7,"DAR","Yes","No","Sideswipe - Passing",1417344,126]
[3,"CRA","Yes","No","Rear End",6667426,266]
[6,"PIC","Yes","No","Right Turn",1081817,64]
[6,"PIC","Yes","No","Backing",327704,30]
[7,"MIA","No","No","Right Turn",642708,39]
[2,"OTT","No","Yes","Sideswipe - Passing",1018332,61]
[7,"SHE","No","No","Fixed Object",25664283,664]
[6,"FRA","Yes","No","Sideswipe - Meeting",128125,11]
[11,"COL","No","No","Animal",6465039,457]
[6,"DEL","Yes","No","Overturning",5094588,46]
[1,"VAN","Yes","No","Left Turn",24240,3]
[9,"HIG","Yes","No","Sideswipe - Passing",380688,26]
[5,"LIC","No","Yes","Unknown",94539,6]
[10,"WAS","No","Yes","Right Turn",116358,3]
[6,"MAD","No","No","Right Turn",1657389,44]
[10,"ATH","Yes","No","Right Turn",823706,50]
[2,"LUC","No","Yes","Angle",62219,2]
[1,"ALL","Yes","Yes","Sideswipe - Passing",8080,1]
[11,"JEF","Yes","No","Unknown",8080,1]
[9,"JAC","Yes","Yes","Overturning",54139,1]
[9,"PIK","Yes","No","Other Object",149944,8]
[2,"WIL","No","No","Overturning",5445639,77]
[3,"CRA","Yes","No","Unknown",95805,7]
[7,"MOT","Yes","No","Parked Vehicle",490459,55]
[6,"DEL","Yes","No","Pedalcycles",320552,8]
[8,"BUT","Yes","No","Sideswipe - Passing",12082100,570]
[4,"ATB","No","No","Pedalcycles",2277308,9]
[2,"WOO","Yes","Yes","Rear End",1097493,71]
[3,"RIC","No","No","Sideswipe - Meeting",1003474,11]
[7,"MOT","No","No","Parked Vehicle",696736,44]
[7,"CHP","Yes","No","Unknown",16160,2]
[2,"HEN","Yes","Yes","Backing",8080,1]
[4,"POR","No","No","Parked Vehicle",1524871,39]
[4,"SUM","Yes","Yes","Fixed Object",87554983,2261]
[5,"MUS","No","Yes","Backing",48480,6]
[3,"ERI","Yes","Yes","Pedalcycles",8080,1]
[12,"CUY","Yes","Yes","Head On",299999,12]
[10,"VIN","Yes","No","Angle",194737,7]
[9,"HIG","No","No","Sideswipe - Meeting",869690,5]
[12,"GEA","No","No","Other Non-Collision",911320,60]
[9,"ADA","No","No","Unknown",40400,5]
[9,"PIK","No","No","Sideswipe - Passing",2434141,62]
[7,"LOG","No","No","Sideswipe - Meeting",16160,2]
[4,"SUM","Yes","No","Other Non-Collision",8392436,281]
[8,"CLE","No","No","Sideswipe - Passing",7336945,208]
[8,"BUT","Yes","Yes","Other Non-Collision",1002848,103]
[3,"WAY","Yes","Yes","Angle",667319,11]
[9,"LAW","Yes","Yes","Other Non-Collision",16160,2]
[10,"HOC","Yes","Yes","Pedestrian",476864,2]
[5,"FAI","Yes","No","Parked Vehicle",6707694,426]
[6,"FRA","Yes","No","Backing",5693182,591]
[2,"LUC","Yes","Yes","Pedestrian",2685139,9]
[2,"OTT","Yes","No","Rear End",70299,3]
[2,"LUC","Yes","No","Overturning",10654835,130]
[9,"JAC","Yes","No","Pedestrian",54139,1]
[2,"HEN","Yes","Yes","Other Non-Collision",526610,9]
[11,"HOL","No","No","Head On",10557103,98]
[9,"LAW","Yes","No","Parked Vehicle",40400,5]
[4,"TRU","No","No","Animal",10939376,842]
[2,"FUL","No","No","Overturning",8228403,100]
[6,"FRA","Yes","Yes","Overturning",982807,15]
[9,"SCI","No","No","Animal",6664699,529]
[7,"AUG","Yes","Yes","Animal",102619,7]
[7,"MIA","Yes","No","Sideswipe - Passing",4184792,387]
[6,"UNI","Yes","Yes","Head On",532269,4]
[11,"TUS","Yes","No","Other Object",8080,1]
[11,"BEL","No","No","Rear End",9624370,379]
[4,"STA","Yes","No","Right Turn",269989,18]
[6,"DEL","Yes","No","Fixed Object",38299399,1452]
[12,"LAK","No","No","Animal",841248,83]
[7,"SHE","Yes","No","Rear End",172918,10]
[10,"ATH","Yes","Yes","Left Turn",813576,12]
[8,"BUT","No","No","Pedalcycles",209742,4]
[2,"LUC","Yes","No","Left Turn",1830307,54]
[8,"WAR","Yes","No","Pedestrian",578328,4]
[7,"LOG","No","No","Pedestrian",1001053,5]
[9,"HIG","Yes","No","Head On",1924844,30]
[10,"ATH","Yes","Yes","Fixed Object",1885712,56]
[7,"MOT","Yes","Yes","Rear End",4617286,264]
[6,"PIC","Yes","No","Angle",3806647,87]
[1,"ALL","No","Yes","Other Non-Collision",239979,24]
[1,"ALL","No","Yes","Backing",24240,3]
[1,"HAN","Yes","No","Rear End",1088629,34]
[2,"WOO","Yes","No","Backing",2523038,262]
[8,"WAR","Yes","No","Backing",700650,77]
[12,"GEA","Yes","No","Overturning",47325,1]
[6,"DEL","Yes","No","Left Turn",37741643,945]
[5,"LIC","No","No","Angle",30111869,575]
[3,"ERI","Yes","Yes","Head On",8080,1]
[8,"GRE","Yes","No","Other Non-Collision",179843,6]
[7,"MIA","Yes","Yes","Sideswipe - Passing",40400,5]
[6,"FRA","Yes","No","Unknown",222664,17]
[1,"PUT","No","No","Angle",11176048,204]
[1,"HAN","Yes","No","Sideswipe - Passing",32320,4]
[3,"LOR","No","Yes","Overturning",124438,4]
[7,"MIA","Yes","No","Pedalcycles",2580880,28]
[7,"AUG","Yes","Yes","Other Non-Collision",24240,3]
[11,"COL","Yes","Yes","Rear End",8080,1]
[11,"CAR","No","No","Other Non-Collision",1287202,25]
[4,"SUM","Yes","Yes","Angle",778018,19]
[1,"WYA","No","No","Pedalcycles",8080,1]
[9,"PIK","Yes","No","Animal",1043137,112]
[7,"SHE","Yes","Yes","Pedestrian",470050,2]
[2,"OTT","Yes","Yes","Other Object",136205,12]
[3,"LOR","Yes","Yes","Fixed Object",2047683,45]
[8,"CLI","No","No","Unknown",133784,6]
[9,"ADA","No","No","Backing",1171406,66]
[2,"SEN","No","No","Head On",9432094,54]
[2,"SEN","No","No","Train",470050,2]
[3,"MED","Yes","No","Rear End",51303052,2559]
[6,"MAR","No","Yes","Sideswipe - Passing",16160,2]
[7,"SHE","No","No","Other Object",222664,17]
[4,"SUM","Yes","Yes","Parked Vehicle",4673916,86]
[2,"SAN","Yes","Yes","Parked Vehicle",24240,3]
[1,"HAR","Yes","No","Angle",4279417,162]
[4,"MAH","Yes","Yes","Sideswipe - Passing",11626905,475]
[8,"WAR","No","Yes","Animal",818163,85]
[3,"ASD","No","No","Head On",8377572,84]
[6,"PIC","No","No","Sideswipe - Passing",5294885,207]
[3,"ERI","No","No","Head On",4509338,50]
[3,"ERI","No","No","Train",8080,1]
[2,"HEN","No","No","Unknown",32320,4]
[7,"SHE","Yes","No","Right Turn",1942350,112]
[10,"GAL","Yes","No","Left Turn",2235941,70]
[10,"HOC","Yes","No","Animal",24240,3]
[10,"ATH","Yes","No","Other Object",70299,3]
[7,"AUG","No","No","Unknown",48480,6]
[2,"SAN","Yes","No","Backing",210080,26]
[11,"BEL","Yes","No","Backing",1617967,154]
[9,"BRO","Yes","No","Head On",1485997,8]
[8,"GRE","Yes","Yes","Parked Vehicle",221509,12]
[12,"CUY","Yes","Yes","Parked Vehicle",14344791,283]
[1,"VAN","No","No","Animal",6151354,589]
[3,"HUR","Yes","No","Overturning",2064214,16]
[6,"MAD","No","Yes","Parked Vehicle",799726,20]
[1,"ALL","No","No","Other Object",630384,21]
[4,"POR","Yes","No","Right Turn",16160,2]
[9,"JAC","No","No","Sideswipe - Meeting",899589,3]
[5,"MUS","Yes","No","Pedalcycles",2273247,29]
[11,"BEL","Yes","No","Unknown",573935,10]
[5,"GUE","Yes","Yes","Backing",40400,5]
[2,"WOO","Yes","Yes","Overturning",1948413,23]
[4,"STA","Yes","No","Backing",1886917,197]
[5,"LIC","No","Yes","Other Object",790829,36]
[10,"WAS","No","Yes","Backing",16160,2]
[7,"SHE","Yes","No","Backing",2665018,299]
[2,"HEN","Yes","No","Sideswipe - Passing",1732419,63]
[8,"GRE","Yes","Yes","Fixed Object",14958212,643]
[6,"MAD","No","No","Backing",739784,81]
[1,"ALL","Yes","No","Sideswipe - Meeting",430805,2]
[11,"COL","No","No","Sideswipe - Passing",7570963,166]
[5,"LIC","Yes","Yes","Angle",959016,30]
[9,"BRO","No","No","Parked Vehicle",1884446,55]
[11,"JEF","No","No","Head On",6215952,42]
[5,"FAI","Yes","No","Animal",126859,10]
[12,"CUY","No","No","Other Non-Collision",1480338,13]
[7,"AUG","Yes","No","Other Non-Collision",121200,15]
[9,"ROS","Yes","No","Right Turn",2361579,181]
[11,"TUS","Yes","Yes","Animal",3587096,335]
[8,"WAR","No","No","Head On",8223568,70]
[8,"WAR","No","No","Train",54139,1]
[4,"STA","Yes","No","Pedalcycles",539083,4]
[11,"HOL","No","No","Other Non-Vehicle",539083,4]
[7,"SHE","Yes","No","Pedalcycles",3750902,33]
[1,"PAU","No","Yes","Other Object",48480,6]
[6,"DEL","Yes","No","Rear End",111826847,4924]
[7,"MOT","Yes","Yes","Fixed Object",7274310,135]
[5,"PER","No","No","Backing",1200117,112]
[1,"VAN","Yes","No","Other Non-Collision",40400,5]
[4,"MAH","Yes","No","Backing",218160,27]
[5,"LIC","Yes","Yes","Other Non-Collision",225085,23]
[1,"HAN","No","No","Pedalcycles",62219,2]
[11,"COL","Yes","No","Sideswipe - Passing",1980811,76]
[9,"JAC","Yes","No","Rear End",64640,8]
[10,"WAS","No","Yes","Sideswipe - Passing",469568,37]
[4,"POR","Yes","Yes","Fixed Object",339133,16]
[11,"JEF","No","No","Falling From Or In Vehicle",422725,1]
[10,"NOB","Yes","No","Sideswipe - Meeting",8080,1]
[2,"OTT","Yes","No","Left Turn",16160,2]
[7,"MOT","Yes","No","Fixed Object",283993239,6361]
[8,"WAR","Yes","Yes","Parked Vehicle",54139,1]
[2,"SEN","Yes","No","Unknown",32320,4]
[9,"ROS","Yes","Yes","Angle",187923,7]
[11,"COL","Yes","No","Overturning",1174082,11]
[6,"PIC","Yes","No","Pedestrian",2431645,11]
[8,"WAR","Yes","No","Overturning",304281,10]
[3,"LOR","Yes","Yes","Backing",474299,53]
[7,"MOT","Yes","No","Left Turn",151304369,4315]
[7,"MER","Yes","No","Rear End",8355205,424]
[8,"BUT","Yes","Yes","Sideswipe - Passing",17186505,998]
[4,"MAH","Yes","No","Right Turn",132518,5]
[2,"LUC","Yes","No","Parked Vehicle",63471790,4277]
[8,"BUT","No","Yes","Right Turn",40400,5]
[5,"GUE","No","No","Other Object",237558,18]
[5,"LIC","Yes","No","Sideswipe - Meeting",550850,12]
[4,"ATB","Yes","No","Head On",8080,1]
[9,"BRO","No","No","Left Turn",6223253,180]
[5,"LIC","Yes","No","Unknown",135050,7]
[2,"HEN","No","Yes","Overturning",286855,7]
[9,"LAW","Yes","Yes","Rear End",8080,1]
[8,"GRE","Yes","Yes","Left Turn",1731746,23]
[2,"WIL","No","Yes","Fixed Object",2281039,144]
[10,"ATH","No","No","Backing",863549,45]
[11,"TUS","No","Yes","Head On",502370,6]
[3,"ASD","Yes","No","Angle",13369472,364]
[4,"TRU","No","Yes","Unknown",16160,2]
[8,"WAR","Yes","No","Left Turn",23593400,843]
[10,"WAS","Yes","No","Head On",2451938,34]
[12,"LAK","Yes","Yes","Sideswipe - Passing",729765,39]
[2,"WOO","Yes","Yes","Sideswipe - Meeting",8080,1]
[7,"MER","Yes","No","Pedestrian",2949020,14]
[3,"RIC","Yes","No","Angle",64924378,1723]
[1,"HAR","No","No","Other Object",654624,24]
[4,"ATB","No","No","Other Non-Collision",644796,57]
[5,"FAI","Yes","No","Right Turn",87725,6]
[12,"GEA","No","No","Pedalcycles",1820177,16]
[3,"ERI","Yes","Yes","Overturning",54139,1]
[9,"LAW","No","Yes","Sideswipe - Passing",24240,3]
[7,"MIA","No","No","Other Object",206504,15]
[7,"SHE","Yes","No","Fixed Object",56560,7]
[1,"PUT","Yes","No","Sideswipe - Passing",24240,3]
[12,"CUY","Yes","No","Sideswipe - Meeting",2635806,69]
[11,"COL","Yes","No","Parked Vehicle",501104,5]
[8,"PRE","Yes","No","Parked Vehicle",103885,8]
[10,"HOC","Yes","Yes","Rear End",612249,27]
[4,"STA","Yes","No","Sideswipe - Passing",47799686,3188]
[10,"WAS","Yes","No","Parked Vehicle",205349,10]
[6,"FRA","Yes","No","Rear End",566301,23]
[6,"UNI","Yes","No","Right Turn",32320,4]
[7,"LOG","No","No","Rear End",8734358,268]
[10,"MEG","No","No","Animal",5620965,339]
[10,"MOE","No","No","Backing",550479,43]
[3,"LOR","No","Yes","Parked Vehicle",592405,22]
[4,"ATB","Yes","No","Animal",1691393,150]
[11,"BEL","Yes","No","Other Non-Collision",1628756,47]
[4,"STA","Yes","No","Unknown",125704,5]
[6,"MAR","Yes","No","Sideswipe - Meeting",16160,2]
[10,"HOC","Yes","No","Unknown",8080,1]
[1,"HAN","Yes","Yes","Unknown",88880,11]
[3,"RIC","Yes","Yes","Other Object",1240888,86]
[8,"HAM","Yes","No","Animal",17994292,1436]
[10,"ATH","Yes","No","Sideswipe - Passing",8080,1]
[7,"MOT","Yes","No","Rear End",308399000,13311]
[1,"HAR","Yes","No","Other Object",16160,2]
[5,"MUS","No","Yes","Other Non-Collision",751584,36]
[10,"HOC","Yes","No","Right Turn",414163,35]
[10,"GAL","No","No","Pedalcycles",476864,2]
[3,"ERI","No","Yes","Animal",2184273,211]
[3,"RIC","Yes","No","Fixed Object",3492202,118]
[9,"LAW","Yes","Yes","Pedalcycles",54139,1]
[1,"DEF","Yes","No","Other Object",40400,5]
[5,"MUS","Yes","Yes","Right Turn",62219,2]
[10,"ATH","No","No","Unknown",56560,7]
[11,"COL","Yes","Yes","Other Object",8080,1]
[12,"GEA","Yes","No","Backing",584998,61]
[6,"DEL","No","Yes","Parked Vehicle",16160,2]
[7,"LOG","Yes","No","Other Non-Collision",78379,4]
[7,"DAR","Yes","Yes","Sideswipe - Passing",606255,14]
[4,"MAH","Yes","No","Head On",95805,7]
[2,"WIL","No","Yes","Parked Vehicle",1342690,110]
[6,"DEL","Yes","No","Parked Vehicle",6498182,452]
[4,"POR","Yes","Yes","Rear End",656707,8]
[9,"ROS","Yes","No","Pedalcycles",1454680,28]
[2,"OTT","No","No","Left Turn",4429208,76]
[4,"STA","No","No","Overturning",7963592,86]
[6,"UNI","Yes","Yes","Sideswipe - Passing",1554361,87]
[2,"SAN","Yes","No","Unknown",8080,1]
[6,"FAY","No","No","Animal",3967308,404]
[2,"WOO","Yes","No","Left Turn",7071862,205]
[12,"CUY","No","No","Unknown",8080,1]
[5,"FAI","Yes","Yes","Unknown",16160,2]
[7,"CLA","Yes","No","Parked Vehicle",159179,14]
[3,"RIC","No","Yes","Pedestrian",422725,1]
[6,"PIC","Yes","No","Left Turn",5227295,96]
[11,"JEF","Yes","Yes","Sideswipe - Passing",549584,11]
[3,"ASD","No","No","Rear End",11955033,296]
[8,"GRE","Yes","No","Rear End",89133842,4001]
[5,"LIC","Yes","No","Other Non-Collision",1278862,51]
[7,"AUG","No","No","Other Object",592405,22]
[2,"SEN","Yes","No","Sideswipe - Passing",1041866,77]
[7,"AUG","Yes","No","Pedestrian",101464,2]
[2,"FUL","Yes","No","Overturning",422725,1]
[4,"POR","Yes","No","Overturning",547163,5]
[8,"WAR","Yes","No","Animal",6837695,588]
[6,"PIC","Yes","No","Other Object",24240,3]
[9,"ROS","No","No","Fixed Object",89122984,2007]
[3,"ERI","Yes","No","Unknown",86459,5]
[2,"WOO","No","No","Rear End",14554015,371]
[9,"BRO","No","No","Animal",10186235,915]
[2,"SEN","No","No","Fixed Object",45465144,824]
[12,"CUY","Yes","No","Overturning",17076764,177]
[7,"SHE","Yes","No","Backing",40400,5]
[4,"STA","No","No","Head On",13499866,122]
[11,"JEF","No","No","Backing",488149,45]
[8,"HAM","Yes","Yes","Head On",8080,1]
[1,"VAN","No","No","Pedestrian",995505,6]
[10,"NOB","No","No","Sideswipe - Passing",143019,12]
[3,"MED","Yes","No","Other Non-Collision",1230160,53]
[2,"SAN","Yes","No","Right Turn",48480,6]
[2,"FUL","No","No","Head On",5556450,55]
[2,"FUL","No","No","Train",79645,5]
[3,"LOR","Yes","Yes","Right Turn",40400,5]
[5,"COS","Yes","No","Pedestrian",1687659,11]
[4,"TRU","No","Yes","Other Non-Collision",624725,26]
[4,"POR","Yes","No","Animal",745443,76]
[4,"TRU","Yes","Yes","Backing",153520,19]
[7,"MIA","Yes","Yes","Other Non-Collision",207659,20]
[11,"TUS","Yes","No","Animal",4269423,347]
[11,"TUS","No","No","Unknown",64640,8]
[7,"MER","Yes","No","Other Non-Collision",232010,19]
[11,"BEL","Yes","No","Backing",80800,10]
[4,"MAH","No","No","Overturning",3080458,59]
[8,"HAM","Yes","Yes","Other Object",3917703,336]
[4,"MAH","Yes","No","Other Non-Collision",101464,2]
[7,"DAR","Yes","No","Backing",56560,7]
[7,"CHP","Yes","No","Left Turn",1453381,80]
[4,"STA","Yes","No","Pedalcycles",616753,17]
[8,"CLI","No","No","Sideswipe - Meeting",63485,3]
[12,"GEA","Yes","No","Fixed Object",363262,23]
[3,"RIC","No","Yes","Angle",422725,1]
[2,"HEN","No","Yes","Angle",524189,3]
[6,"MRW","No","Yes","Angle",55405,2]
[6,"UNI","No","Yes","Pedestrian",108278,2]
[11,"TUS","No","No","Backing",2420596,145]
[6,"PIC","Yes","Yes","Sideswipe - Passing",8080,1]
[3,"ERI","Yes","No","Unknown",716843,26]
[3,"LOR","Yes","Yes","Other Object",48480,6]
[11,"COL","Yes","No","Other Non-Collision",151099,13]
[2,"LUC","Yes","Yes","Head On",2302440,40]
[8,"CLE","Yes","No","Fixed Object",325283,24]
[5,"PER","No","No","Animal",4582183,240]
[3,"ERI","No","No","Parked Vehicle",613180,10]
[1,"VAN","Yes","No","Angle",7937494,234]
[7,"MIA","Yes","No","Right Turn",2288859,172]
[4,"STA","Yes","Yes","Fixed Object",31474822,847]
[6,"FAY","No","No","Pedalcycles",524189,3]
[2,"WOO","Yes","Yes","Other Non-Collision",613742,54]
[6,"PIC","No","Yes","Fixed Object",1010623,29]
[6,"MAR","Yes","No","Backing",48480,6]
[2,"LUC","Yes","No","Pedalcycles",47325,1]
[7,"LOG","No","No","Angle",13725316,245]
[4,"STA","No","No","Other Non-Collision",1609585,82]
[5,"FAI","Yes","No","Pedestrian",47325,1]
[7,"DAR","Yes","Yes","Animal",264219,27]
[2,"WOO","No","Yes","Angle",72720,9]
[4,"TRU","No","Yes","Other Object",185840,23]
[1,"ALL","Yes","No","Fixed Object",628074,11]
[1,"HAR","Yes","No","Head On",587563,10]
[8,"CLI","No","No","Backing",865377,90]
[3,"WAY","Yes","No","Parked Vehicle",291697,19]
[1,"VAN","No","Yes","Fixed Object",438885,3]
[7,"AUG","Yes","No","Right Turn",55405,2]
[3,"RIC","No","Yes","Overturning",1404266,15]
[8,"BUT","No","No","Right Turn",2049395,60]
[4,"SUM","Yes","No","Overturning",179843,6]
[11,"JEF","Yes","No","Other Non-Collision",8080,1]
[6,"MAD","No","Yes","Right Turn",78379,4]
[3,"CRA","Yes","No","Rear End",40400,5]
[5,"COS","No","No","Pedalcycles",1268175,3]
[4,"SUM","Yes","No","Other Object",137360,17]
[6,"FAY","No","No","Backing",559714,49]
[7,"MOT","Yes","No","Left Turn",1258904,46]
[8,"GRE","Yes","No","Sideswipe - Passing",17664954,1122]
[12,"CUY","Yes","Yes","Left Turn",702617,31]
[10,"WAS","Yes","No","Sideswipe - Passing",2740744,237]
[5,"GUE","No","Yes","Other Non-Collision",387840,48]
[6,"DEL","Yes","No","Unknown",421088,31]
[8,"BUT","No","Yes","Angle",54139,1]
[9,"HIG","Yes","No","Left Turn",1997566,69]
[4,"TRU","Yes","No","Angle",77977078,2376]
[8,"GRE","Yes","Yes","Unknown",144285,13]
[4,"SUM","Yes","Yes","Rear End",316159,14]
[9,"JAC","Yes","No","Other Object",16160,2]
[1,"ALL","No","No","Sideswipe - Passing",7263402,208]
[2,"OTT","Yes","No","Other Non-Collision",32320,4]
[5,"KNO","Yes","No","Pedalcycles",47325,1]
[4,"STA","No","Yes","Other Non-Collision",598064,17]
[8,"PRE","Yes","No","Backing",688883,69]
[2,"SAN","Yes","Yes","Left Turn",110810,4]
[10,"MEG","Yes","No","Head On",194737,7]
[4,"ATB","Yes","Yes","Other Non-Collision",80800,10]
[8,"PRE","No","No","Rear End",10413740,252]
[1,"VAN","No","No","Parked Vehicle",291697,19]
[3,"RIC","Yes","No","Animal",32320,4]
[6,"DEL","Yes","Yes","Backing",145440,18]
[7,"DAR","Yes","No","Pedestrian",2259173,15]
[7,"CLA","No","No","Animal",5258640,446]
[4,"ATB","No","Yes","Fixed Object",7317657,239]
[5,"LIC","Yes","No","Pedestrian",1056458,7]
[8,"BUT","Yes","No","Sideswipe - Meeting",24240,3]
[3,"CRA","No","No","Other Non-Collision",1760008,51]
[8,"PRE","Yes","No","Unknown",40400,5]
[2,"LUC","Yes","No","Unknown",24240,3]
[10,"GAL","Yes","No","Right Turn",8080,1]
[3,"ASD","No","No","Sideswipe - Passing",7951050,193]
[4,"POR","No","No","Other Non-Collision",1439345,47]
[9,"LAW","Yes","No","Fixed Object",32320,4]
[1,"VAN","Yes","No","Pedestrian",108278,2]
[12,"CUY","Yes","No","Angle",61797960,2329]
[9,"PIK","Yes","No","Unknown",70299,3]
[1,"HAN","Yes","No","Backing",3452349,373]
[1,"ALL","Yes","No","Pedestrian",12516636,111]
[1,"PUT","No","No","Sideswipe - Meeting",8080,1]
[1,"VAN","Yes","No","Sideswipe - Passing",126859,10]
[2,"WOO","Yes","No","Parked Vehicle",1910963,121]
[4,"POR","No","Yes","Head On",79645,5]
[11,"JEF","Yes","Yes","Overturning",3402688,22]
[11,"BEL","Yes","No","Other Non-Collision",446965,4]
[1,"DEF","No","No","Angle",16225625,180]
[1,"HAN","Yes","No","Unknown",121200,15]
[3,"HUR","Yes","No","Angle",180998,11]
[10,"NOB","Yes","Yes","Other Object",40400,5]
[10,"GAL","Yes","Yes","Rear End",324239,15]
[10,"HOC","No","No","Sideswipe - Meeting",78379,4]
[10,"ATH","Yes","No","Rear End",10601602,456]
[6,"FRA","Yes","No","Right Turn",109544,3]
[1,"PAU","No","No","Other Object",64640,8]
[4,"MAH","Yes","Yes","Other Object",458250,47]
[6,"DEL","Yes","No","Other Non-Vehicle",422725,1]
[7,"LOG","No","No","Right Turn",646990,37]
[9,"ROS","No","No","Other Non-Collision",1120505,54]
[8,"CLE","Yes","No","Pedalcycles",4766181,33]
[10,"HOC","Yes","Yes","Angle",70299,3]
[1,"HAR","No","No","Angle",17146398,178]
[3,"RIC","Yes","No","Other Object",673540,50]
[10,"NOB","No","Yes","Other Non-Collision",64640,8]
[6,"FAY","Yes","Yes","Fixed Object",55405,2]
[5,"FAI","Yes","Yes","Overturning",63485,3]
[11,"HAS","No","No","Backing",767373,69]
[3,"WAY","Yes","No","Sideswipe - Passing",24240,3]
[4,"POR","Yes","No","Fixed Object",2772229,95]
[7,"CLA","No","No","Left Turn",3603716,79]
[4,"SUM","Yes","No","Other Object",88880,11]
[7,"SHE","No","No","Head On",2308697,30]
[7,"SHE","No","No","Train",8080,1]
[5,"PER","Yes","No","Other Non-Collision",24240,3]
[7,"DAR","Yes","Yes","Other Non-Collision",8080,1]
[4,"TRU","Yes","No","Backing",245749,15]
[7,"AUG","No","No","Overturning",3183226,43]
[8,"WAR","Yes","No","Head On",4031319,43]
[3,"WAY","No","Yes","Overturning",248876,8]
[1,"PUT","Yes","No","Other Non-Collision",102619,7]
[6,"PIC","Yes","No","Head On",258333,6]
[2,"SEN","No","No","Other Object",826387,29]
[11,"COL","Yes","No","Animal",305885,33]
[8,"HAM","No","Yes","Overturning",1159188,10]
[6,"UNI","No","No","Parked Vehicle",954512,40]
[3,"LOR","Yes","No","Pedestrian",1369639,5]
[3,"WAY","No","Yes","Angle",124438,4]
[6,"DEL","Yes","Yes","Rear End",7900334,305]
[3,"LOR","Yes","Yes","Pedalcycles",8080,1]
[3,"ERI","Yes","No","Head On",422725,1]
[3,"LOR","Yes","Yes","Animal",3475802,336]
[3,"LOR","Yes","Yes","Rear End",3291808,203]
[9,"ROS","Yes","Yes","Pedestrian",422725,1]
[6,"UNI","Yes","No","Sideswipe - Passing",3101505,175]
[10,"HOC","Yes","No","Overturning",55405,2]
[7,"SHE","No","Yes","Other Non-Collision",177760,22]
[8,"GRE","Yes","Yes","Head On",1130444,17]
[2,"SEN","No","No","Falling From Or In Vehicle",422725,1]
[5,"FAI","No","Yes","Fixed Object",3811378,103]
[2,"WOO","Yes","No","Animal",2594863,239]
[3,"RIC","Yes","No","Sideswipe - Passing",8080,1]
[6,"PIC","Yes","No","Angle",10432143,257]
[1,"PAU","No","Yes","Other Non-Collision",226240,28]
[10,"GAL","No","No","Rear End",6445463,145]
[11,"JEF","Yes","Yes","Angle",2094673,28]
[11,"HAS","No","No","Unknown",113120,14]
[6,"PIC","Yes","No","Sideswipe - Passing",2390619,98]
[2,"LUC","No","Yes","Other Object",56560,7]
[11,"TUS","No","No","Head On",6396576,80]
[11,"TUS","No","No","Train",54139,1]
[5,"FAI","Yes","No","Other Object",40400,5]
[11,"BEL","No","No","Right Turn",1144856,53]
[6,"MRW","No","No","Backing",1174384,82]
[3,"HUR","Yes","No","Angle",1028049,32]
[8,"WAR","No","No","Rear End",11452894,433]
[4,"STA","Yes","No","Head On",1653256,23]
[10,"VIN","Yes","No","Rear End",690293,13]
[4,"POR","Yes","No","Backing",3650551,395]
[3,"HUR","Yes","No","Pedalcycles",438885,3]
[11,"BEL","Yes","Yes","Unknown",96960,12]
[2,"WOO","Yes","Yes","Backing",168525,16]
[9,"SCI","Yes","No","Right Turn",3138924,160]
[3,"MED","Yes","No","Sideswipe - Passing",2539821,168]
[3,"LOR","Yes","No","Other Non-Collision",3495890,99]
[5,"FAI","Yes","Yes","Right Turn",8080,1]
[3,"ERI","Yes","Yes","Rear End",1322835,63]
[7,"CLA","Yes","Yes","Other Non-Collision",8080,1]
[4,"SUM","Yes","No","Sideswipe - Passing",99196397,6842]
[5,"LIC","Yes","No","Parked Vehicle",6030805,391]
[11,"BEL","Yes","No","Parked Vehicle",1835116,119]
[10,"ATH","Yes","Yes","Rear End",8080,1]
[6,"DEL","No","Yes","Sideswipe - Passing",3136689,195]
[7,"SHE","Yes","No","Sideswipe - Passing",102619,7]
[5,"MUS","Yes","Yes","Angle",16160,2]
[10,"MRG","Yes","No","Fixed Object",55405,2]
[7,"DAR","Yes","No","Head On",531003,3]
[4,"ATB","Yes","No","Left Turn",24240,3]
[11,"JEF","No","No","Pedestrian",1048378,6]
[9,"PIK","Yes","No","Backing",575763,55]
[2,"WIL","No","Yes","Backing",527394,45]
[2,"HEN","Yes","Yes","Pedestrian",422725,1]
[2,"LUC","Yes","No","Rear End",420030878,17906]
[10,"ATH","Yes","No","Sideswipe - Passing",2336893,164]
[7,"MOT","No","No","Sideswipe - Passing",1970756,83]
[12,"CUY","No","Yes","Sideswipe - Passing",141864,7]
[5,"GUE","No","No","Angle",4539647,111]
[7,"MOT","Yes","No","Other Non-Vehicle",116358,3]
[5,"LIC","Yes","No","Backing",1050173,104]
[5,"FAI","No","No","Head On",8658392,93]
[7,"MOT","No","Yes","Parked Vehicle",32320,4]
[2,"WOO","Yes","Yes","Unknown",32320,4]
[2,"WOO","Yes","Yes","Backing",8080,1]
[8,"WAR","Yes","No","Fixed Object",3221842,131]
[7,"AUG","Yes","Yes","Backing",16160,2]
[12,"LAK","Yes","Yes","Backing",16160,2]
[5,"GUE","Yes","No","Backing",870330,98]
[1,"VAN","No","No","Unknown",183530,13]
[6,"MAD","No","Yes","Rear End",14883690,276]
[6,"MAD","Yes","No","Pedalcycles",70299,3]
[6,"MAD","No","No","Sideswipe - Passing",5108374,174]
[6,"FRA","Yes","Yes","Other Non-Collision",15474902,451]
[8,"PRE","Yes","No","Fixed Object",869690,5]
[1,"HAN","Yes","No","Overturning",1691346,18]
[3,"MED","Yes","No","Fixed Object",1967332,53]
[4,"SUM","Yes","No","Head On",1510683,25]
[2,"LUC","Yes","Yes","Other Object",63485,3]
[4,"MAH","No","No","Animal",8849490,656]
[8,"WAR","Yes","Yes","Other Object",64640,8]
[4,"MAH","Yes","Yes","Head On",8080,1]
[1,"HAN","Yes","No","Right Turn",32320,4]
[6,"MAR","No","No","Unknown",56560,7]
[6,"FRA","Yes","Yes","Backing",2122791,113]
[7,"AUG","No","Yes","Sideswipe - Passing",1344064,103]
[2,"HEN","Yes","No","Parked Vehicle",533053,40]
[8,"BUT","Yes","No","Other Non-Collision",564589,8]
[2,"LUC","Yes","Yes","Angle",189078,12]
[7,"DAR","Yes","Yes","Fixed Object",301154,17]
[4,"ATB","Yes","Yes","Right Turn",55405,2]
[7,"MOT","Yes","Yes","Sideswipe - Passing",2029180,86]
[3,"CRA","Yes","No","Animal",307040,38]
[5,"KNO","Yes","No","Pedestrian",101464,2]
[1,"ALL","Yes","Yes","Unknown",111965,9]
[1,"PUT","Yes","No","Left Turn",180998,11]
[3,"RIC","Yes","No","Rear End",54755092,2365]
[9,"ADA","Yes","No","Fixed Object",8080,1]
[9,"SCI","Yes","No","Pedestrian",10955358,66]
[4,"SUM","Yes","No","Rear End",494514,27]
[1,"ALL","No","No","Parked Vehicle",1139308,54]
[2,"OTT","Yes","Yes","Left Turn",24240,3]
[5,"LIC","Yes","Yes","Parked Vehicle",110699,8]
[8,"GRE","Yes","No","Head On",55405,2]
[3,"LOR","Yes","No","Sideswipe - Meeting",101464,2]
[10,"MOE","No","No","Pedestrian",899589,3]
[8,"BUT","Yes","Yes","Parked Vehicle",1510572,29]
[3,"WAY","Yes","No","Rear End",3388612,117]
[6,"DEL","No","Yes","Animal",682069,69]
[3,"HUR","Yes","Yes","Rear End",16160,2]
[11,"BEL","Yes","No","Parked Vehicle",40400,5]
[8,"BUT","Yes","No","Animal",749130,83]
[2,"OTT","No","Yes","Parked Vehicle",16160,2]
[11,"JEF","No","No","Right Turn",371453,20]
[7,"SHE","No","No","Left Turn",1519660,88]
[7,"LOG","Yes","No","Sideswipe - Passing",2150571,176]
[7,"AUG","No","Yes","Other Non-Collision",202000,25]
[7,"AUG","Yes","No","Pedestrian",54139,1]
[5,"GUE","No","No","Left Turn",1645140,71]
[10,"WAS","Yes","No","Pedalcycles",484944,3]
[10,"ATH","Yes","Yes","Sideswipe - Passing",653098,50]
[10,"MRG","No","No","Sideswipe - Passing",1970570,42]
[8,"HAM","Yes","No","Overturning",15233463,208]
[3,"WAY","Yes","Yes","Parked Vehicle",16160,2]
[1,"ALL","Yes","No","Right Turn",8080,1]
[3,"RIC","Yes","Yes","Other Object",16160,2]
[5,"KNO","No","No","Pedestrian",1915536,9]
[6,"MAR","No","Yes","Rear End",71565,4]
[1,"HAN","No","No","Pedestrian",1753119,6]
[9,"ROS","Yes","No","Rear End",229589,13]
[7,"DAR","Yes","No","Backing",1127735,125]
[4,"MAH","No","No","Pedalcycles",1048378,6]
[7,"MIA","Yes","Yes","Overturning",240796,7]
[2,"HEN","Yes","No","Fixed Object",1970988,143]
[5,"GUE","Yes","No","Rear End",9582230,446]
[10,"MOE","Yes","No","Other Object",8080,1]
[5,"FAI","Yes","No","Right Turn",3430848,205]
[10,"NOB","Yes","Yes","Unknown",8080,1]
[6,"UNI","Yes","Yes","Left Turn",155603,3]
[5,"FAI","No","No","Animal",3791772,305]
[3,"LOR","Yes","No","Sideswipe - Meeting",55405,2]
[5,"KNO","Yes","No","Pedalcycles",975993,15]
[7,"MIA","Yes","No","Pedestrian",2472488,26]
[7,"CLA","Yes","Yes","Right Turn",86459,5]
[7,"CLA","Yes","No","Sideswipe - Passing",78379,4]
[12,"GEA","Yes","No","Right Turn",16160,2]
[8,"PRE","Yes","No","Angle",1005297,22]
[4,"POR","Yes","Yes","Pedestrian",422725,1]
[1,"PAU","No","Yes","Fixed Object",1993879,62]
[3,"ASD","No","No","Unknown",471205,7]
[4,"TRU","No","No","Sideswipe - Meeting",24240,3]
[2,"FUL","Yes","No","Left Turn",917015,6]
[4,"STA","Yes","No","Pedestrian",1690900,4]
[7,"MIA","Yes","No","Sideswipe - Meeting",8080,1]
[3,"MED","Yes","Yes","Parked Vehicle",8080,1]
[7,"MOT","Yes","No","Pedalcycles",28149425,317]
[1,"HAN","Yes","Yes","Parked Vehicle",8080,1]
[3,"ASD","Yes","Yes","Sideswipe - Passing",702395,39]
[11,"COL","Yes","Yes","Angle",24240,3]
[7,"LOG","Yes","No","Head On",509184,6]
[10,"HOC","Yes","No","Fixed Object",3147743,95]
[5,"LIC","Yes","No","Overturning",1118677,9]
[3,"ASD","No","No","Other Object",277958,23]
[3,"WAY","Yes","No","Left Turn",278069,19]
[2,"WOO","No","Yes","Unknown",64640,8]
[12,"LAK","No","No","Fixed Object",13051455,362]
[7,"MOT","Yes","No","Animal",9678852,697]
[11,"COL","Yes","Yes","Other Non-Collision",179843,6]
[6,"UNI","No","Yes","Right Turn",24240,3]
[9,"SCI","No","No","Left Turn",6562755,135]
[7,"CLA","Yes","No","Sideswipe - Passing",20447556,1096]
[12,"LAK","No","Yes","Overturning",781145,12]
[8,"BUT","Yes","Yes","Pedestrian",940100,4]
[4,"TRU","Yes","No","Left Turn",48480,6]
[4,"SUM","No","No","Unknown",8080,1]
[3,"HUR","No","No","Parked Vehicle",628074,11]
[4,"STA","Yes","No","Fixed Object",6565029,194]
[3,"MED","Yes","No","Overturning",484944,3]
[3,"LOR","Yes","Yes","Overturning",2485784,12]
[3,"ERI","Yes","Yes","Head On",931909,7]
[11,"COL","No","Yes","Fixed Object",3467738,93]
[11,"JEF","Yes","No","Right Turn",2213605,131]
[7,"LOG","Yes","Yes","Other Non-Collision",8080,1]
[10,"VIN","No","No","Animal",3584484,254]
[7,"SHE","No","No","Pedestrian",954994,5]
[11,"JEF","No","Yes","Parked Vehicle",116358,3]
[7,"MIA","Yes","Yes","Overturning",717660,9]
[3,"RIC","Yes","No","Angle",62219,2]
[4,"MAH","Yes","No","Animal",234320,29]
[4,"ATB","Yes","No","Backing",2240016,235]
[7,"SHE","Yes","No","Pedalcycles",47325,1]
[6,"PIC","Yes","No","Sideswipe - Passing",4195163,179]
[10,"MOE","No","No","Parked Vehicle",818307,28]
[3,"HUR","Yes","No","Other Non-Collision",48480,6]
[8,"CLI","No","No","Head On",12228267,89]
[8,"CLI","No","No","Train",16160,2]
[10,"HOC","No","No","Other Non-Collision",361996,22]
[8,"CLI","Yes","No","Other Non-Collision",576245,20]
[2,"FUL","No","Yes","Sideswipe - Passing",1607612,120]
[7,"MER","Yes","No","Other Object",48480,6]
[7,"DAR","No","Yes","Rear End",16160,2]
[3,"CRA","Yes","No","Other Non-Collision",580749,10]
[9,"BRO","Yes","No","Animal",295384,26]
[1,"PUT","No","No","Other Non-Collision",1750327,31]
[4,"POR","Yes","No","Other Object",8080,1]
[1,"ALL","No","Yes","Overturning",312361,11]
[12,"LAK","Yes","No","Left Turn",771093,23]
[11,"COL","Yes","No","Animal",869064,97]
[3,"ASD","Yes","No","Fixed Object",6096245,193]
[3,"ERI","Yes","No","Animal",2801849,219]
[12,"GEA","No","No","Head On",9469549,129]
[5,"LIC","Yes","Yes","Parked Vehicle",124438,4]
[3,"WAY","Yes","No","Right Turn",8080,1]
[9,"ROS","Yes","No","Rear End",196003,8]
[8,"WAR","Yes","No","Animal",1277568,137]
[3,"ASD","No","Yes","Overturning",124438,4]
[7,"SHE","No","No","Unknown",446965,4]
[2,"WIL","Yes","No","Rear End",16160,2]
[2,"FUL","Yes","No","Animal",113120,14]
[10,"MRG","No","No","Overturning",10647171,61]
[7,"MER","Yes","No","Sideswipe - Passing",62219,2]
[5,"KNO","Yes","No","Overturning",526610,9]
[3,"CRA","Yes","No","Right Turn",258560,32]
[9,"ROS","Yes","No","Animal",8080,1]
[7,"AUG","Yes","No","Other Non-Collision",24240,3]
[4,"ATB","Yes","Yes","Rear End",278069,19]
[6,"MAR","No","Yes","Animal",8080,1]
[1,"PUT","No","No","Left Turn",2797885,50]
[3,"HUR","Yes","No","Left Turn",79645,5]
[5,"LIC","Yes","No","Other Object",229589,13]
[2,"HEN","Yes","No","Backing",105040,13]
[11,"JEF","No","Yes","Other Object",16160,2]
[8,"HAM","Yes","Yes","Sideswipe - Passing",2029482,157]
[3,"ASD","No","No","Parked Vehicle",830074,36]
[3,"RIC","Yes","Yes","Angle",476864,2]
[7,"MOT","Yes","No","Other Non-Collision",40400,5]
[7,"LOG","Yes","No","Head On",1879269,25]
[9,"HIG","Yes","No","Right Turn",508813,37]
[5,"LIC","No","Yes","Rear End",7594896,203]
[8,"CLI","Yes","No","Head On",1344468,19]
[9,"LAW","Yes","No","Other Object",80800,10]
[7,"CLA","Yes","Yes","Animal",251297,14]
[5,"LIC","Yes","No","Pedestrian",101464,2]
[1,"ALL","No","Yes","Animal",910392,81]
[2,"HEN","Yes","No","Fixed Object",32320,4]
[6,"FRA","Yes","Yes","Animal",5090587,327]
[5,"KNO","No","No","Other Object",129280,16]
[6,"UNI","Yes","No","Head On",484944,3]
[4,"POR","Yes","No","Angle",40935576,1311]
[7,"AUG","Yes","Yes","Sideswipe - Passing",16160,2]
[6,"DEL","No","No","Backing",1108816,95]
[3,"ASD","Yes","No","Rear End",86459,5]
[3,"ERI","No","No","Fixed Object",30011510,703]
[7,"MIA","Yes","No","Left Turn",9403462,309]
[4,"ATB","No","Yes","Rear End",4851562,108]
[8,"GRE","Yes","No","Fixed Object",58735122,1797]
[7,"SHE","No","No","Parked Vehicle",1036129,33]
[8,"HAM","Yes","No","Other Object",48480,6]
[7,"MOT","Yes","No","Head On",540349,5]
[8,"HAM","No","Yes","Head On",55405,2]
[9,"ROS","Yes","No","Angle",25705343,833]
[12,"CUY","Yes","No","Backing",60552599,4935]
[5,"LIC","Yes","Yes","Other Non-Collision",1248068,21]
[2,"SEN","Yes","No","Pedestrian",1572567,9]
[6,"UNI","Yes","Yes","Right Turn",78379,4]
[5,"GUE","Yes","Yes","Overturning",2094113,14]
[7,"AUG","Yes","No","Other Object",8080,1]
[7,"AUG","No","Yes","Head On",446965,4]
[6,"PIC","Yes","No","Unknown",16160,2]
[8,"CLE","Yes","Yes","Head On",657862,13]
[4,"SUM","Yes","Yes","Unknown",79645,5]
[10,"MEG","Yes","No","Left Turn",760592,16]
[1,"ALL","Yes","Yes","Left Turn",71565,4]
[4,"SUM","Yes","No","Sideswipe - Passing",2995910,182]
[6,"FRA","Yes","No","Parked Vehicle",141444325,10045]
[11,"COL","Yes","Yes","Left Turn",24240,3]
[6,"DEL","No","No","Unknown",208925,21]
[11,"HOL","No","No","Overturning",7853269,81]
[11,"HOL","No","No","Sideswipe - Meeting",71565,4]
[9,"HIG","No","No","Sideswipe - Passing",5053933,102]
[8,"GRE","Yes","No","Angle",55204920,1783]
[1,"VAN","Yes","No","Other Object",16160,2]
[10,"NOB","No","No","Pedestrian",907669,4]
[3,"HUR","Yes","No","Head On",1904218,19]
[3,"LOR","Yes","No","Other Object",16160,2]
[5,"FAI","Yes","No","Sideswipe - Meeting",8080,1]
[1,"WYA","No","No","Angle",7285404,103]
[7,"AUG","Yes","No","Head On",1096858,12]
[7,"AUG","Yes","No","Train",422725,1]
[7,"MIA","Yes","No","Other Object",213318,15]
[5,"GUE","Yes","Yes","Animal",2150942,145]
[5,"LIC","Yes","Yes","Angle",71565,4]
[7,"CLA","Yes","No","Other Non-Collision",292963,20]
[2,"SEN","No","No","Sideswipe - Passing",4822109,124]
[4,"POR","Yes","No","Rear End",16160,2]
[4,"SUM","Yes","Yes","Angle",703772,36]
[10,"GAL","Yes","No","Unknown",8080,1]
[11,"COL","Yes","No","Sideswipe - Meeting",62219,2]
[10,"HOC","Yes","No","Left Turn",1107583,41]
[3,"CRA","No","Yes","Parked Vehicle",8080,1]
[7,"MIA","No","Yes","Parked Vehicle",430805,2]
[7,"CLA","No","No","Parked Vehicle",933399,30]
[3,"MED","Yes","No","Other Object",16160,2]
[4,"POR","Yes","Yes","Animal",1152565,85]
[3,"RIC","Yes","No","Rear End",8080,1]
[11,"TUS","Yes","Yes","Unknown",144285,13]
[4,"SUM","Yes","Yes","Left Turn",2774540,79]
[2,"OTT","No","No","Overturning",5079918,67]
[6,"UNI","Yes","Yes","Head On",900855,4]
[8,"HAM","Yes","No","Backing",59832209,5911]
[8,"WAR","No","No","Left Turn",5687816,198]
[4,"POR","Yes","Yes","Unknown",8080,1]
[5,"KNO","Yes","No","Rear End",174184,11]
[3,"LOR","No","Yes","Left Turn",54139,1]
[6,"FAY","No","Yes","Unknown",8080,1]
[5,"FAI","Yes","No","Rear End",129280,16]
[1,"ALL","Yes","No","Pedalcycles",211008,5]
[3,"CRA","Yes","No","Fixed Object",455045,5]
[7,"CLA","Yes","No","Pedestrian",634999,7]
[5,"GUE","Yes","No","Head On",4650047,52]
[9,"SCI","Yes","No","Pedalcycles",2576041,20]
[3,"MED","Yes","Yes","Other Non-Collision",40400,5]
[2,"LUC","No","No","Parked Vehicle",143019,12]
[7,"CLA","No","Yes","Fixed Object",14106656,519]
[7,"SHE","No","Yes","Backing",16160,2]
[4,"TRU","Yes","No","Head On",54139,1]
[4,"MAH","Yes","No","Head On",163683,4]
[9,"ROS","Yes","No","Unknown",47325,1]
[1,"ALL","Yes","No","Rear End",214695,12]
[9,"SCI","Yes","No","Other Non-Collision",8080,1]
[4,"STA","Yes","Yes","Angle",705298,10]
[3,"WAY","No","No","Unknown",110699,8]
[3,"MED","Yes","No","Parked Vehicle",1402372,76]
[12,"GEA","Yes","No","Unknown",24240,3]
[8,"PRE","Yes","No","Sideswipe - Passing",24240,3]
[4,"TRU","Yes","Yes","Backing",8080,1]
[10,"HOC","No","No","Head On",7078714,47]
[2,"WIL","Yes","No","Backing",1426728,109]
[3,"LOR","Yes","No","Angle",2844504,64]
[7,"LOG","No","No","Left Turn",3343411,85]
[5,"COS","Yes","No","Right Turn",469568,37]
[7,"MOT","Yes","No","Overturning",62219,2]
[4,"MAH","Yes","No","Fixed Object",93029380,2369]
[4,"STA","Yes","Yes","Rear End",1439642,84]
[3,"MED","Yes","No","Overturning",758171,10]
[1,"HAN","Yes","Yes","Backing",95805,7]
[10,"NOB","No","Yes","Overturning",155603,3]
[8,"BUT","Yes","No","Pedalcycles",4079350,31]
[6,"FRA","Yes","No","Fixed Object",2746946,57]
[11,"TUS","No","No","Pedestrian",693420,6]
[3,"MED","No","No","Angle",49724042,871]
[8,"GRE","No","Yes","Overturning",250142,9]
[5,"FAI","No","No","Sideswipe - Meeting",869690,5]
[4,"STA","Yes","Yes","Other Non-Collision",919738,83]
[8,"HAM","No","Yes","Other Non-Collision",55405,2]
[7,"MOT","Yes","Yes","Sideswipe - Meeting",422725,1]
[1,"WYA","No","Yes","Angle",24240,3]
[4,"MAH","Yes","No","Left Turn",486210,4]
[6,"FRA","Yes","No","Overturning",13928765,169]
[11,"JEF","No","Yes","Head On",47325,1]
[6,"UNI","Yes","No","Overturning",681058,7]
[7,"MOT","Yes","Yes","Parked Vehicle",109544,3]
[2,"HEN","Yes","No","Pedalcycles",564700,4]
[4,"ATB","No","Yes","Parked Vehicle",48480,6]
[2,"LUC","Yes","No","Fixed Object",179640969,4975]
[8,"CLE","Yes","Yes","Other Non-Collision",458139,51]
[9,"BRO","Yes","Yes","Rear End",16160,2]
[4,"SUM","Yes","No","Angle",354027,17]
[8,"WAR","Yes","Yes","Overturning",194737,7]
[2,"SAN","Yes","Yes","Fixed Object",8080,1]
[3,"MED","Yes","Yes","Angle",422725,1]
[6,"DEL","Yes","No","Other Non-Collision",32320,4]
[12,"CUY","Yes","Yes","Fixed Object",207741276,5051]
[7,"MER","No","No","Animal",11282458,868]
[2,"OTT","No","No","Fixed Object",31164326,667]
[1,"HAN","Yes","No","Parked Vehicle",619883,14]
[5,"COS","Yes","No","Backing",944205,112]
[2,"FUL","Yes","No","Unknown",8080,1]
[4,"POR","Yes","Yes","Unknown",32320,4]
[7,"MIA","Yes","Yes","Sideswipe - Passing",6168187,313]
[8,"CLI","Yes","No","Overturning",548429,6]
[3,"MED","Yes","No","Head On",8080,1]
[11,"BEL","No","Yes","Rear End",5191923,144]
[7,"AUG","Yes","No","Right Turn",164838,9]
[12,"CUY","Yes","No","Head On",13905008,301]
[12,"CUY","Yes","No","Train",8080,1]
[2,"FUL","Yes","No","Backing",737585,67]
[3,"ERI","Yes","No","Sideswipe - Passing",9928727,669]
[4,"POR","Yes","No","Animal",6290523,432]
[3,"LOR","Yes","Yes","Unknown",183419,17]
[6,"FRA","Yes","No","Left Turn",243328,9]
[6,"UNI","Yes","No","Pedalcycles",108278,2]
[7,"SHE","Yes","Yes","Rear End",1984384,83]
[6,"MAD","Yes","No","Overturning",1062006,6]
[9,"BRO","No","No","Fixed Object",52895402,1326]
[3,"CRA","No","No","Overturning",2867849,35]
[4,"POR","Yes","Yes","Rear End",183530,13]
[3,"LOR","Yes","No","Other Non-Collision",1081964,11]
[7,"SHE","Yes","Yes","Sideswipe - Passing",63485,3]
[2,"SAN","Yes","No","Backing",1638891,119]
[5,"MUS","Yes","Yes","Angle",141864,7]
[3,"HUR","No","No","Other Non-Collision",3737284,101]
[6,"PIC","Yes","No","Other Object",24240,3]
[5,"COS","No","No","Other Non-Vehicle",422725,1]
[7,"AUG","No","No","Backing",465175,43]
[2,"SAN","Yes","No","Unknown",8080,1]
[9,"LAW","Yes","Yes","Sideswipe - Passing",1314982,88]
[4,"POR","No","No","Overturning",7482259,71]
[3,"HUR","Yes","No","Sideswipe - Passing",248170,21]
[10,"ATH","Yes","No","Animal",229478,17]
[7,"CLA","No","Yes","Animal",1218587,124]
[10,"WAS","Yes","No","Fixed Object",16160,2]
[3,"CRA","Yes","No","Sideswipe - Passing",1149216,100]
[2,"WIL","Yes","No","Angle",430805,2]
[10,"MEG","No","No","Unknown",24240,3]
[5,"PER","No","No","Other Non-Collision",1279906,60]
[2,"FUL","Yes","No","Sideswipe - Passing",215850,17]
[10,"ATH","Yes","Yes","Rear End",1950352,64]
[4,"SUM","Yes","No","Angle",23449682,826]
[1,"DEF","Yes","No","Angle",9861739,352]
[4,"SUM","Yes","Yes","Overturning",1008313,19]
[12,"GEA","Yes","No","Other Non-Collision",495445,10]
[7,"MOT","Yes","No","Right Turn",445439,30]
[2,"HEN","No","No","Other Non-Collision",980240,36]
[8,"HAM","No","No","Unknown",95805,7]
[12,"LAK","Yes","No","Sideswipe - Meeting",455045,5]
[2,"WOO","Yes","No","Angle",668809,34]
[8,"CLE","Yes","Yes","Pedalcycles",8080,1]
[2,"OTT","No","No","Rear End",7384077,243]
[4,"TRU","Yes","No","Animal",40400,5]
[3,"LOR","Yes","No","Right Turn",204083,9]
[7,"MOT","Yes","Yes","Left Turn",832046,24]
[8,"HAM","Yes","Yes","Unknown",769345,57]
[4,"POR","Yes","Yes","Parked Vehicle",54139,1]
[3,"RIC","No","No","Head On",7660953,80]
[3,"RIC","No","No","Train",8080,1]
[3,"WAY","No","No","Animal",11387908,944]
[1,"HAN","Yes","Yes","Sideswipe - Passing",588829,11]
[8,"PRE","No","No","Unknown",78379,4]
[2,"FUL","No","Yes","Overturning",70299,3]
[6,"DEL","Yes","Yes","Left Turn",217822,5]
[11,"BEL","Yes","No","Other Object",8080,1]
[1,"HAN","Yes","No","Left Turn",63485,3]
[3,"MED","No","Yes","Fixed Object",10962303,394]
[7,"MIA","No","No","Angle",25120314,381]
[2,"SAN","Yes","Yes","Rear End",86459,5]
[10,"MEG","Yes","No","Sideswipe - Passing",263064,22]
[8,"PRE","Yes","No","Animal",394765,44]
[10,"MOE","Yes","No","Parked Vehicle",62219,2]
[2,"SAN","Yes","No","Other Non-Collision",54139,1]
[3,"LOR","Yes","Yes","Parked Vehicle",494290,5]
[3,"RIC","Yes","Yes","Rear End",54139,1]
[7,"SHE","Yes","No","Left Turn",24240,3]
[10,"NOB","No","No","Right Turn",32320,4]
[8,"PRE","No","No","Backing",1843229,67]
[4,"STA","Yes","No","Animal",892149,95]
[2,"LUC","Yes","Yes","Fixed Object",52996385,1647]
[2,"HEN","No","No","Sideswipe - Passing",4002875,91]
[3,"ERI","Yes","No","Pedestrian",8080,1]
[4,"MAH","Yes","No","Right Turn",32320,4]
[3,"HUR","No","No","Unknown",121200,15]
[12,"GEA","Yes","No","Parked Vehicle",24240,3]
[5,"GUE","Yes","Yes","Rear End",2568856,51]
[9,"ROS","Yes","Yes","Other Object",193920,24]
[4,"POR","Yes","No","Left Turn",649782,12]
[9,"ROS","Yes","No","Other Non-Collision",8080,1]
[3,"MED","Yes","No","Angle",906478,48]
[2,"WIL","Yes","No","Unknown",16160,2]
[11,"JEF","Yes","Yes","Rear End",79645,5]
[5,"LIC","Yes","No","Rear End",1821856,84]
[4,"TRU","Yes","Yes","Rear End",24240,3]
[1,"PAU","No","No","Pedalcycles",476864,2]
[3,"LOR","No","No","Backing",1578273,136]
[3,"ASD","Yes","No","Fixed Object",16160,2]
[1,"HAN","Yes","Yes","Fixed Object",8436074,275]
[6,"MRW","No","Yes","Fixed Object",9527249,496]
[6,"FRA","Yes","No","Unknown",54139,1]
[1,"WYA","Yes","No","Fixed Object",6502736,121]
[1,"DEF","No","No","Sideswipe - Passing",2316741,80]
[2,"SEN","No","No","Pedestrian",899589,3]
[2,"WOO","Yes","No","Right Turn",3112712,169]
[4,"MAH","Yes","No","Sideswipe - Passing",16160,2]
[4,"SUM","Yes","Yes","Sideswipe - Passing",10450376,632]
[4,"SUM","Yes","No","Pedestrian",1804017,14]
[8,"CLE","Yes","Yes","Overturning",1822709,18]
[12,"CUY","Yes","Yes","Left Turn",6167213,176]
[1,"VAN","Yes","No","Sideswipe - Passing",8080,1]
[4,"STA","No","No","Other Object",501777,45]
[9,"HIG","No","No","Pedestrian",2023814,11]
[10,"ATH","Yes","No","Animal",24240,3]
[5,"MUS","Yes","Yes","Overturning",618728,9]
[6,"PIC","No","Yes","Parked Vehicle",86459,5]
[4,"STA","Yes","Yes","Parked Vehicle",345836,20]
[7,"DAR","No","No","Left Turn",3846341,105]
[5,"COS","No","No","Animal",4174133,252]
[8,"GRE","Yes","Yes","Backing",56560,7]
[5,"KNO","Yes","No","Animal",16160,2]
[11,"BEL","No","No","Animal",5288899,232]
[6,"UNI","Yes","Yes","Sideswipe - Passing",853048,38]
[6,"FRA","Yes","No","Rear End",22265476,1120]
[2,"FUL","Yes","No","Rear End",189189,8]
[7,"CHP","Yes","No","Other Non-Collision",143130,8]
[9,"HIG","Yes","No","Right Turn",230855,14]
[10,"MRG","No","No","Unknown",62219,2]
[10,"MOE","Yes","No","Left Turn",8080,1]
[8,"GRE","No","No","Overturning",7512718,83]
[5,"LIC","Yes","Yes","Sideswipe - Passing",1720508,112]
[3,"WAY","Yes","No","Fixed Object",4043576,193]
[2,"WOO","No","Yes","Parked Vehicle",471651,21]
[8,"WAR","Yes","No","Backing",2768903,307]
[3,"WAY","Yes","Yes","Sideswipe - Passing",1323098,40]
[4,"MAH","No","No","Backing",1062757,95]
[6,"PIC","Yes","No","Other Object",495445,10]
[3,"ERI","Yes","No","Angle",1778700,55]
[4,"TRU","No","No","Other Non-Vehicle",16160,2]
[11,"BEL","Yes","No","Angle",205349,10]
[5,"KNO","No","No","Right Turn",981990,32]
[4,"TRU","No","No","Left Turn",6952564,167]
[3,"ERI","No","Yes","Parked Vehicle",721458,12]
[4,"SUM","No","Yes","Fixed Object",7871255,237]
[6,"FAY","Yes","No","Overturning",721569,8]
[3,"LOR","No","No","Unknown",244483,14]
[10,"ATH","No","No","Rear End",5664989,143]
[7,"LOG","Yes","Yes","Sideswipe - Passing",128125,11]
[9,"BRO","No","No","Backing",1531541,96]
[7,"AUG","No","No","Left Turn",2849827,67]
[7,"LOG","No","No","Fixed Object",36274875,1002]
[11,"TUS","No","Yes","Backing",71565,4]
[1,"PAU","No","No","Overturning",8012557,61]
[9,"ROS","No","No","Pedalcycles",271961,6]
[3,"ERI","Yes","No","Angle",33066847,986]
[9,"HIG","No","No","Angle",10048993,183]
[2,"LUC","Yes","No","Animal",279224,24]
[2,"FUL","No","Yes","Other Non-Collision",208925,21]
[8,"BUT","Yes","No","Parked Vehicle",1920049,150]
[5,"FAI","Yes","No","Fixed Object",872668,21]
[2,"OTT","Yes","No","Sideswipe - Meeting",430805,2]
[1,"PAU","No","No","Sideswipe - Meeting",422725,1]
[8,"CLE","Yes","No","Pedalcycles",54139,1]
[2,"HEN","No","No","Parked Vehicle",315937,22]
[3,"CRA","No","No","Head On",2239664,28]
[3,"CRA","No","No","Train",109544,3]
[11,"BEL","No","No","Pedalcycles",524189,3]
[2,"WIL","Yes","No","Other Non-Collision",8080,1]
[7,"CLA","Yes","No","Angle",102619,7]
[2,"OTT","No","Yes","Angle",47325,1]
[11,"COL","Yes","No","Animal",215739,21]
[2,"OTT","No","No","Parked Vehicle",2010039,64]
[6,"MAR","Yes","No","Left Turn",10349483,311]
[3,"ASD","Yes","No","Backing",16160,2]
[10,"MEG","No","No","Backing",830074,36]
[3,"RIC","Yes","No","Sideswipe - Passing",32320,4]
[2,"HEN","No","No","Rear End",9452050,168]
[1,"VAN","No","No","Fixed Object",23523221,513]
[2,"LUC","No","No","Rear End",5460386,188]
[1,"HAR","Yes","No","Head On",24240,3]
[1,"HAR","Yes","No","Train",422725,1]
[2,"HEN","Yes","Yes","Left Turn",476864,2]
[8,"HAM","Yes","Yes","Left Turn",5037215,173]
[2,"FUL","No","No","Other Object",800064,42]
[6,"DEL","No","Yes","Left Turn",273116,11]
[11,"JEF","Yes","Yes","Right Turn",102619,7]
[1,"ALL","Yes","No","Animal",40400,5]
[10,"WAS","Yes","Yes","Sideswipe - Passing",79645,5]
[2,"WOO","No","No","Sideswipe - Passing",8193342,231]
[6,"UNI","Yes","No","Other Object",64640,8]
[1,"WYA","Yes","No","Backing",8080,1]
[4,"ATB","No","No","Head On",10695280,98]
[4,"ATB","No","No","Train",422725,1]
[6,"PIC","No","No","Head On",10759807,80]
[3,"WAY","No","Yes","Right Turn",8080,1]
[8,"CLI","No","No","Fixed Object",47350152,1062]
[8,"HAM","Yes","No","Right Turn",1442996,103]
[4,"MAH","Yes","No","Unknown",16160,2]
[6,"UNI","No","Yes","Fixed Object",4294945,109]
[4,"POR","Yes","No","Rear End",60185396,2796]
[8,"BUT","Yes","No","Head On",1262962,22]
[8,"WAR","Yes","No","Unknown",120045,10]
[9,"ROS","No","No","Angle",20376465,309]
[5,"COS","Yes","No","Parked Vehicle",1360595,74]
[7,"MIA","Yes","Yes","Parked Vehicle",1017213,7]
[11,"CAR","No","No","Sideswipe - Passing",2969058,98]
[6,"MRW","No","No","Parked Vehicle",917688,46]
[3,"HUR","No","No","Angle",24569944,247]
[5,"KNO","Yes","No","Parked Vehicle",2347649,110]
[4,"STA","Yes","No","Head On",32899672,497]
[4,"STA","Yes","No","Train",16160,2]
[2,"SEN","Yes","No","Parked Vehicle",851522,64]
[10,"GAL","Yes","No","Animal",156758,8]
[3,"ASD","Yes","Yes","Head On",47325,1]
[8,"GRE","No","Yes","Sideswipe - Passing",2893471,69]
[7,"MOT","Yes","No","Right Turn",39477934,1971]
[9,"JAC","Yes","No","Overturning",1010288,11]
[7,"CLA","Yes","Yes","Sideswipe - Passing",16160,2]
[12,"LAK","Yes","Yes","Animal",2821206,225]
[2,"OTT","Yes","No","Right Turn",24240,3]
[4,"SUM","No","No","Animal",331280,41]
[8,"WAR","Yes","Yes","Parked Vehicle",54139,1]
[3,"LOR","Yes","Yes","Right Turn",103885,8]
[10,"MOE","Yes","No","Fixed Object",8080,1]
[2,"WOO","No","Yes","Right Turn",187923,7]
[9,"BRO","Yes","No","Rear End",24240,3]
[3,"ERI","Yes","Yes","Sideswipe - Passing",16160,2]
[9,"LAW","No","Yes","Overturning",54139,1]
[1,"HAN","Yes","Yes","Fixed Object",275537,17]
[7,"MOT","Yes","No","Pedalcycles",257067,5]
[2,"WOO","Yes","Yes","Unknown",56560,7]
[8,"HAM","Yes","Yes","Angle",417512,20]
[4,"POR","Yes","No","Unknown",143130,8]
[6,"DEL","Yes","Yes","Rear End",543665,43]
[6,"PIC","Yes","No","Animal",518159,39]
[10,"GAL","Yes","No","Angle",438885,3]
[8,"HAM","Yes","No","Pedalcycles",524189,3]
[3,"CRA","Yes","Yes","Backing",8080,1]
[8,"PRE","Yes","No","Other Non-Collision",555243,6]
[8,"HAM","Yes","No","Overturning",63485,3]
[2,"SAN","Yes","No","Other Object",8080,1]
[4,"MAH","Yes","No","Overturning",8080,1]
[7,"MIA","Yes","No","Right Turn",851522,64]
[3,"CRA","Yes","No","Sideswipe - Passing",1418870,100]
[12,"LAK","Yes","No","Head On",17420518,269]
[12,"LAK","Yes","No","Train",438885,3]
[2,"SAN","Yes","Yes","Backing",8080,1]
[8,"BUT","Yes","Yes","Overturning",1873496,30]
[2,"FUL","Yes","Yes","Parked Vehicle",8080,1]
[1,"WYA","Yes","Yes","Angle",8080,1]
[8,"CLI","Yes","Yes","Other Non-Collision",24240,3]
[11,"TUS","Yes","No","Left Turn",9335919,330]
[7,"AUG","Yes","No","Left Turn",54139,1]
[6,"FAY","Yes","Yes","Backing",16160,2]
[11,"BEL","No","Yes","Pedestrian",476864,2]
[8,"HAM","Yes","No","Parked Vehicle",3739605,292]
[5,"COS","Yes","No","Left Turn",1481233,45]
[1,"HAN","No","No","Right Turn",208925,21]
[7,"DAR","No","No","Animal",11885941,1100]
[1,"HAN","No","Yes","Pedestrian",54139,1]
[8,"GRE","Yes","Yes","Pedestrian",476864,2]
[3,"WAY","Yes","Yes","Rear End",141975,3]
[6,"PIC","Yes","No","Other Non-Collision",63485,3]
[10,"WAS","Yes","No","Other Object",8080,1]
[2,"LUC","Yes","No","Rear End",3864028,194]
[4,"MAH","Yes","No","Parked Vehicle",199690,15]
[2,"WOO","No","No","Backing",2004912,170]
[9,"JAC","No","No","Overturning",7230037,82]
[2,"OTT","Yes","No","Sideswipe - Passing",175450,12]
[6,"DEL","No","No","Other Non-Collision",1629429,87]
[3,"LOR","Yes","No","Fixed Object",3994428,181]
[4,"ATB","Yes","No","Sideswipe - Passing",970223,24]
[5,"KNO","Yes","No","Right Turn",8080,1]
[12,"GEA","No","Yes","Other Non-Collision",48480,6]
[4,"SUM","Yes","Yes","Other Non-Collision",303575,23]
[9,"JAC","No","Yes","Angle",108278,2]
[1,"WYA","No","No","Right Turn",598064,17]
[3,"MED","Yes","No","Backing",3312972,266]
[12,"CUY","Yes","Yes","Animal",143019,12]
[4,"SUM","No","Yes","Left Turn",8080,1]
[8,"BUT","Yes","No","Right Turn",3742346,214]
[10,"GAL","Yes","No","Pedestrian",47325,1]
[12,"CUY","Yes","No","Other Non-Collision",18003367,509]
[2,"OTT","Yes","No","Overturning",16160,2]
[11,"TUS","No","Yes","Parked Vehicle",70299,3]
[11,"JEF","Yes","No","Parked Vehicle",4817464,195]
[9,"HIG","Yes","No","Fixed Object",2477333,42]
[5,"FAI","Yes","No","Backing",3529462,376]
[3,"ASD","No","Yes","Head On",16160,2]
[6,"DEL","Yes","No","Other Non-Collision",2210067,101]
[2,"FUL","No","No","Pedalcycles",829847,10]
[7,"MOT","Yes","Yes","Fixed Object",73402747,1924]
[6,"MAD","No","No","Parked Vehicle",2398361,77]
[10,"MOE","No","No","Right Turn",567010,14]
[4,"MAH","Yes","No","Fixed Object",1473153,44]
[11,"JEF","No","No","Angle",3413707,84]
[1,"ALL","Yes","No","Rear End",70112129,2772]
[3,"MED","No","Yes","Left Turn",8080,1]
[1,"WYA","Yes","No","Rear End",55405,2]
[3,"MED","No","Yes","Head On",32320,4]
[7,"MOT","Yes","No","Head On",70093245,972]
[7,"MOT","Yes","No","Train",579483,9]
[4,"ATB","Yes","No","Head On",2908695,54]
[12,"CUY","Yes","Yes","Right Turn",4815673,214]
[10,"MEG","Yes","No","Angle",1464513,29]
[2,"WOO","Yes","No","Other Non-Collision",24240,3]
[9,"SCI","No","Yes","Overturning",8080,1]
[6,"UNI","No","No","Backing",490459,55]
[10,"ATH","Yes","Yes","Fixed Object",70299,3]
[3,"MED","Yes","No","Pedalcycles",170497,4]
[10,"WAS","Yes","Yes","Head On",8080,1]
[3,"ERI","No","Yes","Head On",86459,5]
[5,"LIC","Yes","Yes","Right Turn",40400,5]
[7,"DAR","Yes","No","Other Object",8080,1]
[9,"SCI","No","Yes","Animal",164838,9]
[7,"SHE","Yes","No","Parked Vehicle",227168,7]
[8,"HAM","Yes","Yes","Animal",5835886,460]
[11,"COL","Yes","No","Right Turn",747637,56]
[6,"DEL","Yes","Yes","Fixed Object",5285162,228]
[6,"DEL","Yes","Yes","Fixed Object",163683,4]
[6,"MAR","Yes","No","Rear End",34068225,1333]
[5,"LIC","Yes","No","Fixed Object",32392856,871]
[8,"BUT","Yes","Yes","Other Object",54139,1]
[2,"LUC","Yes","No","Pedalcycles",38819036,445]
[6,"UNI","Yes","Yes","Angle",555243,6]
[3,"LOR","Yes","No","Sideswipe - Passing",1631404,79]
[7,"LOG","No","No","Falling From Or In Vehicle",422725,1]
[10,"HOC","Yes","No","Pedalcycles",102730,3]
[8,"WAR","Yes","No","Head On",13933461,208]
[8,"WAR","Yes","No","Train",55405,2]
[10,"GAL","Yes","No","Pedestrian",422725,1]
[10,"HOC","Yes","Yes","Animal",32320,4]
[5,"COS","No","No","Left Turn",1767977,56]
[12,"LAK","No","Yes","Animal",960844,75]
[2,"HEN","Yes","Yes","Sideswipe - Passing",47325,1]
[6,"MAD","Yes","No","Sideswipe - Passing",1501753,94]
[7,"AUG","Yes","No","Right Turn",207770,16]
[2,"WOO","Yes","Yes","Head On",55405,2]
[6,"MAD","No","No","Fixed Object",42545575,903]
[4,"TRU","No","Yes","Animal",1511323,118]
[7,"MIA","Yes","No","Parked Vehicle",6287582,480]
[8,"BUT","Yes","No","Sideswipe - Passing",1461131,97]
[4,"MAH","Yes","No","Overturning",4676148,47]
[3,"LOR","Yes","No","Pedalcycles",1281094,12]
[6,"MAD","No","Yes","Left Turn",1088889,7]
[6,"UNI","Yes","No","Angle",322862,18]
[4,"ATB","Yes","No","Fixed Object",910425,28]
[7,"CLA","Yes","Yes","Head On",189189,8]
[3,"RIC","No","No","Rear End",11248954,254]
[3,"RIC","Yes","No","Pedalcycles",162417,3]
[4,"STA","Yes","Yes","Unknown",8080,1]
[6,"PIC","No","No","Other Non-Collision",3026064,119]
[3,"WAY","Yes","No","Parked Vehicle",408504,40]
[4,"STA","Yes","No","Other Non-Collision",7588918,266]
[3,"MED","Yes","No","Angle",1003809,29]
[7,"CLA","Yes","Yes","Sideswipe - Passing",1617773,75]
[5,"LIC","No","Yes","Sideswipe - Passing",7544378,315]
[9,"JAC","No","Yes","Other Non-Collision",8080,1]
[10,"HOC","Yes","Yes","Other Object",103885,8]
[7,"MOT","Yes","Yes","Right Turn",200845,20]
[1,"DEF","Yes","No","Overturning",501104,5]
[5,"FAI","Yes","Yes","Fixed Object",1347335,39]
[3,"ASD","No","No","Pedestrian",2542455,15]
[5,"PER","No","No","Sideswipe - Passing",3934179,137]
[8,"PRE","No","No","Pedestrian",1799178,6]
[8,"BUT","No","Yes","Overturning",531003,3]
[8,"WAR","Yes","No","Right Turn",428013,27]
[8,"HAM","Yes","No","Unknown",3662074,188]
[6,"FRA","No","No","Rear End",3858253,169]
[3,"LOR","Yes","No","Animal",2086385,220]
[12,"GEA","Yes","Yes","Sideswipe - Passing",886296,21]
[4,"SUM","Yes","No","Head On",109544,3]
[1,"HAR","Yes","No","Sideswipe - Passing",2209843,79]
[10,"MOE","Yes","No","Backing",40400,5]
[3,"ASD","No","Yes","Backing",143130,8]
[6,"FRA","Yes","No","Animal",379422,25]
[1,"HAN","No","No","Unknown",210080,26]
[5,"MUS","No","No","Sideswipe - Meeting",501104,5]
[7,"LOG","Yes","No","Backing",40400,5]
[9,"SCI","Yes","No","Backing",2751250,278]
[6,"MRW","Yes","No","Angle",8080,1]
[9,"SCI","No","No","Unknown",40400,5]
[8,"CLE","Yes","No","Right Turn",10328510,641]
[12,"LAK","No","No","Backing",217005,22]
[2,"OTT","Yes","No","Fixed Object",32320,4]
[2,"WOO","No","No","Fixed Object",72569796,1644]
[2,"WIL","No","No","Other Non-Collision",855804,62]
[7,"MIA","Yes","No","Overturning",162417,3]
[7,"MIA","No","No","Head On",6511558,60]
[7,"MIA","No","No","Train",430805,2]
[7,"MOT","No","Yes","Left Turn",911802,25]
[2,"OTT","Yes","No","Angle",6252441,157]
[9,"LAW","Yes","No","Left Turn",94650,2]
[10,"WAS","Yes","Yes","Animal",471989,43]
[2,"LUC","Yes","No","Left Turn",143977538,4255]
[6,"PIC","Yes","No","Head On",4198354,36]
[8,"PRE","No","No","Sideswipe - Meeting",1690900,4]
[11,"COL","Yes","No","Right Turn",169680,21]
[1,"ALL","No","No","Head On",6767957,59]
[1,"ALL","No","No","Train",8080,1]
[4,"POR","No","No","Angle",21250642,475]
[7,"MIA","Yes","No","Backing",1053638,119]
[7,"CHP","No","No","Angle",20563046,271]
[9,"SCI","Yes","No","Fixed Object",36575703,891]
[7,"CLA","Yes","No","Other Object",102619,7]
[7,"MIA","No","Yes","Animal",72720,9]
[10,"ATH","No","No","Fixed Object",46339307,1098]
[1,"DEF","Yes","Yes","Sideswipe - Passing",813914,34]
[7,"MOT","Yes","No","Other Object",24240,3]
[3,"RIC","Yes","No","Pedestrian",204194,5]
[2,"SEN","Yes","No","Overturning",173029,6]
[4,"MAH","Yes","No","Pedestrian",22883915,142]
[4,"STA","Yes","No","Unknown",117624,4]
[3,"ASD","Yes","No","Pedalcycles",656707,8]
[6,"FRA","Yes","No","Angle",737103420,23109]
[3,"LOR","Yes","Yes","Right Turn",103885,8]
[8,"PRE","No","No","Overturning",5705796,68]
[3,"HUR","Yes","No","Other Non-Collision",349523,27]
[4,"POR","No","No","Pedestrian",2439725,12]
[5,"LIC","Yes","Yes","Other Object",134939,11]
[4,"TRU","Yes","No","Overturning",6413553,65]
[4,"ATB","No","Yes","Sideswipe - Passing",5385889,187]
[2,"WOO","Yes","No","Left Turn",13589781,326]
[4,"MAH","No","No","Unknown",87725,6]
[11,"HOL","No","No","Fixed Object",34269588,1081]
[7,"CHP","Yes","No","Left Turn",55405,2]
[4,"SUM","Yes","Yes","Animal",78379,4]
[7,"MOT","Yes","No","Unknown",4939850,132]
[1,"ALL","Yes","No","Left Turn",25275169,634]
[6,"MAR","No","No","Angle",26486366,276]
[6,"DEL","No","Yes","Backing",118779,9]
[2,"WOO","No","Yes","Animal",2374650,171]
[11,"TUS","Yes","No","Parked Vehicle",3945171,260]
[2,"OTT","Yes","No","Unknown",8080,1]
[6,"FAY","Yes","No","Unknown",16160,2]
[12,"CUY","Yes","Yes","Backing",1711573,147]
[6,"DEL","Yes","No","Animal",8548192,696]
[4,"POR","Yes","No","Parked Vehicle",1842265,137]
[1,"DEF","Yes","No","Animal",3742896,421]
[12,"LAK","Yes","Yes","Left Turn",40400,5]
[7,"SHE","Yes","No","Unknown",8080,1]
[9,"LAW","Yes","No","Left Turn",3201249,124]
[2,"SAN","Yes","No","Pedalcycles",155603,3]
[2,"LUC","No","No","Animal",4626098,396]
[4,"SUM","No","Yes","Overturning",971154,7]
[2,"WOO","Yes","Yes","Head On",16160,2]
[7,"MOT","Yes","Yes","Backing",543443,51]
[9,"ROS","Yes","No","Backing",2208851,236]
[3,"MED","No","No","Other Non-Collision",997557,73]
[6,"FRA","Yes","No","Pedestrian",311349476,2440]
[5,"FAI","Yes","Yes","Parked Vehicle",8080,1]
[6,"FAY","Yes","No","Parked Vehicle",1663353,114]
[4,"ATB","Yes","No","Backing",56560,7]
[6,"UNI","Yes","Yes","Pedestrian",422725,1]
[8,"PRE","Yes","No","Sideswipe - Meeting",47325,1]
[8,"CLE","Yes","Yes","Right Turn",1612967,14]
[1,"HAN","Yes","Yes","Other Non-Collision",48480,6]
[5,"COS","Yes","No","Overturning",16160,2]
[10,"WAS","Yes","No","Pedestrian",1894385,18]
[9,"JAC","Yes","Yes","Parked Vehicle",8080,1]
[4,"TRU","Yes","No","Other Non-Collision",117624,4]
[1,"DEF","Yes","No","Pedestrian",2642653,16]
[6,"UNI","No","Yes","Rear End",5136970,164]
[5,"MUS","No","No","Pedalcycles",108278,2]
[10,"ATH","Yes","Yes","Right Turn",8080,1]
[8,"CLI","Yes","No","Pedestrian",1400095,13]
[4,"POR","Yes","Yes","Overturning",343526,10]
[8,"HAM","Yes","No","Left Turn",3180363,140]
[4,"POR","Yes","Yes","Backing",177760,22]
[8,"CLE","Yes","No","Angle",355293,18]
[3,"WAY","Yes","No","Other Non-Collision",124438,4]
[1,"HAN","Yes","No","Parked Vehicle",4235275,298]
[1,"ALL","No","Yes","Parked Vehicle",438885,3]
[6,"DEL","Yes","Yes","Right Turn",47325,1]
[2,"SEN","Yes","No","Left Turn",4311327,103]
[6,"FRA","No","Yes","Animal",575090,15]
[1,"VAN","Yes","No","Backing",2006660,136]
[2,"WIL","No","Yes","Rear End",2132987,45]
[5,"LIC","No","No","Right Turn",1320863,75]
[2,"FUL","Yes","No","Animal",339360,42]
[12,"LAK","Yes","Yes","Backing",277958,23]
[10,"NOB","Yes","No","Fixed Object",8080,1]
[4,"SUM","No","Yes","Rear End",2470558,136]
[6,"MAD","No","No","Unknown",80800,10]
[2,"LUC","Yes","No","Right Turn",46538031,2312]
[4,"ATB","Yes","No","Rear End",143130,8]
[7,"MIA","No","Yes","Sideswipe - Passing",278069,19]
[3,"RIC","No","No","Fixed Object",48822669,1212]
[2,"OTT","No","Yes","Pedestrian",845450,2]
[7,"DAR","Yes","No","Head On",8080,1]
[12,"LAK","No","Yes","Other Object",193920,24]
[7,"SHE","No","Yes","Left Turn",8080,1]
[11,"COL","Yes","No","Fixed Object",3406674,96]
[7,"MER","No","Yes","Rear End",54139,1]
[3,"HUR","No","No","Backing",410925,46]
[9,"LAW","Yes","No","Right Turn",1821521,66]
[4,"ATB","Yes","No","Other Non-Collision",1200743,20]
[4,"STA","Yes","No","Fixed Object",8315804,326]
[2,"SAN","Yes","No","Sideswipe - Passing",729056,48]
[10,"VIN","No","No","Overturning",5128550,54]
[8,"CLE","No","No","Overturning",10385445,81]
[5,"GUE","No","Yes","Other Object",368104,35]
[12,"GEA","Yes","No","Other Non-Collision",398225,25]
[2,"WIL","Yes","No","Pedestrian",54139,1]
[12,"GEA","Yes","No","Backing",56560,7]
[9,"PIK","No","No","Angle",8790425,129]
[4,"SUM","Yes","No","Pedalcycles",62219,2]
[7,"AUG","Yes","No","Parked Vehicle",476864,2]
[1,"WYA","No","No","Overturning",3581822,37]
[1,"DEF","Yes","No","Rear End",16205046,750]
[8,"CLE","Yes","No","Left Turn",35532164,1171]
[1,"ALL","Yes","No","Left Turn",740039,20]
[6,"UNI","Yes","No","Other Non-Collision",62219,2]
[11,"BEL","No","No","Overturning",12988966,123]
[2,"LUC","No","Yes","Unknown",16160,2]
[9,"LAW","No","No","Left Turn",3220871,137]
[2,"OTT","Yes","No","Other Object",8080,1]
[10,"NOB","No","No","Rear End",755044,17]
[3,"WAY","Yes","No","Other Object",8080,1]
[6,"DEL","Yes","Yes","Unknown",79645,5]
[5,"LIC","Yes","Yes","Overturning",118890,5]
[6,"DEL","Yes","No","Backing",691304,75]
[7,"LOG","No","No","Unknown",32320,4]
[1,"HAN","Yes","No","Head On",5185407,98]
[1,"HAN","Yes","No","Train",8080,1]
[9,"ADA","No","No","Left Turn",4570479,122]
[1,"DEF","No","Yes","Sideswipe - Passing",32320,4]
[8,"BUT","Yes","No","Angle",44424478,1124]
[6,"UNI","No","No","Other Non-Collision",2065893,84]
[11,"CAR","Yes","No","Angle",62219,2]
[3,"MED","No","Yes","Parked Vehicle",187923,7]
[6,"DEL","Yes","No","Unknown",32320,4]
[11,"COL","No","Yes","Unknown",16160,2]
[6,"FRA","Yes","Yes","Backing",129280,16]
[3,"LOR","Yes","Yes","Left Turn",94539,6]
[7,"AUG","Yes","Yes","Fixed Object",48480,6]
[9,"ROS","No","No","Pedestrian",2854370,12]
[1,"HAN","No","No","Backing",945504,60]
[2,"SEN","Yes","No","Rear End",4376226,167]
[3,"MED","Yes","Yes","Rear End",3383102,99]
[8,"WAR","Yes","No","Right Turn",1667486,135]
[9,"JAC","Yes","No","Other Non-Collision",739928,24]
[11,"TUS","Yes","Yes","Other Object",8080,1]
[5,"FAI","Yes","No","Parked Vehicle",172918,10]
[5,"KNO","Yes","No","Head On",1551083,30]
[10,"GAL","No","No","Unknown",48480,6]
[1,"DEF","Yes","No","Right Turn",1536491,100]
[9,"BRO","Yes","No","Sideswipe - Passing",250142,9]
[8,"BUT","Yes","No","Overturning",8080,1]
[4,"SUM","No","No","Right Turn",237669,14]
[3,"ERI","No","No","Sideswipe - Passing",2508016,76]
[1,"DEF","Yes","No","Angle",117624,4]
[5,"FAI","No","Yes","Left Turn",16160,2]
[10,"WAS","Yes","Yes","Overturning",54139,1]
[7,"MIA","Yes","No","Pedalcycles",54139,1]
[8,"HAM","No","No","Left Turn",4376413,125]
[12,"GEA","Yes","No","Angle",126859,10]
[1,"ALL","Yes","No","Backing",7136098,615]
[4,"ATB","Yes","Yes","Backing",24240,3]
[11,"COL","No","Yes","Backing",16160,2]
[1,"PUT","Yes","No","Unknown",8080,1]
[10,"GAL","No","No","Backing",691783,36]
[8,"WAR","Yes","Yes","Rear End",1646517,68]
[7,"CHP","Yes","No","Other Object",32320,4]
[4,"POR","Yes","No","Other Non-Collision",40400,5]
[3,"WAY","Yes","No","Unknown",8080,1]
[5,"LIC","Yes","No","Animal",1470217,126]
[3,"RIC","No","Yes","Fixed Object",5958444,196]
[3,"WAY","Yes","No","Sideswipe - Passing",687839,60]
[11,"CAR","No","No","Overturning",6307098,74]
[5,"LIC","No","Yes","Angle",352761,16]
[7,"LOG","Yes","No","Overturning",694686,7]
[4,"STA","No","Yes","Other Object",64640,8]
[1,"HAN","Yes","No","Unknown",24240,3]
[4,"MAH","Yes","No","Rear End",133838434,5963]
[3,"CRA","Yes","Yes","Other Non-Collision",140598,6]
[2,"WOO","Yes","Yes","Right Turn",213429,11]
[12,"GEA","No","No","Sideswipe - Passing",11369047,313]
[5,"LIC","Yes","Yes","Rear End",230744,18]
[3,"RIC","Yes","No","Right Turn",279224,24]
[3,"CRA","Yes","Yes","Left Turn",54139,1]
[4,"TRU","Yes","No","Sideswipe - Passing",134939,11]
[4,"SUM","Yes","No","Animal",441979,49]
[8,"CLI","No","No","Animal",7548851,706]
[6,"MAR","No","No","Sideswipe - Passing",4477766,131]
[3,"LOR","Yes","No","Overturning",1764772,14]
[5,"LIC","Yes","No","Pedalcycles",141975,3]
[8,"PRE","Yes","No","Rear End",48480,6]
[6,"MRW","Yes","No","Animal",24240,3]
[3,"ERI","Yes","No","Angle",768672,17]
[7,"MIA","Yes","Yes","Head On",609382,7]
[3,"ASD","Yes","No","Sideswipe - Passing",2668095,156]
[11,"COL","Yes","No","Backing",160445,15]
[7,"DAR","Yes","No","Angle",13830653,352]
[12,"CUY","Yes","Yes","Other Non-Collision",1161833,38]
[8,"CLI","Yes","Yes","Sideswipe - Passing",64640,8]
[1,"WYA","Yes","No","Parked Vehicle",478914,39]
[8,"HAM","No","Yes","Other Object",55405,2]
[7,"DAR","Yes","No","Angle",124438,4]
[11,"HAS","No","No","Animal",3443584,177]
[12,"LAK","Yes","No","Pedestrian",16486369,124]
[4,"STA","No","Yes","Overturning",478130,3]
[4,"POR","Yes","No","Sideswipe - Passing",4445231,256]
[2,"SEN","Yes","No","Unknown",16160,2]
[5,"LIC","No","No","Other Object",206504,15]
[1,"VAN","Yes","No","Left Turn",3107341,60]
[4,"MAH","Yes","Yes","Pedalcycles",54139,1]
[8,"PRE","Yes","No","Fixed Object",1970570,42]
[7,"MIA","Yes","Yes","Other Non-Collision",290880,36]
[3,"LOR","Yes","No","Other Object",1613978,76]
[4,"MAH","Yes","Yes","Overturning",47325,1]
[4,"ATB","Yes","Yes","Animal",429168,32]
[10,"GAL","Yes","No","Rear End",11216039,455]
[2,"HEN","Yes","No","Sideswipe - Passing",8080,1]
[10,"MRG","Yes","No","Backing",16160,2]
[1,"VAN","Yes","No","Rear End",6759578,326]
[8,"HAM","No","No","Backing",647328,59]
[6,"PIC","Yes","No","Pedalcycles",278775,6]
[2,"LUC","Yes","No","Head On",1009579,20]
[5,"FAI","No","No","Pedestrian",1156656,8]
[8,"WAR","Yes","Yes","Head On",969888,6]
[1,"DEF","Yes","Yes","Pedestrian",422725,1]
[6,"PIC","Yes","No","Fixed Object",87725,6]
[6,"PIC","No","Yes","Other Non-Collision",24240,3]
[7,"LOG","Yes","No","Animal",24240,3]
[2,"SAN","Yes","No","Other Non-Collision",24240,3]
[2,"WOO","No","No","Parked Vehicle",1531912,65]
[11,"COL","Yes","No","Rear End",143130,8]
[2,"WOO","Yes","No","Unknown",72720,9]
[1,"HAR","Yes","No","Angle",2692848,41]
[9,"SCI","Yes","No","Animal",2926766,184]
[1,"PUT","Yes","No","Other Non-Collision",24240,3]
[8,"HAM","Yes","Yes","Right Turn",835733,31]
[3,"LOR","Yes","Yes","Other Non-Collision",572525,66]
[3,"WAY","Yes","No","Sideswipe - Passing",1069715,38]
[8,"BUT","No","No","Backing",2192528,72]
[6,"FRA","No","No","Left Turn",787699,39]
[9,"LAW","No","No","Overturning",9424643,104]
[10,"NOB","Yes","No","Left Turn",64640,8]
[5,"MUS","Yes","No","Right Turn",4568181,267]
[3,"RIC","No","No","Left Turn",5599794,155]
[6,"PIC","Yes","No","Left Turn",8080,1]
[3,"ERI","Yes","No","Pedestrian",55405,2]
[3,"WAY","Yes","No","Other Non-Collision",79645,5]
[4,"TRU","Yes","Yes","Overturning",1293902,25]
[2,"LUC","Yes","Yes","Rear End",53624305,2096]
[11,"JEF","No","No","Sideswipe - Meeting",8080,1]
[4,"SUM","No","No","Left Turn",1053068,37]
[6,"MRW","Yes","No","Right Turn",47325,1]
[11,"COL","Yes","No","Left Turn",8080,1]
[7,"MIA","Yes","Yes","Right Turn",55405,2]
[8,"WAR","Yes","Yes","Fixed Object",431140,20]
[5,"MUS","Yes","No","Fixed Object",183419,17]
[3,"MED","Yes","No","Left Turn",10579704,379]
[6,"MAD","No","No","Other Non-Collision",2874070,74]
[2,"HEN","No","Yes","Parked Vehicle",8080,1]
[3,"WAY","Yes","Yes","Other Non-Collision",62219,2]
[2,"SEN","Yes","No","Backing",842625,80]
[4,"SUM","Yes","Yes","Other Object",746598,81]
[10,"WAS","No","Yes","Other Non-Collision",129280,16]
[5,"FAI","No","Yes","Head On",135050,7]
[3,"MED","Yes","Yes","Sideswipe - Passing",2182251,87]
[11,"COL","Yes","Yes","Fixed Object",70299,3]
[3,"ERI","Yes","No","Sideswipe - Meeting",16160,2]
[4,"MAH","Yes","No","Rear End",649522,39]
[4,"POR","No","Yes","Pedestrian",47325,1]
[4,"ATB","Yes","No","Angle",4459445,96]
[1,"HAN","Yes","No","Fixed Object",727901,43]
[9,"HIG","Yes","No","Pedalcycles",54139,1]
[10,"GAL","No","No","Right Turn",891844,20]
[12,"LAK","No","Yes","Unknown",80800,10]
[3,"MED","Yes","No","Fixed Object",20526434,601]
[4,"POR","Yes","Yes","Backing",24240,3]
[7,"MOT","Yes","No","Parked Vehicle",2084441,145]
[12,"GEA","Yes","No","Head On",101464,2]
[11,"COL","Yes","No","Fixed Object",11212063,253]
[8,"CLE","No","No","Other Non-Collision",2316968,106]
[3,"CRA","Yes","No","Other Non-Collision",1780226,29]
[4,"ATB","No","No","Sideswipe - Passing",8284559,191]
[4,"STA","No","No","Right Turn",1528671,72]
[6,"FRA","No","No","Train",8080,1]
[6,"FRA","No","No","Head On",1564933,22]
[1,"DEF","No","No","Sideswipe - Meeting",8080,1]
[4,"ATB","Yes","No","Pedestrian",1163470,8]
[1,"ALL","Yes","No","Parked Vehicle",153520,19]
[4,"MAH","Yes","No","Fixed Object",1463696,46]
[5,"KNO","No","No","Pedalcycles",162417,3]
[3,"HUR","Yes","No","Sideswipe - Passing",313965,34]
[5,"GUE","Yes","Yes","Unknown",32320,4]
[2,"WOO","Yes","Yes","Animal",218160,27]
[1,"HAN","Yes","No","Angle",30090517,1037]
[11,"TUS","No","No","Sideswipe - Meeting",555243,6]
[7,"CHP","No","No","Other Object",526610,9]
[6,"PIC","Yes","No","Rear End",32320,4]
[7,"CLA","Yes","No","Overturning",1273014,11]
[3,"CRA","Yes","No","Right Turn",54139,1]
[7,"CLA","No","No","Head On",2667339,33]
[11,"JEF","Yes","No","Fixed Object",17358946,481]
[12,"LAK","Yes","Yes","Head On",1237567,14]
[2,"HEN","No","No","Backing",552900,49]
[3,"HUR","Yes","No","Fixed Object",10348264,303]
[9,"ROS","Yes","Yes","Right Turn",32320,4]
[7,"MOT","Yes","Yes","Left Turn",4103070,88]
[3,"WAY","Yes","No","Pedalcycles",2123303,21]
[9,"ROS","Yes","No","Angle",565855,9]
[10,"WAS","No","No","Sideswipe - Passing",3597091,124]
[9,"JAC","No","No","Falling From Or In Vehicle",422725,1]
[12,"CUY","No","No","Sideswipe - Passing",272410,24]
[6,"FAY","Yes","Yes","Overturning",946914,4]
[4,"TRU","No","No","Unknown",32320,4]
[11,"BEL","Yes","Yes","Parked Vehicle",166215,6]
[3,"ASD","No","No","Sideswipe - Meeting",422725,1]
[2,"WOO","Yes","No","Head On",872557,25]
[2,"FUL","No","No","Right Turn",667654,29]
[8,"WAR","Yes","Yes","Unknown",32320,4]
[8,"PRE","Yes","No","Head On",2411427,33]
[8,"PRE","Yes","No","Train",438885,3]
[2,"SAN","No","Yes","Unknown",113120,14]
[6,"UNI","Yes","Yes","Sideswipe - Passing",8080,1]
[7,"MER","No","No","Rear End",9582035,197]
[2,"HEN","Yes","No","Pedestrian",1206513,11]
[9,"PIK","Yes","No","Left Turn",1319148,56]
[3,"ERI","Yes","No","Sideswipe - Passing",480069,44]
[1,"VAN","Yes","No","Right Turn",1085058,57]
[1,"PAU","No","No","Pedestrian",1268175,3]
[9,"JAC","Yes","Yes","Other Non-Collision",24240,3]
[6,"DEL","Yes","Yes","Right Turn",70299,3]
[1,"ALL","Yes","Yes","Other Non-Collision",1104010,34]
[12,"CUY","Yes","Yes","Animal",12404126,704]
[3,"LOR","Yes","No","Left Turn",670075,35]
[10,"ATH","Yes","No","Fixed Object",501104,5]
[3,"RIC","No","No","Right Turn",444173,29]
[6,"DEL","No","No","Other Object",302198,26]
[7,"AUG","No","Yes","Other Object",88880,11]
[3,"ERI","Yes","No","Sideswipe - Passing",175339,16]
[12,"CUY","Yes","No","Other Non-Collision",5584790,132]
[6,"UNI","No","Yes","Animal",3133603,187]
[4,"SUM","No","Yes","Right Turn",174295,7]
[5,"GUE","Yes","Yes","Parked Vehicle",430805,2]
[11,"COL","Yes","Yes","Animal",24240,3]
[8,"BUT","No","No","Sideswipe - Meeting",1739380,10]
[2,"LUC","Yes","Yes","Backing",16160,2]
[5,"KNO","No","No","Fixed Object",59337731,1414]
[10,"WAS","No","Yes","Fixed Object",1539280,71]
[2,"WOO","Yes","Yes","Angle",190455,9]
[4,"ATB","Yes","No","Rear End",17618729,695]
[1,"HAR","Yes","No","Overturning",54139,1]
[8,"HAM","Yes","No","Unknown",32320,4]
[11,"COL","Yes","No","Head On",713378,11]
[10,"MOE","No","No","Left Turn",2787016,78]
[2,"LUC","Yes","Yes","Pedalcycles",62219,2]
[7,"SHE","Yes","No","Animal",87725,6]
[11,"HOL","No","No","Unknown",133784,6]
[8,"BUT","Yes","No","Right Turn",18823751,1027]
[8,"PRE","Yes","No","Parked Vehicle",16160,2]
[11,"JEF","Yes","Yes","Sideswipe - Passing",8080,1]
[3,"ERI","No","Yes","Rear End",7146666,172]
[8,"HAM","Yes","Yes","Overturning",11759286,144]
[1,"ALL","Yes","No","Sideswipe - Meeting",63485,3]
[12,"GEA","Yes","No","Fixed Object",7074141,159]
[5,"LIC","No","Yes","Head On",128125,11]
[8,"WAR","Yes","No","Sideswipe - Passing",1963947,117]
[6,"FRA","Yes","No","Other Object",2794583,197]
[9,"PIK","Yes","No","Parked Vehicle",384264,37]
[1,"VAN","Yes","No","Head On",8080,1]
[4,"POR","Yes","Yes","Left Turn",79645,5]
[2,"SEN","Yes","No","Fixed Object",3615226,118]
[4,"TRU","Yes","No","Fixed Object",845785,20]
[11,"HAS","No","No","Rear End",6525555,138]
[6,"FAY","Yes","Yes","Other Object",64640,8]
[6,"MAR","No","No","Other Non-Collision",959243,56]
[4,"MAH","No","No","Other Non-Collision",1223573,79]
[3,"LOR","Yes","No","Head On",17950773,244]
[3,"LOR","Yes","No","Train",16160,2]
[6,"UNI","Yes","No","Sideswipe - Passing",759404,64]
[9,"ROS","Yes","No","Overturning",1795826,17]
[4,"SUM","Yes","No","Head On",50739556,967]
[4,"SUM","Yes","No","Train",845450,2]
[5,"COS","No","No","Right Turn",198535,10]
[11,"BEL","No","Yes","Other Object",301043,21]
[7,"MIA","Yes","No","Fixed Object",8112730,292]
[11,"HOL","Yes","No","Angle",24240,3]
[2,"OTT","No","No","Right Turn",834578,26]
[6,"FRA","No","No","Pedalcycles",430805,2]
[7,"AUG","Yes","No","Backing",8080,1]
[1,"ALL","Yes","Yes","Pedestrian",62219,2]
[6,"UNI","Yes","Yes","Other Object",8080,1]
[3,"ERI","Yes","Yes","Fixed Object",6102946,167]
[8,"WAR","Yes","Yes","Animal",978608,100]
[1,"PAU","No","No","Fixed Object",25895880,477]
[7,"CLA","Yes","No","Angle",4764580,153]
[2,"WOO","No","Yes","Rear End",11374434,237]
[3,"LOR","No","No","Sideswipe - Passing",9164568,279]
[4,"MAH","No","Yes","Animal",3789124,273]
[6,"FAY","Yes","No","Pedalcycles",1344579,15]
[5,"MUS","Yes","No","Backing",126859,10]
[2,"SAN","Yes","No","Angle",3562610,87]
[11,"JEF","No","Yes","Backing",8080,1]
[5,"LIC","Yes","No","Unknown",510785,25]
[10,"NOB","No","Yes","Sideswipe - Passing",477759,34]
[4,"ATB","Yes","No","Head On",1870743,10]
[4,"ATB","Yes","No","Train",8080,1]
[9,"LAW","Yes","Yes","Pedestrian",1268175,3]
[6,"MAR","Yes","No","Angle",218977,10]
[7,"CHP","No","No","Sideswipe - Meeting",845450,2]
[5,"FAI","Yes","No","Sideswipe - Passing",6751335,424]
[8,"PRE","Yes","No","Parked Vehicle",842287,58]
[5,"PER","No","No","Head On",11476536,106]
[5,"PER","No","No","Train",422725,1]
[11,"COL","Yes","No","Unknown",48480,6]
[2,"OTT","Yes","Yes","Overturning",430805,2]
[1,"ALL","Yes","No","Unknown",248059,25]
[2,"WIL","No","Yes","Unknown",71565,4]
[3,"WAY","Yes","Yes","Fixed Object",151210,9]
[3,"RIC","No","No","Animal",13892182,1161]
[7,"AUG","Yes","Yes","Sideswipe - Passing",283617,18]
[4,"MAH","Yes","No","Backing",10999960,961]
[5,"LIC","Yes","Yes","Overturning",422725,1]
[12,"GEA","Yes","Yes","Other Object",8080,1]
[1,"HAR","Yes","No","Pedestrian",1102517,7]
[11,"COL","Yes","Yes","Other Object",80800,10]
[11,"BEL","No","Yes","Animal",774187,69]
[5,"LIC","Yes","No","Sideswipe - Meeting",54139,1]
[8,"BUT","Yes","No","Pedestrian",3145134,18]
[3,"HUR","Yes","No","Pedestrian",578328,4]
[12,"CUY","Yes","Yes","Rear End",24240,3]
[9,"JAC","Yes","Yes","Other Object",16160,2]
[8,"HAM","Yes","Yes","Pedestrian",63485,3]
[11,"COL","Yes","No","Left Turn",321707,13]
[1,"HAN","No","No","Parked Vehicle",914223,31]
[8,"PRE","Yes","No","Fixed Object",3361175,110]
[8,"HAM","No","Yes","Sideswipe - Passing",1348233,75]
[8,"WAR","No","No","Unknown",493024,4]
[2,"SAN","Yes","Yes","Animal",322045,35]
[10,"WAS","Yes","Yes","Backing",8080,1]
[1,"PUT","No","No","Pedestrian",422725,1]
[1,"WYA","Yes","No","Pedalcycles",62219,2]
[6,"FAY","No","Yes","Backing",134939,11]
[10,"WAS","Yes","No","Animal",1070837,96]
[4,"ATB","Yes","Yes","Parked Vehicle",8080,1]
[7,"AUG","Yes","No","Unknown",8080,1]
[7,"LOG","No","Yes","Angle",1680734,15]
[5,"MUS","Yes","Yes","Pedestrian",476864,2]
[6,"FRA","No","Yes","Overturning",764985,10]
[5,"FAI","Yes","No","Unknown",16160,2]
[10,"ATH","Yes","No","Left Turn",3382285,116]
[10,"WAS","No","Yes","Parked Vehicle",8080,1]
[2,"HEN","No","Yes","Fixed Object",2336475,63]
[11,"TUS","Yes","Yes","Other Non-Collision",16160,2]
[11,"COL","No","No","Angle",21118550,388]
[10,"ATH","Yes","No","Fixed Object",1226584,42]
[3,"RIC","No","No","Parked Vehicle",862391,36]
[6,"MRW","Yes","No","Rear End",8080,1]
[2,"HEN","No","Yes","Animal",1081338,103]
[8,"WAR","Yes","Yes","Pedestrian",476864,2]
[4,"SUM","No","No","Rear End",2833710,137]
[10,"MRG","No","No","Backing",1143255,34]
[12,"GEA","Yes","No","Other Object",533424,9]
[6,"FRA","Yes","Yes","Unknown",116358,3]
[5,"LIC","Yes","Yes","Sideswipe - Meeting",8080,1]
[11,"JEF","Yes","No","Rear End",346058,12]
[2,"OTT","Yes","Yes","Left Turn",54139,1]
[7,"MIA","Yes","No","Fixed Object",651048,13]
[10,"HOC","No","Yes","Head On",455045,5]
[4,"POR","Yes","Yes","Right Turn",24240,3]
[8,"CLE","No","Yes","Sideswipe - Passing",217005,22]
[9,"ROS","No","No","Overturning",9191366,110]
[4,"MAH","Yes","Yes","Angle",1023058,43]
[10,"HOC","Yes","Yes","Right Turn",8080,1]
[6,"UNI","Yes","Yes","Other Object",72720,9]
[5,"FAI","Yes","Yes","Animal",256139,26]
[7,"MER","No","No","Right Turn",1315724,26]
[12,"GEA","Yes","No","Pedestrian",470050,2]
[3,"ERI","Yes","Yes","Backing",32320,4]
[3,"ERI","No","Yes","Unknown",113120,14]
[4,"ATB","Yes","No","Unknown",125704,5]
[12,"GEA","No","Yes","Sideswipe - Passing",507658,32]
[3,"HUR","Yes","No","Other Object",8080,1]
[3,"RIC","Yes","No","Rear End",2336628,157]
[2,"LUC","Yes","No","Backing",700650,77]
[1,"PUT","No","No","Right Turn",192765,19]
[5,"COS","Yes","No","Fixed Object",3755453,155]
[7,"MOT","Yes","No","Right Turn",527765,14]
[2,"OTT","Yes","No","Animal",1560850,137]
[7,"MIA","Yes","Yes","Left Turn",211008,5]
[12,"LAK","Yes","No","Angle",76677461,2587]
[3,"ERI","No","Yes","Backing",105040,13]
[4,"TRU","No","Yes","Left Turn",24240,3]
[9,"SCI","No","Yes","Left Turn",8080,1]
[3,"LOR","No","No","Parked Vehicle",2420997,57]
[12,"LAK","No","Yes","Left Turn",63485,3]
[12,"CUY","Yes","No","Sideswipe - Passing",306051143,17370]
[6,"UNI","No","No","Head On",6838924,68]
[6,"UNI","No","No","Train",8080,1]
[6,"MAR","No","No","Overturning",2936768,37]
[3,"CRA","No","No","Pedestrian",108278,2]
[2,"OTT","Yes","No","Overturning",971154,7]
[2,"WOO","Yes","No","Overturning",63485,3]
[8,"WAR","Yes","Yes","Angle",140598,6]
[11,"CAR","No","No","Sideswipe - Meeting",931909,7]
[5,"FAI","Yes","No","Other Non-Collision",3157463,70]
[10,"WAS","No","Yes","Head On",422725,1]
[9,"ROS","No","No","Sideswipe - Meeting",1370794,10]
[4,"MAH","Yes","No","Right Turn",14088202,779]
[1,"ALL","No","Yes","Sideswipe - Passing",2197112,141]
[1,"DEF","Yes","Yes","Angle",47325,1]
[2,"SEN","No","No","Sideswipe - Meeting",869690,5]
[10,"NOB","No","No","Overturning",3136832,25]
[9,"ROS","Yes","No","Head On",470050,2]
[7,"DAR","Yes","No","Pedalcycles",672269,15]
[9,"JAC","Yes","Yes","Sideswipe - Passing",134939,11]
[5,"FAI","Yes","No","Backing",1124530,83]
[6,"MRW","No","Yes","Animal",2406857,149]
[3,"RIC","No","Yes","Animal",1430412,112]
[11,"HOL","No","No","Sideswipe - Passing",8214936,232]
[3,"WAY","No","No","Backing",1146684,98]
[5,"COS","Yes","No","Pedalcycles",1017213,7]
[11,"HAS","Yes","No","Angle",70299,3]
[1,"HAN","Yes","Yes","Animal",804086,67]
[2,"WOO","Yes","No","Other Non-Collision",47325,1]
[4,"SUM","Yes","Yes","Head On",4424483,68]
[9,"PIK","No","No","Sideswipe - Meeting",518530,8]
[2,"SAN","Yes","No","Right Turn",1249298,71]
[4,"STA","Yes","Yes","Head On",1831349,33]
[4,"ATB","Yes","No","Parked Vehicle",2377326,116]
[11,"COL","Yes","No","Left Turn",2001735,41]
[3,"MED","Yes","Yes","Overturning",718926,10]
[5,"LIC","Yes","Yes","Right Turn",652314,14]
[10,"NOB","Yes","No","Rear End",214584,16]
[1,"VAN","Yes","No","Unknown",16160,2]
[1,"PAU","No","No","Animal",9522578,1002]
[11,"BEL","Yes","Yes","Head On",534690,10]
[3,"MED","No","No","Sideswipe - Passing",12714633,330]
[6,"FRA","Yes","Yes","Sideswipe - Passing",197087206,8853]
[4,"POR","Yes","Yes","Rear End",3639125,95]
[2,"WOO","Yes","No","Angle",299888,16]
[6,"UNI","Yes","No","Other Object",8080,1]
[4,"STA","Yes","No","Rear End",2318862,102]
[3,"LOR","No","Yes","Backing",80800,10]
[6,"MRW","No","No","Head On",8184063,97]
[6,"MRW","No","No","Train",54139,1]
[4,"POR","Yes","No","Other Non-Collision",314782,17]
[3,"HUR","Yes","No","Overturning",8080,1]
[6,"UNI","No","No","Unknown",160445,15]
[11,"JEF","No","Yes","Animal",283617,18]
[7,"MIA","Yes","Yes","Rear End",3308520,124]
[11,"BEL","Yes","Yes","Backing",598064,17]
[10,"GAL","No","Yes","Fixed Object",3170756,52]
[10,"GAL","No","Yes","Rear End",901190,22]
[4,"MAH","Yes","No","Rear End",1267095,43]
[6,"FRA","No","Yes","Left Turn",56560,7]
[11,"TUS","Yes","No","Head On",4544747,66]
[12,"CUY","Yes","No","Pedestrian",35685948,267]
[6,"MAR","Yes","No","Right Turn",70299,3]
[6,"MAD","Yes","No","Fixed Object",56560,7]
[5,"KNO","No","No","Backing",825088,81]
[8,"WAR","Yes","Yes","Backing",8080,1]
[2,"HEN","Yes","Yes","Rear End",24240,3]
[8,"GRE","Yes","No","Sideswipe - Passing",294229,21]
[7,"CHP","No","No","Head On",6498971,65]
[7,"CHP","No","No","Train",8080,1]
[3,"WAY","Yes","No","Angle",22690314,713]
[9,"LAW","Yes","No","Backing",1878870,143]
[7,"AUG","Yes","Yes","Overturning",585142,4]
[3,"LOR","Yes","Yes","Parked Vehicle",1248630,65]
[2,"OTT","Yes","No","Other Object",113120,14]
[9,"ROS","No","Yes","Other Non-Collision",396737,32]
[10,"GAL","No","Yes","Pedestrian",422725,1]
[11,"JEF","Yes","No","Overturning",2496285,19]
[9,"SCI","Yes","No","Sideswipe - Passing",120045,10]
[1,"ALL","Yes","Yes","Sideswipe - Passing",5183962,177]
[5,"FAI","Yes","No","Left Turn",132518,5]
[4,"POR","Yes","No","Angle",8080,1]
[2,"HEN","Yes","No","Other Non-Collision",677709,22]
[11,"COL","Yes","No","Other Non-Collision",32320,4]
[4,"SUM","Yes","No","Pedestrian",69193058,500]
[6,"PIC","No","No","Overturning",9175542,100]
[2,"SAN","Yes","No","Overturning",1764772,14]
[10,"GAL","Yes","No","Right Turn",1195868,61]
[11,"CAR","Yes","No","Right Turn",8080,1]
[7,"AUG","No","Yes","Overturning",156758,8]
[6,"FRA","Yes","Yes","Animal",71565,4]
[4,"TRU","Yes","Yes","Sideswipe - Passing",10595435,556]
[12,"CUY","No","Yes","Fixed Object",78379,4]
[10,"ATH","Yes","No","Fixed Object",10998592,283]
[4,"ATB","Yes","Yes","Other Object",24240,3]
[4,"STA","Yes","Yes","Right Turn",24240,3]
[5,"LIC","Yes","No","Rear End",37460732,1957]
[9,"BRO","No","No","Head On",6039310,100]
[7,"CLA","Yes","Yes","Sideswipe - Passing",6874607,381]
[7,"AUG","Yes","No","Backing",161600,20]
[4,"ATB","No","Yes","Left Turn",8080,1]
[10,"GAL","No","No","Fixed Object",41271076,985]
[6,"MAR","Yes","No","Fixed Object",24073475,699]
[7,"MOT","Yes","No","Rear End",4685465,219]
[6,"MAD","Yes","No","Pedalcycles",422725,1]
[7,"AUG","No","No","Animal",8233457,811]
[8,"WAR","No","No","Animal",7905736,592]
[5,"GUE","No","Yes","Angle",540349,5]
[4,"SUM","Yes","No","Sideswipe - Meeting",422725,1]
[3,"CRA","Yes","Yes","Sideswipe - Passing",236403,13]
[11,"COL","Yes","No","Fixed Object",5519332,167]
[1,"ALL","Yes","No","Other Non-Collision",8080,1]
[9,"PIK","No","No","Other Non-Collision",914112,35]
[4,"ATB","Yes","No","Angle",5477737,146]
[11,"TUS","Yes","No","Angle",429279,28]
[6,"DEL","Yes","No","Head On",15776385,200]
[6,"DEL","Yes","No","Train",438885,3]
[11,"COL","Yes","Yes","Overturning",47325,1]
[10,"GAL","Yes","No","Rear End",705187,14]
[10,"MOE","No","Yes","Rear End",8080,1]
[7,"MOT","Yes","Yes","Rear End",82498767,3036]
[5,"GUE","Yes","No","Backing",32320,4]
[10,"GAL","Yes","No","Head On",934776,27]
[7,"AUG","Yes","No","Sideswipe - Passing",744399,67]
[11,"COL","No","Yes","Sideswipe - Passing",280379,29]
[7,"SHE","Yes","No","Fixed Object",12338236,453]
[10,"HOC","Yes","No","Rear End",4748804,249]
[5,"MUS","No","Yes","Sideswipe - Passing",2610339,159]
[9,"JAC","No","No","Angle",15584072,146]
[7,"LOG","Yes","No","Sideswipe - Passing",474072,27]
[4,"ATB","No","Yes","Other Non-Collision",1139086,62]
[8,"HAM","Yes","No","Head On",137970239,2089]
[8,"HAM","Yes","No","Train",493919,36]
[4,"POR","Yes","No","Sideswipe - Passing",1199477,19]
[7,"SHE","Yes","No","Parked Vehicle",5067845,385]
[3,"RIC","Yes","No","Left Turn",54139,1]
[8,"WAR","No","Yes","Backing",111965,9]
[7,"CLA","Yes","No","Sideswipe - Meeting",446965,4]
[11,"COL","Yes","No","Rear End",7854086,260]
[12,"LAK","Yes","No","Sideswipe - Passing",663599,57]
[8,"PRE","Yes","No","Other Non-Collision",47325,1]
[2,"SAN","Yes","No","Parked Vehicle",2636809,93]
[10,"HOC","No","No","Pedestrian",1430592,6]
[3,"MED","Yes","No","Other Object",16160,2]
[9,"SCI","Yes","No","Overturning",54139,1]
[2,"FUL","Yes","Yes","Sideswipe - Passing",479285,8]
[1,"WYA","No","Yes","Sideswipe - Passing",120045,10]
[7,"MOT","Yes","No","Fixed Object",6919876,198]
[8,"BUT","Yes","No","Pedalcycles",12394984,156]
[8,"GRE","Yes","No","Overturning",54139,1]
[2,"SAN","Yes","No","Sideswipe - Passing",32320,4]
[2,"HEN","Yes","Yes","Sideswipe - Passing",589984,16]
[6,"FRA","Yes","Yes","Fixed Object",795444,22]
[9,"BRO","No","No","Other Non-Collision",1400884,83]
[6,"DEL","No","Yes","Other Non-Collision",280379,29]
[8,"CLI","Yes","No","Right Turn",8080,1]
[7,"MER","No","No","Unknown",120045,10]
[7,"SHE","No","No","Other Non-Collision",379533,21]
[5,"KNO","Yes","No","Unknown",48480,6]
[2,"WIL","No","No","Sideswipe - Passing",2864577,125]
[7,"CLA","Yes","No","Pedestrian",18118996,132]
[6,"MAD","Yes","No","Animal",24240,3]
[1,"DEF","Yes","Yes","Other Object",32320,4]
[2,"FUL","Yes","No","Other Non-Collision",70299,3]
[1,"WYA","Yes","No","Unknown",24240,3]
[11,"COL","Yes","No","Parked Vehicle",24240,3]
[10,"GAL","No","No","Parked Vehicle",701949,25]
[8,"WAR","Yes","No","Other Non-Collision",1049533,11]
[8,"HAM","No","No","Animal",1849866,177]
[6,"DEL","Yes","Yes","Parked Vehicle",390740,15]
[9,"LAW","No","No","Pedalcycles",270695,5]
[2,"LUC","Yes","No","Backing",29544417,2728]
[8,"WAR","Yes","No","Overturning",1909168,23]
[2,"SAN","Yes","Yes","Overturning",1300495,7]
[7,"SHE","Yes","No","Rear End",12355477,585]
[6,"DEL","Yes","No","Sideswipe - Passing",801330,43]
[6,"PIC","Yes","No","Pedestrian",202928,4]
[2,"FUL","No","No","Fixed Object",33929640,834]
[8,"CLE","Yes","No","Backing",4917502,495]
[1,"VAN","Yes","No","Angle",8080,1]
[1,"ALL","Yes","No","Sideswipe - Passing",48480,6]
[2,"LUC","Yes","Yes","Overturning",4582055,55]
[10,"ATH","Yes","No","Overturning",109544,3]
[3,"CRA","Yes","Yes","Fixed Object",416135,23]
[3,"CRA","Yes","Yes","Animal",408615,36]
[6,"MAD","Yes","No","Other Object",16160,2]
[5,"KNO","Yes","No","Fixed Object",32320,4]
[9,"SCI","No","No","Backing",811122,59]
[2,"SAN","Yes","No","Pedestrian",845450,2]
[6,"FRA","Yes","Yes","Other Object",8080,1]
[7,"LOG","No","No","Overturning",4421502,48]
[1,"HAR","Yes","No","Other Non-Collision",71565,4]
[11,"BEL","Yes","No","Left Turn",3656072,137]
[5,"FAI","Yes","No","Overturning",398931,12]
[5,"COS","No","No","Rear End",4622495,128]
[3,"CRA","Yes","Yes","Unknown",24240,3]
[12,"CUY","Yes","No","Parked Vehicle",95859732,5087]
[9,"BRO","No","No","Unknown",228323,12]
[3,"CRA","No","No","Sideswipe - Passing",1210424,40]
[1,"PAU","No","Yes","Angle",2897302,19]
[7,"SHE","Yes","Yes","Other Object",218160,27]
[12,"GEA","No","No","Pedestrian",3855423,17]
[12,"GEA","Yes","No","Sideswipe - Passing",2610375,110]
[1,"DEF","No","No","Other Non-Collision",1824091,49]
[8,"BUT","Yes","No","Angle",2571798,116]
[1,"HAR","Yes","No","Right Turn",8080,1]
[8,"CLE","No","Yes","Angle",8080,1]
[4,"MAH","Yes","No","Animal",4782150,417]
[4,"SUM","Yes","Yes","Fixed Object",383815,19]
[9,"SCI","Yes","No","Unknown",32320,4]
[7,"MIA","Yes","No","Other Non-Collision",771093,23]
[11,"HAS","No","No","Right Turn",895531,27]
[11,"JEF","No","Yes","Left Turn",478130,3]
[1,"PUT","No","No","Other Object",174184,11]
[8,"PRE","No","No","Fixed Object",51077439,1058]
[11,"JEF","No","Yes","Other Non-Collision",40400,5]
[10,"MOE","No","No","Unknown",16160,2]
[5,"LIC","Yes","No","Fixed Object",1508340,68]
[6,"MRW","No","Yes","Rear End",4627708,109]
[5,"FAI","No","Yes","Backing",16160,2]
[8,"WAR","Yes","Yes","Sideswipe - Passing",6574605,365]
[3,"RIC","Yes","No","Overturning",140598,6]
[5,"LIC","Yes","No","Left Turn",13325647,469]
[4,"POR","Yes","No","Fixed Object",38807294,1064]
[3,"RIC","Yes","No","Sideswipe - Meeting",470050,2]
[2,"OTT","Yes","No","Backing",16160,2]
[11,"JEF","Yes","Yes","Fixed Object",637309,17]
[10,"WAS","Yes","No","Fixed Object",4386914,132]
[4,"POR","No","No","Pedalcycles",586408,5]
[5,"LIC","Yes","Yes","Pedalcycles",476864,2]
[8,"GRE","Yes","No","Sideswipe - Meeting",590095,12]
[4,"POR","Yes","No","Left Turn",118779,9]
[6,"FRA","Yes","Yes","Pedestrian",18174823,74]
[4,"STA","Yes","Yes","Sideswipe - Passing",21709475,1026]
[3,"LOR","Yes","No","Backing",1640124,173]
[1,"VAN","No","No","Sideswipe - Passing",3602791,104]
[3,"ERI","No","No","Pedestrian",155603,3]
[3,"MED","Yes","Yes","Angle",140598,6]
[5,"LIC","Yes","No","Right Turn",1920791,88]
[3,"HUR","Yes","No","Other Object",40400,5]
[7,"DAR","No","No","Right Turn",647101,33]
[2,"SEN","Yes","No","Animal",193920,24]
[4,"MAH","Yes","Yes","Overturning",2430825,24]
[8,"PRE","Yes","No","Animal",64640,8]
[1,"ALL","Yes","No","Animal",56560,7]
[7,"MOT","No","Yes","Other Non-Collision",56560,7]
[8,"BUT","Yes","No","Other Object",1481011,53]
[10,"NOB","Yes","Yes","Overturning",63485,3]
[3,"ASD","No","No","Angle",32176307,417]
[5,"LIC","Yes","No","Parked Vehicle",1191253,75]
[4,"STA","Yes","Yes","Backing",8080,1]
[11,"BEL","No","Yes","Angle",674133,11]
[4,"SUM","Yes","No","Parked Vehicle",16160,2]
[10,"WAS","Yes","No","Rear End",64640,8]
[6,"PIC","Yes","No","Right Turn",24240,3]
[10,"VIN","No","No","Unknown",40400,5]
[1,"PUT","Yes","No","Rear End",16160,2]
[8,"PRE","No","Yes","Overturning",718926,10]
[6,"FRA","Yes","Yes","Sideswipe - Meeting",1284335,5]
[6,"FAY","Yes","No","Backing",1904487,143]
[11,"BEL","No","No","Unknown",126859,10]
[7,"AUG","Yes","Yes","Other Non-Collision",96960,12]
[4,"MAH","Yes","No","Sideswipe - Meeting",1497055,25]
[3,"RIC","Yes","Yes","Fixed Object",16160,2]
[3,"CRA","Yes","No","Parked Vehicle",24240,3]
[1,"DEF","Yes","Yes","Overturning",547163,5]
[6,"MAR","No","No","Pedestrian",1376453,5]
[3,"LOR","Yes","No","Parked Vehicle",1425568,70]
[5,"KNO","Yes","No","Parked Vehicle",48480,6]
[8,"CLI","Yes","Yes","Angle",62219,2]
[12,"GEA","Yes","No","Left Turn",2312124,64]
[9,"LAW","Yes","Yes","Overturning",755639,8]
[6,"DEL","No","No","Angle",24633185,509]
[11,"HOL","No","No","Animal",5007525,356]
[3,"ERI","Yes","No","Overturning",8080,1]
[8,"CLE","No","No","Head On",13427220,184]
[8,"WAR","Yes","No","Head On",424548,12]
[3,"WAY","Yes","No","Right Turn",2513307,106]
[2,"WOO","Yes","No","Sideswipe - Passing",214695,12]
[2,"LUC","No","No","Pedalcycles",632467,5]
[4,"STA","Yes","No","Sideswipe - Passing",4537916,334]
[2,"HEN","Yes","No","Angle",16160,2]
[3,"ASD","Yes","No","Pedestrian",1907456,8]
[10,"WAS","No","No","Other Non-Collision",526017,48]
[4,"STA","Yes","Yes","Pedalcycles",8080,1]
[10,"ATH","No","Yes","Overturning",170497,4]
[4,"TRU","No","Yes","Right Turn",16160,2]
[8,"CLE","Yes","No","Sideswipe - Passing",160445,15]
[12,"LAK","Yes","Yes","Left Turn",1194264,38]
[10,"GAL","Yes","No","Left Turn",16160,2]
[8,"WAR","Yes","No","Sideswipe - Meeting",16160,2]
[6,"PIC","No","Yes","Sideswipe - Passing",493919,36]
[10,"NOB","No","No","Angle",394427,22]
[10,"GAL","Yes","No","Backing",744399,67]
[6,"PIC","Yes","No","Rear End",2945259,75]
[7,"CLA","No","No","Rear End",7242581,201]
[7,"SHE","No","No","Angle",15018476,193]
[6,"PIC","Yes","No","Angle",923120,15]
[10,"GAL","No","Yes","Other Object",56560,7]
[6,"FRA","No","Yes","Fixed Object",4809864,129]
[2,"SAN","No","Yes","Other Non-Collision",419005,47]
[1,"HAN","Yes","No","Sideswipe - Passing",8289397,600]
[5,"GUE","Yes","No","Left Turn",78379,4]
[12,"GEA","No","Yes","Angle",579483,9]
[7,"MIA","No","Yes","Fixed Object",275537,17]
[6,"DEL","Yes","Yes","Left Turn",62219,2]
[9,"ADA","Yes","No","Other Object",47325,1]
[12,"LAK","Yes","No","Sideswipe - Passing",25468023,1658]
[3,"MED","No","Yes","Sideswipe - Passing",4993476,251]
[11,"CAR","No","No","Head On",5483733,50]
[3,"ERI","Yes","Yes","Parked Vehicle",116358,3]
[7,"LOG","Yes","No","Other Object",72720,9]
[4,"POR","Yes","No","Pedestrian",1525242,8]
[3,"MED","Yes","Yes","Fixed Object",714533,16]
[2,"WOO","Yes","Yes","Right Turn",8080,1]
[4,"TRU","Yes","No","Parked Vehicle",118779,9]
[6,"MRW","No","No","Angle",21674911,392]
[5,"FAI","No","Yes","Animal",889390,67]
[8,"WAR","No","No","Pedalcycles",1017213,7]
[11,"JEF","No","Yes","Unknown",16160,2]
[4,"POR","Yes","No","Left Turn",18584846,523]
[9,"PIK","No","No","Pedestrian",1792364,6]
[1,"ALL","Yes","Yes","Other Object",145440,18]
[8,"GRE","No","No","Animal",8798195,796]
[5,"KNO","Yes","No","Right Turn",962332,68]
[8,"BUT","Yes","No","Other Object",24240,3]
[8,"WAR","No","No","Backing",881648,88]
[8,"GRE","No","No","Other Object",177760,22]
[12,"LAK","Yes","Yes","Parked Vehicle",24240,3]
[7,"MOT","Yes","Yes","Pedalcycles",422725,1]
[2,"LUC","Yes","Yes","Angle",4251599,118]
[10,"GAL","Yes","No","Pedalcycles",217822,5]
[2,"LUC","No","Yes","Overturning",1397452,15]
[4,"STA","Yes","Yes","Animal",184685,18]
[1,"HAN","Yes","Yes","Left Turn",8080,1]
[2,"OTT","No","No","Pedalcycles",742011,8]
[3,"LOR","No","Yes","Right Turn",47325,1]
[10,"GAL","Yes","No","Animal",895276,88]
[3,"ASD","No","No","Other Non-Collision",1591672,80]
[10,"VIN","No","No","Pedalcycles",845450,2]
[11,"JEF","No","Yes","Fixed Object",406083,34]
[2,"WOO","Yes","Yes","Rear End",1760341,39]
[5,"KNO","No","No","Parked Vehicle",815626,49]
[5,"LIC","No","No","Sideswipe - Meeting",3125179,17]
[9,"JAC","Yes","No","Sideswipe - Passing",3426521,105]
[3,"HUR","Yes","No","Unknown",48480,6]
[3,"RIC","No","Yes","Parked Vehicle",47325,1]
[10,"MOE","No","No","Fixed Object",25743630,576]
[4,"TRU","Yes","Yes","Angle",705633,28]
[3,"RIC","Yes","Yes","Head On",728272,12]
[8,"CLI","Yes","No","Other Object",16160,2]
[2,"SAN","No","No","Sideswipe - Passing",6692300,158]
[1,"ALL","Yes","No","Overturning",55405,2]
[4,"STA","Yes","No","Left Turn",3594595,73]
[3,"MED","Yes","Yes","Overturning",609382,7]
[3,"WAY","No","No","Other Non-Vehicle",539083,4]
[2,"HEN","No","No","Fixed Object",28670979,653]
[6,"FAY","No","Yes","Animal",1764224,155]
[10,"MOE","Yes","No","Rear End",8080,1]
[11,"COL","Yes","No","Overturning",288121,8]
[5,"GUE","Yes","Yes","Fixed Object",6073306,168]
[5,"KNO","Yes","No","Animal",1802541,176]
[7,"AUG","Yes","No","Rear End",470050,2]
[8,"WAR","Yes","No","Angle",20880589,485]
[5,"LIC","Yes","Yes","Pedestrian",422725,1]
[7,"MIA","Yes","No","Pedestrian",5520665,36]
[9,"HIG","No","No","Animal",5581790,350]
[1,"WYA","Yes","No","Backing",711040,88]
[7,"MIA","Yes","No","Left Turn",3822398,139]
[9,"LAW","Yes","Yes","Sideswipe - Meeting",47325,1]
[8,"HAM","Yes","No","Fixed Object",8194869,318]
[7,"AUG","Yes","No","Parked Vehicle",581904,15]
[2,"SAN","No","Yes","Backing",500960,62]
[5,"GUE","No","No","Overturning",6374086,73]
[2,"OTT","Yes","No","Pedestrian",748825,8]
[4,"SUM","Yes","Yes","Other Object",137360,17]
[4,"STA","Yes","No","Train",32320,4]
[4,"STA","Yes","No","Head On",1539762,36]
[3,"WAY","Yes","No","Rear End",2111581,115]
[10,"WAS","Yes","Yes","Rear End",259488,11]
[3,"MED","Yes","Yes","Other Object",113120,14]
[8,"BUT","Yes","No","Unknown",527394,45]
[5,"MUS","No","No","Overturning",11382886,124]
[3,"HUR","Yes","No","Right Turn",560980,50]
[5,"LIC","Yes","No","Right Turn",5657779,265]
[11,"HAS","No","No","Left Turn",3494881,67]
[4,"POR","Yes","Yes","Fixed Object",1749360,97]
[7,"MER","No","No","Parked Vehicle",373763,30]
[12,"LAK","No","No","Left Turn",1490465,47]
[6,"MRW","No","Yes","Right Turn",55405,2]
[9,"LAW","No","No","Other Object",549584,11]
[3,"MED","Yes","No","Pedestrian",109544,3]
[8,"GRE","No","Yes","Other Non-Collision",303464,27]
[7,"MIA","Yes","No","Animal",8080,1]
[4,"STA","No","Yes","Sideswipe - Passing",1130408,66]
[12,"LAK","Yes","Yes","Unknown",118779,9]
[7,"MOT","No","Yes","Unknown",16160,2]
[6,"PIC","Yes","No","Overturning",162417,3]
[7,"CLA","No","Yes","Left Turn",71565,4]
[4,"MAH","No","Yes","Backing",719004,59]
[5,"MUS","Yes","No","Overturning",1645508,36]
[1,"ALL","Yes","Yes","Fixed Object",8080,1]
[11,"BEL","Yes","Yes","Right Turn",550850,12]
[6,"FRA","No","No","Right Turn",324128,19]
[12,"CUY","Yes","No","Other Object",1395109,58]
[2,"OTT","No","No","Backing",1665552,128]
[8,"PRE","Yes","No","Backing",72720,9]
[7,"MIA","Yes","Yes","Other Non-Vehicle",8080,1]
[4,"POR","Yes","No","Animal",64640,8]
[12,"LAK","No","No","Parked Vehicle",159290,10]
[10,"HOC","Yes","No","Parked Vehicle",1691313,71]
[4,"SUM","No","Yes","Unknown",86459,5]
[2,"WOO","Yes","No","Head On",5597296,74]
[2,"WOO","Yes","No","Train",16160,2]
[11,"TUS","Yes","No","Fixed Object",21468914,708]
[1,"HAN","No","No","Fixed Object",32523819,1015]
[7,"CHP","Yes","No","Backing",40400,5]
[12,"LAK","Yes","Yes","Fixed Object",2621358,82]
[2,"LUC","Yes","Yes","Animal",3522149,222]
[1,"VAN","No","No","Head On",4070827,20]
[1,"VAN","No","No","Train",8080,1]
[6,"MAR","Yes","No","Animal",2734979,280]
[8,"BUT","No","No","Parked Vehicle",748343,43]
[4,"SUM","No","Yes","Backing",24240,3]
[9,"PIK","No","Yes","Fixed Object",8080,1]
[7,"CLA","No","Yes","Overturning",424326,20]
[5,"GUE","Yes","No","Parked Vehicle",1504769,91]
[7,"DAR","Yes","No","Right Turn",796339,54]
[4,"POR","Yes","No","Parked Vehicle",109544,3]
[7,"CHP","Yes","No","Rear End",470050,2]
[1,"WYA","Yes","No","Animal",984605,117]
[2,"WOO","Yes","Yes","Other Object",16160,2]
[8,"WAR","Yes","No","Pedalcycles",365345,7]
[2,"WOO","Yes","Yes","Animal",2440814,123]
[3,"ERI","No","No","Angle",13860850,247]
[1,"DEF","Yes","No","Rear End",135050,7]
[2,"LUC","No","Yes","Backing",16160,2]
[2,"WIL","No","No","Other Object",307968,17]
[4,"SUM","Yes","No","Right Turn",3262845,222]
[4,"STA","Yes","No","Backing",363600,45]
[9,"ROS","Yes","No","Fixed Object",17618585,499]
[3,"RIC","No","Yes","Rear End",3215286,74]
[3,"LOR","Yes","Yes","Left Turn",56560,7]
[11,"JEF","Yes","No","Left Turn",8391718,196]
[5,"MUS","Yes","Yes","Rear End",2928279,86]
[4,"SUM","Yes","Yes","Head On",1535854,11]
[2,"WIL","No","Yes","Animal",1285421,112]
[11,"TUS","No","Yes","Left Turn",16160,2]
[4,"ATB","Yes","No","Parked Vehicle",533424,9]
[12,"GEA","Yes","No","Sideswipe - Passing",111965,9]
[7,"MOT","Yes","No","Parked Vehicle",70364034,3983]
[4,"MAH","Yes","No","Pedalcycles",4610910,44]
[8,"GRE","Yes","Yes","Other Non-Collision",32320,4]
[12,"LAK","No","No","Unknown",8080,1]
[6,"UNI","Yes","Yes","Angle",55405,2]
[4,"SUM","Yes","Yes","Other Non-Collision",3546533,168]
[3,"MED","Yes","Yes","Fixed Object",3520396,222]
[11,"COL","No","No","Sideswipe - Meeting",885850,7]
[4,"MAH","Yes","No","Other Non-Collision",16160,2]
[3,"MED","Yes","Yes","Other Object",87725,6]
[8,"CLI","No","No","Sideswipe - Passing",3183866,136]
[7,"AUG","Yes","No","Rear End",1656572,61]
[10,"VIN","No","No","Parked Vehicle",737507,18]
[10,"VIN","No","No","Backing",288570,26]
[7,"CLA","No","Yes","Parked Vehicle",205349,10]
[4,"POR","Yes","No","Backing",744770,36]
[7,"SHE","Yes","Yes","Left Turn",8080,1]
[2,"OTT","Yes","No","Parked Vehicle",438885,3]
[6,"UNI","Yes","Yes","Angle",16160,2]
[11,"COL","Yes","No","Backing",40400,5]
[1,"WYA","Yes","No","Overturning",1002319,6]
[3,"RIC","Yes","No","Sideswipe - Meeting",1416482,41]
[3,"MED","Yes","No","Other Non-Collision",133784,6]
[3,"CRA","No","Yes","Sideswipe - Passing",260643,16]
[8,"GRE","Yes","No","Pedestrian",13227893,100]
[10,"MEG","No","No","Left Turn",3077704,65]
[9,"ROS","No","No","Sideswipe - Passing",4725938,182]
[5,"FAI","Yes","No","Sideswipe - Passing",10629370,625]
[7,"AUG","Yes","Yes","Rear End",63485,3]
[3,"MED","Yes","Yes","Backing",8080,1]
[5,"COS","Yes","No","Rear End",4669234,289]
[6,"MAR","Yes","No","Backing",2610652,272]
[2,"LUC","Yes","Yes","Left Turn",117624,4]
[8,"HAM","Yes","Yes","Backing",1480607,137]
[3,"MED","Yes","No","Pedalcycles",55405,2]
[7,"MER","Yes","No","Right Turn",1034157,45]
[1,"ALL","No","No","Other Non-Collision",1065995,84]
[11,"JEF","Yes","No","Fixed Object",715688,21]
[3,"WAY","Yes","No","Head On",220243,11]
[2,"LUC","No","Yes","Animal",477648,38]
[8,"BUT","Yes","No","Overturning",1584555,35]
[9,"HIG","No","No","Rear End",10790412,204]
[1,"DEF","No","No","Pedestrian",1586195,9]
[10,"NOB","Yes","No","Fixed Object",1288468,26]
[3,"RIC","Yes","No","Animal",404000,50]
[10,"WAS","No","No","Other Object",190344,13]
[12,"CUY","Yes","No","Angle",665086747,20558]
[5,"LIC","Yes","Yes","Animal",8080,1]
[8,"WAR","Yes","Yes","Left Turn",118779,9]
[10,"HOC","No","No","Other Object",56560,7]
[3,"LOR","Yes","No","Backing",2089028,218]
[7,"CLA","No","Yes","Backing",598175,13]
[1,"HAN","Yes","No","Animal",193920,24]
[2,"SAN","Yes","No","Left Turn",78379,4]
[10,"GAL","Yes","No","Parked Vehicle",1181647,100]
[3,"WAY","Yes","No","Head On",8080,1]
[9,"ROS","Yes","No","Sideswipe - Passing",16160,2]
[6,"FRA","Yes","No","Fixed Object",22927582,758]
[8,"BUT","Yes","No","Sideswipe - Meeting",861610,4]
[11,"JEF","Yes","Yes","Animal",56560,7]
[10,"GAL","Yes","No","Fixed Object",5587397,179]
[11,"BEL","No","No","Parked Vehicle",1623659,96]
[5,"FAI","No","No","Angle",33047298,457]
[1,"DEF","Yes","No","Sideswipe - Meeting",8080,1]
[1,"HAN","Yes","Yes","Rear End",4168120,159]
[4,"POR","Yes","Yes","Fixed Object",6271697,235]
[7,"DAR","No","No","Head On",7831564,84]
[7,"DAR","No","No","Train",16160,2]
[1,"HAR","Yes","No","Other Object",8080,1]
[12,"LAK","Yes","Yes","Other Non-Collision",16160,2]
[8,"PRE","No","No","Animal",6989508,626]
[7,"CLA","No","Yes","Unknown",129280,16]
[3,"HUR","Yes","No","Pedestrian",1377719,6]
[10,"ATH","No","No","Animal",6625941,528]
[8,"BUT","Yes","Yes","Angle",8080,1]
[5,"MUS","Yes","No","Left Turn",182375,8]
[10,"MEG","Yes","No","Other Object",32320,4]
[3,"ASD","Yes","No","Overturning",671601,9]
[4,"SUM","Yes","Yes","Pedestrian",422725,1]
[1,"VAN","No","Yes","Rear End",8080,1]
[8,"HAM","Yes","No","Parked Vehicle",151391060,10750]
[4,"TRU","Yes","Yes","Animal",8080,1]
[6,"PIC","No","No","Other Object",333363,25]
[11,"TUS","Yes","Yes","Backing",126859,10]
[2,"SEN","Yes","No","Pedalcycles",366611,8]
[4,"ATB","Yes","Yes","Sideswipe - Passing",420044,22]
[11,"JEF","Yes","No","Parked Vehicle",56560,7]
[11,"COL","Yes","No","Sideswipe - Passing",1124674,26]
[9,"PIK","Yes","No","Head On",2269563,26]
[4,"STA","Yes","No","Other Object",1139053,115]
[11,"TUS","No","No","Overturning",10795471,117]
[9,"JAC","Yes","Yes","Angle",587563,10]
[6,"FRA","Yes","Yes","Angle",13779940,354]
[9,"BRO","Yes","No","Pedestrian",101464,2]
[7,"AUG","No","Yes","Right Turn",8080,1]
[7,"DAR","Yes","No","Overturning",170497,4]
[11,"BEL","No","No","Fixed Object",48040372,1395]
[8,"CLI","Yes","Yes","Pedestrian",422725,1]
[3,"MED","No","No","Pedestrian",2267253,16]
[4,"POR","No","No","Sideswipe - Meeting",455045,5]
[5,"LIC","Yes","No","Other Non-Vehicle",422725,1]
[7,"MER","Yes","No","Rear End",24240,3]
[8,"PRE","No","No","Pedalcycles",162417,3]
[7,"LOG","Yes","No","Right Turn",520469,49]
[5,"GUE","Yes","No","Other Non-Collision",599330,18]
[8,"HAM","Yes","No","Fixed Object",363046577,10424]
[8,"CLE","Yes","No","Sideswipe - Meeting",8080,1]
[7,"MIA","Yes","No","Unknown",24240,3]
[2,"LUC","No","No","Fixed Object",15635760,337]
[3,"WAY","No","Yes","Other Object",345019,37]
[10,"WAS","Yes","No","Unknown",70299,3]
[10,"NOB","No","Yes","Angle",47325,1]
[3,"LOR","Yes","No","Fixed Object",21391015,557]
[2,"SAN","No","Yes","Sideswipe - Passing",6549847,307]
[9,"LAW","Yes","No","Pedalcycles",428830,10]
[3,"LOR","Yes","No","Pedalcycles",1401361,14]
[10,"MRG","Yes","No","Sideswipe - Passing",8080,1]
[6,"MAD","No","Yes","Fixed Object",15033391,443]
[1,"WYA","Yes","No","Fixed Object",94539,6]
[7,"SHE","Yes","Yes","Sideswipe - Meeting",422725,1]
[3,"ERI","Yes","Yes","Sideswipe - Passing",3298139,125]
[8,"WAR","No","Yes","Unknown",16160,2]
[7,"MIA","Yes","Yes","Fixed Object",4328384,167]
[2,"SAN","Yes","No","Parked Vehicle",143130,8]
[6,"FRA","Yes","No","Parked Vehicle",32320,4]
[2,"SEN","Yes","No","Animal",2465472,227]
[6,"DEL","Yes","No","Parked Vehicle",1391505,134]
[4,"STA","No","No","Fixed Object",57343455,1557]
[7,"AUG","Yes","No","Overturning",101464,2]
[6,"MAD","No","Yes","Backing",169680,21]
[9,"JAC","No","No","Pedestrian",1807258,7]
[6,"FRA","Yes","Yes","Rear End",132518,5]
[9,"JAC","Yes","No","Animal",48480,6]
[5,"LIC","Yes","No","Animal",1677427,128]
[11,"TUS","No","Yes","Angle",1017213,7]
[9,"BRO","Yes","No","Other Object",16160,2]
[8,"GRE","Yes","No","Other Non-Collision",2638451,97]
[6,"UNI","No","Yes","Backing",40400,5]
[8,"BUT","Yes","No","Overturning",6145497,80]
[7,"LOG","Yes","No","Pedestrian",1738225,5]
[3,"RIC","Yes","Yes","Angle",1213216,15]
[3,"HUR","Yes","No","Pedestrian",54139,1]
[5,"MUS","No","No","Right Turn",876244,32]
[3,"HUR","No","No","Sideswipe - Passing",2840819,87]
[11,"COL","Yes","No","Head On",8080,1]
[7,"MER","No","No","Backing",836295,75]
[5,"FAI","Yes","Yes","Sideswipe - Passing",1183730,84]
[5,"MUS","Yes","No","Parked Vehicle",48480,6]
[8,"HAM","Yes","No","Other Non-Vehicle",47325,1]
[7,"MOT","No","Yes","Sideswipe - Passing",2176368,70]
[2,"OTT","Yes","Yes","Rear End",8080,1]
[8,"WAR","Yes","Yes","Rear End",7300333,277]
[3,"ERI","No","No","Other Object",2018604,34]
[3,"RIC","Yes","No","Other Object",16160,2]
[1,"HAN","No","Yes","Overturning",242062,8]
[11,"BEL","No","No","Left Turn",5274291,226]
[11,"JEF","Yes","No","Left Turn",539083,4]
[11,"CAR","Yes","No","Rear End",70299,3]
[12,"GEA","Yes","No","Pedalcycles",693420,6]
[8,"GRE","Yes","Yes","Sideswipe - Passing",7448363,471]
[4,"ATB","No","No","Sideswipe - Meeting",1707060,6]
[8,"WAR","No","Yes","Overturning",266413,7]
[3,"RIC","Yes","No","Backing",556365,64]
[7,"MOT","No","Yes","Backing",24240,3]
[4,"POR","No","No","Sideswipe - Passing",7271813,249]
[4,"SUM","Yes","Yes","Angle",6666566,211]
[8,"WAR","Yes","Yes","Backing",95805,7]
[8,"BUT","No","No","Fixed Object",64128435,1334]
[11,"COL","Yes","No","Right Turn",70299,3]
[2,"SEN","Yes","No","Sideswipe - Passing",24240,3]
[9,"SCI","Yes","No","Left Turn",10135495,260]
[5,"MUS","Yes","No","Animal",24240,3]
[4,"STA","Yes","No","Left Turn",856397,23]
[1,"PUT","Yes","No","Sideswipe - Meeting",8080,1]
[11,"BEL","Yes","No","Head On",4978682,65]
[11,"BEL","Yes","No","Train",55405,2]
[10,"ATH","Yes","No","Left Turn",8080,1]
[12,"GEA","Yes","No","Parked Vehicle",166215,6]
[11,"HOL","No","No","Backing",1156479,118]
[3,"LOR","Yes","No","Left Turn",15312970,417]
[7,"DAR","No","No","Rear End",12305263,284]
[11,"TUS","Yes","Yes","Sideswipe - Passing",16160,2]
[9,"HIG","Yes","No","Pedestrian",953728,4]
[10,"HOC","Yes","No","Left Turn",70299,3]
[8,"BUT","Yes","No","Rear End",34578474,1319]
[8,"PRE","No","Yes","Sideswipe - Passing",3304695,182]
[8,"HAM","Yes","No","Backing",2778393,252]
[11,"COL","Yes","No","Overturning",866449,12]
[9,"PIK","Yes","No","Rear End",5187685,274]
[3,"WAY","Yes","No","Backing",490459,55]
[8,"CLI","No","Yes","Backing",48480,6]
[1,"HAN","Yes","Yes","Rear End",753407,47]
[7,"MIA","Yes","No","Right Turn",63485,3]
[9,"LAW","Yes","No","Unknown",549584,11]
[2,"WOO","No","No","Unknown",126859,10]
[9,"PIK","Yes","No","Sideswipe - Passing",32320,4]
[5,"GUE","Yes","No","Parked Vehicle",109544,3]
[11,"JEF","Yes","No","Unknown",134939,11]
[7,"LOG","Yes","Yes","Other Object",16160,2]
[1,"HAR","Yes","No","Sideswipe - Meeting",422725,1]
[6,"MRW","No","Yes","Parked Vehicle",541504,10]
[11,"TUS","Yes","Yes","Left Turn",48480,6]
[7,"AUG","Yes","Yes","Rear End",563323,7]
[7,"MOT","Yes","Yes","Left Turn",8080,1]
[4,"POR","No","Yes","Sideswipe - Passing",6326507,246]
[10,"HOC","No","No","Angle",3816699,76]
[4,"STA","Yes","No","Parked Vehicle",349523,27]
[8,"CLI","No","Yes","Animal",1016249,77]
[11,"COL","No","Yes","Head On",8080,1]
[10,"GAL","No","No","Other Non-Vehicle",54139,1]
[5,"GUE","Yes","No","Right Turn",438885,3]
[2,"FUL","No","Yes","Other Object",347440,43]
[8,"HAM","No","No","Overturning",2814305,25]
[11,"JEF","Yes","No","Backing",1874699,141]
[10,"ATH","Yes","No","Parked Vehicle",102619,7]
[4,"SUM","No","Yes","Animal",566417,53]
[5,"LIC","No","Yes","Sideswipe - Meeting",422725,1]
[3,"ERI","Yes","No","Animal",8080,1]
[1,"WYA","Yes","No","Right Turn",276803,18]
[7,"MIA","Yes","No","Rear End",571143,35]
[6,"DEL","Yes","No","Head On",125704,5]
[6,"DEL","Yes","No","Sideswipe - Passing",17950468,1140]
[2,"LUC","No","Yes","Rear End",1363235,68]
[5,"MUS","Yes","No","Fixed Object",30553617,1077]
[10,"GAL","Yes","Yes","Animal",345130,33]
[11,"TUS","Yes","Yes","Fixed Object",10549920,298]
[4,"POR","Yes","No","Fixed Object",862394,40]
[6,"MAR","Yes","No","Pedalcycles",3480203,50]
[7,"CLA","Yes","Yes","Angle",8080,1]
[2,"FUL","Yes","No","Parked Vehicle",8080,1]
[11,"BEL","Yes","Yes","Animal",1116896,96]
[1,"DEF","No","No","Other Object",143019,12]
[10,"MOE","Yes","No","Animal",79645,5]
[10,"MEG","No","No","Head On",4768975,38]
[5,"FAI","No","No","Other Object",184685,18]
[4,"ATB","No","No","Pedestrian",4333553,20]
[10,"HOC","Yes","Yes","Other Non-Collision",8080,1]
[2,"WIL","Yes","No","Sideswipe - Passing",818274,81]
[11,"COL","Yes","No","Animal",55405,2]
[9,"ROS","No","Yes","Other Object",552005,17]
[4,"MAH","Yes","No","Unknown",1199106,50]
[1,"PAU","Yes","No","Sideswipe - Passing",8080,1]
[4,"ATB","Yes","Yes","Rear End",47325,1]
[7,"SHE","No","No","Sideswipe - Meeting",1268175,3]
[10,"WAS","No","No","Pedestrian",1322314,4]
[9,"ROS","Yes","No","Left Turn",12688668,379]
[4,"STA","Yes","No","Fixed Object",1844046,50]
[6,"FAY","Yes","Yes","Sideswipe - Passing",8080,1]
[6,"UNI","Yes","Yes","Other Non-Collision",78379,4]
[2,"WOO","Yes","No","Sideswipe - Passing",2245226,212]
[6,"FRA","No","No","Animal",711968,67]
[7,"CHP","Yes","No","Sideswipe - Passing",1785337,165]
[5,"LIC","Yes","No","Other Non-Vehicle",8080,1]
[7,"MER","No","No","Left Turn",4718931,77]
[5,"KNO","Yes","No","Backing",1368869,154]
[9,"ROS","No","Yes","Angle",790491,14]
[11,"JEF","Yes","Yes","Pedestrian",953728,4]
[10,"MEG","No","No","Parked Vehicle",845785,20]
[8,"HAM","Yes","Yes","Overturning",242062,8]
[4,"ATB","No","Yes","Head On",1300495,7]
[8,"GRE","No","No","Pedalcycles",1350127,14]
[6,"MRW","Yes","Yes","Sideswipe - Passing",54139,1]
[7,"AUG","Yes","No","Fixed Object",134939,11]
[8,"BUT","Yes","No","Angle",5204554,267]
[11,"TUS","No","No","Sideswipe - Passing",5852025,156]
[2,"WOO","No","No","Other Non-Collision",2284424,80]
[2,"FUL","Yes","No","Fixed Object",16160,2]
[9,"LAW","Yes","No","Head On",430805,2]
[3,"RIC","Yes","Yes","Animal",86459,5]
[3,"RIC","Yes","Yes","Sideswipe - Passing",140598,6]
[1,"PAU","No","Yes","Overturning",1548216,10]
[2,"WOO","Yes","Yes","Other Non-Collision",32320,4]
[1,"HAN","No","No","Left Turn",3946688,83]
[2,"FUL","Yes","No","Left Turn",55405,2]
[1,"HAN","Yes","Yes","Head On",286855,7]
[6,"PIC","Yes","No","Head On",540349,5]
[3,"CRA","Yes","No","Angle",5566248,218]
[10,"MEG","Yes","No","Other Non-Collision",133784,6]
[2,"OTT","No","Yes","Right Turn",8080,1]
[4,"TRU","Yes","Yes","Fixed Object",24240,3]
[2,"LUC","Yes","Yes","Right Turn",1914905,67]
[3,"CRA","No","Yes","Other Non-Collision",64640,8]
[9,"HIG","Yes","No","Sideswipe - Passing",8080,1]
[1,"HAR","Yes","No","Pedestrian",155603,3]
[3,"LOR","Yes","Yes","Head On",3145732,13]
[3,"CRA","Yes","No","Head On",1051245,26]
[6,"FAY","Yes","Yes","Rear End",164949,5]
[4,"MAH","No","Yes","Pedestrian",639281,5]
[12,"LAK","No","Yes","Parked Vehicle",455045,5]
[7,"SHE","Yes","No","Sideswipe - Passing",79645,5]
[12,"LAK","Yes","No","Overturning",62219,2]
[7,"CHP","Yes","No","Pedalcycles",1327153,12]
[12,"GEA","No","No","Unknown",56560,7]
[11,"COL","Yes","Yes","Rear End",1550601,65]
[3,"MED","No","Yes","Other Object",231899,23]
[1,"HAR","Yes","No","Overturning",422725,1]
[1,"PUT","No","No","Backing",491725,56]
[6,"MAR","No","No","Left Turn",6723720,96]
[2,"SAN","Yes","No","Sideswipe - Passing",4642352,205]
[8,"GRE","No","Yes","Rear End",2557535,57]
[3,"MED","Yes","Yes","Animal",288570,26]
[12,"LAK","Yes","No","Rear End",3358569,176]
[3,"ERI","Yes","Yes","Fixed Object",172918,10]
[8,"PRE","Yes","No","Pedestrian",1526508,9]
[6,"MAD","Yes","No","Parked Vehicle",2173614,76]
[9,"ROS","Yes","No","Right Turn",463125,6]
[10,"GAL","Yes","No","Other Non-Collision",133784,6]
[5,"FAI","Yes","Yes","Other Object",40400,5]
[9,"ROS","Yes","No","Other Non-Collision",887562,22]
[4,"TRU","No","No","Sideswipe - Passing",9090728,242]
[6,"DEL","No","Yes","Pedestrian",8080,1]
[8,"PRE","No","Yes","Right Turn",24240,3]
[6,"FRA","Yes","No","Other Non-Collision",3537256,64]
[6,"FAY","No","No","Right Turn",431140,20]
[7,"LOG","Yes","Yes","Left Turn",8080,1]
[9,"LAW","Yes","Yes","Unknown",8080,1]
[1,"HAN","Yes","No","Animal",8080,1]
[4,"ATB","No","Yes","Other Object",320779,34]
[3,"WAY","Yes","No","Animal",32320,4]
[3,"RIC","No","Yes","Other Non-Collision",728610,34]
[11,"TUS","Yes","No","Fixed Object",746742,24]
[4,"ATB","No","No","Unknown",40400,5]
[6,"MAR","Yes","No","Rear End",306813,12]
[6,"FRA","Yes","Yes","Head On",618728,9]
[6,"FAY","Yes","No","Head On",685191,28]
[6,"FAY","Yes","No","Train",24240,3]
[1,"HAN","No","No","Head On",3299698,46]
[1,"HAN","No","No","Train",62219,2]
[8,"BUT","Yes","No","Head On",8359510,105]
[8,"BUT","Yes","No","Train",62219,2]
[1,"ALL","Yes","Yes","Fixed Object",9023491,312]
[3,"CRA","Yes","No","Overturning",163683,4]
[2,"SAN","Yes","No","Backing",376184,36]
[3,"HUR","Yes","No","Unknown",8080,1]
[6,"PIC","Yes","No","Animal",641558,68]
[12,"GEA","Yes","No","Pedestrian",892775,3]
[6,"UNI","Yes","No","Animal",934632,84]
[10,"HOC","No","Yes","Overturning",164949,5]
[6,"PIC","No","No","Animal",8174769,718]
[5,"LIC","Yes","Yes","Backing",143019,12]
[8,"WAR","Yes","No","Angle",3101086,100]
[9,"HIG","Yes","No","Backing",185840,23]
[4,"SUM","Yes","No","Left Turn",1257489,68]
[9,"HIG","Yes","No","Overturning",16160,2]
[2,"SEN","Yes","No","Sideswipe - Passing",4730941,326]
[12,"GEA","No","No","Backing",2885917,161]
[4,"SUM","Yes","Yes","Overturning",7099450,80]
[7,"SHE","Yes","No","Angle",16419515,514]
[7,"MIA","Yes","Yes","Rear End",624016,35]
[4,"ATB","Yes","No","Falling From Or In Vehicle",422725,1]
[5,"COS","Yes","No","Left Turn",101464,2]
[9,"ADA","Yes","No","Animal",55405,2]
[8,"GRE","No","No","Head On",9830578,78]
[8,"GRE","No","No","Train",47325,1]
[3,"HUR","Yes","No","Animal",238824,19]
[5,"GUE","No","No","Rear End",2850833,95]
[12,"GEA","Yes","No","Pedalcycles",484944,3]
[3,"WAY","Yes","No","Unknown",24240,3]
[11,"BEL","Yes","Yes","Rear End",236403,13]
[2,"SEN","Yes","No","Sideswipe - Meeting",16160,2]
[6,"UNI","Yes","No","Backing",320890,30]
[2,"SAN","No","No","Right Turn",853865,21]
[4,"STA","Yes","No","Animal",13727095,1360]
[11,"COL","Yes","No","Sideswipe - Passing",985677,39]
[5,"GUE","No","No","Fixed Object",43858328,895]
[12,"LAK","Yes","Yes","Angle",202817,8]
[10,"NOB","No","No","Unknown",16160,2]
[2,"SAN","Yes","No","Sideswipe - Meeting",8080,1]
[2,"OTT","Yes","No","Animal",185840,23]
[5,"GUE","Yes","No","Angle",171763,5]
[3,"MED","Yes","No","Fixed Object",7745668,236]
[2,"WOO","Yes","No","Overturning",178577,5]
[2,"SAN","Yes","No","Pedestrian",4876918,22]
[3,"MED","Yes","No","Right Turn",206504,15]
[8,"BUT","Yes","Yes","Unknown",136205,12]
[6,"FRA","Yes","Yes","Left Turn",9395753,277]
[4,"SUM","Yes","Yes","Right Turn",1109071,34]
[12,"LAK","Yes","No","Fixed Object",5264684,138]
[8,"GRE","No","Yes","Fixed Object",3915969,98]
[3,"RIC","Yes","No","Rear End",78379,4]
[6,"FAY","Yes","Yes","Fixed Object",886296,21]
[7,"LOG","Yes","Yes","Fixed Object",54139,1]
[3,"RIC","Yes","Yes","Rear End",6800344,209]
[1,"HAR","No","No","Rear End",2519891,76]
[6,"DEL","Yes","No","Other Object",345019,37]
[10,"HOC","No","No","Pedalcycles",470050,2]
[9,"PIK","Yes","No","Angle",9574963,254]
[4,"ATB","Yes","Yes","Overturning",422725,1]
[11,"BEL","Yes","No","Sideswipe - Meeting",455045,5]
[2,"WOO","Yes","No","Sideswipe - Passing",7341876,450]
[3,"CRA","Yes","Yes","Other Object",48480,6]
[5,"COS","Yes","No","Head On",8080,1]
[11,"TUS","Yes","No","Rear End",189078,12]
[10,"VIN","No","No","Head On",3637825,34]
[10,"MOE","No","Yes","Angle",47325,1]
[10,"MEG","No","No","Pedestrian",54139,1]
[9,"ADA","No","No","Sideswipe - Passing",5009032,111]
[7,"CLA","Yes","No","Right Turn",7093206,358]
[7,"MOT","Yes","No","Angle",2660940,130]
[8,"HAM","Yes","Yes","Backing",120045,10]
[3,"RIC","Yes","Yes","Overturning",1641935,29]
[3,"CRA","Yes","No","Parked Vehicle",1057577,61]
[3,"WAY","Yes","No","Backing",2179207,177]
[7,"DAR","No","No","Overturning",8349006,94]
[4,"ATB","Yes","No","Unknown",16160,2]
[11,"JEF","Yes","No","Rear End",102619,7]
[5,"FAI","Yes","No","Head On",6184151,67]
[11,"BEL","No","Yes","Other Non-Collision",288459,30]
[10,"HOC","Yes","Yes","Parked Vehicle",430805,2]
[9,"ROS","Yes","Yes","Animal",1095672,90]
[3,"WAY","Yes","No","Fixed Object",136205,12]
[6,"UNI","Yes","No","Unknown",16160,2]
[9,"LAW","No","Yes","Animal",191499,18]
[6,"MAD","No","Yes","Angle",1111752,13]
[8,"CLE","Yes","No","Angle",70564285,2396]
[7,"AUG","Yes","No","Overturning",748825,8]
[2,"WOO","No","Yes","Backing",430323,37]
[9,"HIG","Yes","No","Overturning",531003,3]
[2,"SAN","Yes","No","Head On",422725,1]
[11,"JEF","Yes","Yes","Overturning",8080,1]
[1,"PUT","Yes","No","Overturning",116358,3]
[9,"HIG","No","No","Right Turn",788519,26]
[3,"MED","Yes","No","Pedestrian",422725,1]
[7,"AUG","Yes","No","Head On",70299,3]
[6,"PIC","No","No","Pedestrian",2855636,13]
[9,"LAW","No","No","Animal",3123440,202]
[10,"GAL","Yes","No","Backing",8080,1]
[2,"SEN","No","No","Other Non-Collision",971827,47]
[4,"MAH","Yes","No","Angle",832157,20]
[10,"ATH","Yes","No","Rear End",1165631,41]
[7,"MOT","Yes","Yes","Animal",3057761,219]
[8,"HAM","Yes","No","Left Turn",256034144,9142]
[12,"GEA","Yes","No","Head On",1566797,18]
[5,"LIC","Yes","No","Unknown",174295,7]
[2,"LUC","Yes","Yes","Animal",48480,6]
[1,"WYA","No","No","Pedestrian",2121705,6]
[10,"HOC","No","Yes","Other Non-Collision",72720,9]
[3,"LOR","No","Yes","Unknown",16160,2]
[7,"CLA","Yes","Yes","Angle",8080,1]
[2,"LUC","No","No","Unknown",16160,2]
[7,"AUG","Yes","Yes","Angle",717660,9]
[11,"COL","No","Yes","Parked Vehicle",54139,1]
[6,"FAY","No","No","Angle",8199364,157]
[6,"FAY","Yes","No","Animal",368104,35]
[2,"WOO","Yes","No","Head On",202928,4]
[8,"GRE","No","Yes","Other Object",159179,14]
[7,"MOT","No","No","Angle",12786220,239]
[4,"STA","Yes","No","Pedestrian",40346830,313]
[2,"OTT","No","No","Animal",7600577,739]
[1,"ALL","Yes","No","Pedalcycles",6422744,82]
[3,"RIC","Yes","No","Overturning",3560933,49]
[5,"LIC","No","No","Pedestrian",4767599,15]
[1,"WYA","No","Yes","Overturning",116358,3]
[8,"CLE","Yes","No","Overturning",6973524,83]
[6,"PIC","Yes","No","Pedestrian",422725,1]
[8,"GRE","No","Yes","Head On",8080,1]
[1,"VAN","No","No","Right Turn",134939,11]
[10,"HOC","Yes","No","Other Non-Collision",519685,13]
[4,"MAH","No","No","Rear End",17418066,599]
[1,"HAN","No","Yes","Animal",1419911,105]
[8,"CLE","Yes","No","Head On",34002855,423]
[3,"ERI","Yes","No","Left Turn",54139,1]
[4,"MAH","Yes","No","Fixed Object",1064056,43]
[2,"WIL","No","No","Pedestrian",742011,8]
[12,"GEA","Yes","No","Angle",7742906,204]
[11,"TUS","Yes","Yes","Other Non-Collision",862394,40]
[4,"STA","Yes","No","Sideswipe - Passing",1475574,50]
[11,"TUS","Yes","No","Right Turn",40400,5]
[8,"PRE","No","No","Parked Vehicle",1560058,63]
[9,"BRO","Yes","No","Overturning",54139,1]
[6,"UNI","No","No","Pedestrian",1532056,8]
[3,"RIC","Yes","No","Head On",1261696,21]
[6,"FAY","No","No","Fixed Object",29841151,748]
[3,"LOR","Yes","No","Right Turn",11379781,550]
[8,"BUT","Yes","No","Head On",30885416,412]
[8,"BUT","Yes","No","Train",502370,6]
[2,"WIL","Yes","No","Pedestrian",774442,8]
[7,"MER","Yes","No","Backing",1570869,179]
[6,"UNI","No","No","Sideswipe - Meeting",845450,2]
[9,"LAW","No","No","Head On",6725319,85]
[4,"TRU","Yes","No","Left Turn",35475813,945]
[1,"PUT","Yes","No","Fixed Object",8080,1]
[11,"HAS","No","No","Sideswipe - Passing",3274270,91]
[6,"PIC","Yes","No","Unknown",103885,8]
[2,"WOO","Yes","Yes","Overturning",187923,7]
[10,"ATH","Yes","Yes","Other Non-Collision",471205,7]
[8,"BUT","No","No","Other Object",48480,6]
[1,"WYA","No","Yes","Animal",330125,36]
[8,"HAM","Yes","No","Pedalcycles",33820998,430]
[9,"JAC","Yes","No","Parked Vehicle",55405,2]
[5,"MUS","No","Yes","Animal",2927661,216]
[8,"BUT","Yes","Yes","Animal",1105240,84]
[11,"TUS","No","Yes","Overturning",758171,10]
[3,"RIC","Yes","No","Right Turn",8080,1]
[3,"LOR","Yes","No","Animal",648965,29]
[5,"GUE","No","Yes","Parked Vehicle",220243,11]
[9,"SCI","No","No","Right Turn",2156183,39]
[8,"CLI","Yes","Yes","Rear End",24240,3]
[3,"CRA","Yes","No","Rear End",3603834,196]
[1,"ALL","No","No","Pedalcycles",633733,6]
[7,"DAR","Yes","No","Rear End",101464,2]
[3,"HUR","No","No","Other Object",622304,20]
[8,"HAM","Yes","Yes","Animal",32320,4]
[8,"WAR","Yes","No","Parked Vehicle",2313024,130]
[3,"ERI","Yes","No","Parked Vehicle",24240,3]
[12,"LAK","Yes","No","Overturning",8402294,52]
[4,"STA","Yes","No","Right Turn",1629989,101]
[10,"MEG","No","No","Angle",4044237,78]
[8,"GRE","Yes","No","Animal",118779,9]
[3,"LOR","Yes","Yes","Angle",1542557,15]
[6,"FAY","No","No","Rear End",2572022,138]
[3,"LOR","Yes","No","Other Object",87725,6]
[1,"HAN","Yes","No","Right Turn",3340775,208]
[7,"CHP","Yes","No","Pedestrian",1254879,17]
[3,"LOR","No","No","Pedestrian",3863503,18]
[12,"LAK","No","No","Sideswipe - Passing",980129,40]
[6,"FAY","No","No","Overturning",4800656,62]
[11,"JEF","Yes","No","Head On",6312051,82]
[11,"COL","Yes","Yes","Other Non-Collision",24240,3]
[7,"CLA","Yes","No","Fixed Object",57401336,1792]
[6,"FRA","No","No","Overturning",992153,17]
[1,"DEF","Yes","Yes","Right Turn",8080,1]
[10,"NOB","No","No","Animal",1228077,69]
[7,"CHP","No","No","Pedalcycles",845450,2]
[4,"STA","Yes","Yes","Other Object",1128890,130]
[2,"WOO","Yes","No","Unknown",8080,1]
[6,"PIC","Yes","No","Sideswipe - Passing",604169,26]
[2,"WIL","Yes","No","Animal",48480,6]
[3,"LOR","No","Yes","Head On",47325,1]
[4,"ATB","Yes","No","Pedalcycles",1091085,17]
[9,"LAW","Yes","No","Head On",3546821,54]
[4,"MAH","Yes","No","Parked Vehicle",16160,2]
[4,"SUM","Yes","Yes","Left Turn",310500,19]
[1,"PUT","No","No","Sideswipe - Passing",1520367,49]
[4,"MAH","Yes","No","Left Turn",71565,4]
[2,"SAN","Yes","No","Angle",785987,24]
[3,"MED","Yes","No","Head On",2990686,20]
[7,"AUG","Yes","No","Sideswipe - Passing",40400,5]
[3,"WAY","No","Yes","Fixed Object",4111266,119]
[1,"PUT","Yes","No","Angle",54139,1]
[1,"VAN","No","Yes","Overturning",470050,2]
[2,"WOO","Yes","No","Backing",96960,12]
[4,"MAH","No","No","Sideswipe - Meeting",954994,5]
[5,"COS","Yes","No","Fixed Object",54139,1]
[11,"COL","Yes","No","Head On",525455,4]
[10,"ATH","Yes","No","Angle",24240,3]
[4,"TRU","No","No","Other Non-Collision",1989040,54]
[7,"DAR","No","No","Sideswipe - Passing",5276783,160]
[4,"POR","Yes","Yes","Backing",8080,1]
[8,"HAM","No","Yes","Rear End",3351831,195]
[5,"MUS","Yes","No","Other Object",275648,13]
[2,"SEN","Yes","No","Angle",3761182,161]
[2,"HEN","Yes","Yes","Animal",370525,41]
[6,"FRA","Yes","No","Left Turn",363650872,10081]
[6,"UNI","Yes","No","Animal",63485,3]
[10,"MRG","No","No","Pedestrian",47325,1]
[1,"HAN","No","Yes","Unknown",32320,4]
[10,"HOC","Yes","No","Rear End",71565,4]
[4,"STA","Yes","No","Other Non-Collision",168525,16]
[4,"ATB","Yes","No","Sideswipe - Passing",6401616,288]
[5,"GUE","Yes","No","Right Turn",1344435,72]
[6,"PIC","Yes","No","Backing",897919,86]
[8,"WAR","Yes","No","Pedestrian",681058,7]
[7,"LOG","Yes","No","Animal",296539,31]
[12,"CUY","Yes","No","Left Turn",232234786,7295]
[3,"CRA","No","No","Left Turn",1615945,30]
[8,"PRE","Yes","No","Animal",8080,1]
[5,"LIC","No","No","Sideswipe - Passing",9100042,271]
[3,"ERI","Yes","No","Backing",177760,22]
[4,"SUM","Yes","No","Unknown",4540623,196]
[9,"ROS","Yes","Yes","Unknown",16160,2]
[8,"PRE","Yes","No","Pedalcycles",1212061,10]
[4,"POR","Yes","No","Pedalcycles",3705326,54]
[7,"MIA","No","No","Backing",1122109,77]
[2,"SAN","No","No","Left Turn",4039958,84]
[9,"ROS","Yes","Yes","Other Non-Collision",113120,14]
[3,"LOR","Yes","No","Other Non-Collision",132518,5]
[12,"CUY","Yes","No","Pedestrian",230649400,1875]
[5,"COS","No","No","Overturning",5174945,46]
[6,"MRW","No","No","Pedestrian",3584728,12]
[2,"WIL","No","No","Left Turn",4695959,105]
[4,"MAH","No","No","Pedestrian",3277095,13]
[1,"PUT","Yes","No","Animal",32320,4]
[7,"SHE","Yes","No","Left Turn",5728552,195]
[1,"ALL","Yes","No","Backing",242400,30]
[7,"AUG","Yes","No","Animal",48480,6]
[2,"LUC","No","No","Backing",1188159,29]
[3,"LOR","Yes","No","Unknown",164838,9]
[10,"WAS","Yes","No","Angle",8307915,400]
[9,"BRO","Yes","No","Angle",699639,15]
[5,"LIC","Yes","No","Rear End",19466994,853]
[7,"MOT","Yes","Yes","Unknown",8080,1]
[10,"WAS","Yes","No","Right Turn",8080,1]
[4,"SUM","Yes","No","Rear End",6629749,338]
[6,"PIC","Yes","No","Parked Vehicle",102619,7]
[4,"STA","Yes","Yes","Overturning",539083,4]
[4,"SUM","Yes","Yes","Parked Vehicle",8080,1]
[7,"CHP","Yes","No","Head On",1677607,22]
[7,"LOG","Yes","Yes","Angle",476864,2]
[2,"SAN","Yes","No","Left Turn",4778693,122]
[10,"WAS","Yes","No","Backing",499805,57]
[2,"WIL","No","No","Head On",4174002,63]
[2,"WIL","No","No","Train",8080,1]
[5,"KNO","Yes","Yes","Fixed Object",422725,1]
[4,"ATB","Yes","No","Animal",79645,5]
[3,"RIC","Yes","No","Angle",181109,7]
[3,"MED","Yes","No","Right Turn",3478024,229]
[6,"UNI","Yes","No","Pedestrian",54139,1]
[3,"CRA","Yes","No","Animal",836744,93]
[4,"STA","Yes","Yes","Animal",2976108,275]
[1,"DEF","Yes","No","Backing",1290379,154]
[11,"BEL","Yes","No","Rear End",13038644,598]
[5,"GUE","Yes","No","Pedalcycles",108278,2]
[4,"SUM","Yes","No","Angle",2813860,124]
[11,"COL","Yes","Yes","Sideswipe - Passing",126970,6]
[4,"MAH","Yes","Yes","Unknown",8080,1]
[4,"ATB","Yes","No","Unknown",54139,1]
[2,"WOO","Yes","No","Animal",16160,2]
[8,"CLE","Yes","Yes","Animal",2303163,216]
[6,"MRW","No","No","Rear End",12169463,440]
[12,"CUY","Yes","Yes","Sideswipe - Meeting",143130,8]
[7,"CHP","No","Yes","Angle",8080,1]
[1,"DEF","Yes","No","Other Non-Collision",230744,18]
[11,"COL","Yes","Yes","Head On",163683,4]
[7,"MOT","Yes","No","Left Turn",488966,28]
[1,"DEF","No","No","Parked Vehicle",269878,22]
[6,"UNI","Yes","Yes","Overturning",422725,1]
[9,"SCI","No","No","Pedalcycles",476864,2]
[7,"AUG","No","Yes","Left Turn",55405,2]
[7,"SHE","Yes","No","Other Object",184685,18]
[4,"SUM","Yes","No","Sideswipe - Passing",7331567,492]
[4,"MAH","Yes","No","Falling From Or In Vehicle",422725,1]
[6,"PIC","No","Yes","Animal",197158,13]
[6,"FAY","No","No","Pedestrian",1430592,6]
[3,"RIC","Yes","Yes","Fixed Object",174184,11]
[9,"ROS","Yes","No","Sideswipe - Meeting",8080,1]
[8,"WAR","Yes","No","Unknown",8080,1]
[7,"CHP","Yes","No","Fixed Object",6508137,173]
[9,"HIG","No","No","Parked Vehicle",1385317,42]
[4,"STA","Yes","No","Other Object",24240,3]
[8,"PRE","Yes","No","Angle",5631367,187]
[5,"FAI","Yes","No","Sideswipe - Meeting",1268175,3]
[2,"WIL","Yes","No","Rear End",3505237,214]
[4,"STA","No","No","Left Turn",7683481,207]
[7,"MOT","No","No","Left Turn",1479258,53]
[10,"NOB","No","Yes","Unknown",24240,3]
[3,"LOR","Yes","No","Backing",402845,45]
[2,"SAN","Yes","No","Animal",446965,4]
[5,"FAI","Yes","No","Parked Vehicle",743839,53]
[11,"BEL","Yes","No","Pedestrian",1420537,13]
[6,"UNI","Yes","No","Head On",1765332,28]
[6,"UNI","Yes","No","Train",8080,1]
[9,"ROS","Yes","Yes","Backing",438885,3]
[8,"PRE","Yes","No","Right Turn",485839,35]
[11,"JEF","No","No","Overturning",4177800,66]
[8,"BUT","Yes","No","Left Turn",942596,55]
[2,"OTT","Yes","No","Sideswipe - Passing",2525669,105]
[9,"ROS","No","Yes","Backing",8080,1]
[4,"STA","Yes","Yes","Backing",55405,2]
[4,"POR","Yes","No","Other Non-Collision",1181569,51]
[4,"TRU","Yes","No","Right Turn",86459,5]
[8,"GRE","Yes","No","Backing",5124344,532]
[8,"HAM","Yes","No","Sideswipe - Passing",289249265,20536]
[2,"SEN","Yes","No","Rear End",16160,2]
[3,"WAY","Yes","No","Animal",1900656,193]
[8,"HAM","Yes","Yes","Angle",7641961,231]
[2,"SEN","Yes","No","Overturning",1033373,9]
[4,"MAH","Yes","No","Rear End",151099,13]
[3,"WAY","Yes","No","Head On",8080,1]
[7,"MIA","Yes","Yes","Other Object",676299,78]
[11,"TUS","Yes","Yes","Sideswipe - Passing",4613605,208]
[5,"FAI","Yes","Yes","Left Turn",16160,2]
[3,"RIC","Yes","Yes","Backing",80800,10]
[5,"LIC","Yes","No","Angle",21479803,473]
[2,"WOO","Yes","No","Fixed Object",8038522,290]
[8,"CLI","No","Yes","Overturning",756905,9]
[5,"KNO","No","No","Angle",16077768,273]
[2,"OTT","Yes","Yes","Right Turn",47325,1]
[4,"STA","Yes","Yes","Other Non-Collision",117624,4]
[10,"VIN","Yes","No","Sideswipe - Passing",32320,4]
[2,"WIL","No","No","Sideswipe - Meeting",853530,3]
[11,"JEF","Yes","Yes","Rear End",40400,5]
[3,"ASD","No","No","Overturning",13118285,94]
[10,"HOC","No","No","Parked Vehicle",500622,40]
[6,"MRW","No","No","Fixed Object",41058795,972]
[12,"CUY","No","No","Animal",307040,38]
[9,"PIK","Yes","No","Pedalcycles",539083,4]
[12,"GEA","No","Yes","Backing",8080,1]
[5,"GUE","No","No","Other Non-Collision",1938959,29]
[8,"PRE","No","Yes","Rear End",6784857,108]
[3,"RIC","No","No","Overturning",6381232,87]
[7,"CLA","Yes","No","Left Turn",109544,3]
[7,"CLA","Yes","No","Parked Vehicle",27170561,1511]
[4,"SUM","Yes","No","Backing",32320,4]
[1,"ALL","Yes","No","Parked Vehicle",11343199,684]
[8,"GRE","Yes","No","Unknown",462643,41]
[5,"PER","No","No","Right Turn",826833,43]
[2,"FUL","No","Yes","Head On",494290,5]
[8,"CLI","No","No","Right Turn",2166573,50]
[3,"HUR","No","No","Animal",11897037,1098]
[5,"FAI","No","Yes","Overturning",1381292,13]
[9,"SCI","No","No","Other Non-Collision",581904,15]
[4,"TRU","No","Yes","Parked Vehicle",124438,4]
[11,"BEL","Yes","No","Fixed Object",10691455,434]
[12,"GEA","Yes","No","Rear End",16872771,764]
[3,"MED","No","No","Animal",12316945,897]
[11,"HOL","Yes","No","Rear End",62219,2]
[10,"HOC","Yes","No","Fixed Object",62219,2]
[7,"DAR","Yes","No","Fixed Object",70299,3]
[2,"SAN","No","No","Fixed Object",37888350,807]
[7,"AUG","Yes","No","Left Turn",1008762,37]
[10,"MOE","No","No","Angle",3332315,87]
[3,"MED","No","No","Unknown",237558,18]
[7,"LOG","Yes","No","Parked Vehicle",1047863,94]
[7,"CHP","Yes","No","Overturning",603834,8]
[3,"WAY","Yes","No","Other Object",40400,5]
[8,"PRE","No","Yes","Fixed Object",2642135,100]
[4,"SUM","Yes","No","Animal",10498815,914]
[7,"LOG","No","Yes","Parked Vehicle",16160,2]
[6,"FRA","Yes","No","Head On",159903431,2264]
[6,"FRA","Yes","No","Train",103885,8]
[6,"FRA","No","Yes","Sideswipe - Passing",3287749,114]
[7,"AUG","No","Yes","Parked Vehicle",32320,4]
[12,"GEA","Yes","No","Right Turn",422243,36]
[1,"HAN","Yes","No","Pedalcycles",3637186,54]
[12,"LAK","Yes","Yes","Overturning",2216801,22]
[4,"MAH","Yes","No","Fixed Object",587674,6]
[11,"JEF","Yes","Yes","Fixed Object",258222,10]
[7,"AUG","Yes","No","Rear End",3691819,175]
[7,"AUG","Yes","Yes","Sideswipe - Passing",159290,10]
[4,"SUM","No","No","Overturning",1571190,12]
[5,"COS","Yes","No","Other Object",16160,2]
[8,"WAR","Yes","No","Overturning",3363180,45]
[7,"MIA","Yes","No","Other Object",32320,4]
[8,"CLI","No","No","Overturning",3330638,49]
[4,"TRU","Yes","Yes","Head On",213318,15]
[5,"COS","No","No","Angle",2919642,75]
[6,"DEL","Yes","Yes","Other Object",495074,41]
[8,"CLE","Yes","No","Left Turn",250142,9]
[2,"OTT","No","No","Other Object",297805,32]
[7,"CLA","Yes","No","Backing",4862236,402]
[6,"MAR","Yes","No","Sideswipe - Passing",229589,13]
[7,"MOT","Yes","Yes","Angle",4738963,153]
[11,"BEL","Yes","No","Fixed Object",190344,13]
[9,"JAC","No","No","Animal",7659250,673]
[6,"PIC","No","Yes","Rear End",2068458,33]
[8,"WAR","Yes","No","Sideswipe - Passing",5837927,346]
[7,"LOG","Yes","Yes","Animal",280379,29]
[6,"PIC","No","Yes","Left Turn",54139,1]
[9,"ADA","Yes","No","Rear End",16160,2]
[9,"ROS","Yes","No","Left Turn",109544,3]
[6,"UNI","Yes","No","Unknown",40400,5]
[9,"PIK","Yes","No","Backing",24240,3]
[2,"WOO","Yes","No","Left Turn",1033373,9]
[6,"MAR","No","No","Backing",679648,63]
[6,"FRA","Yes","Yes","Other Object",174184,11]
[7,"CLA","Yes","No","Unknown",1057580,65]
[3,"ERI","Yes","Yes","Overturning",2660788,10]
[3,"ERI","No","Yes","Overturning",1633409,14]
[7,"MOT","Yes","Yes","Angle",1017548,25]
[6,"UNI","Yes","No","Backing",572525,66]
[9,"HIG","Yes","No","Unknown",95805,7]
[5,"MUS","No","No","Parked Vehicle",945277,34]
[9,"PIK","Yes","No","Pedestrian",108278,2]
[2,"SAN","Yes","Yes","Sideswipe - Passing",712896,46]
[5,"FAI","Yes","No","Unknown",511605,12]
[6,"FRA","No","No","Angle",4654069,77]
[7,"SHE","No","No","Rear End",7934111,189]
[1,"DEF","Yes","Yes","Animal",923425,90]
[11,"TUS","No","Yes","Animal",3039293,237]
[3,"CRA","No","Yes","Unknown",16160,2]
[6,"DEL","Yes","No","Overturning",8080,1]
[2,"OTT","Yes","Yes","Head On",430805,2]
[7,"AUG","Yes","No","Pedestrian",47325,1]
[12,"LAK","No","Yes","Head On",501104,5]
[3,"ASD","Yes","No","Head On",1471438,25]
[4,"SUM","Yes","No","Fixed Object",187923,7]
[11,"COL","No","Yes","Overturning",8080,1]
[8,"PRE","Yes","No","Sideswipe - Meeting",8080,1]
[2,"FUL","Yes","No","Fixed Object",673205,32]
[7,"LOG","Yes","Yes","Backing",16160,2]
[3,"ERI","Yes","No","Left Turn",7864999,221]
[8,"PRE","Yes","No","Overturning",117624,4]
[3,"RIC","Yes","No","Left Turn",20907180,622]
[7,"MOT","No","No","Animal",3338284,191]
[6,"UNI","Yes","Yes","Right Turn",8080,1]
[3,"WAY","Yes","Yes","Fixed Object",47325,1]
[1,"WYA","No","Yes","Parked Vehicle",8080,1]
[11,"COL","No","No","Left Turn",6934210,185]
[2,"WOO","Yes","Yes","Other Object",489304,50]
[7,"DAR","No","No","Pedestrian",1007867,5]
[12,"LAK","Yes","No","Animal",5581654,445]
[4,"ATB","Yes","Yes","Unknown",8080,1]
[7,"AUG","Yes","Yes","Animal",1129962,52]
[1,"HAN","Yes","No","Backing",56560,7]
[8,"CLI","Yes","No","Parked Vehicle",16160,2]
[5,"PER","Yes","No","Parked Vehicle",32320,4]
[2,"WOO","No","No","Right Turn",1566650,71]
[9,"JAC","Yes","Yes","Animal",226240,28]
[8,"GRE","Yes","Yes","Pedalcycles",422725,1]
[4,"MAH","Yes","No","Animal",32320,4]
[1,"HAN","Yes","No","Unknown",8080,1]
[3,"ERI","Yes","No","Sideswipe - Passing",40400,5]
[4,"STA","Yes","No","Falling From Or In Vehicle",422725,1]
[3,"MED","Yes","Yes","Rear End",717289,40]
[1,"HAR","Yes","No","Rear End",3488669,179]
[2,"LUC","Yes","Yes","Other Non-Collision",2387827,123]
[9,"ROS","Yes","No","Parked Vehicle",88880,11]
[9,"LAW","No","No","Angle",3519080,85]
[3,"RIC","Yes","No","Fixed Object",49332688,1560]
[4,"POR","No","Yes","Animal",2093789,177]
[2,"WOO","Yes","No","Backing",1626274,181]
[10,"HOC","No","Yes","Left Turn",54139,1]
[7,"DAR","Yes","Yes","Rear End",251297,14]
[7,"MER","No","No","Sideswipe - Meeting",422725,1]
[6,"DEL","Yes","No","Pedalcycles",8028783,96]
[10,"GAL","Yes","No","Backing",8080,1]
[1,"WYA","Yes","No","Other Non-Collision",252674,11]
[6,"FRA","Yes","No","Angle",728829,22]
[3,"MED","Yes","Yes","Fixed Object",2366936,105]
[1,"PUT","Yes","No","Head On",8080,1]
[7,"CLA","Yes","Yes","Animal",1179675,112]
[7,"CHP","No","No","Parked Vehicle",1042237,46]
[2,"SEN","Yes","No","Pedalcycles",54139,1]
[4,"STA","Yes","No","Rear End",6634697,312]
[12,"CUY","Yes","Yes","Unknown",740150,16]
[5,"KNO","No","No","Overturning",6146988,77]
[2,"FUL","No","Yes","Angle",124438,4]
[11,"COL","No","Yes","Left Turn",62219,2]
[11,"JEF","No","No","Other Non-Collision",1223606,26]
[9,"PIK","Yes","No","Angle",16160,2]
[8,"PRE","No","Yes","Other Non-Collision",311544,28]
[4,"ATB","Yes","Yes","Left Turn",8080,1]
[2,"LUC","No","No","Right Turn",1114173,19]
[9,"HIG","No","No","Other Object",145440,18]
[3,"LOR","No","No","Animal",10446833,829]
[1,"PUT","Yes","No","Fixed Object",1034528,14]
[6,"FRA","Yes","No","Backing",118890,5]
[9,"ROS","No","Yes","Sideswipe - Passing",2208577,78]
[4,"SUM","Yes","Yes","Sideswipe - Passing",3946664,287]
[4,"SUM","Yes","No","Pedestrian",4435017,22]
[2,"LUC","Yes","Yes","Other Object",2312769,191]
[6,"UNI","Yes","No","Angle",1712420,73]
[5,"LIC","Yes","No","Right Turn",88880,11]
[2,"SEN","No","No","Angle",20088492,222]
[9,"LAW","No","No","Right Turn",806651,16]
[4,"TRU","Yes","Yes","Other Object",872413,82]
[8,"GRE","Yes","Yes","Sideswipe - Passing",197158,13]
[2,"WOO","Yes","No","Other Non-Collision",621149,15]
[8,"WAR","Yes","Yes","Backing",62219,2]
[3,"WAY","No","No","Sideswipe - Meeting",509184,6]
[7,"AUG","Yes","No","Left Turn",598175,13]
[9,"SCI","Yes","No","Rear End",28505928,1252]
[3,"RIC","No","Yes","Unknown",80800,10]
[6,"MRW","Yes","No","Fixed Object",102619,7]
[1,"ALL","No","No","Pedestrian",2706847,10]
[12,"LAK","No","No","Rear End",3323152,122]
[4,"STA","Yes","Yes","Left Turn",1497279,47]
[3,"WAY","Yes","No","Other Non-Collision",117624,4]
[2,"SAN","No","No","Other Non-Collision",1174755,51]
[3,"RIC","Yes","Yes","Other Non-Collision",47325,1]
[8,"BUT","No","No","Rear End",15907868,543]
[7,"DAR","No","No","Unknown",72720,9]
[2,"SAN","Yes","No","Other Non-Collision",565744,13]
[3,"MED","No","No","Head On",8718306,119]
[3,"MED","No","No","Train",16160,2]
[3,"LOR","Yes","No","Rear End",47596887,2299]
[3,"CRA","Yes","No","Parked Vehicle",745105,54]
[4,"MAH","No","Yes","Unknown",72720,9]
[7,"MER","Yes","No","Angle",11219279,278]
[6,"DEL","Yes","No","Left Turn",238935,15]
[10,"MOE","Yes","No","Right Turn",493024,4]
[3,"WAY","Yes","No","Pedestrian",7842766,44]
[3,"CRA","Yes","Yes","Angle",8080,1]
[7,"MER","Yes","No","Pedalcycles",1649680,12]
[6,"MAD","Yes","No","Right Turn",16160,2]
[7,"CLA","Yes","No","Other Object",8080,1]
[7,"CLA","No","No","Unknown",88880,11]
[12,"CUY","Yes","Yes","Unknown",5812449,255]
[10,"ATH","Yes","No","Rear End",949335,10]
[7,"AUG","Yes","No","Fixed Object",71565,4]
[8,"CLI","Yes","No","Angle",8441243,267]
[5,"LIC","Yes","No","Animal",24240,3]
[10,"GAL","Yes","Yes","Right Turn",54139,1]
[3,"ERI","No","Yes","Fixed Object",14309724,488]
[7,"AUG","Yes","Yes","Sideswipe - Passing",1723630,71]
[10,"WAS","No","Yes","Rear End",1380808,18]
[7,"MOT","No","No","Other Non-Collision",910536,24]
[8,"HAM","Yes","Yes","Fixed Object",137071245,4314]
[4,"ATB","Yes","No","Fixed Object",22068419,447]
[4,"POR","Yes","Yes","Parked Vehicle",47325,1]
[3,"WAY","Yes","No","Left Turn",3178833,49]
[2,"WOO","No","No","Animal",12678088,1303]
[2,"FUL","Yes","No","Train",8080,1]
[2,"FUL","Yes","No","Head On",124438,4]
[10,"HOC","Yes","No","Overturning",610648,8]
[9,"HIG","Yes","No","Backing",1093105,111]
[8,"WAR","Yes","Yes","Other Non-Collision",208925,21]
[10,"WAS","Yes","Yes","Parked Vehicle",8080,1]
[6,"UNI","Yes","No","Angle",8282700,286]
[5,"FAI","Yes","Yes","Other Non-Collision",64640,8]
[4,"TRU","Yes","No","Pedalcycles",5495269,54]
[6,"PIC","Yes","No","Left Turn",829736,14]
[7,"AUG","Yes","No","Rear End",40400,5]
[3,"HUR","No","No","Left Turn",6283683,92]
[10,"ATH","No","Yes","Animal",376184,36]
[3,"HUR","Yes","No","Other Object",248170,21]
[3,"MED","Yes","Yes","Head On",8080,1]
[10,"MRG","Yes","No","Head On",54139,1]
[2,"SAN","No","No","Angle",21065418,250]
[6,"FAY","No","No","Sideswipe - Passing",2046268,67]
[8,"PRE","Yes","No","Left Turn",1873572,49]
[3,"RIC","Yes","No","Pedestrian",10388978,77]
[2,"WOO","Yes","Yes","Sideswipe - Passing",368921,18]
[6,"MRW","No","No","Other Non-Collision",1268959,39]
[8,"CLE","No","No","Sideswipe - Meeting",1011554,12]
[7,"CLA","Yes","No","Other Object",691077,49]
[8,"WAR","Yes","Yes","Other Non-Collision",56560,7]
[1,"ALL","Yes","No","Backing",118779,9]
[7,"MOT","Yes","No","Pedalcycles",70299,3]
[12,"GEA","No","Yes","Head On",54139,1]
[5,"COS","No","No","Unknown",78379,4]
[4,"MAH","Yes","Yes","Pedestrian",1376453,5]
[8,"CLE","Yes","No","Other Non-Collision",16160,2]
[5,"FAI","Yes","No","Sideswipe - Meeting",24240,3]
[4,"STA","No","Yes","Angle",360952,13]
[11,"COL","Yes","No","Pedalcycles",8080,1]
[7,"LOG","No","No","Pedalcycles",539083,4]
[7,"DAR","Yes","No","Other Object",72720,9]
[2,"LUC","Yes","Yes","Right Turn",166104,10]
[7,"MOT","Yes","Yes","Fixed Object",16160,2]
[9,"LAW","No","Yes","Pedestrian",422725,1]
[7,"CLA","No","Yes","Rear End",8723853,201]
[7,"CLA","Yes","No","Angle",95301947,2378]
[2,"FUL","Yes","Yes","Fixed Object",215850,17]
[3,"LOR","Yes","No","Head On",563323,7]
[7,"AUG","Yes","No","Parked Vehicle",467258,27]
[6,"MAD","Yes","No","Other Non-Collision",126859,10]
[11,"JEF","Yes","No","Animal",16160,2]
[9,"LAW","Yes","No","Overturning",1658915,18]
[6,"MRW","No","Yes","Backing",143019,12]
[12,"GEA","No","No","Sideswipe - Meeting",62219,2]
[3,"MED","Yes","No","Pedalcycles",1986167,26]
[2,"WOO","Yes","No","Angle",22264838,665]
[8,"WAR","Yes","Yes","Angle",16160,2]
[8,"CLI","Yes","No","Pedalcycles",687872,7]
[3,"RIC","Yes","No","Fixed Object",164838,9]
[6,"PIC","Yes","No","Animal",8080,1]
[11,"JEF","No","No","Other Object",649782,12]
[2,"HEN","Yes","No","Overturning",110810,4]
[10,"WAS","Yes","No","Animal",8080,1]
[1,"HAN","No","No","Overturning",4798573,78]
[8,"HAM","Yes","Yes","Parked Vehicle",9191184,186]
[7,"MIA","Yes","No","Left Turn",95805,7]
[3,"MED","Yes","Yes","Right Turn",124438,4]
[4,"SUM","Yes","No","Sideswipe - Meeting",1654522,24]
[1,"WYA","No","No","Rear End",4777241,80]
[8,"WAR","No","No","Right Turn",884770,47]
[2,"HEN","Yes","Yes","Fixed Object",16160,2]
[1,"ALL","No","Yes","Head On",8080,1]
[2,"LUC","No","Yes","Fixed Object",2070062,56]
[7,"CHP","Yes","No","Angle",8800819,257]
[1,"VAN","Yes","No","Overturning",8080,1]
[5,"KNO","No","No","Other Non-Vehicle",422725,1]
[5,"FAI","Yes","Yes","Rear End",401352,18]
[4,"ATB","Yes","No","Sideswipe - Passing",735164,61]
[7,"SHE","No","Yes","Parked Vehicle",16160,2]
[7,"LOG","Yes","No","Parked Vehicle",542770,11]
[4,"STA","Yes","No","Overturning",47325,1]
[8,"GRE","Yes","Yes","Other Non-Collision",661067,55]
[9,"HIG","Yes","No","Other Non-Collision",1264117,27]
[9,"BRO","No","No","Sideswipe - Passing",5419583,184]
[11,"TUS","Yes","No","Backing",3554857,384]
[7,"CLA","Yes","No","Other Non-Collision",2356806,67]
[4,"ATB","Yes","No","Sideswipe - Meeting",8080,1]
[12,"CUY","Yes","Yes","Parked Vehicle",370298,15]
[10,"MOE","No","No","Rear End",3995352,100]
[7,"DAR","Yes","No","Sideswipe - Passing",16160,2]
[7,"MIA","Yes","Yes","Left Turn",484944,3]
[6,"MRW","No","Yes","Unknown",302309,22]
[2,"SEN","Yes","No","Head On",2204103,31]
[2,"SEN","Yes","No","Train",430805,2]
[7,"DAR","No","No","Backing",1830872,102]
[5,"PER","No","No","Parked Vehicle",2006095,88]
[7,"CLA","Yes","No","Pedalcycles",470050,2]
[11,"TUS","Yes","No","Unknown",181109,7]
[7,"MIA","Yes","No","Rear End",9975134,498]
[3,"MED","Yes","Yes","Animal",1239024,90]
[2,"OTT","Yes","No","Head On",16160,2]
[7,"MIA","No","No","Pedestrian",1964127,11]
[8,"BUT","Yes","No","Other Object",438885,3]
[7,"AUG","No","Yes","Angle",273227,7]
[3,"RIC","Yes","Yes","Angle",422725,1]
[6,"UNI","Yes","No","Other Non-Collision",534690,10]
[11,"HOL","No","No","Parked Vehicle",1462990,59]
[2,"SAN","Yes","No","Sideswipe - Passing",121200,15]
[5,"FAI","Yes","Yes","Sideswipe - Passing",230744,18]
[2,"WOO","Yes","No","Sideswipe - Passing",229478,17]
[1,"ALL","Yes","Yes","Rear End",8080,1]
[4,"POR","No","Yes","Other Non-Collision",307040,38]
[7,"LOG","Yes","No","Angle",6772687,297]
[2,"SAN","Yes","No","Head On",531003,3]
[10,"WAS","Yes","No","Right Turn",287304,25]
[7,"CLA","Yes","Yes","Other Object",56560,7]
[1,"VAN","Yes","No","Pedalcycles",397665,11]
[8,"HAM","Yes","Yes","Other Non-Vehicle",422725,1]
[8,"BUT","Yes","No","Pedestrian",11160413,43]
[5,"FAI","Yes","No","Angle",31852379,1016]
[6,"FRA","No","No","Unknown",24240,3]
[6,"DEL","No","Yes","Unknown",56560,7]
[4,"MAH","Yes","Yes","Other Non-Collision",758249,59]
[9,"HIG","Yes","No","Angle",5547072,219]
[7,"SHE","Yes","No","Overturning",829736,14]
[6,"MAD","Yes","No","Rear End",62219,2]
[3,"MED","Yes","No","Rear End",2170260,57]
[1,"ALL","No","No","Overturning",8842891,70]
[3,"ERI","No","Yes","Left Turn",47325,1]
[1,"HAN","Yes","No","Left Turn",12012082,471]
[12,"CUY","Yes","Yes","Fixed Object",32320,4]
[2,"OTT","Yes","No","Rear End",11036387,328]
[8,"BUT","Yes","No","Pedalcycles",585142,4]
[10,"MRG","No","No","Animal",2500612,119]
[1,"VAN","No","No","Left Turn",3103695,38]
[5,"MUS","No","No","Pedestrian",1430592,6]
[6,"MAR","Yes","No","Unknown",292963,20]
[11,"TUS","No","No","Other Non-Collision",641558,68]
[11,"HOL","Yes","No","Sideswipe - Passing",62219,2]
[12,"LAK","Yes","No","Other Non-Collision",56560,7]
[12,"CUY","Yes","Yes","Fixed Object",18507738,390]
[8,"WAR","Yes","No","Animal",303464,27]
[5,"GUE","No","No","Falling From Or In Vehicle",422725,1]
[3,"ASD","No","Yes","Parked Vehicle",164838,9]
[3,"LOR","Yes","Yes","Sideswipe - Passing",9536516,475]
[5,"FAI","No","No","Sideswipe - Passing",5999845,195]
[8,"PRE","No","Yes","Angle",455045,5]
[9,"JAC","Yes","No","Angle",7418669,219]
[3,"MED","Yes","No","Right Turn",95805,7]
[8,"WAR","Yes","No","Other Object",80800,10]
[7,"CLA","No","No","Backing",1430110,41]
[3,"HUR","Yes","No","Right Turn",16160,2]
[2,"HEN","No","No","Head On",2913462,21]
[2,"HEN","No","No","Train",422725,1]
[10,"ATH","No","No","Head On",6290159,70]
[6,"FRA","Yes","No","Pedalcycles",86036020,1090]
[12,"LAK","Yes","No","Other Object",32320,4]
[11,"HAS","No","No","Overturning",7399379,81]
[4,"ATB","Yes","Yes","Angle",422725,1]
[1,"ALL","Yes","No","Fixed Object",1687288,42]
[5,"GUE","No","Yes","Head On",1017213,7]
[4,"POR","Yes","No","Head On",8058095,141]
[4,"POR","Yes","No","Train",54139,1]
[7,"SHE","Yes","No","Right Turn",8080,1]
[9,"HIG","Yes","No","Left Turn",110699,8]
[6,"FAY","No","Yes","Right Turn",16160,2]
[5,"GUE","Yes","Yes","Rear End",47325,1]
[1,"PAU","No","No","Unknown",40400,5]
[8,"CLE","Yes","No","Pedestrian",101464,2]
[2,"WOO","Yes","No","Other Object",64640,8]
[3,"CRA","Yes","Yes","Unknown",16160,2]
[7,"CLA","Yes","Yes","Other Object",416584,41]
[3,"LOR","Yes","No","Sideswipe - Meeting",2342059,13]
[3,"HUR","Yes","No","Pedalcycles",2285125,33]
[5,"MUS","Yes","No","Left Turn",18462211,573]
[5,"GUE","Yes","Yes","Head On",8080,1]
[9,"SCI","Yes","No","Parked Vehicle",12743734,564]
[9,"HIG","Yes","No","Rear End",845747,39]
[4,"TRU","No","No","Head On",9293207,89]
[4,"TRU","No","No","Train",8080,1]
[5,"FAI","Yes","No","Left Turn",707608,20]
[1,"ALL","Yes","No","Animal",6910841,736]
[8,"GRE","Yes","No","Head On",13008736,196]
[7,"LOG","No","No","Other Object",584325,21]
[8,"WAR","Yes","No","Pedalcycles",209742,4]
[3,"RIC","No","Yes","Backing",71565,4]
[7,"MER","No","No","Overturning",4517418,51]
[7,"AUG","Yes","Yes","Fixed Object",152365,14]
[4,"POR","Yes","Yes","Rear End",2033792,68]
[7,"CLA","Yes","Yes","Pedestrian",899589,3]
[7,"CLA","Yes","No","Sideswipe - Passing",2022477,82]
[8,"GRE","Yes","Yes","Animal",2200544,209]
[7,"CLA","Yes","Yes","Other Non-Collision",48480,6]
[3,"LOR","No","Yes","Animal",872413,82]
[3,"WAY","Yes","No","Backing",32320,4]
[3,"WAY","Yes","Yes","Left Turn",8080,1]
[12,"GEA","No","No","Overturning",8382298,66]
[8,"WAR","Yes","No","Sideswipe - Passing",16538708,964]
[5,"KNO","No","No","Rear End",12442689,334]
[3,"MED","No","No","Sideswipe - Meeting",1747460,11]
[10,"HOC","Yes","No","Head On",899589,3]
[10,"MEG","Yes","No","Fixed Object",8080,1]
[3,"ERI","Yes","Yes","Other Object",463125,6]
[11,"BEL","Yes","No","Sideswipe - Meeting",47325,1]
[8,"HAM","Yes","No","Rear End",9216708,549]
[10,"MRG","No","No","Pedalcycles",476864,2]
[11,"BEL","Yes","No","Sideswipe - Passing",2894408,199]
[12,"GEA","Yes","Yes","Angle",8080,1]
[1,"PUT","No","No","Overturning",7681355,69]
[3,"CRA","No","Yes","Angle",892775,3]
[8,"CLE","Yes","No","Parked Vehicle",3851232,279]
[11,"JEF","No","Yes","Rear End",492093,21]
[3,"WAY","Yes","No","Fixed Object",4243784,124]
[12,"CUY","No","No","Sideswipe - Meeting",63485,3]
[10,"WAS","Yes","Yes","Fixed Object",842658,27]
[7,"MIA","No","Yes","Head On",54139,1]
[10,"GAL","No","No","Overturning",4247874,73]
[7,"SHE","No","Yes","Head On",1017213,7]
[6,"MAD","Yes","No","Left Turn",8080,1]
[5,"LIC","Yes","No","Backing",3893433,390]
[4,"MAH","No","No","Sideswipe - Passing",6053876,204]
[3,"WAY","Yes","Yes","Head On",16160,2]
[8,"HAM","No","No","Parked Vehicle",1595508,64]
[9,"PIK","Yes","No","Fixed Object",7947144,198]
[11,"TUS","No","Yes","Other Non-Collision",290880,36]
[9,"ROS","Yes","No","Other Object",16160,2]
[6,"MAD","No","No","Left Turn",9322699,167]
[8,"HAM","No","No","Fixed Object",20760359,547]
[11,"JEF","Yes","Yes","Angle",8080,1]
[3,"ERI","Yes","No","Pedestrian",8784951,62]
[7,"MOT","No","No","Other Object",32320,4]
[3,"HUR","Yes","No","Animal",2889319,286]
[11,"JEF","Yes","No","Backing",24240,3]
[7,"DAR","Yes","No","Other Object",8080,1]
[1,"HAN","No","No","Rear End",6591503,245]
[8,"PRE","Yes","No","Right Turn",8080,1]
[8,"HAM","Yes","No","Rear End",632985644,33240]
[5,"MUS","No","Yes","Pedestrian",524189,3]
[1,"ALL","Yes","No","Parked Vehicle",200845,20]
[5,"FAI","Yes","Yes","Other Object",40400,5]
[1,"PAU","Yes","No","Other Non-Collision",8080,1]
[11,"BEL","No","Yes","Right Turn",133784,6]
[6,"PIC","Yes","No","Backing",72720,9]
[7,"MIA","Yes","Yes","Overturning",8080,1]
[8,"WAR","Yes","Yes","Animal",8080,1]
[4,"MAH","No","Yes","Right Turn",48480,6]
[11,"TUS","No","No","Angle",17301108,318]
[5,"LIC","Yes","Yes","Fixed Object",957415,11]
[6,"UNI","Yes","No","Pedalcycles",476864,2]
[2,"WOO","No","Yes","Fixed Object",20038101,684]
[3,"WAY","Yes","No","Other Non-Collision",229478,17]
[1,"HAN","Yes","No","Angle",557775,8]
[10,"NOB","Yes","No","Animal",16160,2]
[6,"MAR","Yes","No","Right Turn",3243850,173]
[3,"WAY","No","No","Overturning",9785968,116]
[9,"ROS","Yes","No","Rear End",28897408,1339]
[5,"LIC","Yes","Yes","Overturning",1180896,11]
[10,"GAL","Yes","Yes","Unknown",8080,1]
[11,"CAR","No","No","Pedestrian",1095703,7]
[11,"TUS","No","No","Other Object",493808,40]
[5,"FAI","No","Yes","Unknown",24240,3]
[2,"SAN","Yes","Yes","Other Object",185840,23]
[8,"BUT","No","No","Left Turn",4693835,136]
[7,"MOT","Yes","Yes","Animal",8080,1]
[5,"COS","Yes","No","Angle",62219,2]
[11,"HAS","No","No","Fixed Object",31861879,637]
[7,"AUG","Yes","Yes","Overturning",55405,2]
[4,"TRU","Yes","No","Other Object",463798,46]
[3,"WAY","No","No","Left Turn",12400253,281]
[9,"JAC","No","No","Other Non-Collision",782749,35]
[5,"MUS","Yes","No","Parked Vehicle",8406979,506]
[11,"COL","Yes","No","Backing",70299,3]
[6,"FRA","Yes","Yes","Animal",48480,6]
[5,"MUS","No","Yes","Sideswipe - Meeting",8080,1]
[8,"WAR","No","Yes","Left Turn",16160,2]
[11,"JEF","Yes","No","Right Turn",8080,1]
[10,"NOB","No","Yes","Head On",430805,2]
[8,"WAR","Yes","Yes","Right Turn",63485,3]
[11,"HAS","Yes","Yes","Rear End",24240,3]
[1,"PUT","Yes","No","Right Turn",8080,1]
[7,"DAR","No","Yes","Overturning",47325,1]
[8,"BUT","Yes","No","Other Non-Collision",118779,9]
[2,"SEN","Yes","No","Angle",8080,1]
[2,"OTT","No","Yes","Overturning",225902,6]
[6,"UNI","No","No","Sideswipe - Passing",4140905,144]
[5,"MUS","Yes","No","Rear End",44277577,2316]
[8,"CLE","Yes","No","Unknown",494963,45]
[2,"LUC","Yes","No","Sideswipe - Passing",1366221,122]
[7,"CLA","Yes","Yes","Other Non-Collision",999643,61]
[4,"ATB","Yes","Yes","Fixed Object",430805,2]
[10,"ATH","Yes","No","Head On",1572082,40]
[2,"FUL","Yes","No","Sideswipe - Passing",620778,46]
[8,"BUT","No","No","Overturning",4346769,66]
[11,"TUS","Yes","Yes","Rear End",8118860,267]
[1,"WYA","Yes","No","Animal",8080,1]
[1,"ALL","No","No","Sideswipe - Meeting",8080,1]
[3,"HUR","Yes","No","Sideswipe - Meeting",63485,3]
[8,"CLE","Yes","Yes","Pedestrian",108278,2]
[7,"MOT","Yes","No","Head On",1106315,10]
[6,"FRA","No","Yes","Backing",8080,1]
[3,"LOR","No","No","Other Non-Collision",1734394,55]
[3,"CRA","No","No","Other Object",40400,5]
[1,"PAU","No","No","Rear End",3860562,66]
[8,"BUT","Yes","No","Right Turn",552451,31]
[10,"ATH","Yes","Yes","Overturning",8080,1]
[7,"LOG","No","No","Animal",8035005,427]
[6,"PIC","Yes","No","Parked Vehicle",88880,11]
[2,"SAN","No","No","Other Object",774669,34]
[9,"SCI","No","No","Head On",11946140,94]
[10,"GAL","No","No","Left Turn",4697114,110]
[7,"AUG","Yes","No","Fixed Object",1791882,41]
[9,"JAC","No","No","Other Object",137360,17]
[8,"PRE","No","Yes","Other Object",226240,28]
[4,"POR","No","Yes","Angle",94539,6]
[6,"FRA","Yes","Yes","Pedalcycles",155603,3]
[7,"MIA","No","No","Sideswipe - Meeting",853530,3]
[4,"TRU","Yes","No","Animal",9425676,846]
[4,"ATB","Yes","Yes","Sideswipe - Passing",495445,10]
[5,"COS","No","No","Backing",639730,23]
[6,"FRA","Yes","No","Right Turn",93157315,4884]
[8,"WAR","No","Yes","Rear End",2928952,126]
[6,"FRA","Yes","No","Animal",167259,15]
[12,"LAK","Yes","No","Other Object",1367074,56]
[7,"MOT","Yes","Yes","Unknown",952091,34]
[11,"BEL","Yes","No","Overturning",54139,1]
[12,"CUY","No","No","Pedestrian",1799178,6]
[10,"WAS","Yes","No","Backing",24240,3]
[3,"WAY","Yes","No","Overturning",358420,11]
[7,"MOT","Yes","Yes","Rear End",24240,3]
[8,"CLI","Yes","No","Right Turn",610277,39]
[1,"VAN","Yes","No","Animal",716810,79]
[5,"KNO","Yes","Yes","Rear End",8080,1]
[4,"SUM","Yes","Yes","Sideswipe - Passing",66565028,3400]
[7,"LOG","Yes","No","Pedalcycles",538374,13]
[11,"COL","Yes","No","Parked Vehicle",525344,8]
[4,"SUM","Yes","No","Fixed Object",8544758,280]
[3,"ASD","Yes","Yes","Other Object",174184,11]
[6,"PIC","Yes","No","Fixed Object",4438446,86]
[10,"MOE","Yes","No","Backing",8080,1]
[5,"MUS","Yes","No","Right Turn",71565,4]
[6,"MRW","No","No","Sideswipe - Passing",4731484,151]
[4,"MAH","Yes","No","Left Turn",228323,12]
[11,"TUS","Yes","Yes","Parked Vehicle",132518,5]
[8,"CLE","No","No","Pedestrian",3619130,26]
[5,"LIC","Yes","No","Fixed Object",15088821,411]
[11,"COL","No","No","Pedestrian",3016787,15]
[7,"LOG","No","Yes","Other Object",113120,14]
[8,"WAR","No","Yes","Right Turn",32320,4]
[6,"PIC","Yes","No","Right Turn",8080,1]
[8,"CLE","No","No","Falling From Or In Vehicle",422725,1]
[7,"MOT","Yes","Yes","Right Turn",1512733,62]
[8,"HAM","Yes","Yes","Rear End",8741660,437]
[1,"DEF","No","Yes","Other Non-Collision",48480,6]
[10,"NOB","Yes","No","Right Turn",32320,4]
[7,"AUG","Yes","No","Left Turn",62219,2]
[3,"WAY","Yes","No","Sideswipe - Meeting",16160,2]
[6,"DEL","No","No","Sideswipe - Passing",7581911,300]
[3,"LOR","Yes","No","Right Turn",5552028,231]
[8,"WAR","Yes","Yes","Other Object",611659,70]
[8,"WAR","Yes","No","Angle",7207806,270]
[5,"KNO","Yes","No","Backing",96960,12]
[4,"POR","No","Yes","Other Object",578184,61]
[6,"MAD","Yes","No","Other Object",237669,14]
[11,"COL","Yes","No","Animal",1309104,105]
[3,"ERI","No","No","Other Non-Collision",1503725,82]
[6,"FRA","Yes","No","Head On",5340786,79]
[10,"ATH","Yes","No","Parked Vehicle",2025831,101]
[7,"MOT","Yes","Yes","Parked Vehicle",47325,1]
[10,"VIN","Yes","No","Left Turn",8080,1]
[4,"POR","Yes","No","Angle",11615683,379]
[4,"ATB","Yes","No","Left Turn",7271964,174]
[3,"ERI","Yes","No","Other Non-Collision",1877410,63]
[6,"DEL","Yes","Yes","Animal",657829,66]
[11,"COL","Yes","No","Pedestrian",1477917,7]
[6,"UNI","No","Yes","Unknown",40400,5]
[11,"COL","No","No","Other Non-Collision",1785741,81]
[6,"MAD","Yes","No","Parked Vehicle",8080,1]
[4,"MAH","Yes","No","Other Object",16160,2]
[6,"UNI","Yes","Yes","Other Non-Collision",282462,13]
[9,"ROS","Yes","No","Parked Vehicle",5309536,424]
[9,"LAW","Yes","No","Sideswipe - Passing",32320,4]
[4,"POR","Yes","No","Head On",1401959,9]
[3,"ERI","Yes","No","Other Object",24240,3]
[5,"FAI","Yes","No","Angle",21160140,546]
[5,"LIC","Yes","No","Backing",593189,58]
[6,"FRA","No","Yes","Rear End",4844229,136]
[5,"FAI","Yes","No","Overturning",8080,1]
[10,"HOC","Yes","No","Pedestrian",54139,1]
[11,"BEL","Yes","Yes","Fixed Object",55405,2]
[4,"SUM","Yes","Yes","Other Non-Collision",40400,5]
[5,"FAI","Yes","Yes","Fixed Object",158024,9]
[1,"DEF","No","No","Fixed Object",36326712,656]
[12,"CUY","Yes","No","Other Non-Vehicle",430805,2]
[11,"JEF","Yes","Yes","Unknown",137360,17]
[7,"SHE","No","Yes","Rear End",5396191,81]
[6,"PIC","No","Yes","Unknown",8080,1]
[10,"MRG","No","No","Head On",4744140,44]
[1,"DEF","Yes","No","Left Turn",102730,3]
[7,"SHE","Yes","Yes","Animal",851411,68]
[3,"WAY","Yes","No","Rear End",857663,24]
[4,"STA","No","Yes","Animal",879227,82]
[1,"HAR","No","No","Fixed Object",25834219,459]
[8,"WAR","Yes","Yes","Overturning",70299,3]
[8,"WAR","No","No","Overturning",4288607,66]
[9,"SCI","Yes","No","Fixed Object",220243,11]
[5,"FAI","Yes","No","Parked Vehicle",1381115,123]
[1,"DEF","Yes","No","Other Non-Collision",16160,2]
[9,"JAC","Yes","No","Backing",56560,7]
[7,"MOT","Yes","No","Overturning",586408,5]
[4,"MAH","No","No","Right Turn",1160905,59]
[11,"COL","Yes","No","Sideswipe - Passing",24240,3]
[5,"GUE","Yes","No","Pedestrian",54139,1]
[12,"LAK","Yes","Yes","Sideswipe - Meeting",422725,1]
[8,"WAR","No","Yes","Angle",55405,2]
[3,"MED","Yes","No","Rear End",14714111,697]
[4,"MAH","Yes","Yes","Head On",3734672,20]
[1,"VAN","Yes","No","Animal",638575,18]
[8,"WAR","Yes","No","Right Turn",5632199,329]
[7,"MOT","Yes","No","Other Non-Collision",17044939,349]
[1,"VAN","Yes","No","Sideswipe - Passing",2778343,116]
[7,"CLA","Yes","Yes","Rear End",79645,5]
[10,"VIN","Yes","No","Parked Vehicle",54139,1]
[5,"FAI","Yes","No","Right Turn",2451647,144]
[3,"CRA","No","Yes","Other Object",487365,9]
[7,"DAR","Yes","No","Left Turn",2795802,66]
[10,"GAL","No","Yes","Angle",170497,4]
[6,"UNI","Yes","No","Rear End",11086699,553]
[3,"MED","Yes","No","Other Non-Collision",24240,3]
[8,"PRE","No","No","Falling From Or In Vehicle",422725,1]
[10,"HOC","Yes","Yes","Unknown",16160,2]
[3,"WAY","Yes","No","Other Object",111965,9]
[2,"SAN","Yes","Yes","Angle",62219,2]
[11,"JEF","Yes","Yes","Other Object",70299,3]
[9,"HIG","No","No","Backing",708503,52]
[9,"LAW","Yes","No","Angle",8080,1]
[10,"ATH","Yes","Yes","Rear End",288121,8]
[6,"FAY","Yes","No","Rear End",24240,3]
[6,"MAD","Yes","No","Sideswipe - Passing",16160,2]
[8,"BUT","Yes","No","Other Non-Vehicle",8080,1]
[3,"HUR","Yes","No","Sideswipe - Passing",95805,7]
[3,"LOR","Yes","No","Other Object",315937,22]
[7,"CLA","Yes","Yes","Overturning",2520411,22]
[5,"COS","Yes","No","Other Non-Collision",8080,1]
[3,"RIC","Yes","Yes","Fixed Object",9547159,395]
[8,"CLE","Yes","Yes","Unknown",88880,11]
[10,"MEG","Yes","No","Sideswipe - Meeting",8080,1]
[7,"LOG","Yes","No","Sideswipe - Passing",8080,1]
[9,"ROS","Yes","No","Head On",6196402,70]
[9,"ROS","Yes","No","Train",422725,1]
[7,"DAR","No","No","Angle",19138635,375]
[7,"AUG","No","No","Sideswipe - Passing",3196223,101]
[5,"FAI","Yes","Yes","Rear End",464020,38]
[11,"JEF","Yes","No","Pedestrian",4254465,25]
[11,"JEF","Yes","Yes","Backing",133784,6]
[11,"COL","Yes","No","Other Object",8080,1]
[2,"LUC","No","No","Other Non-Collision",126859,10]
[8,"CLE","Yes","No","Pedestrian",13200194,90]
[6,"DEL","No","Yes","Rear End",4633585,175]
[6,"PIC","Yes","No","Right Turn",62219,2]
[7,"MER","Yes","No","Unknown",55405,2]
[2,"WOO","No","Yes","Head On",1095592,11]
[2,"SAN","Yes","No","Pedalcycles",54139,1]
[4,"POR","Yes","No","Angle",1022947,47]
[10,"GAL","Yes","No","Parked Vehicle",8080,1]
[11,"JEF","Yes","No","Fixed Object",151210,9]
[9,"SCI","Yes","No","Rear End",324239,15]
[5,"LIC","Yes","Yes","Left Turn",63485,3]
[11,"COL","Yes","Yes","Animal",333363,25]
[3,"WAY","No","No","Pedestrian",3180470,19]
[7,"SHE","Yes","No","Rear End",111965,9]
[4,"MAH","No","Yes","Angle",327366,8]
[8,"HAM","No","No","Pedestrian",1055192,6]
[6,"DEL","Yes","No","Angle",711741,41]
[2,"SAN","No","Yes","Pedestrian",1484731,7]
[6,"DEL","Yes","Yes","Sideswipe - Passing",6440974,314]
[6,"MAD","Yes","No","Animal",24240,3]
[5,"LIC","Yes","Yes","Head On",117624,4]
[11,"COL","Yes","No","Left Turn",3606957,72]
[9,"HIG","Yes","No","Fixed Object",2375127,102]
[3,"LOR","Yes","No","Animal",32320,4]
[1,"ALL","Yes","No","Other Non-Collision",2487690,106]
[8,"CLI","No","Yes","Head On",1408773,9]
[10,"GAL","Yes","Yes","Other Non-Collision",16160,2]
[3,"LOR","Yes","No","Rear End",113573394,4976]
[10,"ATH","No","No","Other Non-Collision",644907,53]
[1,"WYA","Yes","No","Sideswipe - Passing",8080,1]
[5,"GUE","No","Yes","Rear End",5454950,102]
[4,"ATB","Yes","No","Other Non-Collision",430805,2]
[7,"LOG","No","No","Other Non-Collision",310278,27]
[8,"HAM","Yes","No","Sideswipe - Meeting",40400,5]
[2,"LUC","Yes","No","Right Turn",782262,36]
[2,"OTT","Yes","No","Other Non-Collision",54139,1]
[10,"GAL","No","No","Head On",4566344,71]
[2,"HEN","No","Yes","Head On",16160,2]
[4,"SUM","Yes","Yes","Head On",603834,8]
[7,"AUG","No","No","Sideswipe - Meeting",422725,1]
[3,"RIC","Yes","No","Right Turn",5686449,326]
[11,"TUS","Yes","Yes","Fixed Object",64640,8]
[10,"HOC","No","Yes","Fixed Object",1547363,76]
[6,"UNI","Yes","Yes","Animal",621822,55]
[2,"WOO","Yes","No","Pedestrian",2320126,16]
[7,"DAR","No","No","Pedalcycles",564589,8]
[2,"LUC","No","Yes","Other Non-Collision",164838,9]
[8,"CLE","No","No","Unknown",118779,9]
[4,"SUM","Yes","Yes","Animal",4400894,339]
[3,"MED","Yes","No","Parked Vehicle",561797,33]
[3,"WAY","No","Yes","Rear End",2371473,42]
[6,"PIC","Yes","No","Overturning",919322,12]
[11,"BEL","No","Yes","Sideswipe - Passing",4691611,213]
[7,"MER","Yes","No","Rear End",8080,1]
[6,"FAY","No","No","Left Turn",3138730,81]
[2,"WIL","Yes","No","Right Turn",470834,38]
[9,"ADA","No","No","Sideswipe - Meeting",102619,7]
[6,"UNI","Yes","No","Animal",121200,15]
[7,"AUG","Yes","No","Other Non-Collision",16160,2]
[3,"CRA","Yes","No","Fixed Object",3420859,106]
[7,"SHE","Yes","No","Fixed Object",62219,2]
[3,"MED","Yes","Yes","Sideswipe - Meeting",8080,1]
[12,"LAK","No","Yes","Sideswipe - Passing",4894131,184]
[2,"SAN","No","Yes","Angle",24240,3]
[3,"MED","Yes","No","Head On",55405,2]
[6,"MAR","Yes","No","Sideswipe - Passing",9800748,631]
[5,"MUS","No","No","Head On",9781015,108]
[5,"MUS","No","No","Train",8080,1]
[8,"HAM","Yes","Yes","Unknown",62219,2]
[3,"ERI","No","No","Right Turn",526945,27]
[6,"MAD","Yes","No","Rear End",4448910,225]
[8,"CLE","Yes","Yes","Right Turn",8080,1]
[1,"PAU","Yes","No","Right Turn",8080,1]
[7,"DAR","No","Yes","Angle",47325,1]
[3,"RIC","Yes","Yes","Pedestrian",524189,3]
[2,"WOO","Yes","Yes","Overturning",476864,2]
[4,"POR","Yes","Yes","Overturning",47325,1]
[6,"FRA","Yes","Yes","Backing",8080,1]
[1,"WYA","No","No","Head On",2358108,19]
[2,"FUL","No","No","Angle",34778778,442]
[5,"FAI","Yes","Yes","Fixed Object",847386,39]
[2,"SAN","No","Yes","Rear End",5620304,136]
[7,"MER","No","No","Angle",21027034,222]
[4,"STA","Yes","No","Unknown",1045813,57]
[6,"PIC","Yes","No","Unknown",446965,4]
[4,"ATB","Yes","No","Backing",836855,89]
[9,"ADA","No","No","Pedestrian",686606,6]
[2,"WOO","Yes","Yes","Angle",979680,22]
[12,"CUY","Yes","Yes","Pedalcycles",469341,11]
[4,"STA","No","No","Angle",26994020,526]
[10,"MRG","Yes","No","Angle",8080,1]
[7,"MOT","No","No","Rear End",5491180,218]
[10,"HOC","Yes","Yes","Fixed Object",2555003,55]
[1,"PUT","Yes","No","Rear End",2680112,69]
[4,"POR","Yes","No","Left Turn",9654751,285]
[3,"LOR","Yes","No","Angle",3019472,111]
[8,"BUT","Yes","No","Left Turn",1319968,43]
[10,"HOC","Yes","No","Overturning",124438,4]
[4,"ATB","Yes","Yes","Animal",64640,8]
[5,"KNO","No","No","Sideswipe - Meeting",438885,3]
[7,"MOT","No","No","Fixed Object",20971556,401]
[3,"LOR","Yes","Yes","Rear End",9181613,245]
[1,"ALL","No","Yes","Left Turn",24240,3]
[7,"CLA","Yes","Yes","Fixed Object",48480,6]
[7,"SHE","Yes","Yes","Animal",8080,1]
[8,"CLE","Yes","No","Head On",54139,1]
[9,"BRO","Yes","No","Overturning",8080,1]
[4,"TRU","Yes","No","Angle",266302,11]
[7,"DAR","Yes","Yes","Left Turn",156869,4]
[4,"TRU","Yes","No","Head On",18742348,278]
[4,"TRU","Yes","No","Train",79645,5]
[5,"LIC","Yes","No","Sideswipe - Passing",9830398,698]
[8,"GRE","Yes","Yes","Animal",479285,8]
[5,"GUE","No","Yes","Fixed Object",11690043,305]
[3,"CRA","Yes","Yes","Animal",451325,51]
[7,"MIA","Yes","No","Animal",2515218,234]
[2,"LUC","Yes","Yes","Unknown",1386472,47]
[12,"LAK","Yes","No","Parked Vehicle",458956,34]
[8,"GRE","No","Yes","Parked Vehicle",493024,4]
[8,"PRE","Yes","No","Rear End",6532005,290]
[10,"MEG","Yes","No","Animal",485728,39]
[11,"TUS","Yes","No","Parked Vehicle",143019,12]
[10,"MOE","Yes","No","Head On",101464,2]
[5,"MUS","No","No","Left Turn",7875465,194]
[6,"PIC","Yes","No","Parked Vehicle",3279558,117]
[10,"WAS","No","No","Rear End",11218421,310]
[4,"TRU","No","No","Overturning",6069691,63]
[9,"BRO","No","No","Other Object",183419,17]
[11,"CAR","No","No","Left Turn",2649620,110]
[8,"PRE","No","No","Other Non-Collision",1600383,23]
[11,"CAR","No","No","Other Non-Vehicle",54139,1]
[1,"HAN","Yes","Yes","Other Non-Collision",199579,19]
[10,"MOE","Yes","No","Sideswipe - Passing",8080,1]
[7,"MOT","Yes","Yes","Sideswipe - Passing",64180179,2804]
[2,"WOO","No","Yes","Other Object",860984,96]
[3,"LOR","Yes","No","Fixed Object",79894980,1926]
[4,"TRU","No","No","Pedestrian",2969462,14]
[2,"OTT","No","Yes","Other Non-Collision",560085,18]
[7,"MIA","Yes","Yes","Angle",877770,6]
[1,"ALL","Yes","No","Other Non-Collision",32320,4]
[10,"GAL","Yes","No","Sideswipe - Passing",16160,2]
[2,"SEN","No","No","Right Turn",676554,17]
[2,"LUC","Yes","No","Angle",368651546,10507]
[8,"PRE","No","Yes","Head On",479285,8]
[7,"CHP","Yes","No","Angle",110810,4]
[2,"SEN","Yes","No","Pedestrian",1259386,11]
[11,"TUS","Yes","No","Right Turn",2960574,181]
[3,"LOR","No","Yes","Pedestrian",422725,1]
[1,"ALL","Yes","Yes","Parked Vehicle",869690,5]
[9,"JAC","No","Yes","Backing",62219,2]
[3,"LOR","Yes","Yes","Angle",110810,4]
[1,"HAR","No","No","Parked Vehicle",729538,13]
[7,"CHP","Yes","No","Backing",820584,91]
[10,"ATH","Yes","Yes","Angle",8080,1]
[11,"HAS","No","No","Angle",4758178,107]
[3,"MED","Yes","Yes","Right Turn",62219,2]
[2,"HEN","No","Yes","Other Object",105040,13]
[1,"ALL","No","No","Fixed Object",44222148,763]
[8,"HAM","No","No","Sideswipe - Passing",2302969,137]
[7,"MOT","No","Yes","Rear End",5474799,198]
[3,"WAY","No","No","Sideswipe - Passing",14473852,393]
[7,"CHP","No","No","Fixed Object",30906064,703]
[5,"GUE","No","No","Sideswipe - Passing",1284299,54]
[11,"TUS","Yes","Yes","Rear End",212163,10]
[9,"LAW","Yes","No","Angle",12500416,501]
[7,"SHE","Yes","Yes","Fixed Object",24240,3]
[5,"FAI","Yes","No","Sideswipe - Passing",667175,68]
[2,"WOO","Yes","No","Sideswipe - Meeting",125704,5]
[2,"OTT","Yes","No","Other Non-Collision",818418,24]
[1,"DEF","No","No","Backing",910730,103]
[2,"FUL","Yes","No","Right Turn",296650,27]
[1,"WYA","No","No","Other Non-Collision",981879,36]
[4,"ATB","No","No","Backing",1685878,98]
[7,"MOT","Yes","Yes","Other Non-Collision",3750727,173]
[1,"VAN","Yes","No","Other Non-Collision",136205,12]
[3,"CRA","Yes","Yes","Rear End",218977,10]
[10,"MEG","No","No","Pedalcycles",54139,1]
[2,"WOO","Yes","No","Right Turn",1614981,100]
[11,"BEL","No","No","Other Object",669629,21]
[7,"SHE","Yes","Yes","Rear End",16160,2]
[12,"CUY","Yes","Yes","Pedestrian",14295717,64]
[7,"SHE","No","No","Right Turn",409321,23]
[4,"STA","No","Yes","Left Turn",63485,3]
[11,"BEL","Yes","No","Pedalcycles",632467,5]
[5,"GUE","No","No","Parked Vehicle",332097,24]
[1,"HAN","Yes","No","Other Object",8080,1]
[1,"HAR","Yes","No","Pedalcycles",8080,1]
[3,"MED","Yes","No","Animal",1254627,82]
[6,"FAY","No","Yes","Overturning",1010956,17]
[2,"OTT","Yes","Yes","Fixed Object",1780115,33]
[2,"WIL","Yes","No","Backing",32320,4]
[4,"POR","Yes","Yes","Other Non-Collision",607410,19]
[8,"BUT","Yes","No","Angle",175721160,4606]
[3,"MED","No","No","Backing",2988423,142]
[8,"HAM","Yes","Yes","Sideswipe - Passing",152188439,8241]
[2,"HEN","Yes","No","Head On",833534,17]
[7,"CLA","Yes","Yes","Fixed Object",8348654,344]
[12,"GEA","Yes","No","Rear End",8253957,406]
[5,"LIC","No","Yes","Left Turn",124438,4]
[9,"PIK","No","No","Left Turn",4273010,82]
[3,"RIC","Yes","No","Left Turn",63485,3]
[12,"CUY","Yes","Yes","Other Object",3622430,306]
[4,"ATB","Yes","No","Parked Vehicle",1301836,53]
[1,"DEF","No","No","Unknown",48480,6]
[2,"OTT","Yes","Yes","Rear End",297467,10]
[5,"GUE","Yes","No","Fixed Object",11633891,331]
[10,"GAL","Yes","Yes","Sideswipe - Passing",857441,32]
[5,"FAI","Yes","No","Left Turn",17476148,463]
[4,"ATB","Yes","Yes","Sideswipe - Passing",118779,9]
[3,"RIC","Yes","Yes","Right Turn",8080,1]
[10,"ATH","No","Yes","Head On",16160,2]
[3,"CRA","Yes","Yes","Fixed Object",1264117,27]
[2,"WOO","Yes","Yes","Angle",493024,4]
[6,"PIC","Yes","No","Fixed Object",7479739,224]
[2,"SAN","No","No","Parked Vehicle",1257192,31]
[8,"BUT","Yes","No","Head On",1419942,22]
[2,"FUL","Yes","No","Rear End",1325032,47]
[1,"PUT","Yes","No","Fixed Object",2008660,37]
[3,"ERI","Yes","Yes","Rear End",118779,9]
[7,"CLA","Yes","Yes","Parked Vehicle",94539,6]
[6,"MRW","No","Yes","Other Object",488149,45]
[11,"COL","Yes","No","Angle",1174306,33]
[6,"DEL","No","No","Right Turn",1227479,74]
[2,"WOO","Yes","No","Pedalcycles",3249462,36]
[5,"FAI","Yes","Yes","Parked Vehicle",109544,3]
[4,"ATB","Yes","Yes","Pedestrian",422725,1]
[9,"SCI","Yes","No","Other Object",207659,20]
[3,"LOR","Yes","Yes","Rear End",14459179,385]
[12,"GEA","Yes","Yes","Left Turn",8080,1]
[6,"FRA","Yes","Yes","Sideswipe - Passing",118779,9]
[11,"COL","No","No","Other Non-Vehicle",422725,1]
[8,"HAM","Yes","Yes","Pedestrian",12842749,51]
[2,"WOO","Yes","No","Unknown",8080,1]
[4,"STA","Yes","Yes","Unknown",265485,28]
[9,"HIG","Yes","No","Pedalcycles",55405,2]
[3,"CRA","Yes","No","Left Turn",1750216,35]
[7,"AUG","No","No","Pedestrian",585142,4]
[5,"FAI","Yes","Yes","Rear End",4933890,179]
[2,"OTT","Yes","Yes","Sideswipe - Passing",8080,1]
[10,"WAS","No","No","Animal",7114605,485]
[11,"JEF","Yes","No","Sideswipe - Meeting",438885,3]
[6,"PIC","No","No","Unknown",693869,24]
[3,"LOR","No","No","Right Turn",3063110,105]
[8,"HAM","Yes","Yes","Sideswipe - Meeting",422725,1]
[7,"AUG","Yes","No","Sideswipe - Passing",869992,76]
[11,"BEL","Yes","Yes","Angle",496002,20]
[9,"SCI","No","No","Pedestrian",4278148,18]
[4,"TRU","Yes","Yes","Rear End",13713546,429]
[5,"MUS","Yes","Yes","Sideswipe - Passing",40400,5]
[4,"MAH","Yes","No","Angle",929117,32]
[6,"MAD","Yes","No","Fixed Object",4854543,128]
[11,"JEF","Yes","No","Backing",56560,7]
[7,"LOG","Yes","No","Pedestrian",47325,1]
[12,"CUY","Yes","Yes","Overturning",2620125,28]
[10,"HOC","Yes","No","Angle",8080,1]
[6,"FRA","No","Yes","Right Turn",126970,6]
[9,"SCI","Yes","No","Angle",839193,12]
[10,"ATH","No","No","Left Turn",4337428,98]
[1,"HAR","Yes","No","Angle",8080,1]
[2,"SAN","Yes","No","Rear End",10941435,451]
[10,"ATH","Yes","No","Animal",971683,104]
[2,"SAN","Yes","No","Fixed Object",448566,23]
[1,"HAN","Yes","Yes","Backing",16160,2]
[3,"WAY","No","No","Rear End",25708754,677]
[4,"POR","Yes","Yes","Animal",40400,5]
[5,"MUS","No","Yes","Head On",977968,7]
[4,"ATB","Yes","No","Right Turn",2257949,112]
[11,"TUS","Yes","No","Sideswipe - Passing",176605,17]
[8,"CLE","Yes","No","Sideswipe - Meeting",1166675,50]
[2,"WOO","No","Yes","Left Turn",16160,2]
[12,"LAK","Yes","Yes","Animal",40400,5]
[2,"SEN","Yes","No","Left Turn",1707246,47]
[7,"DAR","No","No","Parked Vehicle",2311642,99]
[7,"AUG","Yes","No","Pedestrian",1055192,6]
[10,"HOC","Yes","No","Rear End",117624,4]
[3,"RIC","Yes","Yes","Sideswipe - Passing",6051984,295]
[8,"HAM","No","Yes","Angle",722724,13]
[6,"MAD","Yes","No","Backing",16160,2]
[6,"UNI","Yes","No","Overturning",24240,3]
[8,"CLI","No","Yes","Right Turn",16160,2]
[2,"OTT","No","No","Unknown",164838,9]
[5,"FAI","No","No","Other Non-Collision",2888031,62]
[6,"DEL","No","No","Head On",6291090,53]
[2,"SAN","Yes","No","Rear End",1062901,38]
[4,"ATB","Yes","No","Other Non-Collision",94539,6]
[8,"HAM","Yes","Yes","Rear End",301082996,13296]
[9,"JAC","Yes","No","Pedalcycles",47325,1]
[7,"MOT","No","Yes","Fixed Object",5289184,114]
[2,"SEN","Yes","No","Pedalcycles",1685573,23]
[11,"COL","Yes","No","Pedestrian",892775,3]
[8,"HAM","No","No","Rear End",12581293,504]
[4,"POR","Yes","Yes","Right Turn",32320,4]
[9,"HIG","Yes","No","Other Non-Collision",47325,1]
[2,"SEN","Yes","No","Fixed Object",8659298,306]
[9,"LAW","Yes","No","Rear End",18256435,621]
[6,"FRA","Yes","No","Right Turn",3447341,195]
[10,"MEG","No","No","Fixed Object",34709721,726]
[2,"WOO","Yes","Yes","Fixed Object",2380897,93]
[8,"HAM","No","No","Pedalcycles",632467,5]
[10,"HOC","No","Yes","Parked Vehicle",484944,3]
[5,"MUS","No","No","Other Object",144285,13]
[4,"TRU","No","No","Pedalcycles",1648414,11]
[11,"JEF","Yes","No","Rear End",14252336,627]
[2,"SAN","No","Yes","Parked Vehicle",2169750,179]
[6,"PIC","Yes","No","Unknown",16160,2]
[6,"PIC","No","No","Sideswipe - Meeting",446965,4]
[8,"CLI","No","No","Left Turn",5822829,141]
[6,"DEL","Yes","Yes","Animal",24240,3]
[9,"SCI","No","Yes","Rear End",143130,8]
[12,"LAK","No","No","Right Turn",260643,16]
[11,"BEL","Yes","Yes","Sideswipe - Passing",16160,2]
[2,"WIL","Yes","No","Head On",745698,15]
[2,"WIL","Yes","No","Train",422725,1]
[1,"ALL","Yes","No","Right Turn",268834,13]
[8,"WAR","Yes","No","Other Object",80800,10]
[10,"ATH","Yes","Yes","Overturning",639281,5]
[8,"HAM","Yes","No","Right Turn",81025455,5133]
[1,"ALL","Yes","Yes","Angle",1032107,8]
[3,"HUR","No","No","Head On",9289299,64]
[3,"HUR","No","No","Train",8080,1]
[9,"LAW","Yes","No","Pedestrian",2710047,18]
[9,"SCI","No","No","Parked Vehicle",1453641,53]
[11,"COL","Yes","No","Other Object",24240,3]
[1,"HAN","Yes","Yes","Left Turn",70299,3]
[4,"MAH","Yes","No","Sideswipe - Passing",463125,6]
[4,"SUM","Yes","No","Overturning",2684319,22]
[7,"LOG","No","Yes","Other Non-Collision",129280,16]
[3,"WAY","Yes","No","Angle",297467,10]
[3,"MED","Yes","No","Other Non-Collision",438885,3]
[3,"WAY","Yes","No","Parked Vehicle",16160,2]
[9,"SCI","No","Yes","Fixed Object",8080,1]
[2,"WOO","Yes","No","Parked Vehicle",2112035,167]
[4,"TRU","No","No","Parked Vehicle",1594724,28]
[9,"HIG","Yes","No","Parked Vehicle",564218,39]
[3,"MED","Yes","No","Animal",3592980,326]
[7,"AUG","Yes","No","Unknown",8080,1]
[2,"SEN","Yes","No","Rear End",13851819,641]
[8,"HAM","No","No","Sideswipe - Meeting",853530,3]
[7,"CHP","No","No","Sideswipe - Passing",2500385,93]
[5,"GUE","Yes","No","Animal",8080,1]
[2,"FUL","Yes","No","Left Turn",1003660,52]
[9,"BRO","Yes","No","Animal",8080,1]
[2,"WOO","Yes","No","Pedalcycles",1973805,27]
[11,"COL","No","No","Head On",8490689,94]
[11,"COL","No","No","Train",8080,1]
[8,"BUT","Yes","No","Sideswipe - Meeting",1332815,11]
[5,"LIC","No","No","Overturning",8050832,123]
[10,"MEG","No","No","Rear End",5033934,112]
[4,"POR","Yes","Yes","Overturning",71565,4]
[9,"ADA","No","No","Pedalcycles",257067,5]
[3,"LOR","No","Yes","Fixed Object",2177633,97]
[11,"TUS","No","Yes","Sideswipe - Passing",3737730,115]
[12,"LAK","Yes","No","Other Non-Collision",4282843,83]
[7,"MER","No","No","Fixed Object",20297951,513]
[7,"DAR","Yes","No","Other Non-Collision",16160,2]
[9,"ADA","No","No","Parked Vehicle",446034,21]
[3,"HUR","Yes","No","Pedestrian",5038851,30]
[6,"MRW","Yes","No","Left Turn",8080,1]
[11,"COL","Yes","No","Overturning",54139,1]
[5,"FAI","Yes","No","Backing",64640,8]
[3,"RIC","Yes","No","Other Non-Collision",2582002,86]
[3,"RIC","No","No","Backing",1216199,65]
[9,"PIK","No","No","Other Object",64640,8]
[2,"HEN","Yes","No","Other Non-Collision",16160,2]
[10,"MOE","Yes","No","Animal",16160,2]
[1,"HAR","No","No","Sideswipe - Passing",2377692,51]
[7,"MIA","Yes","Yes","Backing",87725,6]
[9,"LAW","Yes","No","Sideswipe - Meeting",16160,2]
[10,"ATH","Yes","Yes","Sideswipe - Passing",370187,19]
[11,"JEF","No","No","Sideswipe - Passing",1045586,31]
[2,"WOO","Yes","No","Other Object",8080,1]
[1,"HAN","No","Yes","Angle",907669,4]
[8,"CLE","Yes","No","Animal",10842793,946]
[1,"ALL","No","No","Angle",37639482,437]
[6,"FRA","Yes","Yes","Right Turn",537446,34]
[2,"WOO","Yes","No","Fixed Object",22675094,649]
[6,"PIC","Yes","No","Backing",64640,8]
[12,"GEA","Yes","No","Angle",11392194,341]
[4,"TRU","No","No","Fixed Object",54368989,1368]
[1,"PUT","No","No","Pedalcycles",476864,2]
[4,"STA","Yes","No","Left Turn",5029581,186]
[12,"CUY","Yes","No","Head On",147143868,2487]
[12,"CUY","Yes","No","Train",1074928,19]
[11,"COL","Yes","No","Parked Vehicle",8080,1]
[2,"WOO","Yes","No","Rear End",39530574,1969]
[10,"HOC","No","No","Sideswipe - Passing",1908575,62]
[10,"MOE","No","No","Head On",3908036,44]
[1,"HAR","No","No","Pedestrian",54139,1]
[11,"COL","Yes","No","Backing",392344,38]
[7,"MOT","Yes","No","Animal",234320,29]
[10,"NOB","Yes","No","Backing",79645,5]
[8,"BUT","Yes","Yes","Other Non-Collision",108278,2]
[3,"RIC","Yes","No","Left Turn",1118084,48]
[4,"TRU","No","Yes","Backing",95805,7]
[8,"PRE","Yes","No","Left Turn",135050,7]
[9,"JAC","Yes","No","Fixed Object",110699,8]
[4,"MAH","Yes","Yes","Angle",8080,1]
[5,"KNO","No","No","Left Turn",6614548,175]
[9,"LAW","No","No","Fixed Object",42153455,1083]
[2,"HEN","Yes","No","Head On",47325,1]
[6,"MAD","No","Yes","Animal",1334718,101]
[3,"ERI","Yes","Yes","Angle",47325,1]
[2,"HEN","Yes","Yes","Other Non-Collision",8080,1]
[6,"MAD","Yes","No","Angle",5582926,136]
[4,"STA","Yes","Yes","Other Object",16160,2]
[2,"HEN","No","No","Left Turn",4143733,70]
[7,"LOG","Yes","No","Rear End",40400,5]
[12,"LAK","No","Yes","Pedestrian",422725,1]
[3,"ERI","Yes","No","Other Non-Collision",298622,15]
[8,"BUT","Yes","No","Other Object",166104,10]
[8,"BUT","Yes","No","Rear End",220346577,9898]
[2,"FUL","Yes","Yes","Rear End",140598,6]
[12,"CUY","No","No","Head On",883875,15]
[7,"AUG","Yes","No","Other Object",24240,3]
[4,"POR","Yes","No","Animal",455829,41]
[10,"NOB","Yes","No","Unknown",8080,1]
[4,"TRU","No","No","Rear End",10892472,310]
[4,"POR","Yes","Yes","Animal",8080,1]
[5,"MUS","Yes","Yes","Other Object",282800,35]
[6,"FRA","Yes","Yes","Parked Vehicle",1127912,15]
[3,"RIC","No","Yes","Right Turn",108278,2]
[3,"LOR","No","Yes","Rear End",1962825,59]
[11,"COL","Yes","No","Pedalcycles",108278,2]
[5,"GUE","No","Yes","Sideswipe - Passing",4498624,202]
[10,"HOC","No","Yes","Angle",54139,1]
[4,"STA","Yes","No","Backing",371680,46]
[2,"OTT","Yes","No","Right Turn",1663757,30]
[5,"FAI","Yes","Yes","Angle",986048,8]
[3,"CRA","Yes","No","Train",8080,1]
[3,"CRA","Yes","No","Head On",1103672,12]
[3,"WAY","Yes","No","Backing",507885,58]
[9,"ROS","No","No","Other Object",780328,29]
[10,"GAL","No","Yes","Animal",1262225,118]
[9,"LAW","Yes","No","Animal",16160,2]
[4,"STA","Yes","No","Sideswipe - Meeting",885850,7]
[2,"SAN","Yes","No","Pedalcycles",1388106,13]
[6,"UNI","No","Yes","Left Turn",24240,3]
[6,"FAY","Yes","No","Sideswipe - Passing",62219,2]
[2,"LUC","Yes","Yes","Overturning",101464,2]
[8,"GRE","Yes","No","Angle",687612,34]
[12,"GEA","No","Yes","Other Object",8080,1]
[7,"CHP","No","Yes","Fixed Object",1018479,8]
[5,"LIC","Yes","Yes","Pedalcycles",54139,1]
[7,"CHP","Yes","No","Parked Vehicle",63485,3]
[3,"ASD","Yes","No","Other Object",32320,4]
[5,"LIC","Yes","Yes","Sideswipe - Passing",4885345,196]
[10,"MOE","No","No","Other Object",158024,9]
[8,"BUT","No","No","Angle",22575052,428]
[1,"VAN","No","No","Pedalcycles",1745039,5]
[1,"HAN","No","No","Angle",26784994,356]
[6,"FAY","Yes","Yes","Rear End",48480,6]
[7,"LOG","Yes","No","Angle",32320,4]
[10,"HOC","Yes","Yes","Left Turn",54139,1]
[3,"RIC","Yes","Yes","Overturning",109544,3]
[2,"LUC","Yes","No","Overturning",1425044,7]
[7,"MIA","Yes","Yes","Animal",946399,92]
[6,"DEL","No","No","Rear End",20347968,723]
[2,"SAN","Yes","No","Fixed Object",3024942,61]
[11,"TUS","Yes","No","Backing",202000,25]
[2,"WIL","No","No","Rear End",10574487,281]
[7,"CHP","Yes","No","Rear End",10208401,367]
[6,"UNI","No","No","Fixed Object",31735206,807]
[1,"ALL","No","No","Right Turn",2357737,50]
[8,"HAM","No","No","Angle",6614175,176]
[4,"ATB","Yes","Yes","Angle",117624,4]
[4,"POR","Yes","Yes","Other Object",199579,19]
[11,"HOL","Yes","No","Fixed Object",8080,1]
[5,"LIC","No","Yes","Right Turn",125704,5]
[4,"ATB","No","No","Animal",13954787,973]
[5,"LIC","Yes","No","Sideswipe - Meeting",8080,1]
[7,"LOG","Yes","No","Left Turn",1765742,91]
[10,"ATH","Yes","No","Sideswipe - Passing",167370,11]
[12,"LAK","No","Yes","Other Non-Collision",323200,40]
[10,"MEG","Yes","No","Head On",422725,1]
[3,"ERI","Yes","Yes","Fixed Object",1168423,16]
[10,"MEG","No","No","Right Turn",366500,12]
[3,"HUR","Yes","No","Pedalcycles",62219,2]
[3,"LOR","Yes","No","Pedalcycles",11732139,110]
[1,"HAN","No","No","Other Object",280379,29]
[1,"HAR","Yes","No","Right Turn",334629,26]
[4,"POR","No","No","Unknown",40400,5]
[3,"RIC","Yes","No","Parked Vehicle",24240,3]
[9,"JAC","Yes","No","Parked Vehicle",827060,69]
[10,"VIN","No","No","Sideswipe - Meeting",78379,4]
[6,"FRA","Yes","Yes","Pedestrian",108278,2]
[11,"HOL","Yes","No","Parked Vehicle",54139,1]
[3,"RIC","Yes","No","Left Turn",47325,1]
[10,"HOC","Yes","Yes","Other Non-Collision",24240,3]
[1,"HAN","Yes","Yes","Other Object",8080,1]
[1,"DEF","Yes","No","Sideswipe - Passing",3712682,280]
[7,"LOG","No","Yes","Fixed Object",3276912,115]
[4,"ATB","Yes","Yes","Overturning",8080,1]
[4,"POR","Yes","Yes","Other Non-Collision",24240,3]
[1,"HAR","Yes","No","Backing",945504,60]
[6,"FAY","Yes","No","Pedestrian",1085648,14]
[9,"ROS","Yes","No","Left Turn",132518,5]
[4,"ATB","Yes","Yes","Sideswipe - Passing",16160,2]
[4,"MAH","Yes","No","Head On",21724574,373]
[6,"MAD","No","No","Animal",4188512,341]
[8,"CLI","Yes","No","Left Turn",1587982,69]
[6,"DEL","No","No","Left Turn",9602620,223]
[11,"BEL","No","No","Other Non-Collision",496229,46]
[10,"MRG","No","No","Sideswipe - Meeting",8080,1]
[4,"ATB","Yes","No","Animal",806989,38]
[2,"SEN","Yes","No","Fixed Object",78379,4]
[6,"MAD","Yes","No","Head On",1632814,23]
[9,"ROS","Yes","No","Other Object",254984,21]
[8,"CLE","No","No","Animal",12210273,948]
[6,"UNI","Yes","Yes","Unknown",8080,1]
[1,"WYA","No","Yes","Unknown",16160,2]
[7,"AUG","Yes","No","Other Object",24240,3]
[5,"LIC","No","No","Other Non-Collision",1960964,67]
[6,"UNI","No","No","Rear End",11175114,413]
[10,"HOC","Yes","Yes","Rear End",55405,2]
[9,"JAC","Yes","No","Rear End",11418007,450]
[7,"LOG","Yes","No","Unknown",430805,2]
[3,"RIC","Yes","Yes","Rear End",850738,28]
[7,"CLA","Yes","No","Head On",2661234,24]
[2,"SAN","No","No","Rear End",10438989,230]
[6,"UNI","No","Yes","Sideswipe - Meeting",422725,1]
[3,"RIC","Yes","Yes","Pedalcycles",8080,1]
[3,"MED","Yes","Yes","Unknown",16160,2]
[2,"FUL","Yes","No","Rear End",5546547,239]
[1,"DEF","No","Yes","Fixed Object",48480,6]
[8,"CLI","No","No","Parked Vehicle",1515414,41]
[2,"LUC","Yes","No","Unknown",5135706,193]
[5,"MUS","Yes","No","Animal",2530336,257]
[3,"MED","Yes","Yes","Sideswipe - Passing",621822,55]
[8,"HAM","No","No","Right Turn",933959,44]
[7,"MOT","Yes","No","Unknown",87725,6]
[9,"BRO","Yes","No","Backing",8080,1]
[6,"MAR","No","No","Head On",5723972,47]
[6,"MAR","No","No","Train",62219,2]
[7,"CHP","Yes","No","Parked Vehicle",2484416,166]
[3,"WAY","Yes","No","Animal",279224,24]
[2,"WIL","Yes","No","Parked Vehicle",1019152,48]
[10,"WAS","Yes","No","Rear End",4023873,184]
[11,"BEL","Yes","Yes","Left Turn",1183317,17]
[7,"MIA","Yes","No","Animal",1090800,135]
[3,"WAY","Yes","Yes","Animal",87725,6]
[11,"BEL","Yes","Yes","Rear End",8988925,301]
[3,"ERI","Yes","Yes","Unknown",137360,17]
[1,"HAN","No","Yes","Other Object",105040,13]
[8,"CLE","Yes","Yes","Sideswipe - Passing",16160,2]
[3,"LOR","Yes","Yes","Fixed Object",19797103,560]
[4,"TRU","No","Yes","Pedestrian",54139,1]
[11,"BEL","Yes","Yes","Fixed Object",8508645,307]
[12,"GEA","No","No","Angle",37363418,770]
[3,"LOR","No","No","Rear End",32630825,943]
[6,"FRA","Yes","No","Sideswipe - Meeting",5490287,77]
[6,"MAD","No","Yes","Unknown",727455,29]
[9,"BRO","Yes","Yes","Overturning",422725,1]
[10,"MOE","Yes","No","Rear End",979680,22]
[3,"ERI","Yes","Yes","Parked Vehicle",8080,1]
[8,"WAR","No","No","Fixed Object",52798808,1306]
[5,"FAI","Yes","No","Animal",8080,1]
[9,"LAW","No","No","Sideswipe - Meeting",931909,7]
[1,"VAN","No","No","Backing",526128,44]
[10,"HOC","Yes","No","Backing",8080,1]
[4,"POR","Yes","No","Fixed Object",227057,11]
[12,"LAK","No","No","Pedalcycles",108278,2]
[10,"MRG","No","No","Parked Vehicle",1259613,37]
[5,"MUS","No","No","Angle",8992757,168]
[7,"AUG","Yes","No","Pedestrian",1462314,15]
[9,"JAC","Yes","No","Pedestrian",1416964,6]
[10,"MRG","Yes","No","Unknown",8080,1]
[3,"LOR","Yes","Yes","Backing",56560,7]
[8,"WAR","Yes","No","Pedestrian",4164322,17]
[7,"MIA","Yes","No","Head On",3343260,78]
[7,"MIA","Yes","No","Train",63485,3]
[10,"WAS","No","No","Head On",8439902,82]
[10,"ATH","Yes","Yes","Angle",55405,2]
[2,"LUC","Yes","No","Fixed Object",2949879,95]
[2,"OTT","Yes","Yes","Other Non-Collision",24240,3]
[9,"ROS","Yes","No","Angle",594488,6]
[9,"JAC","No","No","Sideswipe - Passing",3418327,104]
[2,"SAN","No","Yes","Fixed Object",9448070,323]
[12,"LAK","Yes","No","Pedestrian",693420,6]
[1,"DEF","Yes","Yes","Other Non-Collision",167259,15]
[9,"BRO","Yes","No","Fixed Object",422725,1]
[10,"NOB","Yes","Yes","Other Non-Collision",16160,2]
[8,"CLI","No","No","Other Non-Collision",1027121,53]
[3,"WAY","Yes","No","Angle",133784,6]
[2,"WIL","No","No","Angle",22376154,291]
[6,"PIC","Yes","No","Other Non-Collision",269989,18]
[10,"HOC","Yes","No","Sideswipe - Passing",55405,2]
[4,"POR","Yes","No","Other Object",48480,6]
[7,"MIA","Yes","Yes","Unknown",72720,9]
[3,"RIC","Yes","Yes","Parked Vehicle",1073773,14]
[7,"MOT","Yes","No","Angle",3473024,89]
[4,"STA","Yes","No","Right Turn",706082,46]
[7,"AUG","Yes","No","Backing",273565,29]
[5,"FAI","Yes","Yes","Head On",8080,1]
[8,"BUT","Yes","No","Fixed Object",101230901,2924]
[10,"HOC","Yes","Yes","Overturning",70299,3]
[5,"FAI","Yes","Yes","Left Turn",47325,1]
[12,"CUY","Yes","No","Other Object",3546306,142]
[9,"ADA","No","No","Rear End",7962889,242]
[6,"FAY","No","No","Head On",2346676,29]
[2,"WOO","Yes","Yes","Parked Vehicle",62219,2]
[11,"COL","Yes","No","Fixed Object",1403449,32]
[10,"HOC","Yes","No","Sideswipe - Meeting",8080,1]
[5,"GUE","No","No","Pedestrian",1322314,4]
[12,"CUY","Yes","No","Sideswipe - Passing",32262099,2128]
[1,"WYA","No","Yes","Other Non-Collision",48480,6]
[8,"HAM","No","Yes","Sideswipe - Meeting",422725,1]
[3,"CRA","Yes","Yes","Head On",476864,2]
[7,"MOT","No","Yes","Animal",105040,13]
[9,"LAW","No","No","Rear End",4921225,135]
[5,"PER","No","No","Left Turn",9363808,163]
[9,"LAW","Yes","No","Fixed Object",12436965,362]
[5,"KNO","Yes","No","Left Turn",32320,4]
[2,"OTT","Yes","Yes","Sideswipe - Passing",573824,14]
[10,"MRG","No","No","Right Turn",102619,7]
[10,"VIN","Yes","No","Right Turn",63485,3]
[4,"POR","No","No","Other Object",239979,24]
[5,"MUS","Yes","No","Unknown",40400,5]
[7,"CHP","No","No","Pedestrian",961808,5]
[7,"MER","Yes","No","Overturning",974727,14]
[6,"FAY","Yes","No","Right Turn",956933,46]
[6,"MAR","No","No","Other Object",288459,30]
[3,"RIC","Yes","No","Other Non-Collision",62219,2]
[7,"LOG","Yes","No","Fixed Object",614224,19]
[1,"VAN","Yes","No","Angle",1376528,50]
[7,"LOG","Yes","No","Angle",3580296,63]
[1,"HAN","Yes","Yes","Right Turn",24240,3]
[5,"FAI","Yes","No","Other Non-Collision",941590,27]
[6,"FRA","Yes","Yes","Falling From Or In Vehicle",47325,1]
[9,"SCI","No","No","Fixed Object",81780360,1601]
[4,"MAH","No","No","Head On",5206334,67]
[8,"GRE","No","No","Right Turn",1364650,46]
[9,"JAC","Yes","No","Sideswipe - Meeting",8080,1]
[11,"COL","No","Yes","Other Non-Collision",96960,12]
[5,"COS","Yes","No","Right Turn",47325,1]
[10,"HOC","Yes","No","Fixed Object",1645511,40]
[7,"SHE","Yes","Yes","Angle",173029,6]
[8,"GRE","Yes","No","Other Object",442090,45]
[10,"WAS","Yes","Yes","Other Non-Collision",8080,1]
[4,"ATB","Yes","Yes","Fixed Object",981990,32]
[7,"AUG","No","No","Fixed Object",22350282,491]
[5,"FAI","Yes","Yes","Pedestrian",422725,1]
[7,"MIA","Yes","No","Head On",1135172,29]
[10,"HOC","Yes","No","Animal",377450,37]
[7,"AUG","Yes","No","Rear End",3032355,169]
[4,"MAH","Yes","No","Other Non-Collision",40400,5]
[4,"ATB","Yes","Yes","Rear End",494736,19]
[7,"AUG","No","No","Rear End",3867448,107]
[7,"AUG","Yes","No","Angle",3746066,168]
[12,"LAK","Yes","No","Angle",1538239,66]
[8,"WAR","Yes","Yes","Right Turn",132518,5]
[8,"WAR","No","Yes","Fixed Object",4507405,156]
[3,"ASD","Yes","No","Left Turn",8080,1]
[6,"FRA","Yes","Yes","Other Object",6090304,320]
[10,"ATH","Yes","Yes","Animal",722469,74]
[1,"PUT","Yes","No","Sideswipe - Passing",259377,15]
[4,"STA","Yes","Yes","Right Turn",16160,2]
[5,"KNO","No","No","Animal",12138149,904]
[2,"FUL","Yes","No","Other Non-Collision",94539,6]
[4,"POR","Yes","Yes","Left Turn",24240,3]
[7,"MOT","No","No","Pedestrian",2042617,11]
[6,"FAY","No","No","Other Non-Collision",455940,37]
[2,"SAN","No","No","Head On",4640590,54]
[2,"SAN","No","No","Train",62219,2]
[8,"PRE","No","No","Left Turn",7182303,131]
[7,"CHP","Yes","No","Fixed Object",16160,2]
[1,"ALL","Yes","Yes","Overturning",1119943,10]
[7,"CLA","Yes","Yes","Angle",742011,8]
[7,"CLA","No","No","Right Turn",264330,23]
[9,"BRO","Yes","No","Parked Vehicle",8080,1]
[8,"WAR","No","Yes","Parked Vehicle",526610,9]
[10,"WAS","No","No","Sideswipe - Meeting",853530,3]
[2,"FUL","Yes","No","Backing",32320,4]
[5,"GUE","Yes","No","Angle",10373539,360]
[11,"COL","Yes","No","Animal",192765,19]
[2,"LUC","No","Yes","Right Turn",16160,2]
[7,"MIA","Yes","No","Angle",22858132,825]
[7,"DAR","Yes","Yes","Head On",8080,1]
[11,"COL","Yes","No","Rear End",1433534,71]
[11,"JEF","Yes","No","Sideswipe - Passing",56560,7]
[10,"GAL","Yes","No","Sideswipe - Passing",24240,3]
[11,"TUS","Yes","No","Overturning",8080,1]
[9,"SCI","No","No","Rear End",14182300,348]
[2,"LUC","Yes","No","Other Non-Collision",8080,1]
[2,"FUL","Yes","No","Other Object",16160,2]
[3,"ERI","Yes","Yes","Other Non-Collision",346285,38]
[1,"ALL","Yes","No","Right Turn",6984261,324]
[4,"STA","Yes","No","Parked Vehicle",295384,26]
[3,"WAY","No","No","Parked Vehicle",2601325,32]
[4,"TRU","Yes","Yes","Pedestrian",108278,2]
[9,"SCI","Yes","No","Pedestrian",54139,1]
[2,"SAN","No","Yes","Animal",1230465,128]
[6,"DEL","No","Yes","Fixed Object",6482817,210]
[2,"WIL","Yes","No","Other Non-Collision",156758,8]
[12,"CUY","Yes","Yes","Rear End",290457747,11197]
[6,"MAD","No","No","Head On",6146099,53]
[1,"PAU","No","Yes","Sideswipe - Passing",2179866,32]
[5,"FAI","No","Yes","Other Non-Collision",103885,8]
[2,"WOO","No","No","Left Turn",10170421,198]
[12,"CUY","Yes","Yes","Backing",152365,14]
[9,"SCI","No","No","Sideswipe - Passing",3350563,107]
[6,"UNI","No","No","Angle",18185504,253]
[2,"FUL","No","No","Animal",11077126,1047]
[6,"PIC","No","No","Angle",19758039,289]
[5,"FAI","Yes","No","Pedalcycles",476864,2]
[2,"FUL","Yes","No","Fixed Object",2459536,70]
[2,"HEN","Yes","Yes","Animal",8080,1]
[5,"COS","No","No","Parked Vehicle",771093,23]
[3,"WAY","No","No","Pedalcycles",3070926,16]
[8,"CLI","No","Yes","Rear End",3531891,102]
[6,"PIC","Yes","No","Other Object",24240,3]
[5,"KNO","Yes","No","Fixed Object",7580383,239]
[3,"ASD","Yes","No","Other Non-Collision",622304,20]
[7,"LOG","Yes","No","Pedalcycles",47325,1]
[11,"CAR","No","No","Angle",7919287,199]
[2,"SAN","No","Yes","Head On",16160,2]
[7,"DAR","Yes","Yes","Angle",1569215,20]
[1,"PAU","Yes","No","Fixed Object",62219,2]
[7,"MIA","Yes","Yes","Angle",8080,1]
[3,"LOR","Yes","No","Unknown",32320,4]
[12,"LAK","Yes","Yes","Fixed Object",27467221,888]
[11,"HAS","No","No","Pedalcycles",422725,1]
[4,"TRU","Yes","No","Pedestrian",14174475,90]
[3,"CRA","No","Yes","Head On",446965,4]
[10,"ATH","Yes","No","Backing",522779,59]
[10,"HOC","Yes","Yes","Fixed Object",167259,15]
[2,"WIL","Yes","No","Left Turn",1514816,46]
[10,"NOB","Yes","No","Overturning",8080,1]
[3,"WAY","Yes","No","Other Object",113120,14]
[6,"FRA","Yes","Yes","Fixed Object",9365596,336]
[4,"TRU","No","No","Right Turn",901525,40]
[3,"LOR","Yes","Yes","Angle",143130,8]
[8,"HAM","Yes","Yes","Other Object",70299,3]
[4,"POR","Yes","No","Backing",80800,10]
[4,"TRU","No","Yes","Overturning",764985,10]
[9,"PIK","No","No","Head On",3678893,45]
[3,"WAY","No","No","Right Turn",2041204,63]
[11,"TUS","Yes","Yes","Right Turn",118779,9]
[8,"CLI","No","Yes","Fixed Object",3263287,119]
[10,"MRG","No","No","Left Turn",1582472,51]
[10,"NOB","Yes","Yes","Sideswipe - Passing",191610,14]
[3,"RIC","Yes","No","Backing",8080,1]
[4,"SUM","Yes","Yes","Unknown",631168,57]
[8,"CLI","Yes","No","Angle",63485,3]
[7,"MER","No","Yes","Angle",54139,1]
[5,"KNO","Yes","No","Rear End",10260355,539]
[7,"SHE","No","No","Sideswipe - Passing",3292624,73]
[10,"GAL","No","No","Animal",3570008,354]
[6,"UNI","No","No","Left Turn",5847292,110]
[5,"LIC","Yes","No","Other Object",141864,7]
[6,"FRA","No","No","Fixed Object",13806494,206]
[1,"WYA","No","Yes","Other Object",32320,4]
[6,"FAY","No","Yes","Left Turn",422725,1]
[4,"TRU","No","No","Backing",2319722,100]
[2,"WOO","Yes","Yes","Pedestrian",899589,3]
[4,"STA","No","No","Pedestrian",4435017,22]
[12,"LAK","Yes","No","Head On",1165891,14]
[7,"AUG","Yes","No","Other Object",56560,7]
[4,"POR","Yes","Yes","Animal",509857,46]
[3,"ERI","Yes","No","Fixed Object",8080,1]
[9,"HIG","Yes","No","Parked Vehicle",79645,5]
[3,"ERI","Yes","No","Rear End",87725,6]
[10,"GAL","Yes","Yes","Fixed Object",1036018,37]
[5,"LIC","Yes","Yes","Other Object",120045,10]
[10,"WAS","Yes","No","Left Turn",2302402,59]
[7,"DAR","Yes","No","Sideswipe - Passing",126859,10]
[9,"LAW","Yes","Yes","Other Object",72720,9]
[4,"MAH","No","No","Left Turn",4439075,137]
[11,"TUS","Yes","No","Sideswipe - Passing",6191888,469]
[8,"WAR","Yes","No","Parked Vehicle",3726121,235]
[4,"TRU","Yes","No","Rear End",89480359,4156]
[5,"LIC","No","Yes","Other Non-Collision",983594,55]
[4,"POR","Yes","No","Right Turn",4544387,278]
[2,"SEN","Yes","No","Right Turn",524973,39]
[3,"ERI","Yes","Yes","Animal",1777484,190]
[11,"COL","No","Yes","Animal",1534297,120]
[7,"SHE","Yes","No","Head On",8080,1]
[2,"WIL","Yes","Yes","Backing",8080,1]
[8,"BUT","Yes","Yes","Angle",1434949,49]
[6,"DEL","Yes","No","Animal",167370,11]
[10,"MRG","No","No","Fixed Object",24410292,419]
[7,"MIA","Yes","Yes","Backing",64640,8]
[1,"VAN","No","No","Other Non-Collision",2138167,79]
[11,"BEL","Yes","No","Angle",9612463,349]
[8,"HAM","Yes","Yes","Right Turn",4646626,165]
[10,"MRG","No","No","Rear End",3354805,94]
[7,"MIA","No","No","Other Non-Collision",2732093,41]
[6,"FRA","Yes","Yes","Head On",8890180,120]
[6,"FRA","Yes","Yes","Train",54139,1]
[9,"HIG","No","No","Overturning",6157265,62]
[11,"TUS","Yes","No","Other Non-Collision",24240,3]
[10,"NOB","No","No","Other Object",40400,5]
[6,"MRW","No","No","Left Turn",7399864,189]
[6,"FAY","Yes","No","Sideswipe - Meeting",16160,2]
[2,"SAN","No","No","Sideswipe - Meeting",438885,3]
[1,"HAN","Yes","No","Other Non-Collision",1101107,63]
[2,"HEN","Yes","No","Angle",4847466,151]
[9,"ROS","Yes","No","Sideswipe - Passing",70299,3]
[7,"AUG","Yes","No","Animal",185840,23]
[2,"FUL","Yes","Yes","Animal",48480,6]
[4,"ATB","No","Yes","Backing",56560,7]
[3,"CRA","No","No","Sideswipe - Meeting",141864,7]
[7,"AUG","No","No","Parked Vehicle",840126,25]
[8,"CLI","Yes","No","Sideswipe - Meeting",47325,1]
[1,"DEF","Yes","No","Right Turn",8080,1]
[8,"WAR","Yes","Yes","Head On",539083,4]
[9,"ADA","No","No","Right Turn",1031736,39]
[8,"PRE","No","Yes","Pedestrian",155603,3]
[2,"HEN","No","No","Animal",8548776,963]
[10,"MEG","No","Yes","Rear End",8080,1]
[4,"STA","Yes","No","Pedalcycles",117624,4]
[3,"CRA","Yes","Yes","Left Turn",8080,1]
[2,"OTT","Yes","Yes","Angle",124438,4]
[6,"DEL","Yes","Yes","Overturning",617462,8]
[11,"COL","Yes","No","Sideswipe - Meeting",438885,3]
[7,"MOT","Yes","No","Backing",1120954,72]
[7,"LOG","Yes","No","Right Turn",54139,1]
[6,"MAR","Yes","No","Overturning",1562290,24]
[7,"MIA","Yes","Yes","Unknown",32320,4]
[1,"PUT","Yes","No","Angle",2336624,40]
[1,"HAR","No","No","Other Non-Collision",1050206,51]
[4,"POR","Yes","No","Head On",6073116,67]
[1,"PAU","Yes","No","Rear End",70299,3]
[11,"COL","Yes","No","Left Turn",1853021,83]
[1,"ALL","Yes","No","Overturning",2691357,44]
[10,"ATH","No","No","Right Turn",829625,18]
[7,"MOT","No","No","Head On",1802267,18]
[6,"MRW","No","Yes","Head On",487365,9]
[3,"RIC","Yes","No","Overturning",8080,1]
[4,"STA","Yes","No","Parked Vehicle",1960820,124]
[2,"FUL","No","No","Sideswipe - Meeting",422725,1]
[9,"LAW","No","No","Pedestrian",845450,2]
[12,"LAK","Yes","Yes","Other Non-Collision",609122,34]
[4,"STA","Yes","Yes","Backing",184685,18]
[7,"MIA","Yes","Yes","Animal",700201,59]
[11,"JEF","Yes","No","Animal",552789,53]
[12,"LAK","No","Yes","Fixed Object",4161458,140]
[4,"MAH","Yes","No","Unknown",55405,2]
[4,"SUM","Yes","No","Pedalcycles",3098923,37]
[5,"MUS","Yes","No","Rear End",255095,17]
[9,"ADA","No","No","Fixed Object",52593123,1247]
[3,"MED","Yes","No","Unknown",111965,9]
[12,"LAK","No","Yes","Rear End",5654975,135]
[10,"WAS","Yes","No","Other Non-Collision",199579,19]
[2,"WOO","Yes","No","Backing",16160,2]
[7,"CHP","No","Yes","Sideswipe - Passing",63485,3]
[11,"JEF","Yes","No","Pedestrian",54139,1]
[3,"ERI","Yes","No","Other Object",315937,22]
[4,"MAH","Yes","No","Backing",704370,31]
[4,"POR","Yes","Yes","Fixed Object",330942,19]
[11,"COL","Yes","Yes","Sideswipe - Passing",388768,27]
[8,"BUT","No","No","Unknown",72720,9]
[4,"SUM","No","No","Pedalcycles",54139,1]
[8,"CLE","Yes","No","Fixed Object",82591340,2703]
[7,"AUG","Yes","No","Unknown",16160,2]
[5,"FAI","Yes","No","Fixed Object",1297221,67]
[7,"MOT","Yes","Yes","Unknown",8080,1]
[2,"FUL","Yes","No","Pedestrian",8080,1]
[7,"LOG","No","Yes","Sideswipe - Passing",800621,52]
[3,"ERI","Yes","Yes","Sideswipe - Passing",252563,15]
[3,"MED","Yes","No","Overturning",539083,4]
[7,"MOT","Yes","Yes","Overturning",133784,6]
[3,"HUR","Yes","No","Angle",3473735,110]
[10,"WAS","Yes","No","Head On",1603510,16]
[10,"WAS","Yes","No","Train",8080,1]
[10,"WAS","No","Yes","Unknown",16160,2]
[5,"FAI","Yes","No","Pedestrian",116358,3]
[1,"PAU","No","No","Right Turn",973575,13]
[11,"COL","Yes","No","Head On",2458863,30]
[11,"COL","Yes","No","Train",422725,1]
[6,"FRA","No","No","Backing",853159,34]
[7,"CHP","Yes","No","Rear End",463125,6]
[8,"BUT","Yes","No","Pedestrian",33258741,238]
[11,"HOL","No","No","Other Non-Collision",2315027,35]
[3,"LOR","Yes","Yes","Other Object",714389,73]
[8,"PRE","Yes","No","Sideswipe - Passing",2300435,105]
[3,"MED","Yes","No","Angle",7690632,312]
[4,"TRU","Yes","No","Right Turn",8722156,484]
[12,"GEA","Yes","No","Sideswipe - Passing",982885,64]
[7,"SHE","No","Yes","Sideswipe - Passing",3194251,113]
[7,"SHE","Yes","Yes","Overturning",971154,7]
[8,"CLE","Yes","No","Rear End",139165939,6745]
[8,"GRE","No","Yes","Angle",8080,1]
[7,"AUG","Yes","No","Sideswipe - Meeting",8080,1]
[3,"ASD","No","Yes","Other Non-Collision",218160,27]
[6,"MAD","Yes","No","Pedestrian",1056458,7]
[7,"SHE","Yes","No","Angle",267568,12]
[4,"STA","Yes","No","Other Non-Collision",834578,26]
[5,"GUE","Yes","Yes","Left Turn",16160,2]
[2,"OTT","Yes","No","Angle",1183874,27]
[4,"POR","Yes","No","Animal",56560,7]
[6,"FAY","No","Yes","Parked Vehicle",548429,6]
[2,"SEN","Yes","No","Backing",1459015,166]
[4,"SUM","Yes","No","Right Turn",581644,42]
[2,"HEN","Yes","Yes","Angle",116358,3]
[9,"HIG","Yes","No","Unknown",16160,2]
[7,"CLA","No","Yes","Right Turn",102619,7]
[8,"HAM","Yes","Yes","Pedalcycles",70299,3]
[5,"KNO","No","No","Unknown",87725,6]
[3,"WAY","No","No","Fixed Object",68330858,1798]
[2,"SAN","Yes","No","Fixed Object",8255411,282]
[8,"WAR","Yes","Yes","Sideswipe - Passing",1067261,85]
[7,"MOT","Yes","Yes","Backing",94539,6]
[5,"LIC","Yes","Yes","Left Turn",8080,1]
[10,"MOE","Yes","No","Unknown",8080,1]
[2,"FUL","Yes","No","Head On",1150886,17]
[5,"LIC","Yes","No","Pedalcycles",6117865,77]
[3,"LOR","Yes","No","Overturning",55405,2]
[2,"HEN","Yes","No","Other Object",16160,2]
[3,"CRA","Yes","No","Pedestrian",593222,5]
[4,"MAH","No","Yes","Fixed Object",10970122,448]
[4,"MAH","Yes","No","Left Turn",42206682,1255]
[1,"HAR","No","No","Overturning",3084405,39]
[5,"FAI","No","Yes","Sideswipe - Passing",1615241,73]
[9,"LAW","Yes","No","Animal",1081820,68]
[3,"LOR","Yes","No","Sideswipe - Passing",26947327,1469]
[6,"UNI","Yes","No","Pedestrian",1050910,8]
[8,"CLI","Yes","No","Rear End",63485,3]
[11,"TUS","Yes","No","Other Non-Collision",980018,44]
[8,"GRE","Yes","Yes","Angle",126970,6]
[3,"LOR","No","No","Head On",8947595,91]
[3,"LOR","No","No","Train",55405,2]
[8,"HAM","Yes","No","Animal",161600,20]
[11,"HAS","No","No","Parked Vehicle",1773301,33]
[10,"ATH","Yes","No","Right Turn",8080,1]
[7,"DAR","No","No","Fixed Object",43631935,1222]
[3,"WAY","Yes","Yes","Other Object",63485,3]
[6,"FAY","No","Yes","Head On",132518,5]
[10,"WAS","Yes","Yes","Other Non-Collision",71565,4]
[10,"HOC","Yes","No","Parked Vehicle",125704,5]
[10,"VIN","No","No","Right Turn",103885,8]
[1,"ALL","Yes","No","Left Turn",24240,3]
[4,"POR","Yes","Yes","Head On",54139,1]
[4,"SUM","Yes","No","Angle",275690758,9341]
[5,"FAI","Yes","No","Rear End",1098908,49]
[12,"LAK","Yes","Yes","Sideswipe - Passing",19422842,864]
[4,"MAH","Yes","No","Angle",564589,8]
[10,"HOC","Yes","Yes","Animal",987505,84]
[3,"HUR","Yes","No","Rear End",7855180,405]
[7,"AUG","No","No","Pedalcycles",162417,3]
[11,"TUS","Yes","No","Pedestrian",62219,2]
[10,"MEG","No","No","Sideswipe - Passing",2046974,54]
[5,"GUE","Yes","No","Fixed Object",70299,3]
[4,"POR","Yes","Yes","Unknown",8080,1]
[11,"COL","Yes","No","Rear End",6146815,304]
[7,"MIA","No","Yes","Other Non-Collision",48480,6]
[5,"LIC","Yes","No","Left Turn",9017633,204]
[4,"STA","No","No","Animal",11762774,813]
[2,"LUC","Yes","Yes","Parked Vehicle",422725,1]
[3,"RIC","No","No","Unknown",56560,7]
[8,"WAR","Yes","No","Other Non-Collision",974805,63]
[3,"MED","Yes","No","Pedestrian",2003372,11]
[11,"JEF","Yes","Yes","Fixed Object",8080,1]
[10,"NOB","No","Yes","Other Object",126859,10]
[9,"BRO","Yes","No","Other Non-Collision",32320,4]
[7,"DAR","Yes","Yes","Other Object",16160,2]
[6,"FRA","Yes","No","Left Turn",13268009,336]
[3,"LOR","Yes","Yes","Pedestrian",476864,2]
[8,"GRE","No","Yes","Pedestrian",422725,1]
[8,"WAR","Yes","Yes","Parked Vehicle",78379,4]
[5,"LIC","Yes","Yes","Pedestrian",54139,1]
[4,"MAH","No","No","Parked Vehicle",827764,26]
[5,"LIC","Yes","No","Left Turn",364639,20]
[3,"CRA","Yes","Yes","Rear End",540349,5]
[1,"VAN","Yes","No","Overturning",1479072,12]
[10,"WAS","No","Yes","Animal",1045331,92]
[7,"AUG","Yes","Yes","Left Turn",430805,2]
[10,"ATH","No","No","Parked Vehicle",1744557,40]
[2,"WIL","No","Yes","Head On",70299,3]
[7,"MOT","Yes","Yes","Overturning",5973737,79]
[7,"AUG","Yes","Yes","Head On",54139,1]
[4,"ATB","Yes","Yes","Parked Vehicle",24240,3]
[2,"LUC","Yes","No","Parked Vehicle",1298714,94]
[7,"LOG","Yes","Yes","Head On",8080,1]
[8,"WAR","Yes","Yes","Left Turn",24240,3]
[5,"KNO","Yes","No","Left Turn",2063880,111]
[7,"CLA","Yes","No","Pedestrian",47325,1]
[3,"MED","No","Yes","Backing",64640,8]
[4,"TRU","Yes","No","Sideswipe - Meeting",116358,3]
[2,"WIL","Yes","No","Fixed Object",3615821,109]
[2,"FUL","No","No","Pedestrian",4169870,16]
[2,"SEN","Yes","No","Right Turn",1634753,64]
[9,"HIG","Yes","No","Animal",32320,4]
[3,"MED","Yes","No","Sideswipe - Passing",552005,17]
[3,"HUR","Yes","No","Sideswipe - Meeting",126859,10]
[12,"CUY","No","Yes","Unknown",47325,1]
[6,"FAY","No","No","Parked Vehicle",276803,18]
[6,"FRA","Yes","Yes","Left Turn",693271,29]
[3,"MED","Yes","Yes","Angle",430805,2]
[7,"LOG","Yes","No","Pedestrian",2907800,22]
[8,"GRE","No","No","Pedestrian",1454234,14]
[6,"FAY","Yes","No","Left Turn",2698693,77]
[7,"AUG","No","No","Right Turn",776752,18]
[3,"MED","No","Yes","Unknown",56560,7]
[4,"ATB","Yes","No","Overturning",1009133,6]
[8,"WAR","Yes","No","Rear End",1904590,101]
[9,"LAW","Yes","Yes","Angle",3472129,57]
[4,"STA","No","No","Sideswipe - Meeting",907669,4]
[10,"WAS","Yes","Yes","Sideswipe - Passing",721347,16]
[8,"PRE","Yes","No","Angle",666053,10]
[7,"CLA","Yes","No","Overturning",2057621,34]
[1,"VAN","Yes","No","Fixed Object",6139296,234]
[2,"OTT","Yes","Yes","Fixed Object",70299,3]
[4,"TRU","Yes","Yes","Sideswipe - Meeting",422725,1]
[5,"GUE","Yes","No","Sideswipe - Passing",3446897,211]
[2,"LUC","Yes","Yes","Fixed Object",4562400,95]
[1,"WYA","No","No","Other Object",576245,20]
[2,"SAN","Yes","No","Overturning",571514,4]
[6,"PIC","No","Yes","Angle",47325,1]
[9,"LAW","Yes","No","Backing",40400,5]
[6,"UNI","Yes","No","Other Object",24240,3]
[4,"STA","Yes","Yes","Angle",3634172,87]
[4,"POR","Yes","No","Unknown",16160,2]
[3,"LOR","No","No","Fixed Object",52687731,1126]
[2,"SAN","No","No","Pedestrian",585142,4]
[7,"DAR","Yes","No","Pedestrian",54139,1]
[5,"MUS","No","Yes","Other Object",315120,39]
[8,"PRE","No","No","Right Turn",1068449,37]
[8,"CLI","No","Yes","Left Turn",8080,1]
[4,"ATB","No","Yes","Unknown",16160,2]
[1,"HAN","Yes","No","Backing",185840,23]
[12,"CUY","No","No","Angle",1686133,37]
[8,"WAR","Yes","No","Rear End",20532194,916]
[5,"MUS","No","Yes","Angle",149944,8]
[9,"PIK","Yes","No","Sideswipe - Passing",2532594,101]
[3,"CRA","Yes","No","Other Object",56560,7]
[7,"AUG","Yes","No","Angle",4532200,139]
[3,"ERI","Yes","No","Other Non-Collision",32320,4]
[3,"RIC","Yes","No","Sideswipe - Passing",18169666,1029]
[4,"SUM","Yes","No","Sideswipe - Passing",48480,6]
[8,"CLI","No","Yes","Parked Vehicle",40400,5]
[2,"SAN","Yes","Yes","Rear End",1328757,35]
[11,"BEL","No","No","Backing",1421853,150]
[3,"MED","No","No","Other Object",256139,26]
[2,"SEN","Yes","No","Parked Vehicle",2402350,155]
[9,"SCI","Yes","Yes","Angle",8080,1]
[10,"ATH","No","Yes","Left Turn",54139,1]
[3,"ERI","Yes","No","Fixed Object",86459,5]
[10,"MOE","No","No","Animal",1093138,58]
[8,"GRE","No","No","Rear End",10526785,360]
[3,"CRA","Yes","No","Angle",5119505,206]
[11,"TUS","Yes","Yes","Pedalcycles",116358,3]
[2,"FUL","Yes","No","Angle",1537455,30]
[10,"HOC","No","No","Overturning",7108574,90]
[5,"LIC","No","No","Pedalcycles",2434177,13]
[9,"HIG","Yes","No","Other Object",16160,2]
[2,"WOO","Yes","Yes","Rear End",11969636,464]
[6,"FAY","Yes","Yes","Left Turn",8080,1]
[10,"MOE","Yes","No","Left Turn",971154,7]
[3,"CRA","Yes","No","Sideswipe - Meeting",16160,2]
[4,"ATB","No","No","Other Object",357603,28]
[5,"LIC","Yes","No","Head On",16160,2]
[5,"LIC","Yes","No","Train",8080,1]
[8,"GRE","No","No","Fixed Object",42931814,1153]
[1,"DEF","No","No","Overturning",5619932,54]
[6,"FAY","Yes","No","Fixed Object",4958057,167]
[6,"DEL","No","Yes","Head On",202928,4]
[11,"CAR","No","No","Other Object",72720,9]
[7,"SHE","Yes","No","Unknown",64640,8]
[10,"HOC","No","Yes","Sideswipe - Passing",1099614,36]
[8,"WAR","Yes","No","Fixed Object",43774496,1408]
[5,"COS","Yes","No","Rear End",32320,4]
[5,"COS","No","No","Fixed Object",36395789,679]
[7,"MOT","No","No","Sideswipe - Meeting",446965,4]
[10,"GAL","Yes","Yes","Parked Vehicle",16160,2]
[7,"AUG","Yes","No","Pedalcycles",225902,6]
[10,"GAL","Yes","No","Fixed Object",377001,19]
[9,"LAW","Yes","No","Unknown",8080,1]
[11,"JEF","No","Yes","Sideswipe - Passing",565744,13]
[3,"ASD","Yes","Yes","Other Non-Collision",40400,5]
[6,"UNI","No","Yes","Head On",1019745,9]
[6,"FRA","Yes","Yes","Rear End",9736934,496]
[3,"RIC","Yes","Yes","Other Non-Collision",625509,62]
[4,"POR","Yes","No","Unknown",16160,2]
[2,"FUL","Yes","No","Parked Vehicle",411853,25]
[4,"TRU","No","Yes","Rear End",2783066,94]
[10,"MEG","No","No","Other Non-Collision",965495,12]
[1,"ALL","Yes","No","Unknown",24240,3]
[2,"LUC","Yes","No","Other Non-Vehicle",8080,1]
[6,"MAD","Yes","No","Sideswipe - Meeting",48480,6]
[6,"FAY","No","Yes","Rear End",2869899,72]
[6,"FAY","Yes","No","Rear End",6282276,348]
[6,"PIC","No","Yes","Other Object",126859,10]
[11,"BEL","Yes","No","Sideswipe - Passing",118890,5]
[8,"BUT","No","No","Animal",7867608,616]
[1,"DEF","Yes","No","Pedalcycles",1447420,14]
[4,"MAH","No","No","Fixed Object",43399929,1067]
[2,"SAN","Yes","Yes","Fixed Object",1818989,64]
[3,"ERI","Yes","Yes","Other Non-Collision",8080,1]
[3,"LOR","Yes","No","Pedestrian",22486209,146]
[7,"DAR","Yes","No","Angle",556509,7]
[5,"MUS","Yes","No","Backing",3833668,341]
[2,"SAN","Yes","No","Angle",476864,2]
[5,"GUE","No","Yes","Pedestrian",422725,1]
[9,"ROS","Yes","Yes","Overturning",499129,13]
[11,"COL","No","No","Other Object",153520,19]
[8,"BUT","Yes","No","Animal",6380156,562]
[4,"MAH","No","Yes","Parked Vehicle",160445,15]
[4,"MAH","Yes","No","Parked Vehicle",143019,12]
[10,"WAS","Yes","No","Left Turn",101464,2]
[10,"GAL","No","Yes","Overturning",531003,3]
[3,"ERI","Yes","No","Other Object",24240,3]
[10,"WAS","No","No","Angle",12040266,172]
[3,"LOR","Yes","Yes","Animal",64640,8]
[7,"MIA","Yes","No","Sideswipe - Meeting",8080,1]
[3,"ERI","Yes","No","Head On",5698051,85]
[3,"ERI","Yes","No","Train",470050,2]
[8,"WAR","No","No","Parked Vehicle",815069,39]
[3,"MED","Yes","Yes","Other Non-Collision",126859,10]
[3,"CRA","No","No","Angle",7415238,125]
[5,"GUE","Yes","No","Rear End",198535,10]
[2,"LUC","Yes","No","Animal",11166553,1000]
[4,"SUM","No","No","Backing",183419,17]
[10,"VIN","Yes","No","Animal",151210,9]
[7,"CLA","Yes","No","Right Turn",16160,2]
[12,"GEA","Yes","No","Other Non-Collision",8080,1]
[4,"MAH","No","Yes","Rear End",7964861,230]
[3,"WAY","Yes","No","Head On",2027612,14]
[8,"GRE","No","No","Sideswipe - Meeting",455045,5]
[4,"SUM","Yes","Yes","Backing",1036578,51]
[4,"ATB","Yes","Yes","Other Non-Collision",16160,2]
[8,"CLE","Yes","Yes","Angle",932466,17]
[4,"SUM","Yes","Yes","Pedestrian",54139,1]
[11,"BEL","No","Yes","Fixed Object",5963651,169]
[3,"WAY","Yes","Yes","Angle",108278,2]
[3,"LOR","No","No","Left Turn",13426323,261]
[1,"HAR","Yes","No","Sideswipe - Passing",191610,14]
[3,"MED","Yes","Yes","Sideswipe - Passing",48480,6]
[2,"SEN","Yes","No","Parked Vehicle",8080,1]
[6,"FRA","Yes","No","Parked Vehicle",15483557,1343]
[3,"WAY","Yes","Yes","Other Non-Collision",48480,6]
[12,"CUY","No","No","Other Object",62219,2]
[1,"ALL","Yes","No","Fixed Object",37683987,1203]
[3,"LOR","Yes","No","Angle",85967201,2566]
[10,"HOC","Yes","No","Other Non-Collision",8080,1]
[8,"WAR","Yes","No","Sideswipe - Meeting",8080,1]
[11,"COL","Yes","No","Angle",12269298,371]
[7,"LOG","Yes","No","Other Object",16160,2]
[5,"FAI","No","Yes","Parked Vehicle",24240,3]
[7,"MIA","Yes","Yes","Angle",430805,2]
[10,"VIN","No","No","Rear End",3346760,70]
[4,"MAH","No","Yes","Left Turn",178577,5]
[8,"BUT","Yes","Yes","Sideswipe - Passing",55405,2]
[7,"SHE","Yes","Yes","Head On",8080,1]
[4,"ATB","Yes","No","Other Object",102619,7]
[7,"CHP","No","No","Other Non-Collision",1654040,59]
[8,"CLE","No","No","Other Object",210080,26]
[8,"HAM","No","Yes","Pedestrian",422725,1]
[8,"WAR","Yes","Yes","Fixed Object",8145047,292]
[10,"ATH","No","Yes","Fixed Object",884102,41]
[11,"BEL","Yes","Yes","Angle",8080,1]
[12,"CUY","Yes","Yes","Sideswipe - Passing",7524801,404]
[7,"LOG","No","Yes","Overturning",869690,5]
[4,"STA","Yes","Yes","Fixed Object",676554,17]
[5,"FAI","Yes","No","Pedestrian",2207566,16]
[9,"JAC","No","Yes","Sideswipe - Passing",24240,3]
[7,"SHE","No","Yes","Angle",16160,2]
[6,"PIC","Yes","No","Sideswipe - Passing",194737,7]
[5,"GUE","No","No","Pedalcycles",54139,1]
[5,"FAI","Yes","Yes","Head On",8080,1]
[12,"GEA","No","No","Other Object",379422,25]
[7,"AUG","No","Yes","Rear End",3234349,47]
[4,"STA","Yes","No","Angle",186105396,5842]
[1,"WYA","Yes","No","Rear End",4891370,126]
[1,"HAR","Yes","No","Other Non-Collision",745587,19]
[3,"RIC","Yes","No","Sideswipe - Meeting",422725,1]
[4,"SUM","Yes","No","Other Object",2310010,163]
[4,"STA","No","No","Rear End",18256925,649]
[1,"HAN","Yes","Yes","Parked Vehicle",86459,5]
[4,"SUM","Yes","Yes","Other Non-Collision",1297332,63]
[6,"MAR","No","Yes","Angle",8080,1]
[8,"CLE","No","No","Angle",27584647,500]
[12,"LAK","No","Yes","Right Turn",8080,1]
[5,"FAI","Yes","No","Head On",8267170,113]
[6,"MAR","No","No","Sideswipe - Meeting",422725,1]
[10,"VIN","No","No","Left Turn",1972431,34]
[3,"CRA","Yes","No","Backing",24240,3]
[11,"JEF","Yes","No","Head On",430805,2]
[5,"PER","Yes","No","Angle",16160,2]
[4,"STA","Yes","Yes","Rear End",32320,4]
[1,"WYA","Yes","No","Left Turn",1739117,33]
[10,"GAL","Yes","Yes","Overturning",132518,5]
[6,"FAY","Yes","No","Angle",8080,1]
[6,"PIC","Yes","No","Other Non-Collision",761747,21]
[6,"DEL","Yes","No","Backing",4055845,359]
[2,"WOO","No","No","Head On",4780147,55]
[2,"WOO","No","No","Train",532269,4]
[4,"STA","Yes","No","Animal",56560,7]
[7,"MOT","Yes","Yes","Parked Vehicle",2842083,58]
[6,"FAY","No","Yes","Fixed Object",5461582,178]
[1,"VAN","Yes","No","Parked Vehicle",1415183,93]
[7,"SHE","Yes","No","Animal",2583179,314]
[5,"PER","No","No","Angle",14866860,238]
[7,"MOT","Yes","No","Backing",20690412,1844]
[8,"GRE","Yes","No","Other Object",16160,2]
[8,"WAR","Yes","No","Left Turn",1240769,52]
[2,"FUL","No","No","Rear End",12305227,333]
[4,"SUM","No","No","Fixed Object",10436314,259]
[7,"MOT","Yes","No","Rear End",2050628,114]
[4,"MAH","Yes","No","Animal",32320,4]
[12,"CUY","Yes","Yes","Head On",11149875,168]
[12,"CUY","Yes","Yes","Train",8080,1]
[2,"WOO","Yes","Yes","Left Turn",70299,3]
[10,"MOE","Yes","No","Fixed Object",1245425,23]
[10,"VIN","No","No","Fixed Object",27450131,567]
[7,"AUG","Yes","Yes","Other Object",32320,4]
[10,"HOC","Yes","No","Backing",652170,71]
[3,"ASD","No","Yes","Sideswipe - Passing",4861656,195]
[7,"MIA","No","No","Sideswipe - Passing",2485715,114]
[2,"WOO","Yes","Yes","Fixed Object",14005788,482]
[4,"TRU","No","Yes","Fixed Object",4820101,185]
[9,"ROS","Yes","No","Animal",2073912,225]
[3,"ASD","Yes","No","Parked Vehicle",32320,4]
[6,"DEL","No","No","Sideswipe - Meeting",446965,4]
[4,"MAH","No","Yes","Head On",971154,7]
[5,"FAI","Yes","No","Right Turn",120045,10]
[10,"ATH","No","Yes","Parked Vehicle",8080,1]
[4,"SUM","No","No","Parked Vehicle",80800,10]
[12,"LAK","Yes","No","Sideswipe - Meeting",8080,1]
[3,"ERI","No","Yes","Sideswipe - Passing",8346565,352]
[6,"FRA","No","No","Parked Vehicle",446594,35]
[2,"OTT","Yes","No","Pedalcycles",1063272,7]
[5,"COS","Yes","No","Animal",322045,35]
[4,"POR","Yes","Yes","Parked Vehicle",245860,11]
[1,"ALL","No","Yes","Angle",124438,4]
[11,"JEF","Yes","Yes","Other Object",264330,23]
[10,"HOC","Yes","No","Unknown",24240,3]
[11,"BEL","No","Yes","Overturning",1218764,14]
[9,"HIG","Yes","No","Sideswipe - Passing",1804433,85]
[10,"ATH","No","Yes","Rear End",283728,14]
[3,"MED","No","Yes","Other Non-Collision",613742,54]
[7,"CLA","No","No","Fixed Object",32272797,758]
[1,"HAN","No","No","Animal",16437283,1635]
[12,"LAK","Yes","Yes","Parked Vehicle",967207,27]
[2,"HEN","No","Yes","Rear End",1041453,10]
[5,"GUE","No","No","Right Turn",1068114,19]
[8,"CLE","Yes","Yes","Other Object",721203,73]
[8,"BUT","Yes","Yes","Other Object",1373262,148]
[4,"ATB","No","No","Angle",34017711,443]
[4,"SUM","Yes","No","Other Non-Collision",422725,1]
[6,"DEL","No","No","Pedestrian",1327153,12]

{"sheet":"Import","index":8,"n_rows":63,"n_cols":75,"rows_kept":63,"cut":false,"hidden":true,"merged":[[0,0,0,1]]}
["Application ID:",null,{"$f":"IF('Safety Application'!A115=\"\",\"Not Assigned\",'Safety Application'!A115)","v":"Not Assigned"}]
[]
[]
["General Application Data"]
["https://extranet.dot.state.oh.us/divisions/Planning/plan/HSIP_applications/Lists/AppData/ImportView.aspx"]
["Title","Cycle","AppID","District","CountyCd","Sponsor","Project Name","PID","ProjectManager","PM_Phone","PM_Email","Applicant_Name","Applicant_Title","Applicant_Phone","ApplicationDt","RouteNbr","RouteName","Blog","Elog","FolderPath"]
[{"$f":"C7","v":"Not Assigned"},{"$f":"LEFT(C7,6)","v":"Not As"},{"$f":"C1","v":"Not Assigned"},{"$f":"'Safety Application'!C10","v":12},{"$f":"LEFT('Safety Application'!H10,3)","v":"CUY"},{"$f":"IF('Safety Application'!D2=\"\",\"\",'Safety Application'!D2)","v":"ODOT District 12"},{"$f":"IF('Safety Application'!D3=\"\",\"\",'Safety Application'!D3)","v":"CUY-271-9.28 Safety Application"},{"$f":"IF('Safety Application'!D4=\"\",\"\",'Safety Application'!D4)","v":113156},{"$f":"IF('Safety Application'!D5=\"\",\"\",'Safety Application'!D5)","v":"Brian Blayney, D12 Traffic Planning Engineer"},{"$f":"IF('Safety Application'!D6=\"\",\"\",'Safety Application'!D6)","v":"216-584-2108"},{"$f":"IF('Safety Application'!D7=\"\",\"\",'Safety Application'!D7)","v":"Brian.Blayney@dot.ohio.gov"},{"$f":"IF('Safety Application'!A106=\"\",\"\",'Safety Application'!A106)","v":"John Picuri, P.E."},{"$f":"IF('Safety Application'!F106=\"\",\"\",'Safety Application'!F106)","v":"District 12 Deputy Director"},{"$f":"'Safety Application'!I106","v":"216-584-2108"},{"$f":"IF('Safety Application'!I108=\"\",\"\",MONTH('Safety Application'!I108)&\"/\"&DAY('Safety Application'!I108)&\"/\"&YEAR('Safety Application'!I108))","v":{"$error":"#VALUE!"}},{"$f":"'Safety Application'!C11","v":"IR-271*"},{"$f":"'Safety Application'!H11","v":"Interstate Route 271"},{"$f":"'Safety Application'!C12","v":9.36},{"$f":"'Safety Application'!H12","v":11.29},{"$f":"IF(LEFT('Safety Application'!A117,1)=\"\\\",'Safety Application'!A117,\"\\\\itcfs007.dot.state.oh.us\\odrive\"&MID('Safety Application'!A117,FIND(\"\\\",'Safety Application'!A117,1),100))","v":{"$error":"#VALUE!"}}]
[]
[]
["Project Priority"]
["https://extranet.dot.state.oh.us/divisions/Planning/plan/HSIP_applications/Lists/PriorityInfo/ImportView.aspx"]
["AppID","PriorityText"]
[{"$f":"C1","v":"Not Assigned"},{"$f":"IF('Safety Application'!A22=\"\",\"\",'Safety Application'!A22)","v":"The following segment rankings were found on I-271 within the safety improvement area according to the 2018 HSIP Safety Priority Rankings:\n\n- Urban Freeway Segments #12, #62, #350, #458, #833 and #1173\n- Urban Ramp Segments #98 and #359"}]
[]
[]
["Application Summary of Crash Patterns and Recommended Countermeasures"]
["https://extranet.dot.state.oh.us/divisions/Planning/plan/HSIP_applications/Lists/CrashPatterns/ImportView.aspx"]
["AppID","SummaryText","RecCountermeasure"]
[{"$f":"A13","v":"Not Assigned"},{"$f":"'Safety Application'!A18","v":"A total of 296 crashes were found to occur in the northbound direction during the years 2017, 2018 and 2019, including 6 serious injury crashes and 103 total injury crashes (approximately 35% of the total).  285 of the crashes (96%l) were either rear-end, sideswipe - passing or fixed object crashes and these crash types include all 6 serious injury crashes. The rear-end crashes are mainly occurring in the area of the Cedar Road / Brainard Road exit ramp from I-271 NB.  These rear-ends are occurring due to the back up occurring during the peak hours at the I-271 NB / Cedar Road / Brainard Road ramp intersection.  The queue from this signal extends onto the I-271 NB mainline and causes rear-end crashes to occur on the ramp and freeway mainline.  A previous improvement project at the ramp terminal intersection did improve operations, but not significantly enough to eliminate the traffic queue.  The next step to attempt to mitigate this crash pattern would be to provide more storage spacing for exiting traffic to prevent motorists from queuing onto the I-271 mainline.  \n\nThe sideswipe - passing crashes appear to be occurring for two reasons.  The first is due to the typical lane changes that occur along a busy freeway segment.  The second reason appears to be due to the ramps between the I-271 NB Local and Express lanes.  Traffic in the express lanes that wish to exit onto Cedar Road / Brainard Road have approximately 3,000 feet to make the 3 necessary lanes changes to exit.  These lane changes can be difficult, especially during the peak hours.  This section is essentially one large weave section with traffic entering the local lanes on the left side, making three lane changes and exiting onto Cedar Road / Brainard Road on the right side.  While this is occurring, other traffic is also moving into the left lane to position themselves to be able to enter the express lanes via a ramp that exists north of the Cedar Road / Brainard Road interchange.  The most cost effective strategy to mitigate these sideswipe - passing crashes would be to find a way to increase the weaving distance between the two ramps discussed above.  "},{"$f":"'Safety Application'!A20","v":"The improvement plan that is being investigated would be to switch the location of the express lane ramps that exist today. Additionally, a ramp exists approximately 7,800 feet south of the interchange that allows traffic to enter the express lanes from the local lanes.  Reversing these ramps would provide I-271 NB traffic an additional 3,000’ to make the required 3 lane changes to exit I-271. Additionally, this change would increase the distance for I-271 NB traffic entering from Chagrin Boulevard to make the lane changes to access the express lanes.\n\nThe improvement plan that is being investigated is to lengthen the exit ramp and provide a second lane for traffic to exit I-271 NB.  This configuration would create one exit lane with approximately 3,600 feet of storage before the ramp split and a second with approximately 2,000 feet of storage for a combined total of nearly 5,600 feet, which is quadruple the distance provided today.  This improvement project would significantly reduce the likelihood and frequency of I-271 NB traffic queueing onto the I-271 mainline, which is frequently occurring and creates operational and safety issues along the interstate. There are two possible geometric concerns with this proposed improvement plan which was  investigated to ensure this improvement is feasible.  The first is the need to add a fifth travel lane under the Cedar Road bridge over I-271.  The geometric evaluation of the existing bridge found that five (5) 12’ travel lanes can fit under the existing bridge with 18’ of shoulder-width.  To achieve this width underneath the bridge, a concrete d-wall integral to the bridge piers would need to be constructed as part of the improvement project.  The proposed geometric layout of the improvement proposes to provide a 10’ inside shoulder width and an 8’ outside shoulder width. "}]
[]
[]
["Application Crash Data"]
["https://extranet.dot.state.oh.us/divisions/Planning/plan/HSIP_applications/Lists/CrashData/ImportView.aspx"]
["AppID","Pred_Ex_KA","Pred_Ex_B","Pred_Ex_C","Pred_Ex_O","Exp_Ex_KA","Exp_Ex_B","Exp_Ex_C","Exp_Ex_O","PSI_KA","PSI_B","PSI_C","PSI_O","Prop_Type","Prop_KA","Prop_B","Prop_C","Prop_O","Obs_KA","Obs_B","Obs_C","Obs_O","Obs_People_K","Obs_People_A","Obs_People_B","Obs_People_C"]
[{"$f":"A19","v":"Not Assigned"},{"$f":"'Safety Application'!F26","v":1.946},{"$f":"'Safety Application'!G26","v":6.6798000000000002},{"$f":"'Safety Application'!H26","v":9.0298999999999996},{"$f":"'Safety Application'!I26","v":48.850199999999994},{"$f":"'Safety Application'!F27","v":2.1027},{"$f":"'Safety Application'!G27","v":7.2898000000000005},{"$f":"'Safety Application'!H27","v":10.046100000000001},{"$f":"'Safety Application'!I27","v":55.385999999999989},{"$f":"'Safety Application'!F28","v":0.15670000000000006},{"$f":"'Safety Application'!G28","v":0.61000000000000032},{"$f":"'Safety Application'!H28","v":1.0162000000000013},{"$f":"'Safety Application'!I28","v":6.5357999999999947},{"$f":"IF(ScoringCalculations!$AB$1=\"ECAT - Change in base SPF\",\"Predicted\",\"Expected\")","v":"Predicted"},{"$f":"'Safety Application'!F29","v":1.7834999999999999},{"$f":"'Safety Application'!G29","v":5.9057000000000013},{"$f":"'Safety Application'!H29","v":7.8929000000000009},{"$f":"'Safety Application'!I29","v":43.176400000000001},{"$f":"'Safety Application'!F30","v":0},{"$f":"'Safety Application'!G30","v":13},{"$f":"'Safety Application'!H30","v":19.333300000000001},{"$f":"'Safety Application'!I30","v":66.333299999999994},{"$f":"'Safety Application'!F33","v":0},{"$f":"'Safety Application'!G33","v":2},{"$f":"'Safety Application'!H33","v":17},{"$f":"'Safety Application'!I33","v":29.666699999999999}]
[]
[]
["Application Scoring"]
["https://extranet.dot.state.oh.us/divisions/Planning/plan/HSIP_applications/Lists/AppScoring/ImportView.aspx"]
["AppID","Expected_Value","Expected_Points","ObservedFSI_Value","ObservedFSI_Points","PercPSI_Value","PercPSI_Points","RSI_Value","RSI_Points","EPDO_Value","EPDO_Points","VCRatio_Value","VCRatio_Points","BCRatio_Value","BCRatio_Points","FundRequest_Value","FundRequest_Points","LocEquity_Value","LocEquity_Points","BCRatio_Safety_Value","NetBenefit","NetPV_Project","NetPV_Safety"]
[{"$f":"A25","v":"Not Assigned"},null,null,{"$f":"'Safety Application'!H37","v":0.02},{"$f":"'Safety Application'!I37","v":4},{"$f":"'Safety Application'!H38","v":0.11119999999999999},{"$f":"'Safety Application'!I38","v":8},{"$f":"'Safety Application'!H39","v":33528.28},{"$f":"'Safety Application'!I39","v":12},{"$f":"'Safety Application'!H40","v":2.7},{"$f":"'Safety Application'!I40","v":8},null,null,{"$f":"'Safety Application'!I93","v":0.54},null,null,null,{"$f":"'Safety Application'!H41","v":6.9000000000000006E-2},{"$f":"'Safety Application'!I41","v":0},{"$f":"'Safety Application'!I94","v":0.99},{"$f":"'Safety Application'!I92","v":-1924279.55},{"$f":"'Safety Application'!E92","v":4206640},{"$f":"'Safety Application'!E93","v":2282360.4500000002}]
[]
[]
["Strategic Highway Safety Plan"]
["https://extranet.dot.state.oh.us/divisions/Planning/plan/HSIP_applications/Lists/SHSP/ImportView.aspx"]
["AppID","Functional Class","MajAADT","OhioEmpArea","OhioEmpSub","FHWAEmpArea","FHWA_ImprovCat","FHWA_ImprovSubCat"]
[{"$f":"A31","v":"Not Assigned"},{"$f":"'Safety Application'!D48","v":"1 - Interstates"},{"$f":"'Safety Application'!D49","v":128000},{"$f":"'Safety Application'!E54","v":"Serious Crash Types"},{"$f":"'Safety Application'!E55","v":"Intersection"},{"$f":"'Safety Application'!E56","v":"Other"},{"$f":"'Safety Application'!E57","v":"Interchange design"},{"$f":"'Safety Application'!E58","v":"Interchange design - other"}]
[]
[]
["Application Work Locations"]
["https://extranet.dot.state.oh.us/divisions/Planning/plan/HSIP_applications/Lists/WorkLocations/ImportView.aspx"]
["RouteID","AppID","Location ID","NLFID","Begin Logpoint","End Logpoint","startLatitude","startLongitude","endLatitude","endLongitude","Termini"]
[{"$f":"IF(D43=\"\",\"\",MID(D43,5,2)&\"-\"&IFERROR(MID(D43,7,5)*1,MID(D43,7,5))&IF(LEFT(D43,1)=\"S\",IF(RIGHT(D43,2)=\"*C\",\"\",MID(D43,13,1)),IF(RIGHT(D43,3)=\"**C\",\"\",MID(D43,12,1))))","v":"IR-271*"},{"$f":"IF(C43=\"\",\"\",$A$37)","v":"Not Assigned"},{"$f":"IF(D43=\"\",\"\",1)","v":1},{"$f":"IF('Safety Application'!A62=0,\"\",'Safety Application'!A62)","v":"SCUYIR00271**C\t"},{"$f":"IF(D43=\"\",\"\",'Safety Application'!C62)","v":9.36},{"$f":"IF(D43=\"\",\"\",'Safety Application'!D62)","v":11.29},{"$f":"IF(D43=\"\",\"\",'Safety Application'!E62)","v":41.470931},{"$f":"IF(D43=\"\",\"\",'Safety Application'!F62)","v":-81.488960000000006},{"$f":"IF(D43=\"\",\"\",'Safety Application'!AA62)","v":0},{"$f":"IF(D43=\"\",\"\",'Safety Application'!AB62)","v":0},{"$f":"IF(D43=\"\",\"\",'Safety Application'!G62)","v":"Approx. 1.5 miles south of Cedar/Brainard to Cedar/Brainard"}]
[{"$f":"IF(D44=\"\",\"\",MID(D44,5,2)&\"-\"&IFERROR(MID(D44,7,5)*1,MID(D44,7,5))&IF(LEFT(D44,1)=\"S\",IF(RIGHT(D44,2)=\"*C\",\"\",MID(D44,13,1)),IF(RIGHT(D44,3)=\"**C\",\"\",MID(D44,12,1))))","v":""},{"$f":"IF(C44=\"\",\"\",$A$37)","v":""},{"$f":"IF(D44=\"\",\"\",C43+1)","v":""},{"$f":"IF('Safety Application'!A63=0,\"\",'Safety Application'!A63)","v":""},{"$f":"IF(D44=\"\",\"\",'Safety Application'!C63)","v":""},{"$f":"IF(D44=\"\",\"\",'Safety Application'!D63)","v":""},{"$f":"IF(D44=\"\",\"\",'Safety Application'!E63)","v":""},{"$f":"IF(D44=\"\",\"\",'Safety Application'!F63)","v":""},null,null,{"$f":"IF(D44=\"\",\"\",'Safety Application'!G63)","v":""}]
["","",{"$f":"IF(D45=\"\",\"\",C44+1)","v":""},{"$f":"IF('Safety Application'!A64=0,\"\",'Safety Application'!A64)","v":""},{"$f":"IF(D45=\"\",\"\",'Safety Application'!C64)","v":""},{"$f":"IF(D45=\"\",\"\",'Safety Application'!D64)","v":""},{"$f":"IF(D45=\"\",\"\",'Safety Application'!E64)","v":""},{"$f":"IF(D45=\"\",\"\",'Safety Application'!F64)","v":""},null,null,{"$f":"IF(D45=\"\",\"\",'Safety Application'!G64)","v":""}]
["","","",{"$f":"IF('Safety Application'!A65=0,\"\",'Safety Application'!A65)","v":""},{"$f":"IF(D46=\"\",\"\",'Safety Application'!C65)","v":""},{"$f":"IF(D46=\"\",\"\",'Safety Application'!D65)","v":""},{"$f":"IF(D46=\"\",\"\",'Safety Application'!E65)","v":""},{"$f":"IF(D46=\"\",\"\",'Safety Application'!F65)","v":""},null,null,{"$f":"IF(D46=\"\",\"\",'Safety Application'!G65)","v":""}]
["","","",{"$f":"IF('Safety Application'!A66=0,\"\",'Safety Application'!A66)","v":""},{"$f":"IF(D47=\"\",\"\",'Safety Application'!C66)","v":""},{"$f":"IF(D47=\"\",\"\",'Safety Application'!D66)","v":""},{"$f":"IF(D47=\"\",\"\",'Safety Application'!E66)","v":""},{"$f":"IF(D47=\"\",\"\",'Safety Application'!F66)","v":""},null,null,{"$f":"IF(D47=\"\",\"\",'Safety Application'!G66)","v":""}]
["","","",{"$f":"IF('Safety Application'!A67=0,\"\",'Safety Application'!A67)","v":""},{"$f":"IF(D48=\"\",\"\",'Safety Application'!C67)","v":""},{"$f":"IF(D48=\"\",\"\",'Safety Application'!D67)","v":""},{"$f":"IF(D48=\"\",\"\",'Safety Application'!E67)","v":""},{"$f":"IF(D48=\"\",\"\",'Safety Application'!F67)","v":""},null,null,{"$f":"IF(D48=\"\",\"\",'Safety Application'!G67)","v":""}]
["","","",{"$f":"IF('Safety Application'!A68=0,\"\",'Safety Application'!A68)","v":""},{"$f":"IF(D49=\"\",\"\",'Safety Application'!C68)","v":""},{"$f":"IF(D49=\"\",\"\",'Safety Application'!D68)","v":""},{"$f":"IF(D49=\"\",\"\",'Safety Application'!E68)","v":""},{"$f":"IF(D49=\"\",\"\",'Safety Application'!F68)","v":""},null,null,{"$f":"IF(D49=\"\",\"\",'Safety Application'!G68)","v":""}]
["","","",{"$f":"IF('Safety Application'!A69=0,\"\",'Safety Application'!A69)","v":""},{"$f":"IF(D50=\"\",\"\",'Safety Application'!C69)","v":""},{"$f":"IF(D50=\"\",\"\",'Safety Application'!D69)","v":""},{"$f":"IF(D50=\"\",\"\",'Safety Application'!E69)","v":""},{"$f":"IF(D50=\"\",\"\",'Safety Application'!F69)","v":""},null,null,{"$f":"IF(D50=\"\",\"\",'Safety Application'!G69)","v":""}]
["","","",{"$f":"IF('Safety Application'!A70=0,\"\",'Safety Application'!A70)","v":""},{"$f":"IF(D51=\"\",\"\",'Safety Application'!C70)","v":""},{"$f":"IF(D51=\"\",\"\",'Safety Application'!D70)","v":""},{"$f":"IF(D51=\"\",\"\",'Safety Application'!E70)","v":""},{"$f":"IF(D51=\"\",\"\",'Safety Application'!F70)","v":""},null,null,{"$f":"IF(D51=\"\",\"\",'Safety Application'!G70)","v":""}]
["","","",{"$f":"IF('Safety Application'!A71=0,\"\",'Safety Application'!A71)","v":""},{"$f":"IF(D52=\"\",\"\",'Safety Application'!C71)","v":""},{"$f":"IF(D52=\"\",\"\",'Safety Application'!D71)","v":""},{"$f":"IF(D52=\"\",\"\",'Safety Application'!E71)","v":""},{"$f":"IF(D52=\"\",\"\",'Safety Application'!F71)","v":""},null,null,{"$f":"IF(D52=\"\",\"\",'Safety Application'!G71)","v":""}]
[]
["Project Funding"]
["https://extranet.dot.state.oh.us/divisions/Planning/plan/HSIP_applications/Lists/Funding/ImportView.aspx"]
["AppID","FY_SafetyStudy","FY_IMS","FY_PE_Enviro","FY_PE_Design","FY_ROW","FY_Const","NewSafety_AMT_SafetyStudy","NewSafety_AMT_IMS","NewSafety_AMT_PE_Enviro","NewSafety_AMT_PE_Design","NewSafety_AMT_ROW","NewSafety_AMT_Const","PrevSafety_AMT_SafetyStudy","PrevSafety_AMT_IMS","PrevSafety_AMT_PE_Enviro","PrevSafety_AMT_PE_Design","PrevSafety_AMT_ROW","PrevSafety_AMT_Const","Sponsor_AMT_SafetyStudy","Sponsor_AMT_IMS","Sponsor_AMT_PE_Enviro","Sponsor_AMT_PE_Design","Sponsor_AMT_ROW","Sponsor_AMT_Const","Alt1_Source","Alt1_AMT_SafetyStudy","Alt1_AMT_IMS","Alt1_AMT_PE_Enviro","Alt1_AMT_PE_Design","Alt1_AMT_ROW","Alt1_AMT_Const","Alt2_Source","Alt2_AMT_SafetyStudy","Alt2_AMT_IMS","Alt2_AMT_PE_Enviro","Alt2_AMT_PE_Design","Alt2_AMT_ROW","Alt2_AMT_Const","Alt3_Source","Alt3_AMT_SafetyStudy","Alt3_AMT_IMS","Alt3_AMT_PE_Enviro","Alt3_AMT_PE_Design","Alt3_AMT_ROW","Alt3_AMT_Const","Alt4_Source","Alt4_AMT_SafetyStudy","Alt4_AMT_IMS","Alt4_AMT_PE_Enviro","Alt4_AMT_PE_Design","Alt4_AMT_ROW","Alt4_AMT_Const","Alt5_Source","Alt5_AMT_SafetyStudy","Alt5_AMT_IMS","Alt5_AMT_PE_Enviro","Alt5_AMT_PE_Design","Alt5_AMT_ROW","Alt5_AMT_Const","Alt6_Source","Alt6_AMT_SafetyStudy","Alt6_AMT_IMS","Alt6_AMT_PE_Enviro","Alt6_AMT_PE_Design","Alt6_AMT_ROW","Alt6_AMT_Const","Alt7_Source","Alt7_AMT_SafetyStudy","Alt7_AMT_IMS","Alt7_AMT_PE_Enviro","Alt7_AMT_PE_Design","Alt7_AMT_ROW","Alt7_AMT_Const","AddtlDetails"]
[{"$f":"A37","v":"Not Assigned"},{"$f":"IF('Safety Application'!D75=0,\"\",'Safety Application'!D75)","v":2022},{"$f":"IF('Safety Application'!E75=0,\"\",'Safety Application'!E75)","v":2015},{"$f":"IF('Safety Application'!F75=0,\"\",'Safety Application'!F75)","v":2023},{"$f":"IF('Safety Application'!G75=0,\"\",'Safety Application'!G75)","v":2024},{"$f":"IF('Safety Application'!H75=0,\"\",'Safety Application'!H75)","v":""},{"$f":"IF('Safety Application'!I75=0,\"\",'Safety Application'!I75)","v":2025},{"$f":"IF('Safety Application'!D78=0,\"\",'Safety Application'!D78)","v":""},{"$f":"IF('Safety Application'!E78=0,\"\",'Safety Application'!E78)","v":""},{"$f":"IF('Safety Application'!F78=0,\"\",'Safety Application'!F78)","v":""},{"$f":"IF('Safety Application'!G78=0,\"\",'Safety Application'!G78)","v":""},{"$f":"IF('Safety Application'!H78=0,\"\",'Safety Application'!H78)","v":""},{"$f":"IF('Safety Application'!I78=0,\"\",'Safety Application'!I78)","v":2300000},{"$f":"IF('Safety Application'!D77=0,\"\",'Safety Application'!D77)","v":""},{"$f":"IF('Safety Application'!E77=0,\"\",'Safety Application'!E77)","v":""},{"$f":"IF('Safety Application'!F77=0,\"\",'Safety Application'!F77)","v":""},{"$f":"IF('Safety Application'!G77=0,\"\",'Safety Application'!G77)","v":""},{"$f":"IF('Safety Application'!H77=0,\"\",'Safety Application'!H77)","v":""},{"$f":"IF('Safety Application'!I77=0,\"\",'Safety Application'!I77)","v":""},{"$f":"IF('Safety Application'!D79=0,\"\",'Safety Application'!D79)","v":""},{"$f":"IF('Safety Application'!E79=0,\"\",'Safety Application'!E79)","v":""},{"$f":"IF('Safety Application'!F79=0,\"\",'Safety Application'!F79)","v":470000},{"$f":"IF('Safety Application'!G79=0,\"\",'Safety Application'!G79)","v":234000},{"$f":"IF('Safety Application'!H79=0,\"\",'Safety Application'!H79)","v":""},{"$f":"IF('Safety Application'!I79=0,\"\",'Safety Application'!I79)","v":1589640},{"$f":"IF('Safety Application'!A80=0,\"\",'Safety Application'!A80)","v":""},{"$f":"IF('Safety Application'!D80=0,\"\",'Safety Application'!D80)","v":""},{"$f":"IF('Safety Application'!E80=0,\"\",'Safety Application'!E80)","v":""},{"$f":"IF('Safety Application'!F80=0,\"\",'Safety Application'!F80)","v":""},{"$f":"IF('Safety Application'!G80=0,\"\",'Safety Application'!G80)","v":""},{"$f":"IF('Safety Application'!H80=0,\"\",'Safety Application'!H80)","v":""},{"$f":"IF('Safety Application'!I80=0,\"\",'Safety Application'!I80)","v":""},{"$f":"IF('Safety Application'!A81=0,\"\",'Safety Application'!A81)","v":""},{"$f":"IF('Safety Application'!D81=0,\"\",'Safety Application'!D81)","v":""},{"$f":"IF('Safety Application'!E81=0,\"\",'Safety Application'!E81)","v":""},{"$f":"IF('Safety Application'!F81=0,\"\",'Safety Application'!F81)","v":""},{"$f":"IF('Safety Application'!G81=0,\"\",'Safety Application'!G81)","v":""},{"$f":"IF('Safety Application'!H81=0,\"\",'Safety Application'!H81)","v":""},{"$f":"IF('Safety Application'!I81=0,\"\",'Safety Application'!I81)","v":""},{"$f":"IF('Safety Application'!A82=0,\"\",'Safety Application'!A82)","v":""},{"$f":"IF('Safety Application'!D82=0,\"\",'Safety Application'!D82)","v":""},{"$f":"IF('Safety Application'!E82=0,\"\",'Safety Application'!E82)","v":""},{"$f":"IF('Safety Application'!F82=0,\"\",'Safety Application'!F82)","v":""},{"$f":"IF('Safety Application'!G82=0,\"\",'Safety Application'!G82)","v":""},{"$f":"IF('Safety Application'!H82=0,\"\",'Safety Application'!H82)","v":""},{"$f":"IF('Safety Application'!I82=0,\"\",'Safety Application'!I82)","v":""},{"$f":"IF('Safety Application'!A83=0,\"\",'Safety Application'!A83)","v":""},{"$f":"IF('Safety Application'!D83=0,\"\",'Safety Application'!D83)","v":""},{"$f":"IF('Safety Application'!E83=0,\"\",'Safety Application'!E83)","v":""},{"$f":"IF('Safety Application'!F83=0,\"\",'Safety Application'!F83)","v":""},{"$f":"IF('Safety Application'!G83=0,\"\",'Safety Application'!G83)","v":""},{"$f":"IF('Safety Application'!H83=0,\"\",'Safety Application'!H83)","v":""},{"$f":"IF('Safety Application'!I83=0,\"\",'Safety Application'!I83)","v":""},{"$f":"IF('Safety Application'!A84=0,\"\",'Safety Application'!A84)","v":""},{"$f":"IF('Safety Application'!D84=0,\"\",'Safety Application'!D84)","v":""},{"$f":"IF('Safety Application'!E84=0,\"\",'Safety Application'!E84)","v":""},{"$f":"IF('Safety Application'!F84=0,\"\",'Safety Application'!F84)","v":""},{"$f":"IF('Safety Application'!G84=0,\"\",'Safety Application'!G84)","v":""},{"$f":"IF('Safety Application'!H84=0,\"\",'Safety Application'!H84)","v":""},{"$f":"IF('Safety Application'!I84=0,\"\",'Safety Application'!I84)","v":""},{"$f":"IF('Safety Application'!A85=0,\"\",'Safety Application'!A85)","v":""},{"$f":"IF('Safety Application'!D85=0,\"\",'Safety Application'!D85)","v":""},{"$f":"IF('Safety Application'!E85=0,\"\",'Safety Application'!E85)","v":""},{"$f":"IF('Safety Application'!F85=0,\"\",'Safety Application'!F85)","v":""},{"$f":"IF('Safety Application'!G85=0,\"\",'Safety Application'!G85)","v":""},{"$f":"IF('Safety Application'!H85=0,\"\",'Safety Application'!H85)","v":""},{"$f":"IF('Safety Application'!I85=0,\"\",'Safety Application'!I85)","v":""},{"$f":"IF('Safety Application'!A86=0,\"\",'Safety Application'!A86)","v":""},{"$f":"IF('Safety Application'!D86=0,\"\",'Safety Application'!D86)","v":""},{"$f":"IF('Safety Application'!E86=0,\"\",'Safety Application'!E86)","v":""},{"$f":"IF('Safety Application'!F86=0,\"\",'Safety Application'!F86)","v":""},{"$f":"IF('Safety Application'!G86=0,\"\",'Safety Application'!G86)","v":""},{"$f":"IF('Safety Application'!H86=0,\"\",'Safety Application'!H86)","v":""},{"$f":"IF('Safety Application'!I86=0,\"\",'Safety Application'!I86)","v":""},{"$f":"IF('Safety Application'!A89=0,\"\",'Safety Application'!A89)","v":"ODOT District 12 has been interested in implementing these improvements for over 5 years, as evidenced by the approved IMS from June 22nd, 2015.  ODOT District 12 is requesting construction funding only for this improvement and will use district allocation to cover the approximately $2.3 million in funds not requested from the safety committee.  "}]
[]
[]
["Project Development"]
["https://extranet.dot.state.oh.us/divisions/Planning/plan/HSIP_applications/Lists/ProjectDevelopment/ImportView.aspx"]
["AppID","SafetyStudy_CompBy","SafetyStudy_CompDt","IMS_CompBy","IMS__CompDt","PE_Enviro_CompBy","PE_Enviro_CompDt","PE_Design_CompBy","PE_Design_CompDt","ROW_CompBy","ROW_CompDt"]
[{"$f":"A57","v":"Not Assigned"},{"$f":"IF('Safety Application'!E98=0,\"\",'Safety Application'!E98)","v":"GPD Group"},{"$f":"IF('Safety Application'!H98=\"\",\"\",MONTH('Safety Application'!H98)&\"/\"&DAY('Safety Application'!H98)&\"/\"&YEAR('Safety Application'!H98))","v":"8/1/2021"},{"$f":"IF('Safety Application'!E99=0,\"\",'Safety Application'!E99)","v":"Parsons Brinckerhoff"},{"$f":"IF('Safety Application'!H99=\"\",\"\",MONTH('Safety Application'!H99)&\"/\"&DAY('Safety Application'!H99)&\"/\"&YEAR('Safety Application'!H99))","v":"6/22/2015"},{"$f":"IF('Safety Application'!E100=0,\"\",'Safety Application'!E100)","v":""},{"$f":"IF('Safety Application'!H100=\"\",\"\",MONTH('Safety Application'!H100)&\"/\"&DAY('Safety Application'!H100)&\"/\"&YEAR('Safety Application'!H100))","v":""},{"$f":"IF('Safety Application'!E101=0,\"\",'Safety Application'!E101)","v":""},{"$f":"IF('Safety Application'!H101=\"\",\"\",MONTH('Safety Application'!H101)&\"/\"&DAY('Safety Application'!H101)&\"/\"&YEAR('Safety Application'!H101))","v":""},{"$f":"IF('Safety Application'!E102=0,\"\",'Safety Application'!E102)","v":""},{"$f":"IF('Safety Application'!H102=\"\",\"\",MONTH('Safety Application'!H102)&\"/\"&DAY('Safety Application'!H102)&\"/\"&YEAR('Safety Application'!H102))","v":""}]