{"text_format":"1","workbook":"xlsx","n_sheets":23,"sheets":["SafetySummary","RISeg","StateBasic","Ellis","Pavement","Bridge","AssetSQL","ImageQuery","HistoricalImages","CamSQL","Metadata","RefTables","Data","Full Crash Data","Crash Data","Data Analysis","Graphical Analysis","Histograms","Collision Diagram","Diagram Data","Rate Calc Sheet","Severity Calc Sheet","CRF Table_Rev"],"not_rendered":{"charts":32,"images":62,"macros":1,"external_links":0,"defined_names":58,"comments":2,"pivot_tables":82},"unopened":[],"bounds":{"document_bytes":16777216,"sheet_cells":100000,"rows_first":2000,"rows_last":500,"rows_between":2000,"halvings":0,"cell_chars":16384,"cell_head_chars":4096},"cells_cut":0,"cells_raw":0,"read":"whole","date_system":"1900"}

{"sheet":"SafetySummary","index":0,"n_rows":18,"n_cols":206,"rows_kept":18,"cut":false,"hidden":true,"merged":[[14,72,14,76],[14,31,14,32],[14,33,14,35],[14,36,14,45],[14,46,14,52],[14,53,14,71],[14,110,14,132],[14,133,14,135],[14,136,14,138],[14,77,14,81],[14,82,14,88],[14,89,14,100],[14,101,14,104],[14,105,14,106],[14,107,14,109]]}
[]
[]
[]
[null,null,null,null,null,null,null,null,null,null,null,null,null,null,null,null,null,null,null,null,null,null,null,null,null,null,null,null,null,null,null,null,null,null,null,null,null,null,null,null,null,null,null,null,null,null,null,null,null,null,null,null,null,null,null,null,null,null,null,null,null,null,null,null,null,null,null,null,null,null,null,null,null,null,null,null,null,null,null,null,null,null,null,null,null,null,null,null,null,null,null,null,null,null,null,null,null,null,null,null,null,null,null,null,null,null,null,null,null,null,null,null,null,null,null,null,null,null,null,null,null,null,null,null,null,null,null,null,null,null,null,null,null,null,null,null,null,null,null,null,null,null,null,null,null,null,null,null,null,null,null,null,null,null,null,null,null,null,null,null,null,null,null,null,null,null,null,null,null,null,null,null,null,null,null,null,null,null,null,null,null,null,null,null,null,null,null,null,null,null,null,null,null,"NLF_ID","BLOG","ELOG"]
[]
[]
{"$rows_left_out":13}
{"sheet":"RISeg","index":1,"n_rows":7,"n_cols":25,"rows_kept":7,"cut":false,"hidden":true,"merged":[]}
[]
[]
[]
[]
[]
[]
{"$rows_left_out":2}
{"sheet":"StateBasic","index":2,"n_rows":7,"n_cols":43,"rows_kept":7,"cut":false,"hidden":true,"merged":[]}
[]
[]
[]
[]
[]
[]
{"$rows_left_out":2}
{"sheet":"Ellis","index":3,"n_rows":7,"n_cols":71,"rows_kept":7,"cut":false,"hidden":true,"merged":[]}
[]
[]
[]
[]
[]
[]
{"$rows_left_out":2}
{"sheet":"Pavement","index":4,"n_rows":7,"n_cols":33,"rows_kept":7,"cut":false,"hidden":true,"merged":[]}
[]
[]
[]
[]
[]
[]
{"$rows_left_out":2}
{"sheet":"Bridge","index":5,"n_rows":7,"n_cols":22,"rows_kept":7,"cut":false,"hidden":true,"merged":[]}
[]
[]
[]
[]
[]
[]
{"$rows_left_out":2}
{"sheet":"AssetSQL","index":6,"n_rows":20,"n_cols":201,"rows_kept":20,"cut":false,"hidden":true,"merged":[]}
[]
[]
[]
[]
[]
[]
{"$rows_left_out":15}
{"sheet":"ImageQuery","index":7,"n_rows":20,"n_cols":3,"rows_kept":20,"cut":false,"hidden":true,"merged":[[18,165,18,166],[18,149,18,150],[18,151,18,152],[18,153,18,154],[18,155,18,156],[18,157,18,158],[18,159,18,160],[17,136,17,141],[17,142,17,147],[17,148,17,167],[18,135,18,136],[18,137,18,138],[18,139,18,140],[18,141,18,142],[18,143,18,144],[18,145,18,146],[18,147,18,148],[18,161,18,162],[18,163,18,164]]}
[]
[]
[{"$f":"E12&\"-\"&E13&E14&\" - (\"&E15&\"-\"&E16&\")  \"&\"From \"&E17&\" to \"&E18","v":"- - (-)  From  to "}]
[]
[]
[]
{"$rows_left_out":15}
{"sheet":"HistoricalImages","index":8,"n_rows":20,"n_cols":2,"rows_kept":20,"cut":false,"hidden":true,"merged":[]}
[]
[]
[]
[]
[]
[]
{"$rows_left_out":15}
{"sheet":"CamSQL","index":9,"n_rows":20,"n_cols":200,"rows_kept":20,"cut":false,"hidden":true,"merged":[[17,135,17,140],[17,141,17,146],[17,147,17,166],[18,134,18,135],[18,136,18,137],[18,138,18,139],[18,140,18,141],[18,142,18,143],[18,144,18,145],[18,146,18,147],[18,160,18,161],[18,162,18,163],[18,164,18,165],[18,148,18,149],[18,150,18,151],[18,152,18,153],[18,154,18,155],[18,156,18,157],[18,158,18,159]]}
[]
[]
[{"$f":"D12&\"-\"&D13&D14&\" - (\"&D15&\"-\"&D16&\")  \"&\"From \"&D17&\" to \"&D18","v":"CLE-IR-275R - (8.95-10.4)  From 2007 to 2009"}]
[]
[]
[]
{"$rows_left_out":15}
{"sheet":"Metadata","index":10,"n_rows":148,"n_cols":3,"rows_kept":148,"cut":false,"hidden":true,"merged":[]}
["Metadata"]
["2018-04-16"]
[]
["Column Name","Data Type","Definition"]
["DOCUMENT_NBR","NUMBER(11,0)","Unique number assigned to each crash. It will be the same for the crash level record, unit level record and people level record.  The first four numbers will designate the crash year. "]
["CRASH_REPORT_LINK","VARCHAR2(128 BYTE)","Calculated field to display the crash image"]
{"$rows_left_out":143}
{"sheet":"RefTables","index":11,"n_rows":634,"n_cols":5,"rows_kept":634,"cut":false,"hidden":true,"merged":[]}
["Field Definitions / Code Values"]
["2018-04-16"]
[]
["Column Name","Code Value","Code Text","Formatted Code Text","Included"]
["AREA_CODE",766,"AKRON","AKRON","Yes"]
["AREA_CODE",13375,"CANTON","CANTON","Yes"]
{"$rows_left_out":629}
{"sheet":"Data","index":12,"n_rows":20,"n_cols":145,"rows_kept":20,"cut":false,"hidden":true,"merged":[]}
[]
[]
[]
[]
[]
[]
{"$rows_left_out":15}
{"sheet":"Full Crash Data","index":13,"n_rows":30,"n_cols":149,"rows_kept":30,"cut":false,"hidden":false,"merged":[]}
[null,null,null,null,null,null,null,"N",null,null,null,null,null,null,null,null,null,null,null,null,null,null,null,null,null,null,null,null,null,null,null,null,null,null,null,null,null,null,null,null,null,null,null,null,null,null,null,null,null,null,null,null,null,null,null,null,null,null,null,null,null,null,null,null,null,null,null,null,null,null,null,null,null,null,null,null,null,null,null,null,null,null,null,null,null,null,null,null,null,null,null,null,null,null,null,null,null,null,null,null,null,null,null,null,null,null,null,null,null,null,null,null,null,null,null,null,null,null,null,null,null,null,null,null,null,null,null,null,null,null,null,null,null,null,null,null,null,null,null,null,null,null,null,null,null,"N"]
[null,"version: 2018416"]
["PID 23449"]
[]
[]
[]
{"$rows_left_out":25}
{"sheet":"Crash Data","index":14,"n_rows":30,"n_cols":191,"rows_kept":30,"cut":false,"hidden":false,"merged":[[18,89,18,90],[17,61,17,66],[17,67,17,72],[17,73,17,92],[18,61,18,62],[18,91,18,92],[18,75,18,76],[18,77,18,78],[18,79,18,80],[18,81,18,82],[18,83,18,84],[18,85,18,86],[18,65,18,66],[18,67,18,68],[18,69,18,70],[18,71,18,72],[18,73,18,74],[18,63,18,64],[18,87,18,88]]}
[null,null,null,null,null,null,null,"N",null,null,null,null,null,null,null,null,null,null,null,null,{"$f":"\"http://hsip.dot.state.oh.us/report/?docnbr=\"&IF(LEN(B1)=11,B1,\"20\"&B1)","v":"http://hsip.dot.state.oh.us/report/?docnbr=20"},null,null,null,null,null,null,null,null,null,null,null,null,null,null,null,null,null,null,null,null,null,null,null,null,null,null,null,null,null,null,null,null,null,null,null,null,null,null,null,null,null,null,null,null,null,null,null,null,null,null,null,null,null,null,null,null,null,null,null,null,null,null,null,null,null,null,null,null,null,null,null,null,null,"Toggle Map","N"]
[null,"version: 20170913"]
["Type 'Heading' Here"]
[]
[]
[]
{"$rows_left_out":25}
{"sheet":"Data Analysis","index":15,"n_rows":295,"n_cols":14,"rows_kept":295,"cut":false,"hidden":false,"merged":[]}
[{"$f":"'Crash Data'!A3","v":"Type 'Heading' Here"},null,null,null,null,null,null,null,null,null,{"$f":"A1","v":"Type 'Heading' Here"}]
[]
[null,null,null,null,null,null,null,null,null,null,"SEVERITY","CRASH_SEVERITY"]
[null,"Number",null,null,null,null,null,null,null,null,"TRAFFIC_CRASH_YEAR","Property Damage Crash","Injury Crash"]
["Total",10,null,null,null,null,null,null,null,null,2016,2,3]
[null,null,null,null,null,null,null,null,null,null,2017,1,0]
{"$rows_left_out":290}
{"sheet":"Graphical Analysis","index":16,"n_rows":1,"n_cols":25,"rows_kept":1,"cut":false,"hidden":false,"merged":[]}
[{"$f":"'Crash Data'!A3","v":"Type 'Heading' Here"},null,null,null,null,null,null,null,null,null,null,null,{"$f":"A1","v":"Type 'Heading' Here"},null,null,null,null,null,null,null,null,null,null,null,{"$f":"A1","v":"Type 'Heading' Here"}]

{"sheet":"Histograms","index":17,"n_rows":694,"n_cols":175,"rows_kept":694,"cut":false,"hidden":false,"merged":[]}
["Default Bin Size is 0.1 Miles",null,null,{"$f":"'Crash Data'!$A$3","v":"Type 'Heading' Here"},null,null,null,null,null,null,null,null,null,null,null,null,null,null,null,null,null,null,null,null,null,null,null,null,null,null,null,null,"Click for Histogram 1 Graph",null,null,"Click for Histogram 2 Graph",null,null,null,null,"Click for Histogram 3 Graph",null,null,null,null,null,null,null,null,null,null,null,null,null,null,null,null,null,null,"Click for Histogram 4 Graph",null,null,null,null,null,null,null,"Click for Histogram 5 Graph",null,null,null,null,null,null,null,null,null,"Click for Histogram 6 Graph",null,null,null,null,null,"Click for Histogram 7 Graph",null,null,null,null,null,null,null,null,null,null,null,null,null,null,null,null,null,null,null,null,null,null,null,null,null,null,"Click for Histogram 8 Graph",null,null,null,null,null,null,null,null,null,null,null,null,null,null,null,null,null,null,"Click for Histogram 9 Graph",null,null,null,null,null,null,null,null,null,"Click for Histogram 10 Graph",null,null,null,null,null,null,null,null,null,null,null,null,null,null,null,null,null,null,null,null,null,null,null,null,null,null,"Click for Histogram 11 Graph"]
["Click Buttons Below to Modify",null,null,"Histogram 1",null,null,null,null,null,null,null,null,null,null,null,null,null,null,null,null,null,null,null,null,null,null,null,null,null,null,null,null,"Count of ACCIDENTS_POINTS_NBR",null,null,"Count of ACCIDENTS_POINTS_NBR","CRASH_SEVERITY_TXT",null,null,null,"Count of ACCIDENTS_POINTS_NBR","TYPE_OF_CRASH_TXT",null,null,null,null,null,null,null,null,null,null,null,null,null,null,null,null,null,"Count of ACCIDENTS_POINTS_NBR","ROAD_CONDITION_TXT",null,null,null,null,null,null,"Count of ACCIDENTS_POINTS_NBR","LIGHT_CONDITION_TXT",null,null,null,null,null,null,null,null,"Count of ACCIDENTS_POINTS_NBR","ANIMAL_TYPE_TXT",null,null,null,null,"Count of ACCIDENTS_POINTS_NBR","CONTRIBUTING_FACTOR1_TXT",null,null,null,null,null,null,null,null,null,null,null,null,null,null,null,null,null,null,null,null,null,null,null,null,null,"Count of ACCIDENTS_POINTS_NBR","ACTION1_TXT",null,null,null,null,null,null,null,null,null,null,null,null,null,null,null,null,null,"Count of ACCIDENTS_POINTS_NBR","DAY_OF_WEEK_TXT",null,null,null,null,null,null,null,null,"Count of ACCIDENTS_POINTS_NBR","HOUR_OF_DAY",null,null,null,null,null,null,null,null,null,null,null,null,null,null,null,null,null,null,null,null,null,null,null,null,null,"Count of ACCIDENTS_POINTS_NBR",null,"TYPE_OF_CRASH_TXT"]
[null,null,null,null,null,null,null,null,null,null,null,null,null,null,null,null,null,null,null,null,null,null,null,null,null,null,null,null,null,null,null,null,"LOGPOINT_SLM_NBR","Total",null,"LOGPOINT_SLM_NBR","Property Damage Crash","Injury Crash",null,null,"LOGPOINT_SLM_NBR","Fixed Object","Rear End","Pedalcycles","Animal","Pedestrian","Left Turn","Backing",null,null,null,null,null,null,null,null,null,null,null,"LOGPOINT_SLM_NBR","Dry","Wet",null,null,null,null,null,"LOGPOINT_SLM_NBR","Daylight","Dark - Lighted Roadway",null,null,null,null,null,null,null,"LOGPOINT_SLM_NBR","(blank)",null,null,null,null,"LOGPOINT_SLM_NBR","Failure To Control","Improper Turn","Followed To Closely/ACDA","None-Motorist","Ran Stop Sign","Failure To Yield","Improper Backing",null,null,null,null,null,null,null,null,null,null,null,null,null,null,null,null,null,null,null,"LOGPOINT_SLM_NBR","Straight Ahead","Making Right Turn","Leaving Traffic Lane","Backing","Making Left Turn",null,null,null,null,null,null,null,null,null,null,null,null,null,"LOGPOINT_SLM_NBR","Wednesday","Saturday","Friday","Sunday","Monday","Tuesday",null,null,null,"LOGPOINT_SLM_NBR","07","08","09","13","14","15","17","18","20",null,null,null,null,null,null,null,null,null,null,null,null,null,null,null,null,null,"LOGPOINT_SLM_NBR","DIRECTION_TO1_TXT","Fixed Object","Rear End","Pedalcycles","Animal","Pedestrian","Left Turn","Backing"]
[null,null,null,null,null,null,null,null,null,null,null,null,null,null,null,null,null,null,null,null,null,null,null,null,null,null,null,null,null,null,null,null,"6.96-7.06",7,null,"6.96-7.06",2,5,null,null,"6.96-7.06",1,2,1,1,1,null,1,null,null,null,null,null,null,null,null,null,null,null,"6.96-7.06",6,1,null,null,null,null,null,"6.96-7.06",6,1,null,null,null,null,null,null,null,"6.96-7.06",7,null,null,null,null,"6.96-7.06",1,1,2,1,null,1,1,null,null,null,null,null,null,null,null,null,null,null,null,null,null,null,null,null,null,null,"6.96-7.06",3,2,1,1,null,null,null,null,null,null,null,null,null,null,null,null,null,null,"6.96-7.06",2,1,1,1,1,1,null,null,null,"6.96-7.06",1,1,null,1,1,null,1,1,1,null,null,null,null,null,null,null,null,null,null,null,null,null,null,null,null,null,"6.96-7.06","West",null,null,null,null,null,null,1]
[null,null,null,null,null,null,null,null,null,null,null,null,null,null,null,null,null,null,null,null,null,null,null,null,null,null,null,null,null,null,null,null,"7.06-7.16",3,null,"7.06-7.16",2,1,null,null,"7.06-7.16",1,null,1,null,null,1,null,null,null,null,null,null,null,null,null,null,null,null,"7.06-7.16",2,1,null,null,null,null,null,"7.06-7.16",3,null,null,null,null,null,null,null,null,"7.06-7.16",3,null,null,null,null,"7.06-7.16",1,1,null,null,1,null,null,null,null,null,null,null,null,null,null,null,null,null,null,null,null,null,null,null,null,null,"7.06-7.16",2,null,null,null,1,null,null,null,null,null,null,null,null,null,null,null,null,null,"7.06-7.16",null,1,1,null,null,1,null,null,null,"7.06-7.16",null,null,1,null,1,1,null,null,null,null,null,null,null,null,null,null,null,null,null,null,null,null,null,null,null,null,null,"North",1,1,1]
[null,null,null,null,null,null,null,null,null,null,null,null,null,null,null,null,null,null,null,null,null,null,null,null,null,null,null,null,null,null,null,null,"Grand Total",10,null,"Grand Total",4,6,null,null,"Grand Total",2,2,2,1,1,1,1,null,null,null,null,null,null,null,null,null,null,null,"Grand Total",8,2,null,null,null,null,null,"Grand Total",9,1,null,null,null,null,null,null,null,"Grand Total",10,null,null,null,null,"Grand Total",2,2,2,1,1,1,1,null,null,null,null,null,null,null,null,null,null,null,null,null,null,null,null,null,null,null,"Grand Total",5,2,1,1,1,null,null,null,null,null,null,null,null,null,null,null,null,null,"Grand Total",2,2,2,1,1,2,null,null,null,"Grand Total",1,1,1,1,2,1,1,1,1,null,null,null,null,null,null,null,null,null,null,null,null,null,null,null,null,null,null,"South",null,1,null,1,1]
{"$rows_left_out":689}
{"sheet":"Collision Diagram","index":18,"n_rows":93,"n_cols":60,"rows_kept":93,"cut":false,"hidden":true,"merged":[]}
[null,null,null,null,null,null,null,null,null,null,null,null,null,null,null,null,null,null,null,null,null,null,null,null,null,null,null,null,null,null,null,null,null,null,null,null,null,null,null,null,null,{"$f":"LEFT(AO1,1)","v":""},{"$f":"RIGHT(AO1,1)","v":""}]
[null,null,null,null,null,null,null,null,null,null,null,null,null,null,null,null,null,null,null,null,null,null,null,null,null,null,null,null,null,null,null,null,null,null,null,null,null,null,null,null,null,{"$f":"LEFT(AO2,1)","v":""},{"$f":"RIGHT(AO2,1)","v":""}]
[null,null,null,null,null,null,null,null,null,null,null,null,null,null,null,null,null,null,null,null,null,null,null,null,null,null,null,null,null,null,null,null,null,null,null,null,null,null,null,null,null,{"$f":"LEFT(AO3,2)","v":""},{"$f":"RIGHT(AO3,2)","v":""}]
[null,null,null,null,null,null,null,null,null,null,null,null,null,null,null,null,null,null,null,null,null,null,null,null,null,null,null,null,null,null,null,null,null,null,null,null,null,null,null,null,null,{"$f":"LEFT(AO4,2)","v":""},{"$f":"RIGHT(AO4,2)","v":""}]
[]
[null,null,null,null,null,null,null,null,null,null,null,null,null,null,null,null,null,null,null,null,null,null,null,null,null,null,null,null,null,null,null,null,null,null,null,null,null,null,null,null,null,{"$f":"LEFT(AO6,1)","v":""},{"$f":"RIGHT(AO6,2)","v":""}]
{"$rows_left_out":88}
{"sheet":"Diagram Data","index":19,"n_rows":2,"n_cols":49,"rows_kept":2,"cut":false,"hidden":true,"merged":[]}
[{"$f":"IF('Crash Data'!$CU19=\"\",\"\",'Crash Data'!$CU19)","v":""},{"$f":"IF('Crash Data'!$O19=\"\",\"\",IF('Crash Data'!O19=\"Fatal Injury\",\"Fatal Crash\",IF('Crash Data'!O19=\"PDO/No Injury\",\"PDO\",\"Injury Crash\")))","v":""},{"$f":"IF('Crash Data'!$M19=\"\",\"\",'Crash Data'!$M19)","v":""},{"$f":"IF('Crash Data'!$F19=\"\",\"\",'Crash Data'!$F19)","v":"19000207"},{"$f":"IF('Crash Data'!$K19=\"\",\"\",'Crash Data'!$K19)","v":0},{"$f":"IF('Crash Data'!$J19=\"\",\"\",'Crash Data'!$J19)","v":""},{"$f":"IF('Crash Data'!$L19=\"\",\"\",'Crash Data'!$L19)","v":""},{"$f":"IF('Crash Data'!$Q19=\"\",\"\",'Crash Data'!$Q19)","v":""},{"$f":"IF('Crash Data'!$R19=\"\",\"\",'Crash Data'!$R19)","v":""},{"$f":"IF('Crash Data'!$S19=\"\",\"\",'Crash Data'!$S19)","v":""},{"$f":"IF('Crash Data'!$T19=\"\",\"\",'Crash Data'!$T19)","v":""},{"$f":"IF('Crash Data'!$W19=\"\",\"\",'Crash Data'!$W19)","v":""},{"$f":"IF('Crash Data'!$X19=\"\",\"\",'Crash Data'!$X19)","v":""},{"$f":"IF('Crash Data'!$U19=\"\",\"\",IF('Crash Data'!$U19=\"NOTHING STRUCK\",\"\",'Crash Data'!$U19))","v":""},{"$f":"IF('Crash Data'!$AB19=\"\",\"\",IF('Crash Data'!$AB19=\"NO ALCOHOL DETECTED\",\"\",'Crash Data'!$AB19))","v":"No"},{"$f":"IF('Crash Data'!$AF19=\"\",\"\",IF('Crash Data'!$AF19=\"NO DRIVER ERRORS\",\"\",'Crash Data'!$AF19))","v":""},{"$f":"IF('Crash Data'!$AG19=\"\",\"\",'Crash Data'!$AG19)","v":""},{"$f":"IF('Crash Data'!$AK19=\"\",\"\",'Crash Data'!$AK19)","v":""},{"$f":"IF('Crash Data'!$AL19=\"\",\"\",'Crash Data'!$AL19)","v":""},{"$f":"IF('Crash Data'!$AM19=\"\",\"\",IF('Crash Data'!$AM19=\"NO ALCOHOL DETECTED\",\"\",'Crash Data'!$AM19))","v":""},{"$f":"IF('Crash Data'!$AR19=\"\",\"\",'Crash Data'!$AR19)","v":""},{"$f":"IF('Crash Data'!$AS19=\"\",\"\",'Crash Data'!$AS19)","v":15},{"$f":"IF('Crash Data'!$AT19=\"\",\"\",'Crash Data'!$AT19)","v":16},{"$f":"IF('Crash Data'!$AU19=\"\",\"\",'Crash Data'!$AU19)","v":17},{"$f":"IF('Crash Data'!$AV19=\"\",\"\",'Crash Data'!$AV19)","v":18},{"$f":"IF('Crash Data'!$B19=\"\",\"\",'Crash Data'!$B19)","v":2},{"$f":"IF('Crash Data'!$C19=\"\",\"\",'Crash Data'!$C19)","v":76},{"$f":"IF('Crash Data'!$D19=\"\",\"\",'Crash Data'!$D19)","v":6},{"$f":"IF('Crash Data'!$E19=\"\",\"\",'Crash Data'!$E19)","v":10},{"$f":"IF('Crash Data'!$G19=\"\",\"\",'Crash Data'!$G19)","v":"636465"},{"$f":"IF('Crash Data'!$H19=\"\",\"\",'Crash Data'!$H19)","v":"707172"},{"$f":"IF('Crash Data'!$I19=\"\",\"\",'Crash Data'!$I19)","v":""},{"$f":"IF('Crash Data'!$AW19=\"\",\"\",'Crash Data'!$AW19)","v":""},{"$f":"IF('Crash Data'!$N19=\"\",\"\",'Crash Data'!$N19)","v":21},{"$f":"IF('Crash Data'!$P19=\"\",\"\",'Crash Data'!$P19)","v":""},{"$f":"IF('Crash Data'!$V19=\"\",\"\",'Crash Data'!$V19)","v":""},{"$f":"IF('Crash Data'!$Y19=\"\",\"\",'Crash Data'!$Y19)","v":98},{"$f":"IF('Crash Data'!$Z19=\"\",\"\",'Crash Data'!$Z19)","v":""},{"$f":"IF('Crash Data'!$AA19=\"\",\"\",'Crash Data'!$AA19)","v":""},{"$f":"IF('Crash Data'!$AC19=\"\",\"\",IF('Crash Data'!$AC19=\"NO DRUGS DETECTED\",\"\",'Crash Data'!$AC19))","v":"No"},{"$f":"IF('Crash Data'!$AD19=\"\",\"\",'Crash Data'!$AD19)","v":85},{"$f":"IF('Crash Data'!$AE19=\"\",\"\",'Crash Data'!$AE19)","v":86},{"$f":"IF('Crash Data'!$AH19=\"\",\"\",'Crash Data'!$AH19)","v":""},{"$f":"IF('Crash Data'!$AI19=\"\",\"\",'Crash Data'!$AI19)","v":122},{"$f":"IF('Crash Data'!$AJ19=\"\",\"\",'Crash Data'!$AJ19)","v":""},{"$f":"IF('Crash Data'!$AN19=\"\",\"\",IF('Crash Data'!$AN19=\"NO DRUGS DETECTED\",\"\",'Crash Data'!$AN19))","v":""},{"$f":"IF('Crash Data'!$AO19=\"\",\"\",IF('Crash Data'!$AO19=\"SPECIAL AREA - NOT STATED\",\"\",'Crash Data'!$AO19))","v":""},{"$f":"IF('Crash Data'!$BD19=\"\",\"\",'Crash Data'!$BD19)","v":4},{"$f":"IF('Crash Data'!$BE19=\"\",\"\",'Crash Data'!$BE19)","v":39}]
["ROW ID","CRASH SEVERITY","TYPE OF CRASH","CRASH DT","HOUR","DAY","LIGHT CONDITION","ROAD CONDITION","LOCATION","CONTRIBUTING FACTOR1","ACTION1","DIRECTION FROM1","DIRECTION TO1","OBJECT STRUCK1","DRIVER ALCOHOL1","CONTRIBUTING FACTOR2","ACTION2","DIRECTION FROM2","DIRECTION TO2","DRIVER ALCOHOL2","ROAD CONTOUR","FATAL","SERIOUS INJ","MINOR INJ","NO VISIBLE INJ","ACCIDENT NBR","LOCAL REPORT NBR","NLFID","LOGPOINT","STREET1","STREET2 REFERENCE","DISTANCE OFFSET","DIRECTION FROM REF","NUMBER OF VEHICLES","WEATHER CONDITION","VEHICLE TYPE1","DRIVER AGE1","DRIVER GENDER1","TRAFFIC CONTROL1","DRIVER DRUGS1","ESTIMATED SPEED1","POSTED SPEED1","VEHICLE TYPE2","DRIVER AGE2","DRIVER GENDER2","DRIVER DRUGS2","SPECIAL AREA","YEAR","MONTH"]

{"sheet":"Rate Calc Sheet","index":20,"n_rows":37,"n_cols":25,"rows_kept":37,"cut":false,"hidden":false,"merged":[[34,8,35,10],[3,2,3,4],[9,24,9,25],[7,24,7,25],[3,24,3,25],[4,24,4,25],[5,24,5,25],[6,24,6,25],[3,20,3,21],[4,20,4,21],[5,20,5,21],[8,20,8,21],[6,20,6,21],[3,16,3,17],[4,16,4,17],[5,16,5,17],[7,16,7,17],[26,2,26,4],[4,2,4,4],[6,2,6,4],[5,2,5,4],[7,2,7,4],[22,2,22,4],[23,2,23,4],[24,2,24,4],[25,2,25,4]]}
[]
[]
[]
[null,"County:",null,null,null,null,null,null,null,null,null,null,null,null,null,"Entering Leg 1 ",null,null,null,"Entering Leg 1 ",null,null,null,"Entering Leg 1 "]
[null,"R1:",null,null,null,null,null,null,null,null,null,null,null,null,null,"Entering Leg 2 ",null,null,null,"Entering Leg 2 ",null,null,null,"Entering Leg 2 "]
[null,"R1 Log:",null,null,null,null," ",null,null,null,null,null,null,null,null,"Entering Leg 3 ",null,null,null,"Entering Leg 3 ",null,null,null,"Entering Leg 3 "]
{"$rows_left_out":32}
{"sheet":"Severity Calc Sheet","index":21,"n_rows":49,"n_cols":10,"rows_kept":49,"cut":false,"hidden":false,"merged":[[3,3,3,7]]}
["Select Location Type:",null,"Freeway"]
[]
[null,"RSI Value = ",{"$f":"IFERROR(C25/(A25+B25),0)","v":43587.833942461853}]
[null,null,null,"2014 Relative Severity Index"]
["User Override","Auto Fill","Crash Type Severity Calc","Crash Type #","Crash Type","Rural Non-Freeway","Urban Non-Freeway","Freeway"]
[null,{"$f":"IF(A$6:A$24=\"\",COUNTIF('Crash Data'!M$21:M$23,\"Not Stated*\"),\"\")","v":0},{"$f":"IF(C$1=F$5,IF(A6=\"\",B6*F6,A6*F6),IF(C$1=G$5,IF(A6=\"\",B6*G6,A6*G6),IF(C$1=H$5,IF(A6=\"\",B6*H6,A6*H6))))","v":0},0,"Not stated",47469.115923566882,35589.369230769233,19151.229906542056]
{"$rows_left_out":44}
{"sheet":"CRF Table_Rev","index":22,"n_rows":123,"n_cols":39,"rows_kept":123,"cut":false,"hidden":false,"merged":[[1,14,3,25],[1,27,3,38]]}
["Estimates of Countermeasure Effectiveness Reduction (CRF) Factors"]
[null,null,null,null,null,null,null,null,null,null,null,null,null,null,"Property Damage Only Crashes",null,null,null,null,null,null,null,null,null,null,null,null,"Injury / Fatal Crashes"]
[]
[]
["CMF ID","Study Title","Countermeasure Category","Countermeasure","Service Life","Intersection Related (Y/N)","Wet Pavement Related","Night Related","Ran off Road","Publication Year","Star Quality Rating","All","PDO","INJ/FAT","Night","WET","RAN OFF RD","LEFT","RIGHT","ANGLE","REAR END","HEAD ON","SS PASS","FIXED OBJ","PEDESTRIAN","OTHER",{"$f":"D5","v":"Countermeasure"},"Night","WET","RAN OFF RD","LEFT","RIGHT","ANGLE","REAR END","HEAD ON","SS PASS","FIXED OBJ","PEDESTRIAN","OTHER"]
[87,"Handbook of Road Safety Measures","Roadway delineation","Add centerlines on roadway segments (2 lane roadway)",5,"No",null,null,null,2004,3,null,-0.01,0.01,null,null,null,{"$f":"$M6","v":-0.01},-0.01,-0.01,-0.01,-0.01,-0.01,-0.01,-0.01,-0.01,"Add centerlines on roadway segments (2 lane roadway)",null,null,null,{"$f":"$N6","v":0.01},0.01,0.01,0.01,0.01,0.01,0.01,0.01,0.01]
{"$rows_left_out":117}